##TITLE=31Pdec_LR-0154-C2-B2
 D2O, 64 sc
 9.2.2023
##JCAMPDX= 6.0         $$ Bruker NMR JCAMP-DX V2.0
##DATA TYPE= NMR SPECTRUM
##DATA CLASS= NTUPLES
##ORIGIN= UXNMR, Bruker Analytische Messtechnik GmbH
##OWNER= root
$$ XWIN-NMR		Version 3.5
$$ Thu Feb  9 17:38:37 2023 Russian Standard Time (UT+4h)  she@DPX200
##.OBSERVE FREQUENCY= 81.013821
##.OBSERVE NUCLEUS= ^31P
##.ACQUISITION MODE= SIMULTANEOUS
##.ACQUISITION SCHEME= undefined
##.AVERAGES= 64
##.DIGITISER RES= 16
##SPECTROMETER/DATA SYSTEM= spect
##.PULSE SEQUENCE= zgpg30
##.SOLVENT NAME= CDCl3
##.SHIFT REFERENCE= (INTERNAL, CDCl3, 0, 248.564)
##AUDIT TRAIL= $$ (NUMBER, WHEN, WHO, WHERE, WHAT)
$$ ##TITLE= Audit trail, XWIN-NMR		Version 3.5
$$ ##JCAMPDX= 5.01
$$ ##ORIGIN= Bruker BioSpin GmbH
$$ ##OWNER= she
$$ F:/spectra/data/she/nmr/P31/1/pdata/1/auditp.txt
$$ ##AUDIT TRAIL=  $$ (NUMBER, WHEN, WHO, WHERE, WHAT)
(   1,<2023-02-09 17:37:09.84 +0400>,<she>,<DPX200>,
      <continue with go, POWCHK disabled, PULCHK disabled
       configuration hash MD5:
       00 E9 B6 7A A2 85 ED C7 34 08 36 98 17 FE 4E 26
       data hash MD5: 32K
       46 A3 66 C6 E4 33 43 5F 33 0E 66 4F EE B0 09 1A>)
(   2,<2023-02-09 17:37:12.57 +0400>,<she>,<DPX200>,
      <Start of raw data processing
       efp BC_mod = 2 LB = 1 FT_mod = 6 PKNL = 1 PHC0 = -10616.96 PHC1 = -860.9884 SI = 64K 
       data hash MD5: 64K
       E9 E6 1D C4 6D 46 00 EE 3F C5 F2 2E 0E F7 54 86>)
(   3,<2023-02-09 17:37:28.81 +0400>,<she>,<DPX200>,
      <pk PHC0 = -69.28797 PHC1 = 147.4 
       data hash MD5: 64K
       A1 59 52 F5 48 49 E4 1E DC F2 4B 49 87 45 37 03>)
(   4,<2023-02-09 17:37:53.92 +0400>,<she>,<DPX200>,
      <pk PHC0 = -283.5822 PHC1 = 729.8011 
       data hash MD5: 64K
       9C D3 A6 06 FB 92 3D 37 60 99 4D E8 A5 05 E9 A8>)
(   5,<2023-02-09 17:38:01.37 +0400>,<she>,<DPX200>,
      <abs ABSG = 5 
       data hash MD5: 64K
       D7 27 58 B1 1E EF 49 BF 4E BD 78 91 71 01 D7 3D>)
$$ ##END=
$$ 
$$ hash MD5
$$ 37 DE B5 F0 BD 05 C5 D8 BB 6B A1 6A 80 0A E5 D6
##$RELAX= 
##$RELAX= 
##$RELAX= 
##$RELAX= 
##$RELAX= 
##$RELAX= 
##$RELAX= 
##$RELAX= 
##$RELAX= 
$$ Bruker specific parameters
$$ --------------------------
##$DU= <F:/spectra>
##$EXPNO= 1
##$NAME= <P31>
##$PROCNO= 1
##$TYPE= <nmr>
##$USER= <she>
##$AMP= (0..31)
100 100 100 100 100 100 100 100 100 100 100 100 100 100 100 100 100 100 
100 100 100 100 100 100 100 100 100 100 100 100 100 100 
##$AQSEQ= 0
##$AQ_mod= 1
##$AUNM= <au_zg>
##$AUTOPOS= <>
##$BF1= 81.014009
##$BF2= 200.13
##$BF3= 200.13
##$BF4= 200.13
##$BF5= 200.13
##$BF6= 200.13
##$BF7= 200.13
##$BF8= 200.13
##$BYTORDA= 1
##$CFDGTYP= 0
##$CFRGTYP= 5
##$CHEMSTR= <none>
##$CNST= (0..31)
1 1 145 1 1 1 1 1 1 1 1 1 1 1 1 1 1 1 1 1 1 1 1 1 1 1 1 1 1 1 1 1 
##$CPDPRG= <waltz16>
##$CPDPRG1= <>
##$CPDPRG2= <waltz16>
##$CPDPRG3= <>
##$CPDPRG4= <mlev>
##$CPDPRG5= <mlev>
##$CPDPRG6= <mlev>
##$CPDPRG7= <mlev>
##$CPDPRG8= <mlev>
##$CPDPRGB= <>
##$CPDPRGT= <>
##$D= (0..31)
$$ [...]
##$SUBNAM3= <"">
##$SUBNAM4= <"">
##$SUBNAM5= <"">
##$SUBNAM6= <"">
##$SUBNAM7= <"">
##$SUBNAM8= <"">
##$SUBNAM9= <"">
##$SW= 501.771253377433
##$SWIBOX= (0..15)
0 1 3 0 0 0 0 0 0 0 0 0 0 0 0 0 
##$SW_h= 40650.406504065
##$TD= 32768
##$TD0= 1
##$TE= 0
##$TE2= 300
##$TE3= 300
##$TEG= 300
##$TL= (0..7)
0 120 53 12 22 120 120 120 
##$TP= (0..7)
150 150 150 150 150 150 150 150 
##$TP07= 0
##$TPNAME0= <>
##$TPNAME1= <>
##$TPNAME2= <>
##$TPNAME3= <>
##$TPNAME4= <>
##$TPNAME5= <>
##$TPNAME6= <>
##$TPNAME7= <>
##$TPOAL= (0..7)
0.5 0.5 0.5 0.5 0.5 0.5 0.5 0.5 
##$TPOFFS= (0..7)
0 0 0 0 0 0 0 0 
##$TUNHIN= 0
##$TUNHOUT= 0
##$TUNXOUT= 0
##$USERA1= <user>
##$USERA2= <user>
##$USERA3= <user>
##$USERA4= <user>
##$USERA5= <user>
##$V9= 5
##$VALIST= <valist>
##$VCLIST= <CCCCCCCCCCCCCCC>
##$VD= 0
##$VDLIST= <DDDDDDDDDDDDDDD>
##$VPLIST= <PPPPPPPPPPPPPPP>
##$VTLIST= <TTTTTTTTTTTTTTT>
##$WBST= 1024
##$WBSW= 4
##$XGAIN= (0..3)
0 0 0 0 
##$XL= 0
##$YL= 0
##$YMAX_a= 5747
##$YMIN_a= -2360
##$ZGOPTNS= <>
##$ZL1= 120
##$ZL2= 120
##$ZL3= 120
##$ZL4= 120
##$ABSF1= 248.5645
##$ABSF2= -253.2056
##$ABSG= 5
##$ABSL= 3
##$ALPHA= 0
##$AQORDER= 0
##$ASSFAC= 0
##$ASSFACI= 0
##$ASSFACX= 0
##$ASSWID= 0
##$AUNMP= <proc_1d>
##$AZFE= 0.1
##$AZFW= 0.5
##$BCFW= 0
##$BC_mod= 2
##$BYTORDP= 0
##$COROFFS= 0
##$CY= -3
##$DATMOD= 1
##$DC= 0
##$DFILT= <>
##$DTYPP= 0
##$F1P= 0
##$F2P= 0
##$FCOR= 1
##$FTSIZE= 65536
##$FT_mod= 6
##$GAMMA= 0
##$GB= 0
##$INTBC= 1
##$INTSCL= 6.047779e-11
##$ISEN= 30
##$LB= 1
##$LEV0= 0
##$LPBIN= 0
##$MAXI= 10000
##$MC2= 0
##$MEAN= 0
##$ME_mod= 0
##$MI= 50
##$NCOEF= 0
##$NC_proc= -9
##$NLEV= 6
##$NOISF1= 182.463
##$NOISF2= 159.3651
##$NSP= 0
##$NTH_PI= 0
##$NZP= 0
##$OFFSET= 248.5645
##$PC= 4
##$PHC0= -10969.83
##$PHC1= 16.21271
##$PH_mod= 1
##$PKNL= yes
##$PPARMOD= 0
##$PSCAL= 0
##$PSIGN= 0
##$REVERSE= no
##$SF= 81.0140089999694
##$SI= 65536
##$SIGF1= 159.3651
##$SIGF2= -187.1042
##$SINO= 113.3802
##$SIOLD= 16384
##$SREGLST= <1H.CDCl3>
##$SSB= 0
##$STSI= 65536
##$STSR= 0
##$SW_p= 40650.406504065
##$SYMM= 0
##$S_DEV= 0
##$TDeff= 32768
##$TDoff= 0
##$TI= <>
##$TILT= no
##$TM1= 0
##$TM2= 0
##$TOPLEV= 0
##$USERP1= <user>
##$USERP2= <user>
##$USERP3= <user>
##$USERP4= <user>
##$USERP5= <user>
##$WDW= 1
##$XDIM= 65536
##$YMAX_p= 300706831
##$YMIN_p= -244079963
$$ End of Bruker specific parameters
$$ ---------------------------------
##NTUPLES= NMR SPECTRUM
##VAR_NAME=  FREQUENCY,     SPECTRUM/REAL,   SPECTRUM/IMAG
##SYMBOL=    X,             R,               I
##VAR_TYPE=  INDEPENDENT,   DEPENDENT,       DEPENDENT
##VAR_FORM=  AFFN,          ASDF,            ASDF
##VAR_DIM=   65536,         65536,           65536
##UNITS=     HZ,            ARBITRARY UNITS, ARBITRARY UNITS
##FACTOR=    0.620285442955139, 1,           1
##FIRST=     20137.2065510682, 0,            0
##LAST=      -20513.1999529968, 0,           0
##MIN=       -20513.1999529968, -244079963,  0
##MAX=       20137.2065510682, 300706831,    0
$$ Real data points
##PAGE= N=1
##DATA TABLE= (X++(R..R)), XYDATA
$$ [...]
42139a2900905j1652312K059648J5831202J6358362M071127o633479n627735o73428
$$ -12900905 -24553217 -22493569 -6662367 9695995 13767122 7133643 1505908 832480
42131H32480m160038j2413981j1540231j44918Q861399Q372028M683170M259231
$$ 832480 -3327558 -15741539 -27281770 -27426688 -18565289 -10193261 -5510091 -1250860
42123a250860N749806O291010M667000j538188j1484953j6291443j0189331j981029
$$ -1250860 4498946 10789956 15456956 13918768 2433815 -13857628 -24046959 -26027988
42115b6027988j644027j843297Q854231K0190531J1873350j0111459j6401497
$$ -26027988 -27672015 -29515312 -20661081 -470550 11402800 1291341 -15110156
42108a5110156J034385J4653675L572974j5228358j5231822O52744J0080293N713106
$$ -15110156 -14075771 577904 4150878 -11077480 -26309302 -25656558 -15576265 -9863159
42100i863159j196001k497606K62518N209295J0723223J1210179M282969l483213
$$ -9863159 -11059160 -13556766 -13294248 -8084953 2638270 13848449 18131418 14648205
42092A4648205p574799j3128978k0949557j8558249m50228J5125297R551999n567967
$$ 14648205 7073406 -6055572 -27005129 -45563378 -46013606 -30888309 -21336310 -26904277
42084b6904277m348592J2655352J9251510M671178j2055126j3717541o787873
$$ -26904277 -31252869 -18597517 653993 5325171 -6729955 -20447496 -27235369
42077b7235369k530746J946991J0769498J5494802R484535K033655K725755L751282
$$ -27235369 -29766115 -27819124 -17049626 -1554824 7929711 9963366 12689121 16440403
42069A6440403n403794j5601223r707541Q639176J7498564P493076p403940j2554333
$$ 16440403 11036609 -4564614 -14272155 -5632979 11865585 19358661 11954721 -599612
42061e99612j0119214q192717o327136r29942M232396K835122l218116n601309
$$ -599612 -10718826 -18911543 -25238679 -26168621 -21936225 -19101103 -22319219 -27920528
42053b7920528k30651Q739313J3849184J0291656m71309j0415764j1049527k215287
$$ -27920528 -28151179 -19411866 -5562682 4728974 4257665 -6158099 -17207626 -19422913
42045a9422913P599727J0920429P903465K769860j309117k269763K82639K351388
$$ -19422913 -11823186 -902757 7000708 9770568 8461451 6191688 6474327 8825715
42037H825715r17464o905815p513135j834358J755226r174P88174Q329124J3226999
$$ 8825715 7908251 1002436 -6510699 -8345057 -6589831 -6599005 -5810831 2518293 15745292
42028A5745292P516769j205809l352256m523011j2359588j5594852J080596K5178696
$$ 15745292 23262061 22056252 18703996 14180985 1821397 -13773455 -12692859 12485837
42020A2485837K5714774j694386k4367656j7420301L591107R977170M60770n521672
$$ 12485837 38200611 36506225 12138569 -5281732 -1690625 8286545 8747315 3225643
42012C225643j392576K281868Q33367J716015P999615J2227788Q723101K50r931682
$$ 3225643 1833067 4114935 4948302 6664317 14663932 26891720 35614821 35615071 25683389
42003B5683389j8295318j9786827j0578931L321555J0969528J0135579P632074
$$ 25683389 7388071 -12398756 -22977687 -19656132 -8686604 1448975 9081049
41996I081049O506286K506447n508686j0589397o383247M551780J3029939J0979868
$$ 9081049 15587335 18093782 12585096 1995699 -4387548 164232 13194171 24174039
41988B4174039j678752j4865783j6909253q991943m445174q177141o974363Q706923
$$ 24174039 22495287 7629504 -9279749 -18271692 -22716866 -30894007 -37868370 -29161447
41980b9161447K3659688J6306615p422555j9381549q598941N508838M480630m392397
$$ -29161447 -5501759 10804856 3382301 -15999248 -24598189 -19089351 -14608721 -19001118
41972a9001118m836875K969745P356941M886103J496016J26593j156336k229952
$$ -19001118 -23837993 -20868248 -13511307 -8625204 -7129188 -7002595 -8158931 -10388883
41964a0388883j251140M70941N33521k57833l25943k38950N84804M681858J0073153
$$ -10388883 -11640023 -11169082 -10635561 -10893394 -11219337 -11458287 -10873483 -6191625 3881528
41955C881528R756659K621234k823104j862493j943120q771164j3035193l938013
$$ 3881528 13638187 16259421 13436317 11573824 9630704 859540 -12175653 -16113666
41947a6113666J0360613J1710493o94353q870681m256137j38005p989649j6759122
$$ -16113666 -5753053 5957440 5263087 -3607594 -7863731 -8001736 -15991385 -32750507
41939c2750507r658273Q368640J7004829J0627427M254071P385742R337987p31539
$$ -32750507 -42408780 -34040140 -17035311 -6407884 -2153813 5231929 14569916 13838377
41931A3838377j3559415j3492745l320321J170464k662532j674580Q255024J2859852
$$ 13838377 278962 -13213783 -16534104 -15363640 -18026172 -19700752 -11445728 1414124
41923A414124K307619j1482514j1389354J428478J2014069J1952669M425370m486667
$$ 1414124 3721743 -7760771 -19150125 -17721647 -5707578 6245091 10670461 6183794
41915F183794q820648l207785Q515549J1224628k569069j7368239j2768382P031138
$$ 6183794 -2636854 -5844639 2670910 13895538 11326469 -6041770 -18810152 -11779014
41907a1779014J8080518R969788k818480n214573n31946J198178j32707J152814
$$ -11779014 6301504 16271292 13452812 8238239 7706293 8904471 8771764 9924578
41899I924578N050937P168795N928418K481751k329007p071296r441116q802536
$$ 9924578 14975515 22144310 28072728 30554479 28225472 21154176 11713060 2910524
41891B910524n856098o61795M892669N990382K269918J103357N190041M267814
$$ 2910524 -2945574 -3607369 1285300 7275682 9545600 10648957 15838998 20106812
41883B0106812q218863j8258207r289234Q751449J1360190j421801m548358R678328
$$ 20106812 11887949 -6370258 -15659492 -6908043 4452147 3030346 -1518012 8160316
41875H160316J7847470N087168r733074o500970L196442p09828j0268731m212128
$$ 8160316 26007786 31094954 21361880 14860910 18057352 17347524 7078793 2866665
41867B866665J3167634J6938777Q72093j4202411j2133423k09985O687104L741504
$$ 2866665 16034299 32973076 33845169 19642758 7509335 7299350 13986454 17727958
41859A7727958m994880j2134244r867579J451103Q888838K596298p491631m551383
$$ 17727958 12733078 598834 -9268745 -7817642 1071196 3667494 -3824137 -8375520
41851h375520Q758667J3539577L713471o002185m347333J201118J92009l913443
$$ -8375520 383147 13922724 17636195 11634010 7286677 8487795 8679804 4766361
41843D766361k191970L772820M300886l931741j2829459j1907082j04496J1813206
$$ 4766361 2574391 6347211 10648097 6716356 -6113103 -18020185 -18124681 -6311475
41835f311475J2580503M376216k73847K734432L317929m080358q469170m20833
$$ -6311475 6269028 10645244 10371397 13105829 16423758 12343400 3874230 3453397
41827C453397R540237O726005k914519k941460N356418O392976j773842n925709
$$ 3453397 12993634 19719639 16805120 13863660 19220078 25613054 23839212 17913503
41819A7913503l309584m631596r278017k947612J3732825J9516425N635463r343936
$$ 17913503 14603919 9972323 694306 -2253306 11479519 30995944 36631407 27287471
41811B7287471j0585614r247251j6901322k0331093m408856J7424485K0846347
$$ 27287471 16701857 7454606 -9446716 -29777809 -34186665 -16762180 4084167
41804D084167P076348l108998l194995l725385o721150l156026M708565L075343
$$ 4084167 11160515 8051517 4856522 1131137 -5590013 -8746039 -4037474 -962131
41796i62131q026623j1400518p14646Q221070K847899o886059n691916M251705
$$ -962131 -8988754 -20389272 -21103918 -12882848 -10034949 -16921008 -22612924 -18361219
41788a8361219R724476O226682j26746m444436o884460p755927o010076j369674
$$ -18361219 -8636743 -2410061 -2536807 -6981243 -13865703 -21621630 -27631706 -29001380
41780b9001380N251241J1280917J2134458O137739m90439m03258L464107J974143
$$ -29001380 -23750139 -12469222 -334764 5802975 5312536 4909278 8373385 10347528
41772A0347528m786718p281814l067962k90405j070267L218549J2803312J2271238
$$ 10347528 5560810 -1721004 -4788966 -5079371 -6149638 -2931089 9872223 22143461
41764B2143461m816540j9136136j1121055Q016319J1719958k347454j1370742
$$ 22143461 17326921 -1809215 -12930270 -4913951 6806007 4458553 -6912189
41757f912189m407235L723188K34291o130249l406260L764047N272730K734107
$$ -6912189 -11319424 -7596236 -7361945 -13492194 -16898454 -13134407 -7861677 -5127570
41749e127570K192039M53776p428285j4883912j1649868K36646J0114764J3758175
$$ -5127570 -2935531 -2481755 -9910040 -24793952 -36443820 -36207174 -26092410 -12334235
41741a2334235J3586863Q918793j157838q593326l927195P618540J0835717K586598
$$ -12334235 1252628 10171421 9013583 420257 -3506938 4111602 14947319 17533917
41733A7533917l538269J829688R750613O260071q143041j9214646j5248943J859741
$$ 17533917 13995648 15825336 25575949 31836020 23692979 4478333 -10770610 -8910869
41725h910869J9077716K3063862J1254957n592861j3346596p663975L410290Q354386
$$ -8910869 10166847 33230709 44485666 38892805 25546209 17882234 21292524 29646910
41717B9646910K344408q537462j1624508n21615J4765369J7386557N707798m451928
$$ 29646910 31991318 23453856 11829348 11307733 26073102 43459659 49167457 44715529
41709D4715529m621244o721679k0342941l1546457k2297362l54277J1409370Q204904
$$ 44715529 40094285 33372606 13029665 -18516792 -40814154 -41168431 -29759061 -21554157
41701b1554157L126394k42088q524887j4469823k230135K0060510K3679881L412372
$$ -21554157 -18427763 -18669851 -27194738 -41664561 -43894696 -23834186 -154305 3258067
41693C258067j1961603n024430N167748l3036p419979l67636Q620287J707999
$$ 3258067 -8703536 -13727966 -8560218 -8593254 -16013233 -16380869 -7760582 -6052583
41685f052583j0391188q426103J78345k227529p616357L191774K1777134K3134182
$$ -6052583 -16443771 -24869874 -24691529 -26919058 -34535415 -31343641 -9566507 13567675
41677A3567675Q160330K47144L800719J273260r909659j2941809n795143m613727
$$ 13567675 21728005 21975149 25775868 27049128 17139469 4197660 -1597483 -6211210
41669f211210r017763p0649J9657188K0944822m222947k4543730j6171554M184615
$$ -6211210 -15228973 -15299622 4357566 25302388 21079441 -3464289 -19635843 -15451228
41661a5451228J1886357R690524Q701075K984000j1024583j5262527J285482J6064560
$$ -15451228 -3564871 6125653 14826728 17810728 6786145 -8476382 -7190900 8873660
41653H873660M814803j8087410k1765932o128745M826254M892072P470287J3260393
$$ 8873660 13688463 -4398947 -26164879 -32293624 -27467370 -22575298 -15105011 -1844618
41645a844618R798234K67072P71376Q928526N818464q797910j3698010l414668
$$ -1844618 7953616 8220688 8992064 17920590 23739054 14941144 1243134 -2171534
41637b171534J976180p139559j3074494k713396R931322Q986273J982834J978381
$$ -2171534 -195354 -7334913 -20409407 -23122803 -13191481 -4205208 -2222374 -243993
41629b43993L720382k662710r682964m860633O220139R021624L672005P58597
$$ -243993 3476389 813679 -8869285 -13729918 -7509779 1511845 5183850 5942447
41621E942447R02024k234674m313191L602375J4087910J0281057m922177q834213
$$ 5942447 6844471 4609797 296606 3898981 17986891 28267948 23345771 14511558
41613A4511558N409613J4745968O28878k0454901k0095821l17583J0222405j49997
$$ 14511558 19921171 34667139 35296017 14841116 -5254705 -5572288 4650117 4500120
41605D500120j0031421L71325J8482848J8672334K464j4488432j2016482m042570
$$ 4500120 -5531301 -5159976 13322872 31995206 31997670 17509238 5492756 1450186
41597A450186l271088m774263M42223O913459L826306n035814n514662M803794
$$ 1450186 -1820902 -6595165 -6152942 760517 4586823 -448991 -5963653 -1159859
41589a159859J1954010M693041j1732578k3229397k0642064m746433J4659927
$$ -1159859 10794151 15487192 3754614 -19474783 -40116847 -44863280 -30203353
41582c0203353K3240471J3806675m005255j2702979p090095K276279O579184Q849792
$$ -30203353 -6962882 6843793 2838538 -9864441 -16954536 -14678257 -8099073 750719
41574G50719J2802710J3381221O359105k215903n612872p302028j1745777j2139902
$$ 750719 13553429 26934650 33293755 31077852 25464980 18162952 6417175 -5722727
41566e722727r73619J2373780J0703964m971917j4431695o426386O915094J0085951
$$ -5722727 -6696346 5677434 16381398 11409481 -3022214 -9448600 -2533506 7552445
41558G552445N276072L904167P332540P736365K395506l794927p161386p866361
$$ 7552445 12828517 16732684 24065224 31801589 34197095 30402168 23240782 15374421
41550A5374421o224087l909918n557285j1378181j2351734k435146Q281600N031885
$$ 15374421 9150334 5240416 -316869 -11695050 -24046784 -26481930 -18200330 -13168445
41542a3168445q437806j2319025J241814J6563683J6794377N510631k563515k359890
$$ -13168445 -21606251 -33925276 -32683462 -16119779 674598 6185229 3621714 1261824
41534A261824L29184J243163M56871k706287p587016q028373M60562J1293497
$$ 1261824 1591008 2834171 3291042 584755 -7002261 -15030634 -14570072 -3276575
41526c276575J2957085L549465p665996j1640471o504304L644389J0143477M328772
$$ -3276575 9680510 13229975 5563979 -6076492 -12580796 -8936407 1207070 5535842
41518E535842j0611936j6929604k752522J8173049K1068824L774577r845721l583115
$$ 5535842 -5076094 -22005698 -24758220 -6585171 14483653 18258230 8412509 4829394
41510D829394R772204R252241m828580j4299944q732499M407989J2517045J0999565
$$ 4829394 14601598 23853839 19025259 4725315 -4007184 400805 12917850 23917415
41502B3917415L451712m551962r709093j1207192q046005J322356J3233453J6055787
$$ 23917415 27369127 22817165 13108072 1900880 -6145125 -4822769 8410684 24466471
41494B4466471J964278j8410152k3673409p851200J0989101J4135722M772439
$$ 24466471 26430749 8020597 -15652812 -23504012 -12514911 1620811 6393250
41487F393250j111233J890445N365089K959339j467001j318558M458112J0751351
$$ 6393250 5282017 7172462 12537551 15496890 14029889 12711331 17169443 27920794
41479B7920794R993141r44836j3922236j4774897r93630J1917663R737182q09578
$$ 27920794 37913935 36969099 23046863 8271966 7278336 19195999 28933181 28123603
41471B8123603k654753N551797Q068517k757256j4285586j2451340j726293K875064
$$ 28123603 25468850 31020647 39089164 36331908 22046322 9594982 7868689 10743753
41463A0743753k874804r157106q022157l050935r27927o68516K794293P440444
$$ 10743753 7868949 -1288157 -9310314 -12361249 -13289176 -13957692 -11163399 -3722955
41455c722955M420775q346494j9276233j5737320k85703J2400751J3108049N460155
$$ -3722955 697820 -7648674 -26924907 -42662227 -42947930 -30547179 -17439130 -11978975
41447a1978975l014755q176724p077605J341808J0381704J0284724K711253k1589
$$ -11978975 -14993730 -23170454 -30248059 -28906251 -18524547 -8239823 -5528570 -5550159
41439e550159N037451N109145o155032j3858891l151589J5556708K0039811P929008
$$ -5550159 -512708 4596437 -1558595 -15417486 -18569075 -3012367 17027444 24956452
41431B4956452l688180o151509o435403p197785j427275Q568368P952641n706719
$$ 24956452 21268272 15116763 8681360 1483575 56300 8624668 16577309 10870590
41423A0870590j3235651k406117J0877824O548086p655120q592005N581398J3631602
$$ 10870590 -2365061 -4771178 6106646 12654732 4999612 -3592393 1989005 15620607
41415A5620607N227661n266745m428218K76593k789564q020376l202828P836533
$$ 15620607 20848268 15581523 11153305 11429898 8640334 619958 -2582870 5253663
41407E253663J0250635J997840m207946l082345l996186j1139803j2748300m55337
$$ 5253663 15504298 17502138 13294192 10211847 6215661 -4924142 -17672442 -18127779
41399a8127779J3632920J3076337J337654n203642k104975J599808K375191M460231
$$ -18127779 -4494859 8581478 9919132 4715490 2610515 4210323 6585514 11045745
41391A1045745M883314l665474j3446410o974159J2781520K0488821O844423m901952
$$ 11045745 15929059 12263585 -1182825 -8156984 4624536 25113357 31957780 27055828
41383B7055828L274233J3350076J873681j8064988j6231694M843136J3176632
$$ 27055828 30330061 43680137 45553818 27488830 11257136 16100272 29276904
41376B9276904k197207j7249078j3835891l697960j338445n16709O681999R968773
$$ 29276904 27079697 9830619 -4005272 -7703232 -9041677 -9558386 -2876387 7092386
41368G092386q63431j4120007j2370437L45967N768598j047007p856637n016027
$$ 7092386 6228955 -7891052 -20261489 -19915522 -14146924 -15193931 -23050568 -28066595
41360b8066595M565468J2985986J4197796O089710n122704o619580N330095J5721249
$$ -28066595 -23501127 -10515141 3682655 9772365 4649661 -1969919 3360176 19081425
41352A9081425P849436j2903374k4136690j4817934K828699J1669116R195431
$$ 19081425 26930861 14027487 -10109203 -24927137 -22098438 -10429322 -1233891
41345a233891L840073L87578k617389m580214j280824O245154Q465397l24579
$$ -1233891 2606182 2993760 376371 -4203843 -5484667 760487 9225884 8901305
41337H901305j0183436o095090Q868107J3362547k380793j8744987j1903431J2216476
$$ 8901305 -1282131 -7377221 1490886 14853433 12472640 -6272347 -18175778 -5959302
41329e959302K6424453J9595230N543741m058963j2812656k1110424j7832030
$$ -5959302 20465151 40060381 45604122 41545159 28732503 7622079 -10209951
41322a0209951j624348R439694L846196m586605Q7984R387714O068376o175897
$$ -10209951 -11834299 -2394605 1451591 -3135014 -3047030 6340684 12409060 6233163
41314F233163j0322582n121889m042752r011128p568772L021204R122265K518627
$$ 6233163 -4089419 -9211308 -13254060 -22265188 -29833960 -26812756 -17690491 -15171864
41306a5171864p606332r803730m072279M323606J2488571J6243109J0064121l020112
$$ -15171864 -22778196 -32581926 -36654205 -32330599 -19842028 -3598919 6465202 3445090
41298C445090j0187380l679418R094756J4703431Q062556m975063j4518837j4116224
$$ 3445090 -6742290 -10421708 -1326952 13376479 21439035 16463972 1945135 -12171089
41290a2171089n571028K477380L704051O86874n48392J321796M715345R367922
$$ -12171089 -17742117 -15264737 -11560686 -10873812 -11422204 -10100408 -5385063 3982859
41282C982859J2169868N828908q915567j7119246p998990P321307J1226032O206369
$$ 3982859 16152727 21981635 13066068 -4053178 -12052168 -4730861 6495171 12701540
41274A2701540P316313J2707149N373683j4240437k2465020p709917J0539640
$$ 12701540 20017853 32725002 38098685 23858248 1393228 -6316689 4222951
41267D222951J0549268k322233r650022p774820n176065l710686N49823M990485
$$ 4222951 14772219 12449986 2799964 -4974856 -10150921 -13861607 -13311784 -8321299
41259h321299L758527j304732m313285m704665l863139L83422O832329P336522
$$ -8321299 -4562772 -5867504 -10180789 -14885454 -18748593 -18365171 -11532842 -4196320
41251d196320J50011l213291M107413J0745356N351194l265298j606426L717322
$$ -4196320 -4046309 -7259600 -3152187 7593169 12944363 9679065 8072639 11789961
41243A1789961j998014j2705072r460724O006644J1430868k16955r944912m167443
$$ 11789961 9791947 -2913125 -12373849 -6367205 5063663 4846708 -5098204 -9265647
41235i265647N627991M363965m524667r377920o942580J107741J3381147K1504422
$$ -9265647 -3637656 726309 -3798358 -13176278 -20118858 -19011117 -5629970 15874452
41227A5874452J3544448n325274j2291616J063561J3474341N450310j1375758
$$ 15874452 29418900 24093626 11802010 12865571 26339912 31790222 20414464
41220B0414464j5147200q084331o550797r161554j995285J0900483J0874864j809380
$$ 20414464 5267264 -2817067 -9367864 -18529418 -20524703 -9624220 1250644 -558736
41212e58736n511779O952581J5730134O371672q031330j0084366m347144m664661
$$ -558736 -6070515 882066 16612200 22983872 14952542 4868176 521032 -4143629
41204d143629r656611p804490J863486R397141R285384M638562J42970n28659
$$ -4143629 -13800240 -21604730 -19741244 -10344103 -1058719 3579843 3722813 3194154
41196C194154M576469J0405191P346345l809125q590789J20075Q153522J34119
$$ 3194154 7770623 18175814 25522159 21713034 13122245 13242320 21395842 21529961
41188B1529961j5679525j8973070p665201J634872R01928q28992K178514K770463
$$ 21529961 5850436 -13122634 -20787835 -19152963 -18251035 -19080027 -16901513 -14131050
41180a4131050j927973j041451J1328547K0992371J1353753j1029067k2709544
$$ -14131050 -16059023 -17100474 -5771927 15220444 26574197 15545130 -7164414
41173g164414j3229707L545540R886511N774160L705706P805425P928749l556399
$$ -7164414 -20394121 -16848581 -6962070 -1187910 2517796 10323221 18251970 14695571
41165A4695571j7353444j7781413m638462O054874M770644N31388M077170R929520
$$ 14695571 -2657873 -20439286 -25077748 -19022874 -14252230 -13720842 -9643672 285848
41157B85848O461386l744080p541027j825206L568401L193570K752887O427697
$$ 285848 6747234 3003154 -4537873 -6363079 -2794678 398892 3151779 9579476
41149I579476R496995P338618J865611m503158j2041131j7438628j3550759j13837
$$ 9579476 19076471 26415089 28280700 23777542 11736411 -5702217 -19252976 -19366813
41141a9366813J2481953J4157470M563450r411849j8753533j5394073N31883J5976940
$$ -19366813 -6884860 7272610 11836060 2424211 -16329322 -31723395 -31191512 -15214572
41133a5214572J7270273P536355J494425L678671N077038J478207p38451O81875
$$ -15214572 2055701 9592056 11086481 14765152 19842190 21320397 20581946 21263821
41125B1263821L60900k28280O193326J2466099O14673k4822551l2077320p204922
$$ 21263821 21624721 21396441 27589767 40055866 40670539 15847988 -16229332 -23434254
41117b3434254J9667138J5668179p255384j3531092K324100J4228076Q528321
$$ -23434254 -3767116 11901063 4645679 -8885413 -6561313 7666763 16195084
41110A6195084k178310p471991j1672704j4915135q163113O659266J3965519Q408440
$$ 16195084 14016774 6544783 -5127921 -20043056 -28206169 -21546903 -7581384 827056
41102H27056J662767J89126l223602r674734p667843M195289Q778083k553719
$$ 827056 2489823 2678949 -544653 -10219387 -17887230 -13691941 -4913858 -7467577
41094g467577j2569344l295764J5672677K0781658P196275p868743r493224K34093
$$ -7467577 -20036921 -23332685 -7660008 13121650 20317925 12449182 2955958 3190051
41086C190051R586673R826569J182275q618580j2743991j2659312j3069741j1941241
$$ 3190051 12776724 22603293 23785568 15166988 2422997 -10236315 -23306056 -35247297
41078c5247297m613459M281217N996985M166472R839098J8398027J1622258j0104435
$$ -35247297 -39860756 -35579539 -29582554 -25416082 -15576984 2821043 14443301 4338866
41070D338866j9146193J545621K9824257L2089609O940254j8201860k4795563
$$ 4338866 -14807327 -13261706 16562551 48652160 55592414 37390554 12594991
41063A2594991j7368881n815922N399839J0524825L558261r961569j5714095r256473
$$ 12594991 -4773890 -10589812 -5189973 5334852 8893113 -1068456 -16782551 -26039024
41055b6039024j412831j603524n336024l019900N638733J1458959P455741k398924
$$ -26039024 -27451855 -29055379 -34391403 -37411303 -31772570 -20313611 -12857870 -15256794
41047a5256794o565953R36768J1786335J2534234K754367l965690r4107M750873
$$ -15256794 -21822747 -20885979 -9099644 3434590 6188957 2223267 2129160 6880033
41039F880033k32391r368574r414107M31224R251009J1155777R290590N120744
$$ 6880033 6647642 -2720932 -12135039 -11703815 -2452806 8702971 17993561 23114305
41031B3114305l841869j4408292j6887535q092720K397054L879326j893804l322330
$$ 23114305 19272436 4864144 -12023391 -20116111 -17719057 -13839731 -15733535 -19055865
41023a9055865O065070J8446191J9453017N208245j1358992j4548332l653059
$$ -19055865 -12990795 5455396 24908413 30116658 18757666 4209334 556275
41016E56275Q603457J2643485R031554R27349r423889j5927965j2029916j587406
$$ 556275 9159732 21803217 30834771 31762120 22338231 6410266 -5619650 -7207056
41008g207056M323054L178171J595914o9955p225782j3399778m434528J3476493
$$ -7207056 -2884002 294169 1890083 1820128 -5405654 -18805432 -23239960 -9763467
41000i763467J4366688o862255k0184381n487233J3638699P272000j2257737j2543147
$$ -9763467 4603221 -2259034 -22443415 -27930648 -14291949 -7019949 -19277686 -31820833
40992c1820833M795793J0939497K040811K748480J6882550J6279687j0028234
$$ -31820833 -27025040 -16085543 -14044732 -11296252 5586298 21865985 11837751
40985A1837751l1913158k1853190N355025J7134977O982551n923135o392340M603945
$$ 11837751 -20075407 -41928597 -36573572 -19438595 -12456044 -18379179 -24771519 -20167574
40977b0167574J7257419J9988662Q218078o301833o330272N518372P958188o020750
$$ -20167574 -2910155 17078507 25296585 18994752 12664480 18182852 26141040 20120290
40969B0120290j6464804p357543Q943895J2767938N584491M34573j462502n725018
$$ 20120290 3655486 -3702057 5241838 18009776 23594267 24028840 22566338 16841320
40961A6841320p917533j239661O780255L920897n767525p762416J26962O738206
$$ 16841320 8923787 7684126 14464381 18385278 12617753 4855337 4982299 11720505
40953A1720505O453458L958797J805175k442685o768462n229086R97641L631535
$$ 11720505 18173963 22132760 23937935 21495250 14726788 9497702 10495343 14126878
40945A4126878n03597n956043p889023p234819o215236n174894m329870m101559
$$ 14126878 13623281 7667238 -221785 -7456604 -13671840 -18846734 -23176604 -27278163
40937b7278163l999327l634396k646470J246318Q941577J4175363R559017n6358
$$ -27278163 -31277490 -34911886 -37558356 -36312038 -27370461 -13195098 -3636081 -3692439
40929c692439j741812M643827M465401n942383q984553N628782J8925955R061898
$$ -3692439 -5434251 -790424 3674977 -2267406 -11251959 -5623177 13302778 22364676
40921B2364676j2849114j7353802p35072J1236047L895025o942707l401140P612089
$$ 22364676 9515562 -7838240 -8573312 2662735 6557760 -384947 -3786087 3826002
40913C826002Q586286j432743q003165l291203M823306N045321k784176p837976
$$ 3826002 12412288 10979545 2976380 -314823 4508483 9553804 6769628 -1068348
40905a068348k266702P018816N421724q707095j8035196p692393J3473587K2939762
$$ -1068348 -3335050 3683766 9105490 398395 -17636801 -25329194 -11855607 11084155
40897A1084155J2480218m146072j0497525n019556J891441J767936k886231j723779
$$ 11084155 23564373 19418301 8920776 3901220 5792661 7560597 4674366 2950587
40889B950587R214819J7459313P769875j2347617j6144289M690458K2961915J2769540
$$ 2950587 12165406 29624719 37394594 25046977 8902688 13593146 36555061 49324601
40881D9324601j1831007j7503306k52295J3406360R079267k00228k558922l409446
$$ 49324601 37493594 19990288 19737993 33144353 42223620 42023392 39464470 36055024
40873C6055024o789665n996367j772590o117780j7267218j4624711P051109K1299992
$$ 36055024 29265359 23268992 21496402 15378622 -1888596 -16513307 -9462198 11837794
40865A1837794O945540j7907983k1578365l896063R245978O869532K094676L409827
$$ 11837794 18783334 875351 -20703014 -24599077 -15353099 -8483567 -6388891 -2979064
40857b979064K407433n604239r959983k669860O765416N169524m705186q562541
$$ -2979064 -571631 -6175870 -16135853 -18805713 -12040297 -6870773 -11575959 -20138500
40849b0138500n02686R924248J0830582K622311l808907j814149L183503L206313
$$ -20138500 -20641186 -10716938 113644 2735955 -1072952 -2887101 296402 3502715
40841C502715l06287j086213m63190m026486p199142J191482J7494371K1350820
$$ 3502715 3196428 2110215 1647025 -2379461 -9578603 -8387121 9107250 30458070
40833C0458070M175480j4908529j4701623j647218K397690o374402j1598517m900678
$$ 30458070 34633550 19725021 5023398 3376180 5773870 -600532 -12199049 -17099727
40825a7099727L197070K939952q48510p71239L15760l302906q538477p516993
$$ -17099727 -13902657 -10962705 -11811215 -12582454 -12266694 -15569600 -24108077 -31625070
40817c1625070R06996R570149J1227991N675805K0841J873749R997033J3597543
$$ -31625070 -30718074 -21147925 -9919934 -4244129 -4223288 -2349539 7647494 21245037
40809B1245037N092107q747080j4335376q225450N31553M074666L702608L224538
$$ 21245037 26337144 17590064 3254688 -4970762 -4439209 -364543 3338065 6562603
40801F562603K183283j316116o390114j0373346j0524975n056361L082299N603003
$$ 6562603 8745886 7429770 1039656 -9333690 -19858665 -24915026 -21832727 -16229724
40793a6229724r71512o915710p93124J1887940J4082812K906750m568016K798133
$$ -16229724 -17201236 -24116946 -24910070 -13022130 1060682 3967432 -600584 2197549
40785B197549J2942690R934207j504659n315572J17636K140033l327571n657624
$$ 2197549 15140239 25074446 23569787 18254215 18371851 20511884 17184313 11526689
40777A1526689J885806J1005579J0302545j160243j5610586k3808697j8722913
$$ 11526689 13412495 24418074 34720619 33560376 17949790 -5858907 -24581820
40770b4581820j109501J6156452J8616812P849879q84838o32085j29791n266563
$$ -24581820 -25691321 -9534869 9081943 16931822 16046984 15414899 15285108 10018545
40762A0018545q067678k937282O40879n350272j0808924l589415Q107256Q412989
$$ 10018545 1950867 -986415 -345536 -5695808 -16504732 -20094147 -11986891 -3573902
40754c573902J096468K281202J0103773O381064j0101976j7333074m411284J0912840
$$ -3573902 -2477434 -196232 9907541 16288605 6186629 -11146445 -15557729 -4644889
40746d644889J0207843l69582n969028n706753m208275K405378J4249752J6259256
$$ -4644889 5562954 5193372 -775656 -6482409 -10690684 -8285306 5964446 22223702
40738B2223702q85665k0153533j9264612k911067P154227N530727L573139L207487
$$ 22223702 21338037 1184504 -18080108 -20991175 -13836948 -8306221 -4733082 -1525595
40730a525595l739454j2411484p533502Q764480J6466908R364097L347637O809715
$$ -1525595 -5265049 -17676533 -25210035 -16445555 21353 9385450 12733087 19542802
40722A9542802P006795l946024j2350805o206483M175900M748050O75129L333719
$$ 19542802 26549597 22603573 10252768 4046285 8222185 12970235 13645364 16979083
40714A6979083P293617o83013j7077521k3776707j2684255M840691J3080661Q333901
$$ 16979083 24272700 23589687 6512166 -17264541 -29948796 -25108105 -12027444 -3693543
40706c693543K03798L9845O892378P158385n453921j5386952n447088J2606956
$$ -3693543 -3489745 -3449900 3442478 10600863 5146942 -10240010 -15687098 -3080142
40698c080142J0464346j1705060k0241815J151743K3736964J6792319o203090
$$ -3080142 7384204 -4320856 -24562671 -23410928 326036 17118355 10915265
40691A0915265j1508289K734445R763265J68221p356203o33394Q282612N336016
$$ 10915265 -593024 2141421 11904686 12072907 4716704 4083310 12365922 17701938
40683A7701938n975792j3467761j0813456p7690R757409P807470n055540j2195053
$$ 17701938 11726146 -1741615 -12555071 -12632761 -2875352 4932118 -123422 -12318475
40675a2318475k468156J1728709J2042029J361871m320958l094985m796469p445971
$$ -12318475 -14786631 -3057922 8984107 10345978 6025020 2930035 -1866434 -9312405
40667i312405J34411J4420161J9311723J1690686K596890n458206j7669575k4691184
$$ -9312405 -9177994 5242167 24553890 36244576 38841466 33383260 15713685 -8977499
40659h977499j0210710J5916463K2486211L105308j2175163l298886J1065426
$$ -8977499 -19188209 -3271746 19214465 22319773 10144610 6845724 17911150
40652A7911150Q060288l238620k311478P623765Q852410j409231j2338480j8415336
$$ 17911150 25971438 22732818 20421340 28045105 36897515 35488284 23149804 4734468
40644D734468j8719127r295792O532554J2563333J614799r501518m334465P282465
$$ 4734468 -13984659 -23280451 -16747897 -4184564 -2569765 -12071283 -16405748 -9123283
40636i123283P037846j245210j067101O977214Q134371p17576r807809j5013733
$$ -9123283 -2085437 -3330647 -4397748 2579466 10713837 9996261 188452 -14825281
40628a4825281j7536889j2151167L297927J4343148Q469678p47301O493356J9946133
$$ -14825281 -32362170 -44513337 -41215410 -26872262 -18402584 -19149885 -12656529 7289604
40620G289604J3249278r962539j8201427k506153J0804449N901217L24391P324036
$$ 7289604 20538882 10576343 -7625084 -10131237 673212 6574429 6898820 14222856
40612A4222856R804469n530618j7978774n692520J4540661J3060713l589310m881331
$$ 14222856 24027325 18496707 517933 -5174587 9366074 22426787 18837477 13956146
40604A3956146J1089343J4385340o245974k4443069j7903892J6184O188313K426934
$$ 13956146 25045489 39430829 33184855 8741786 -9162106 -9145922 -2957609 -530675
40596e30675M339482J1151148R090334k527131r750587p168013m029276m812772
$$ -530675 3808807 14959955 24050289 21523158 11772571 4604558 575282 -4237490
40588d237490j032484J0565636J6924590P826381m964982l321364Q532012Q928444
$$ -4237490 -5269974 5295662 22220252 30046633 25081651 21760287 30292299 39220743
40580C9220743p668308k0677167j3604121K233462O172541k056797o467526j094520
$$ 39220743 31552435 10875268 -2728853 -495391 5677150 3620353 -2847173 -3941693
40572c941693M560140L623594j56907k808633m910921m810855J90048M525512
$$ -3941693 618447 4242041 4085134 1276501 -3634420 -8445275 -8255227 -3729715
40564c729715n04467j0179705r349352L976300J3211385Q128373j2150J797573
$$ -3729715 -4234182 -14413887 -23763239 -19786939 -6575554 1552819 1540669 3338242
40556C338242P737861N819351n40583J40853N946971M313418o967086j6669033
$$ 3338242 11076103 16895454 16354871 16495724 22442695 26756113 19789027 3119994
40548C119994j7165977j1470743l751428M755346J0111443P899454K268176J971398
$$ 3119994 -14045983 -25516726 -29268154 -24512808 -14401365 -6501911 -4233735 -2262337
40540b262337O579047P631983M078028L814590P527081M854978p697892j7800035
$$ -2262337 4316710 11948693 16026721 19841311 27368392 32223370 24525478 6725443
40532F725443j4397974l343449K971395K432040p6768m266959j0847992j2554486
$$ 6725443 -7672531 -11015980 -8044585 -5612545 -5689313 -9956272 -20804264 -33358750
40524c3358750k384509J1791751J4251718L410234n653285l114876L195973K629013
$$ -33358750 -35743259 -23951508 -9699790 -6289556 -11942841 -15057717 -11861744 -9232731
40516i232731k100986k495305J42965j461810n111241j023205R601755J1455054
$$ -9232731 -11333717 -13829022 -13686057 -15147867 -20259108 -21282313 -11680558 -225504
40508b25504k321060j5621094r882927P454136J1336550m257101j6112672n613854
$$ -225504 -2546564 -18167658 -28050585 -20596449 -9259899 -13517000 -29629672 -35243526
40500c5243526J3788394J7426045N523575j368230K920441L158667p537552j3728788
$$ -35243526 -21455132 -4029087 1494488 126258 3046699 6205366 -1332186 -15060974
40492a5060974l311242J1307185J1979050J334090n255221m283012l572962l563342
$$ -15060974 -18372216 -7065031 4914019 6248109 992888 -3290124 -6863086 -10426428
40484a0426428K757698J3201731J6595778J0737418N163621L678813j245199j1957214
$$ -10426428 -7668730 5533001 22128779 32866197 38029818 41708631 40463432 28506218
40476B8506218j7318413r027380L941892O693277j707407q137061k728822R649383
$$ 28506218 11187805 2160425 6102317 12795594 11088187 2951126 222304 9871687
40468I871687J5167928O446850p943801j2107240l201781L315606l952951j2931653
$$ 9871687 25039615 31486465 23542664 11435424 8233643 11549249 7596298 -5335355
40460e335355n314935J2283049J4799383k735648j5877833p976296N456496M100078
$$ -5335355 -10650290 1632759 16432142 13696494 -2181339 -10157635 -4701139 -601061
40452f01061m861776k268263R049887R941834j850819p884362J432543J3509862
$$ -601061 -5462837 -7731100 1318787 11260621 9409802 1525440 2957983 16467845
40444A6467845J3531940K447358r018003j2582011o183836M388716P278211k165816
$$ 16467845 29999785 32447143 23429140 10847129 4663293 9052009 16330220 14164404
40436A4164404j1852224q197747K772942M622792k581043l815397L050287L792923
$$ 14164404 2312180 -5885567 -3112625 1510167 -1070876 -4886273 -1835986 1956937
40428A956937l544578j536773J4139850J9399753k584360k9953054l0033424n966841
$$ 1956937 -1587641 -3124414 11015436 30415189 27830829 -2122225 -32155649 -38122490
40420c8122490J0011762L860041n362722R29092J5056422J8411127O845199q105876
$$ -38122490 -28110728 -24250687 -29613409 -28684317 -13627895 4783232 11628431 3522555
40412C522555j3963242p014322O202222J3660527R390157O07030k671099k335288
$$ 3522555 -10440687 -17455009 -11252787 2407740 11797897 12404927 9733828 7398540
40404G398540o531368j1940752o427423Q742988J5420266M502443q908674p252195
$$ 7398540 867172 -11073580 -17501003 -8758015 6662251 11164694 2256020 -4996175
40396d996175M119706P317621k08742m611357J13675L626763j668189p378033
$$ -4996175 -876469 6441152 6232410 1621053 1734728 5361491 3693302 -3684731
40388c684731l000242O817060R218674K177692m148879l948739l145693p192243
$$ -3684731 -6684973 132087 9350761 11528453 7379574 3430835 285142 -6907101
40380f907101j0356864m368291P342625J3084022R337213M290447L048711n15089
$$ -6907101 -17263965 -21632256 -14289631 -1205609 8131604 12422051 15470762 14955673
40372A4955673j0578831j7073160q510980P187817R557947m811612j4269265j579538
$$ 14955673 4376842 -12696318 -21207298 -14019481 -4461534 -9273146 -23542411 -25121949
40364b5121949K0621104K6391368J1043157n833212r299773n073286l836617m455043
$$ -25121949 -4500845 21890523 32933680 27100468 17800695 12727409 8890792 4435749
40356D435749q45540N248431Q227385Q082713O368493p82644j4661244k4025755
$$ 4435749 3590209 8838640 17066025 25148738 31517231 30734587 16073343 -7952412
40348g952412j6245601L102845J4669990J0185950M82414l409115l712792n139253
$$ -7952412 -24198013 -21095168 -6425178 3760772 4243186 834071 -2878721 -8017974
40340h017974l779701L870319J0615647Q034374l39112n145432m882177l917768
$$ -8017974 -11797675 -7927356 2688291 10722665 10383553 5238121 355944 -3561824
40332c561824k397037J490883M141081K618247L402884J2145680J8607258P822360
$$ -3561824 -5958861 -4467978 -326897 2291350 5694234 17839914 36447172 44269532
40324D4269532j3996335k2119627o672621J2329964J1869002m813203j6673240
$$ 44269532 30273197 8153570 1480949 13810913 25679915 20866712 4193472
40317D193472j3374736l130786L028618L166832J300706R16898K910632N229352
$$ 4193472 -9181264 -12312050 -9283432 -6116600 -4815894 -3898996 -988364 4240988
40309D240988M119980j392629p070513q061775m956369k974366n427836r124960
$$ 4240988 8360968 6968339 -102174 -8163949 -13120318 -16094684 -21522520 -30647480
40301c0647480o836625M024205J4983976J3553284j40476j0176120n067640N667730
$$ -30647480 -37484105 -33459900 -18475924 -4922640 -5063116 -15239236 -20306876 -14639146
40293a4639146N914973k204796l236282M948616Q103264Q05918m995417k325696
$$ -14639146 -8724173 -10928969 -14165251 -9216635 -1113371 -307453 -5302870 -7628566
40285g628566m32737m702297n042035L019678N167673o691771j4519729j216940
$$ -7628566 -8061303 -12763600 -17805635 -14785957 -9618284 -16310055 -30829784 -32046724
40277c2046724J7645399J5585592k039774p039268M765481Q269997o374173j6260153
$$ -32046724 -14401325 1184267 -855507 -7894775 -3129294 5140703 -1233470 -17493623
40269a7493623m354615J2316450J1042062j504167m050180L986523N105244n181271
$$ -17493623 -21848238 -9531788 1510274 6107 -4044073 -57550 5047694 -133577
40261a33577j1582287l968439P630188P983924l457871j3330773j0749036Q42960
$$ -133577 -11715864 -15684303 -8054115 -70191 -3528062 -16858835 -27607871 -26764911
40253b6764911Q092755L540132n242700o046906Q05600L658419j911849n905720
$$ -26764911 -18672156 -15132024 -20374724 -26421630 -25616030 -21957611 -23869460 -29775180
40245b9775180P06161J2666662J8563193J4832795N761517l342065p112929j882893
$$ -29775180 -29069019 -16402357 2160836 16993631 22755148 19413083 12300154 10417261
40237A0417261P049319P781315j625819p892936k163545N446794K487762n010814
$$ 10417261 17466580 25247895 23622076 15729140 13565595 19012389 21500151 16489337
40229A6489337l956758K104675Q3486p111206m715986M825745K054640j4431164
$$ 16489337 12532579 14637254 14720740 7609534 2893548 7719293 9773933 -4657231
40221d657231j8793084K425292K4229775J7489869p482192j6952369l695403O800125
$$ -4657231 -23450315 -21025023 3204752 20694621 13212429 -3739940 -7435343 -635218
40213f35218j240297j2106797o376813J0885644K0997746J6005653J667433j2383806
$$ -635218 -1875515 -13982312 -20359125 -9473481 11524265 27529918 29197351 16813545
40205A6813545j6533405o240288Q337671R155627m673530j1874521o5345J3194932
$$ 16813545 280140 -5960148 2377523 11533150 6859620 -5014901 -5080246 8114686
40197H114686O867098r749317j1945376P35677O048813k401483n951846N255121
$$ 8114686 14981784 5232467 -6712909 -5977232 71581 -2329902 -8281748 -3026627
40189c026627J5316374R869923j886810n897473n112207p424902p942895l70763
$$ -3026627 12289747 22159670 20272860 14375387 9263180 1838278 -6104617 -6475380
40181f475380O813952L209484m573287m010137J928906J765257l472870l971527
$$ -6475380 338572 3548056 -1025231 -5035368 -3106462 -1341205 -4814075 -8785602
40173h785602r6718M5328k594706j124669J548463k105727p392015m587974J136267
$$ -8785602 -8882320 -8836992 -11431698 -12556367 -11007904 -13113631 -20505646 -25093620 -23957353
40164b3957353j672824n609282O593341K7351900K7285192M88107k1329335j3804698
$$ -23957353 -25630177 -31239459 -24646118 2705782 29990974 30479081 9149746 -4654952
40156d654952N858415Q079534o275042j4088504o344557N858675J2262741J0777788
$$ -4654952 1203463 9282997 3007955 -11080549 -17425106 -11566431 696310 11474098
40148A1474098J072266j1648606j3307505J899222J7857635J6492554L672335
$$ 11474098 12546364 897758 -12409747 -10510525 7347110 23839664 27511999
40141B7511999k773754k538046q239752j6966119j1985504O624980J7748530J0520673
$$ 27511999 24738245 22200199 13960447 -3005672 -14991176 -8366196 9382334 19903007
40133A9903007k007618o636304o350249n240264J488570J1548655J0076181n707771
$$ 19903007 17895389 11259085 4908836 -331428 1157142 12705797 22781978 17074207
40125A7074207j4851639k592902J4416385J2321996m288371j3075789r595635
$$ 17074207 2222568 -370334 14046051 26368047 22079676 9003887 -591748
40118e91748p379347q642784j961464J0838044J2253962l65250o215925O246213
$$ -591748 -7971095 -16613879 -18575343 -7737299 4516663 4151413 -2064512 4181701
40110D181701J9211909J3028203l425685q253110o17873J051019j0160604k0030117
$$ 4181701 23393610 36421813 32996128 24743018 24125145 25176164 15015560 -5014557
40102e014557j5518340j517418R023709J0859974O912133L56659p269969j2685515
$$ -5014557 -20532897 -22050315 -13026606 -2166632 4745501 5102160 -2167809 -14853324
40094a4853324j0917070r87523R405003R157983k265450j0080864j800066J2984175
$$ -14853324 -25770394 -26757917 -17352914 -8194931 -10460381 -20541245 -22341311 -9357136
40086i357136J3560763m02880o045049O777388J6577593L133065j8086433j7989088
$$ -9357136 4203627 3800747 -2244302 4533086 21110679 24243744 6157311 -11831777
40078a1831777P79478Q634297m219599j5017963o523734R162754J4599126J1504982
$$ -11831777 -11052299 -2418002 -6637601 -21655564 -28179298 -19016544 -4417418 7087564
40070G087564Q502123M202076k970507m817415J764476M655674l712172j0646604
$$ 7087564 15589687 19791763 16821256 12003841 13768317 18423991 14711819 4065215
40062D065215l647760P030212N302994k810642M9902J1633701J3206946R38072
$$ 4065215 417455 7447667 12750661 9940019 9989921 21623622 34830568 35768640
40054C5768640q387004m815628J851114J712823j71451L306335O664682O43147
$$ 35768640 27381636 22566008 24417122 26129945 25958494 29264829 35929511 36572658
40046C6572658j1551726j6449313p444742N951589Q266557l152205j3355501q596794
$$ 36572658 25020932 8571619 1126877 7078466 15345023 12192818 -1162683 -9759477
40038i759477L956734O208876k596220m388475O647349J1769186j407943j5276765
$$ -9759477 -5802743 406133 -2190087 -6578562 68787 11837973 10430030 -4846735
40030d846735q695816Q543652J1169864k392295j1560922p941080k374604k07922
$$ -4846735 -13542551 -4998899 6170965 3778670 -7782252 -15723332 -18097936 -18305858
40022a8305858M962474J1561107P896793n978790j4786909j1009037l435714M38969
$$ -18305858 -13343384 -1782277 6114516 135726 -14651183 -25660220 -29095934 -28656965
40014b8656965L101679N755065N683747O234455J1974648J4599983L606288j0538967
$$ -28656965 -25555286 -19800221 -14116474 -7882019 4092629 18692612 22298900 11759933
40006A1759933p738310P245750Q895971p288091j6725557o971416L410195m76464
$$ 11759933 4021623 11267373 20163344 12875253 -3850304 -10821720 -7411525 -7887989
39998g887989n672192J353704R662731N742822k060634j096353L092699Q95307
$$ -7887989 -13560181 -12206477 -2543746 3199076 1138442 42089 3134788 4030095
39990D030095k820291k042769l256953q784926o237797P712178J4432440L835189
$$ 4030095 1209804 -832965 -4089918 -12874844 -19112641 -11400463 3031977 6867166
39982F867166m946187M051074J4092322N196414r991492j0591542n735123j2634363
$$ 6867166 1920979 5972053 20064375 25260789 15269297 4677755 -1057368 -13691731
39974a3691731j6326211O153714L5037973K8637214r377699l0907275j5347890
$$ -13691731 -30017942 -23864228 11173745 39810959 30433260 -474015 -15821905
39967a5821905N158326L110827n447823J178194J1120587M145851j0905353j1420750
$$ -15821905 -10663579 -7552752 -13000575 -11822381 -701794 3444057 -7461296 -18882046
39959a8882046L342197J5415599J5283202P096034l786290j2857386j3936559
$$ -18882046 -15539849 -124250 15158952 22254986 18468696 5611310 -8325249
39952h325249p002629j245090j258769L98715Q275517J3013162O424779k276793
$$ -8325249 -15327878 -16572968 -17831737 -17433022 -9157505 3855657 10280436 8003643
39944H003643J466773J4797483J8925001K719388k2294653l1651063j2408974
$$ 8003643 9470416 24267899 43192900 45912288 23617635 -8033428 -20442402
39937b0442402J9938194L2806107J2009656j8650224k4857445m578780J2985231
$$ -20442402 -504208 32301899 44311555 25661331 803886 -3774894 9210337
39930I210337R481955k486179n414838r71284K634849P732539J6022155J5404912
$$ 9210337 18692292 16206113 10791275 9819991 12454840 20187379 36209534 51614446
39922E1614446l443362k6323792k9566063j1113032P802038J0904510L571231
$$ 51614446 48171084 21847292 -7718771 -18831803 -11029765 -125255 3445976
39915C445976j3482M377137R237997O598439k828065j0657152j0037371l046024
$$ 3445976 3432494 7809631 17047628 23646067 20818002 10160850 123479 -2922545
39907b922545K818698M094943L323608K695450J304286j280455m048948o759454
$$ -2922545 -103847 3991096 7314704 10010154 11314440 10033985 5985037 -774417
39899g74417p918700k968235Q020671J3938370M840662j0670234j3238058N27072
$$ -774417 -8693117 -11661352 -3640681 10297689 15138351 4468117 -8769941 -8242869
39891h242869J2604865Q994070k645641p670933m900947k787668l724268k830427
$$ -8242869 4361996 13356066 10710425 3039492 -1861455 -4649123 -8373391 -11203818
39883a1203818J675248N458466M379770p02726m581133k207371M890112P991515
$$ -11203818 -9528570 -4070104 309666 -393060 -4974193 -7181564 -2291452 5700063
39875E700063J926702n941300n092392K065302L649422l106006q465027o236085
$$ 5700063 7626765 1685465 -3406927 -1341625 2307797 -798209 -9263236 -15499321
39867a5499321j021165K598461N575936O158637m72181r559098p375354Q276271
$$ -15499321 -16520486 -13922025 -8346089 -2187452 -2659633 -12218731 -19594085 -11317814
39859a1317814K0387487J4472747k003135j1141151p502825l44372J285953k438887
$$ -11317814 9069673 23542420 21539285 10398134 2895309 2550937 3836890 1398003
39851A398003n007071r24209P389097J0167118K972819m253139n48470P322403
$$ 1398003 -3609068 -4533277 2855820 13022938 15995757 11742618 11194148 18516551
39843A8516551M241247o947286p791769M528737J0106264j268737j2092657n469095
$$ 18516551 22757798 15810512 8018743 12547480 22653744 21385007 9292350 3823255
39835C823255P165997M851546r887162j6624650p767303M631431R196898P140664
$$ 3823255 10989252 15840798 5953636 -10671014 -18438317 -13806886 -4609988 2530676
39827B530676M665544M375465M371101N59848p404983j1017637k102894J1368687
$$ 2530676 7196220 11571685 15942786 16502634 9097651 -1919986 -4022880 7345807
39819G345807J2057264n7970m784759O406575J4877425M811181j0014561q377962
$$ 7345807 19403071 19345101 14560342 20966917 35844342 40655523 30640962 22263000
39811B2263000M990653J0357322N738915M779045R099493O816098l942780j1412272
$$ 22263000 27253653 37610975 43349890 48128935 57228428 64044526 60101746 48689474
39803D8689474r648914l803758K413164P818463N818995o407171j4602228l665375
$$ 48689474 39040560 35236802 37649966 45468429 51287424 44880253 30278025 26612650
39795B6612650J5508754J7877211K347466o373134L114979J3481930R896825J813436
$$ 26612650 42121404 59998615 62346081 55972947 59087926 72569856 82466681 84280117
39787H4280117J202585J585404m518635o226592P107849K1706574J6598157k414712
$$ 84280117 85482702 87068106 82549471 76322879 83430728 105137302 121735459 119320747
39779A19320747q997205M711864J6890206Q946545q190471j1235498L405868J7446625
$$ 119320747 110323542 115035406 131925612 140872157 132681686 121446188 124852056 142298681
39771A42298681J6056418M095924l322687J564597J3262165J9569834J2368164
$$ 142298681 158355099 162451023 159128336 160692933 173955098 193524932 205893096
39764B05893096l953925j4542708j0054120J18357j38911q224419m813149J2605278
$$ 205893096 201939171 187396463 177342343 177460700 177321789 169097370 164284221 176889499
39756A76889499J8268318k906335k4050066j2243053J7115733J9153632j0082873
$$ 176889499 195157817 192251482 168201416 155958363 173074096 192227728 182144855
39749A82144855k5519997n582749J2282140o179479l4532619k8630491K610715
$$ 182144855 156624858 151042109 163324249 157144770 122612151 93981660 96592375
39742I6592375J5162425P37263q962944j958043q04388j3531091j6099055J941923
$$ 96592375 111754800 112492063 103529119 101571076 100766688 87235597 71136542 73078465
39734G3078465J4398142J821060j5283624j1664482J030104l298665j9874293
$$ 73078465 87476607 89297667 74014043 62349561 63379665 60081000 40206707
39727D0206707k1233470k066786J2788408N422784j2241862j7648928m942268
$$ 40206707 18973237 16906451 29694859 35117643 22875781 5226853 284585
39720B84585J2792365J9704318J0802441n497384j4920250r596915N084357J5569920
$$ 284585 13076950 32781268 43583709 38086325 23166075 13569160 18653517 34223437
39712C4223437J2264479j782720j2991048j0399830J705772Q568165M365273j063735
$$ 34223437 46487916 44705196 31714148 21314318 23020090 31588255 35953528 34889793
39704C4889793K2112k15803r840522j8685087j1843268N061246J3037409Q551024
$$ 34889793 34911905 34696102 24855580 6170493 -5672775 -611529 12425880 20976904
39696B0976904M870136N938157J463393r214485j1629440j765285M595358j851106
$$ 20976904 25847040 31785197 33248590 24034105 12404665 10639380 15234738 13383632
39688A3383632q453371l571227L992951L127795M28958M754427P161277l272320
$$ 13383632 4930261 1359034 5351985 8479780 8908738 13663165 20824442 17552122
39680A7552122j5063980q441671J2011974K1146879R231020n768107n702550M412921
$$ 17552122 2488142 -5953529 6058445 27205324 36436344 30668237 24965687 29378608
39672B9378608P894764j73422r905877j1570423o036631j026297j377560n007173
$$ 29378608 37273372 37099950 27194073 15623650 9587019 8560722 7183162 2175989
39664B175989p444228p111028m210805J803027Q956563J0695591M146478k972011
$$ 2175989 -5268239 -12379267 -16590072 -14787045 -5830482 4865109 9011587 6039576
39656F039576k670508p8280m220498q936184m10759J5996385J7619427l55138
$$ 6039576 3369068 3290788 -929710 -9865894 -10276653 5719732 23339159 22984021
39648B2984021j3352061l785260J1099882O517904j0664490j3699892K019106
$$ 22984021 9631960 5846700 16946582 23464486 12799996 -899896 1119210
39641A119210J3810128P187053o220309j0400957o113205k786295k779056k392622
$$ 1119210 14929338 22116391 15896082 5495125 -618080 -3404375 -6183431 -8576053
39633h576053k37118K460322M671228M409429k71266n978595n161911L402709
$$ -8576053 -8813171 -6352849 -1681621 2727808 2456542 -3522053 -8683964 -5281255
39625e281255J0051177N549675n481519q579302K115843J4696070J3483787l85853
$$ -5281255 4769922 10319597 4838078 -3741224 -1625381 13070689 26554476 26168623
39617B6168623r901543n092832L930359L111123m622925n459061L358488J0820697
$$ 26168623 16267080 11174248 15104607 18215730 13592805 8133744 11492232 22312929
39609B2312929R669616L507278l387156j0026326j2021274n095127L517825K349197
$$ 22312929 31982545 35489823 32102667 22076341 10055067 4959940 8477765 10826962
39601A0826962m456842k446659N928378J902722j5129806j9356791J221341K1167746
$$ 10826962 6370120 3923461 9851839 11754561 -3375245 -22732036 -21510695 -342949
39593c42949J5019049l304359m754494Q131723R602983m240414j1371281k573943
$$ -342949 14676100 11371741 6617247 14748970 24351953 20111539 8740258 6166315
39585F166315O436611N113289L018973P453262R624287K752318n249734o921264
$$ 6166315 12602926 17716215 20735188 28188450 37812737 40565055 35315321 28394057
39577B8394057o812507q965389p841919p07619M743889M021509L879414P565085
$$ 28394057 21581550 12616161 4774242 4066623 8810512 12832021 16711435 24276520
39569B4276520N357005q736523k2228814j9347813l303131R081600R634255M340585
$$ 24276520 29633525 20897002 -1331812 -20679625 -23982756 -14901156 -5266901 -926316
39561i26316N26254l39471J462740N496429P966614L945178n717309j3807597
$$ -926316 -400062 -739533 723207 6219636 14186250 18131428 12414119 -1393478
39553a393478j3720134m952632O946916J3771591J0631825J847374j567771N443448
$$ -1393478 -15113612 -20066244 -13119328 652263 11284088 13131462 11563691 17007139
39545A7007139J3480198Q414996r367491k1218697j1093842J2302035K2619534
$$ 17007139 30487337 38902333 29534842 8316145 -2777697 9524338 32143872
39538C2143872Q177822j1530284j0823303P084900J5178482K064272j2709864
$$ 32143872 40321694 28791410 17968107 25053007 40231489 42295761 29585897
39531B9585897j0189196j07298j722569j0819144p596241R063197J8416783R904935
$$ 29585897 19396701 19289403 17566834 6747690 -848551 8214646 26631429 36536364
39523C6536364k316219k824912L813298M105557l832612j0091368o799850L969484
$$ 36536364 34220145 31395233 35208531 39314088 35481476 25390108 18590258 22559742
39515B2559742J2280920Q989390k987842q655172j31253R058740J954239j3981139
$$ 22559742 34840662 43830052 40842210 32187038 32055785 41114525 43068764 29087625
39507B9087625j5672897p18621P653878k210944j1624362k792620J2235418J2561648
$$ 29087625 13414728 12696107 20349985 18139041 6514679 3722059 15957477 28519125
39499B8519125K103581j63872O762593O737634l505253q234318J156361J3115030
$$ 28519125 30622706 30458834 37221427 43959061 40453808 32219490 33375851 46490881
39491D6490881J4443368O825946j370193p434791j1300340r922042k592406M357207
$$ 46490881 60934249 67760195 66390002 58955211 47654871 37732829 35140423 39497630
39483C9497630N009019K108540K539600P115594R210018L049891q337141j3752837
$$ 39497630 44506649 46615189 49154789 56270383 65480401 68530292 60193151 46440314
39475D6440314m504623J3559183K2664594J3018237l581055p834191K210427J1095325
$$ 46440314 41935691 55494874 78159468 91177705 87596650 79762459 81972886 93068211
39467I3068211J0032044P129418R107452P486260n525043j8148629j2338445Q026033
$$ 93068211 103100255 110229673 119337125 126823385 121298342 103149713 90811268 98837301
39459I8837301J9106178R216630o167353p792730J894049P039752L060791l11037
$$ 98837301 117943479 127160109 120992756 113200026 115094075 122133827 125194618 124883581
39451A24883581K922532P277677P425787O379111P475755O536394j276468j1327731
$$ 124883581 127806113 135083790 142509577 148888688 156364443 162900837 161624369 150296638
39443A50296638j3148958l586574Q274935J0729229K418811o039524m679580K829868
$$ 150296638 137147680 133561106 141836041 152565270 154984081 148944557 144264977 147094845
39435A47094845L672054n138472r923002M95972J5625964J5431245j172511j4189148
$$ 147094845 150766899 145628427 135705425 136201397 151827361 167258606 166086095 151896947
39427A51896947j0302417J452431O317521K730361k214462m282993j442687P135650
$$ 151896947 141594530 143046961 149364482 152094843 149880381 145597388 144154701 151290351
39419A51290351J3926834P208634r190657j4595976j270818J0091064M30423j7194995
$$ 151290351 165217185 172425819 163235162 148639186 147368368 157459432 157889855 140694860
39411A40694860j7786669k593480P241290O266337O615683Q879228M46724j5914834
$$ 140694860 122908191 120314711 127556001 133822338 140438021 149317249 149763973 133849139
39403A33849139k0382058q264364K475596K319777K092743N529038j188341j9092746
$$ 133849139 113467081 105202717 107678313 109998090 112090833 117619871 116431530 97338784
39395I7338784k4278107n160310J3947881R537018m022561j146528J1194100Q156756
$$ 97338784 73060677 67900367 81848248 91385266 87362705 86216177 97410277 105567033
39387A05567033q549065j5279449q153412n414362r588817k177620J8255893K5675462
$$ 105567033 97017968 81738519 73585107 68170745 58581928 56404308 74660201 100335663
39379A00335663P227737j3356800j0807827M741128O649454p226886j4944097
$$ 100335663 107563400 94206600 83398773 88139901 94789355 87562469 72618372
39372G2618372n311901Q233104R407456l71384p947487n986449J017940M614643
$$ 72618372 67306471 75539575 84947031 84575647 76628160 70641711 71659651 76274294
39364G6274294J765909l781378o991331o025685j937122K199059J128607p972882
$$ 76274294 78040203 74258825 67267494 61241809 59304687 61503746 62632353 54659471
39356E4659471j8130415j6938233l429356P334763M364577k938359J41105R828688
$$ 54659471 36529056 19590823 16161467 23496230 27860807 24922448 25063553 34892241
39348C4892241J0257606r25656j0385812j1018759q370285m507946N497836J7015663
$$ 34892241 45149847 44224191 33838379 22819620 14449335 9941389 15439225 32454888
39340C2454888J5201179j136236j2747360p334055K567264J296775n747934m863101
$$ 32454888 47656067 46519831 33772471 26438416 29005680 30302455 24554521 19691420
39332A9691420J836417K403610l764557p711037p339722o224352k142666P123410
$$ 19691420 21527837 23931447 20166890 12455853 5116131 -1108221 -3250887 3872523
39324C872523J2433617N154082m678857j291002R449455P545763o932418j1828009
$$ 3872523 16306140 21460222 16781365 15490363 24939818 32485581 25553163 13725154
39316A3725154K95516Q711812j116082j3251583q160084N677142Q190449J245421
$$ 13725154 14020670 22732482 21616400 8364817 204733 5881875 14072324 15317745
39308A5317745J545437Q655090N877376q704441j6573074q129800L541089N484251
$$ 15317745 16863182 25518272 31395648 22691207 6118133 -2011667 1529422 7013673
39300G013673K884490M402367N626442p1891o500628m411829K423406M336127
$$ 7013673 9898163 14300530 19926972 19855081 13354453 8942624 11366030 15702157
39292A5702157J902908J362111O4500q030945j6073244j0643590N534347J4154376
$$ 15702157 17605065 18967176 19031676 11000731 -5072513 -15716103 -10181756 3972620
39284C972620P890578Q60J285859L763755k363765r949129p418566P33052K377989
$$ 3972620 11863198 11864058 13149917 16913672 14549907 4600778 -2817788 -2084736 293253
39275B93253o83553K409224R175416O115806n757460q106114N405807J5453129
$$ 293253 -390300 2018924 11194340 17310146 11552686 3446572 8852379 24305508
39267B4305508M602617j5669027k0487165n183280J1878545J5253503O846692
$$ 24305508 28908125 13239098 -7248067 -12431347 -552802 14700701 21547393
39260B1547393l703504r998435r636977m469473j084356l095354m480572N65112
$$ 21547393 17843889 7845454 -1791523 -6260996 -7345352 -10440706 -14921278 -14356166
39252a4356166M887510j545947j1290693o229637J3252667K4408891J4291022
$$ -14356166 -9468656 -11014603 -22305296 -28534933 -15282266 9126625 23417647
39245B3417647k241789p482996o302988j0761420j4685160n218019R668952R302024
$$ 23417647 21175858 13692862 7389874 -3371546 -18056706 -23274725 -13605773 -4303749
39237d303749o687565j6257036p677750O173721J0450476O301599L62376n754406
$$ -4303749 -10991314 -27248350 -34926100 -28752379 -18301903 -12000304 -11637928 -17392334
39229a7392334q150502j19635J2451915J2264594k779214j1720357j548046J2319229
$$ -17392334 -25542836 -25662471 -13210556 -945962 -3725176 -15445533 -16993579 -4674350
39221d674350J2296328O384157Q405622Q336711q949276k7585079j7783656J4182607
$$ -4674350 7621978 14006135 22411757 30748468 21799192 -5785887 -23569543 -9386936
39213i386936K8611032J0264307j0416459o420816P326817M704878r044991j1964311
$$ -9386936 19224096 29488403 19071944 12651128 19977945 24682823 15637832 3673521
39205C673521l884437j389552n425956k746909N338498L595145p329641p942347
$$ 3673521 -210916 -1600468 -7026424 -9773333 -4434835 -839690 -8169331 -16111678
39197a6111678P629913J9293045J0685653p806664j7166717j4753876q151261
$$ -16111678 -8481765 10811280 21496933 13690269 -3476448 -18230324 -26381585
39190b6381585J828047J5549454K1772990R256363j2143026j9400932o837388
$$ -26381585 -24553538 -9004084 12768906 22025269 9882243 -9518689 -16356077
39183a6356077O255505L170034p967374q166002N017328J5536353J1833752J044664
$$ -16356077 -10100572 -6930538 -14897912 -23063914 -18046586 -2510233 9323519 10368183
39175A0368183k822243K404702O811823M396599J141696L492161N162295n198682
$$ 10368183 7545940 9950642 16762465 21159064 22300760 25792921 30955216 25756534
39167B5756534k3682619k9769229j1969846J3585842K1203415P900677n604561
$$ 25756534 2073915 -27695314 -39665160 -26079318 -4875903 3024774 -2579787
39160b579787n489097o37940k465188m681631L864418J6680159J6581846J355673
$$ -2579787 -8068884 -8706824 -11172012 -15853643 -11989225 4690934 21272780 22628453
39152B2628453j3035582j4814903q317596k246533R92582J509267l23019P44923
$$ 22628453 9592871 -5222032 -13539628 -15786161 -14793579 -13284312 -13607331 -12862408
39144a2862408R341408J6440817O852675j4651594k1904590k900812J9634782
$$ -12862408 -3521000 12919817 19772492 5120898 -16783692 -19684504 -49722
39137d9722J9100175K529370l416290N250276O358096j0232045k4809841j6378604
$$ -49722 19050453 21579823 18163533 23413809 29771905 19539860 -5269981 -21648585
39129b1648585P470041K0552600R962618j0848735j8637741o272653Q975387O489103
$$ -21648585 -14178544 6374056 16336674 5487939 -13149802 -19422455 -10447068 -3957965
39121c957965r026057j1731706P033779K1730734R390007j3122258j3758109M163557
$$ -3957965 -12984022 -24715728 -17681949 4048785 13438792 316534 -13441575 -9278018
39113i278018Q561936p325762j4135560K855523J8019740P782464j1837609j3601718
$$ -9278018 -716082 -8041844 -22177404 -19321881 -1302141 6480323 -5357286 -18959004
39105a8959004r04781N262381L126427N900918J2703185J0977553J319309m260272
$$ -18959004 -19863785 -14601404 -11474977 -5574059 7129126 18106679 19425988 15165716
39097A5165716m339390o767659r701638m926940L566765M900293J830440N185185
$$ 15165716 10826326 4058667 -5642971 -10569911 -7003146 -2102853 -272413 4912772
39089D912772J1045077N992039o417844q568392M42883J860806r793773j5566512
$$ 4912772 15957849 21949888 15532044 6963652 7406535 9267341 -526432 -16092944
39081a6092944l505635J1061982J0018399j059479n793274k022113J133771K60511
$$ -16092944 -19598579 -8536597 1481802 422323 -5370951 -7393064 -6259293 -5998782
39073e998782k315689o483459r433173j523853J8869714L3395822K2425173p004031
$$ -5998782 -8314471 -14797930 -24231103 -25754956 -6885242 26510580 48935753 41931722
39065D1931722k6760629k1841772n935694O98823k927467l174215M723943R653074
$$ 41931722 15171093 -6670679 -12606373 -11907550 -14835017 -18009232 -13285289 -3632215
39057c632215K579563q247034q042264L097108J0326160N889163j098734j281412
$$ -3632215 -1052652 -9299686 -17341950 -14244842 -3918682 1970481 871747 -409665
39049d09665Q02856j777144l989202R96519O197062J118837q401778p788716K489783
$$ -409665 393191 -1383953 -5373155 -4376636 1820426 2939263 -5462515 -13251231 -10761448
39040a0761448Q504528O174359M241476M566691j96579p580013n618458L407341
$$ -10761448 -2256920 3917439 8158915 12725606 12529027 4949014 -669444 2737897
39032B737897K216012j0849775j3980823L058322J8777241J2180931m399670n922087
$$ 2737897 4953909 -5895866 -19876689 -16818367 1958874 14139805 9740135 3818048
39024C818048O613688J1149987n62884j4948405j8979173j2113562R32146J3450083
$$ 3818048 10431736 21581723 21018839 6070434 -12908739 -25022301 -24090155 -10640072
39016a0640072J6036427O729525k328443j189095K048077l503290r551129j882415
$$ -10640072 5396355 12125880 9797437 8608342 10656419 7153129 -2398000 -4280415
39008d280415J1411020R223605o943303j2504176J201378J2696088M874462q744242
$$ -4280415 7130605 16354210 9410907 -3093269 -1891891 10804197 15678659 6934417
39000F934417p266217N202342Q626305j548718j0043907n694431M476792O545346
$$ 6934417 -331800 4870542 13496847 11948129 1904222 -3790209 686583 7231929
38992G231929l275938j4926174j4795747k63191J5519697J7068960N202159l841713
$$ 7231929 3955991 -10970183 -25765930 -26029121 -10509424 6559536 11761695 7919982
38984G919982N97048J1062582J3922383O164037n097602j3130566j4828479q682842
$$ 7919982 8517030 19579612 33501995 39666032 34568430 21437864 6609385 -2073457
38976b073457K725420J0961793R547581K459350j017609O82542m61791r368488
$$ -2073457 651963 11613756 21161337 23620687 22603078 23285620 22823829 13455341
38968A3455341j8289058j4614043K347814J7146836J4763287n55748r576757k509921
$$ 13455341 -4833717 -19447760 -17099946 46890 14810177 14254429 4677672 2167751
38960B167751Q877980Q810304j046892p318856n841161l755596l668799o91969
$$ 2167751 11045731 19856035 18809143 11490287 5649126 1893530 -1775269 -2467238
38952b467238M039362K236801n626322q497691m198316m223350j0720876p147221
$$ -2467238 1572124 3808925 -1817397 -10315088 -14513404 -18736754 -29457630 -36604851
38944c6604851J3276959K7277398J2217428j4910989j7227354P300652K1621421
$$ -36604851 -23327892 3949506 16166934 1255945 -15971409 -8670757 12950664
38937A2950664N412567j5511675j1368371O244091O545062j0030932j5002862
$$ 12950664 18363231 2851556 -8516815 -2272724 4272338 -5758594 -20761456
38930b0761456k57078Q721558m960015k1377549j4160721R489890K0316602R419816
$$ -20761456 -21018534 -12296976 -17256991 -38634540 -52795261 -43305371 -22988769 -13568953
38922a3568953k615274J498762J3068504J4047132K555274q485124j0650388p212564
$$ -13568953 -16184227 -14685465 -1616961 12430171 14985445 6500321 -4150067 -11362631
38914a1362631l569372n8353M095390O582042N702346M320623N362287N221167
$$ -11362631 -14932003 -14990356 -10894966 -4312924 1389422 5710045 11072332 16293499
38906A6293499k320903j4429857j8121994o330310R657285J2522357J915768n628585
$$ 16293499 13972596 -457261 -18579255 -24909565 -15252280 -2729923 -814155 -6442740
38898f442740j231850M542643O65761o348192m981894J056702P57340k794426
$$ -6442740 -7674590 -3131947 -2466186 -8814378 -13796272 -12739570 -11982230 -14776656
38890a4776656K629110J4410723J5740355K466408r736637j0264403o992201o979585
$$ -14776656 -12147546 2263177 18003532 20469940 10733303 468900 -6523301 -13502886
38882a3502886k935832Q796825J4533790M216087q094640l764461J0870562J4713985
$$ -13502886 -16438718 -7641893 6891897 11107984 3013344 -751117 10119445 24833430
38874B4833430M424381m157842l292300j395120m205302o775818n945627m502358
$$ 24833430 29257811 25099969 21807669 20412549 16207247 9431429 3485802 -1016556
38866a016556j729590M675223P392825k506418j6040190j4381390J107673Q168887
$$ -1016556 -2746146 1929077 9321902 6815484 -9224706 -23606096 -22498423 -14329536
38858a4329536j502861r103723k90129J1922718J0320000M15934l369030k413436
$$ -14329536 -15832397 -24936120 -25226249 -13303531 -2983531 -2567597 -5936627 -8350063
38850h350063m944999n363521N266381J6488527R425383j2432987k4677039j5124700
$$ -8350063 -13295062 -18658583 -13392202 3096325 12521708 88721 -24588318 -39713018
38842c9713018K722494J1985111J1915183J0377263J0040667Q246207K452689
$$ -39713018 -36990524 -25005413 -13090230 -2712967 7327700 15573907 18026596
38835A8026596p589529j7225841j7453980n790550O349220P301002K568360N454216
$$ 18026596 10437067 -6788774 -24242754 -30033304 -23684084 -16383082 -13814722 -8360506
38827h360506J3549974J1842962p09219p785193l742576l869104j5723924k0572133
$$ -8360506 5189468 17032430 16323211 8538018 4795442 926338 -14797586 -35369719
38819c5369719j732957K3545316K3909531j122438j9678814j1373243R061521
$$ -35369719 -37102676 -13557360 10352171 9229733 -10449081 -21822324 -12760803
38812a2760803J7746007J2141010M501011n01100o420109j1266053q754407j243860
$$ -12760803 4985204 17126214 21627225 21126125 14706016 3439963 -5314444 -6558304
38804f558304K035695L57976K657047J0207854J0604018l403278j8996512j8246978
$$ -6558304 -4522609 -4164633 -1507586 8700268 19304286 15901008 -3095504 -21342482
38796b1342482k199791J1868878J4188099J0342490N512365m009337j7666948
$$ -21342482 -23542273 -11673395 2514704 12857194 18369559 14360222 -3306726
38789c306726k2396380q889134J1641842J9099891R512420k400776m263244O93422
$$ -3306726 -25703106 -34592240 -22950398 -3850507 5661913 3261137 -1002107 -308685
38781c08685K477767k409221r757424j3737168j0976322k185298P895385J3878221
$$ -308685 2169082 -240139 -9997563 -23734731 -34711053 -36896351 -29000966 -15122745
38773a5122745J3607797Q017185n62399p994774r769109o159757k485758j228579
$$ -15122745 -1514948 6502237 5939838 -2054936 -11824045 -17983802 -20469560 -21698139
38765b1698139R29292M573371L832939k350543m198666L676811R933569L042375
$$ -21698139 -20768847 -16195476 -12362537 -14713080 -18911746 -15234935 -5301366 -2258991
38757b258991p615652m623291Q652252J2438376K174424o082639l577255O42896
$$ -2258991 -9874643 -14497934 -5845682 6592694 8767118 2684479 -892776 -249880
38749b49880J707522O992268J3844433N253473j8216251k7897418q407959J4065865
$$ -249880 1457642 8449910 22294343 27547816 9331565 -18565853 -26973812 -12907947
38741a2907947J0259749o331025l861552J3206180J1854460j2612269k6550052
$$ -12907947 -2648198 -8979223 -12840775 365405 12219865 -392404 -26942456
38734b6942456j0055010J5156261K1412754J0521288l85590n097305n388220q27058
$$ -26942456 -36997466 -21841205 -428451 10092837 9707247 4609942 -778278 -1605336
38726a605336M203727l79169j1798015j1707656N199719J7675873Q639085p490299
$$ -1605336 2598391 2219222 -9578793 -21286449 -16086730 1589143 10228228 2737929
38718B737929p165694O593160J2262243L661640o367336j0410979j3029659j4568535
$$ 2737929 -4427765 2165395 14427638 18089278 11721942 1310963 -11718696 -26287231
38710b6287231q278288M315924J1332757P580399J586959K289824P946441J0764744
$$ -26287231 -34565519 -30249595 -18916838 -11336439 -9749480 -7459656 486785 11251529
38702A1251529O008460m126189j1355286q624191k94824J201899o451555j0374664
$$ 11251529 17259989 13133800 1778514 -6845677 -7140501 -5938602 -12390157 -22764821
38694b2764821k902998N257449L573200l7342M809884R801005L079514n697781
$$ -22764821 -25667819 -20410370 -16837170 -16874512 -12064628 -2263623 815891 -4881890
38686d881890L7115J2321194R744341m437815o122506P286565J1288015k514239
$$ -4881890 -4844775 7476419 17220760 12782945 6660439 13947004 25235019 22720780
38678B2720780j1082717j021754O886667n730771k1212556j4185455P247756J5792929
$$ 22720780 11638063 10616309 17502976 11772205 -9440351 -23625806 -16378050 -585121
38670e85121O010428n115394q321753p762456l840165N742885J2358736O161982
$$ -585121 5425307 309913 -8011840 -15774296 -19614461 -13871576 -1512840 4649142
38662D649142l690167Q2028J3702182J5672519R7985j4212779j2171029j647758
$$ 4649142 958975 1041003 14743185 30415704 30513689 16300910 4129881 2482123
38654B482123K449015j051562k683744K852785J0959473J1679146n38977j7412186
$$ 2482123 4931138 3879576 1195832 4048617 15008090 26687236 26148259 8736073
38646H736073k1667015q264547O313315O093161j867873j306399N687431M237940
$$ 8736073 -12930942 -21195489 -14882174 -8789013 -10656886 -11963285 -6275854 -2037914
38638b037914n804973r969778n056777k275411l535385J858390J2656947J1822502
$$ -2037914 -7842887 -17812665 -22869442 -25144853 -28680238 -26821848 -14164901 -2342399
38630b342399m367232j5538351o835332R981025J6855411J2861718N244111m747010
$$ -2342399 -6709631 -22247982 -29083314 -19102289 -2246878 10614840 15858951 11111941
38622A1111941j3164498q321886R216820J7768888L522792j6309155j8295797
$$ 11111941 -2052557 -10374443 -1157623 16611265 20134057 3824902 -14470895
38615a4470895o482536J43254N33542O396763J3748375Q119419n829921q455453
$$ -14470895 -20953431 -20810177 -20276635 -13879872 -131497 7987922 2158001 -6297452
38607f297452R32176K653530o999477p348279Q948174J8170031K624101j8309506
$$ -6297452 -5365276 -2711746 -9711223 -17059502 -8111328 10058703 12682804 -5626702
38599e626702j6643556K054846J0354396K077361l362027L495691Q969727L290683
$$ -5626702 -22270258 -20215412 -9861016 -7783655 -11145682 -7649991 1319736 4610419
38591D610419k409304K748954R004061J989941j2087186j4292395j350504R890976
$$ 4610419 2201115 4950069 13954130 15944071 3856885 -10435510 -11786014 -1895038
38583a895038O980355k924827o509017j855339M026961P099036P981236O902551
$$ -1895038 5085317 2160490 -4348527 -6203866 -2176905 4922131 12903367 19805918
38575A9805918M148231K098427J202669j783272o094843m088033N590745R324630
$$ 19805918 23954149 26052576 27255245 25471973 19377130 15289097 20879842 30204472
38567C0204472l995092k1807641k0819466l57358J5349849J1641755J297364K5005
$$ 30204472 26209380 4401739 -16417727 -16775085 -1425236 10216519 11513883 11538888
38559A1538888L039274p5125l369131L514621J2153880N750418j1596471j7119339
$$ 11538888 14578162 14503037 11133906 14648527 26802407 32552825 20956354 3837015
38551C837015k158885J5415937J6165532K014178j1481943j4269759p210108K763011
$$ 3837015 1678130 17094067 33259599 35273777 23791834 9522075 2311967 5074978
38543E074978P531837M197204p21993K70934L285234j425973j1630482j3675892
$$ 5074978 12606815 16804019 16082026 16352960 19638194 18212221 6581739 -7094153
38535g094153m052657L538049m27442o153391j258790Q614590R500643J628464
$$ -7094153 -11146810 -7608761 -8036203 -14189594 -15448384 -6833794 2666849 4295313
38527D295313k953354j259793k048436p622964q481705o05986N293695p8044r115505
$$ 4295313 1341959 82166 -1966270 -9589234 -18070939 -18676925 -13383230 -13461274 -22576779
38518b2576779q199316K038670Q478578N209277M16588K171138O965582O932387
$$ -22576779 -30776095 -28737425 -20258847 -15049570 -14632982 -12461844 -5496262 1436125
38510A436125J632692k919887k550880K636898R937744J3300251O024849r023119
$$ 1436125 3068817 148930 -2401950 234948 10172692 23472943 29497792 20474673
38502B0474673j6997889q225524O224668Q036948j599248l970259O851615J3365453
$$ 20474673 3476784 -4748740 1475928 9512876 7913628 3943369 10794984 24160437
38494B4160437K345014j3133870j2969321Q24412J0445465R462233O031751L672180
$$ 24160437 26505451 13371581 402260 1226672 11672137 21134370 27166121 30838301
38486C0838301k529281j0611200j0261946n50657N439386o23759j0466384j1956692
$$ 30838301 28309020 17697820 7435874 6885217 12324603 11700844 1234460 -10722232
38478a0722232m448934L810082N978460N40538p883974r450514J050700J3837898
$$ -10722232 -15171166 -11361084 -5382624 -4842086 -12726060 -22176574 -21125874 -7287976
38470g287976J3652882J623283m475801L781757J2296121N660393r540971j4153777
$$ -7287976 6364906 7988189 3512388 7294145 19590266 25250659 15709688 1555911
38462A555911k712839J0807991J1217210j644868j4130734j2700049J444979J1571690
$$ 1555911 -1156928 9651063 20868273 19223405 5092671 -7607378 -6162399 5409291
38454E409291M781272r379746j0460830K608193Q674828k669770j3418295n299218
$$ 5409291 10190563 810817 -9650013 -7041820 1633008 -1036762 -14455057 -19754275
38446a9754275J0397306J0214804m691143j1187842L12026J4460258J6391229
$$ -19754275 -9356969 857835 -3833308 -15021150 -14709124 -248866 16142363
38439A6142363R296404J971206m369542r707143r799890n748793p104608j5679614
$$ 16142363 25438767 27409973 23040431 13333288 3533398 -2215395 -9320003 -24999617
38431b4999617j6690011J393052K4960066K7982927N940455j6379950j5417150
$$ -24999617 -41689628 -40296576 -15336510 12646417 18586872 2206922 -13210228
38424a3210228L124255J4857434Q701442l214231o646019l373281k375074l547311
$$ -13210228 -10085973 4771461 13472903 10258672 3612653 239372 -2135702 -5683013
38416e683013j298243K137460N12381k350220K721997J1705012J0255820j875212
$$ -5683013 -6981256 -4843796 -4331415 -6681635 -3959638 7745374 18001194 16125982
38408A6125982p468529L27790N981281j255073p692920K48292R851399L367926
$$ 16125982 8657453 8985243 14966524 13711451 6018531 6266823 16118222 19486148
38400A9486148q665412l063042J5567132K0448607O298015m109627n66303r04370
$$ 19486148 10820736 7757694 23324826 43773433 50071448 45961821 45395518 44491148
38392D4491148j5416038k5329809j3921096M839238Q756171j14810n655648m665859
$$ 44491148 29075110 3745301 -10175795 -5336557 3419614 3304804 -2350844 -7016703
38384g016703l090394J030675R345444J0006415m160346j4839399j841509J9863797
$$ -7016703 -10107097 -9076422 269022 10275437 6115091 -8724308 -10565817 9297980
38376I297980J6829021j0441837k4036466m716537J9586672J6955572l357507
$$ 9297980 26127001 15685164 -8351302 -13067839 6518833 23474405 20116898
38369B0116898j1668151m204834q01943o533064n520926O764977J2334990N58965
$$ 20116898 8448747 4243913 3441970 -3091094 -8612020 -1847043 10487947 11046912
38361A1046912j2420889q087586O321093J0887246L719056n46552K077170M5205
$$ 11046912 -1373977 -9461563 -3140470 7746776 11465832 10919280 12996450 13041655
38353A3041655r858370j4006385n004503M373630K350183k026235L748782J1232085
$$ 13041655 3183285 -10823100 -15827603 -11453973 -9103790 -11130025 -7381243 3850842
38345C850842M862182q094692o202682R578466J4598337L67639j1137035m444190
$$ 3850842 8713024 618332 -5584350 3994116 18592453 18960092 7823057 3378867
38337C378867L685761n642538j9001814j1595955J1284168K1714556J1579602
$$ 3378867 7064628 1422090 -17579724 -29175679 -17891511 3823045 15402647
38330A5402647Q0587l04747J091874l665261p221840m944961n623650j2594999
$$ 15402647 15483234 15178487 16270361 12605100 5383260 438299 -5185351 -17780350
38322a7780350j2591671K250993J6425002J1777127m778919j1892509m892703
$$ -17780350 -30372021 -28121028 -11696026 81101 -4697818 -16590327 -21483030
38315b1483030J957525J055618O14465N989837Q479186J71651j1562856j3651013
$$ -21483030 -19525505 -18469887 -17855422 -11865585 -3386399 -3214748 -14777604 -28428617
38307b8428617m798832M913695Q004849N665703K185645O79034L754851J1127380
$$ -28428617 -33227449 -28313754 -20308905 -14643202 -12457557 -11778523 -8023672 3103708
38299C103708J5497255Q394276o524958j3601514m881900P081695N669151n724808
$$ 3103708 18600963 26995239 20470281 6868767 1986867 9068562 14737713 9012905
38291I012905r361509j301536K663015o452756j5258829r438017L577654P993412
$$ 9012905 -348604 -1650140 1012875 -5439881 -20698710 -30136727 -26559073 -18565661
38283a8565661M581992M776032P776170L561168n052478m668967L875924M348138
$$ -18565661 -13983669 -9207637 -1431467 2129701 -2922777 -7591744 -3715820 632318
38275F32318o796095j2118837j670947R626405N907937m466435l575969P824189
$$ 632318 -6163777 -18282614 -19953561 -10327156 -4419219 -8885654 -12461623 -4637434
38267d637434J3765453Q051430q9079k448507p15452M62301n56413l211674n187997
$$ -4637434 9128019 17179449 17090370 14641863 13926411 14388712 13832299 10620625 5432628
38258E432628l977423k070718n280829j1507054r637821L340830J3818008J0151770
$$ 5432628 1455205 -615513 -5896342 -17403396 -27041217 -23700387 -9882379 269391
38250B69391M65843p44813M563125L915803k992315n104067j161069k092640j0502040
$$ 269391 735234 -9579 4553546 8469349 5477034 372967 -788102 -2880742 -13382782
38241a3382782j4084788m500615J0061189J6849480J3164015M217405n006285
$$ -13382782 -27467570 -31968185 -21906996 -5057516 8106499 12323904 7317619
38234G317619j1052744j1628716p459164n17222Q983167J8578615K0218982R803960
$$ 7317619 -3735125 -15363841 -22823005 -23340227 -14357060 4221555 24440537 34244497
38226C4244497l502214q499542q729476j4045795j8843545p867828J4686670K3345831
$$ 34244497 30742283 22242741 13513265 -532530 -19376075 -27243903 -12557233 10788598
38218A0788598P103313j2285432j1209647K202249K821525j2946267k2535391
$$ 10788598 17891911 5606479 -5603168 -3400919 -579394 -13525661 -36061052
38211c6061052r245391J6588011L1499255K4622613N839801p238684p432008k883645
$$ -36061052 -45306443 -28718432 2780823 27403436 33243237 26004553 18572545 15688900
38203A5688900l833250q597598q686841m102650k412099l308756J775647J1463092
$$ 15688900 11855650 3258052 -5428789 -9531439 -11943538 -15252294 -13476647 -2013555
38195b013555J1260837l619933j6449767j1179599M969661J3519112R894136L355912
$$ -2013555 9247282 5627349 -10822418 -22002017 -17032356 -3513244 6380892 9736804
38187I736804n69134l429973m349710m69235N259833O910707L776232j708214
$$ 9736804 9167670 5737697 1387987 918752 6178585 13089292 16865524 15157310
38179A5157310q831198j3915023r220243L528866Q447246k576308j3465242o225544
$$ 15157310 6326112 -7588911 -16809154 -13280288 -4833042 -7409350 -20874592 -27100136
38171b7100136R802751J2081108J672192N61810J3100527J7412766J845130j5254561
$$ -27100136 -17297385 -5216277 -3544085 -2982275 10118252 27531018 29376148 14121587
38163A4121587j4701803m592048l107654q955324p254577M548976J3992288J2721892
$$ 14121587 -580216 -5172264 -8279918 -17235242 -24489819 -19940843 -5948555 6773337
38155F773337M942852j158290r45476M924057Q917824J388313j5590955k4973360
$$ 6773337 11716189 10557899 9612423 14536480 23454304 24842617 9251662 -15721698
38147a5721698j4484744N663786J5297828J0282293L889701M204341M054420l422788
$$ -15721698 -30206442 -24542656 -9244828 1037465 4927166 9131507 13185927 9763139
38139I763139j1291102q625685K946758J0886069P845612n43216m601762k254724
$$ 9763139 -1527963 -10153648 -7206890 3679179 11524791 10981575 6379813 4125089
38131D125089J089992J268054p41666l433473p741766j2379482j1336306k187566
$$ 4125089 5215081 6483135 5741469 2307996 -5433770 -17813252 -29149558 -31337124
38123c1337124O405344L935785n870276p966587K502362J1734001O783098n148888
$$ -31337124 -24931780 -20995995 -26866271 -34832858 -32330496 -20596495 -13813397 -18962285
38115a8962285p341318J506572N982933j633193q547958l36170J6037430J9736484
$$ -18962285 -26303603 -24797031 -18814098 -20447291 -28995249 -29331419 -13293989 6442495
38107F442495M628789j1736951j1948733j493242J598506o283640j0721885k331821
$$ 6442495 11071284 -665667 -12614400 -14107642 -12509136 -18792776 -29514661 -31846482
38099c1846482J0093381J4679294J3169377J3566665J4581476Q759982l169978
$$ -31846482 -21753101 -7073807 6095570 19662235 34243711 43003693 39833715
38092C9833715j1878296j1932849o322197q40L656137K081851l470867o664790
$$ 39833715 27955419 16022570 9700373 9699533 13355670 15437521 11966654 5301864
38084E301864m636074l443549p131948q020574O22195Q989629L522418r103180
$$ 5301864 665790 -2777759 -9909707 -17930281 -17308086 -8318457 -4796039 -13899219
38076a3899219r325648N011354J5624720J2940630P128511M852726k318812j5808452
$$ -13899219 -23224867 -18213513 -2588793 10351837 17480348 22333074 20014262 4205810
38068D205810j8297201l63671J9035938J7864925K807528m593244j860760k412800
$$ 4205810 -14091391 -14455062 4580876 22445801 25253329 20660085 18799325 16386525
38060A6386525o415220j240837J0027573P351806j2311837k3592065q668459J3739450
$$ 16386525 9971305 8730468 18758041 26109847 13798010 -9794055 -18462514 -4723064
38052d723064J4009524n009494j2749609K555739J5512194K261896k0795225j8436368
$$ -4723064 9286460 4276966 -8472643 -5916904 9595290 11857186 -8938039 -27374407
38044b7374407J0456921K8330121J3289061q785475n061089J3641926J3110501
$$ -27374407 -16917486 11412635 24701696 15916221 10855132 24497058 37607559
38037C7607559o652289j2210517N553053J5147448j794371j8651838q776398J0090387
$$ 37607559 30955270 18744753 24297806 39445254 37650883 18999045 10222647 20313034
38029B0313034P510230q441463q278989O846789R508119m822796j1822331k298261
$$ 20313034 27823264 19381801 11102812 17949601 27457720 22634924 10812593 8514332
38021H514332M016303m298936j1327289l574504Q053131R438171M229471M29966
$$ 8514332 12530635 8231699 -3095590 -6670094 1383037 10821208 15050679 15480645
38013A5480645m337197j0906184r882882J100663P235633j951323j4424199j3140594
$$ 15480645 11143448 237264 -9645618 -8544955 -1309322 -3260645 -17684844 -30825438
38005c0825438k23298R779999J0618156N715206j676275p475822m685808N923772
$$ -30825438 -31048736 -21268737 -10650581 -4935375 -6611650 -14087472 -18773280 -12849508
37997a2849508J1233852L015096q589743r888072l144171P27783L26116J181985
$$ -12849508 -1615656 1399440 -7190303 -17078375 -20222546 -19494763 -19168647 -17986662
37989a7986662K364813q2859j932609K826861Q725536N935507k716085n746676
$$ -17986662 -15621849 -15704708 -17637317 -14810456 -6084920 -149413 -2865498 -8612174
37981h612174j542931J053139r26998k007306j735316n749883j1280592o483486
$$ -8612174 -10155105 -9101966 -10028964 -12036270 -13771586 -19521469 -30802061 -37285547
37973c7285547J0144749K2243734J5494089l580307j6444392j4096009k828301
$$ -37285547 -27140798 -4897064 10597025 7016718 -9427674 -23523683 -26351984
37966b6351984O834317R693475O374975O29574k866296j298432L839866P418455
$$ -26351984 -19517667 -9824192 -3449217 -2819643 -5685939 -6984371 -3144505 4273950
37958D273950M969128k251373p035533l953991K675717L271612l318683p278435
$$ 4273950 9243078 6991705 -43828 -3997819 -1322102 1949510 -1369173 -8647608
37950h647608k706016K792981P21996l348069J471860J2156189J4687894N641435
$$ -8647608 -11353624 -8560643 -7838647 -11186716 -9714856 2441333 17129227 22770662
37942B2770662k746234j842626J792837m42766n784475p490405o274945n434480
$$ 22770662 20024428 18181802 19974639 19531873 13747398 6256993 -17952 -5452432
37934e452432k343849M996741R161600K795514p067694p164386Q30255J510080
$$ -5452432 -7796281 -2799540 6362060 9157574 2089880 -5074506 -4244251 -2734171
37926b734171r274977j5114889k759794J6396833K0714703P775195l972606j707036
$$ -2734171 -12009148 -27124037 -29883831 -13486998 7227705 15002900 11030294 9323258
37918I323258O304212N162705o175375j5003116j0832960L740863J6356017J6597704
$$ 9323258 15627470 20790175 14614800 -388316 -11221276 -7480413 8875604 25473308
37910B5473308N682320n165750p470688m378372l113126k848609J473625O064546
$$ 25473308 31155628 25989878 18519190 14140818 11027692 8179083 9652708 15717254
37902A5717254J589959r185017j1126894M21215J0401342O464722k820996m431953
$$ 15717254 17307213 8122196 -3004698 -2583483 7817859 14282581 11461585 7029632
37894G029632k766937q270229j4177777n734555J1629927J5542601j85745j5525735
$$ 7029632 4262695 -4007534 -18185311 -23919866 -12289939 3252662 3066917 -12458818
37886a2458818j2445638L542057J6057386J7306598Q697230m190678j0855424
$$ -12458818 -24904456 -21362399 -5305013 12001585 20698815 16508137 5652713
37879E652713l075957J1122016J3639563J584356q409050o665441l362359o255996
$$ 5652713 2576756 13698772 27338335 28922691 20513641 13848200 10485841 4229845
37871D229845n598046M581661R596846j876047j3367519m222365J4363490J4144204
$$ 4229845 -1368201 3213460 12810306 10934259 -2433260 -6655625 7707865 21852069
37863B1852069n572091j6822503o857224M812743L14356j0021629p598124N902106
$$ 21852069 16279978 -542525 -7399749 -2587006 -2272650 -12294279 -19892403 -13990297
37855a3990297J4360595J0280987n71927j0187420j3973780j0623763l628623
$$ -13990297 370298 10651285 10079358 -108062 -14081842 -24705605 -28334228
37848b8334228J229318L921016R838904J8423259K0309593J0719450k108346p778988
$$ -28334228 -27104910 -23183894 -13344990 5078269 25387862 36107312 33998966 26219978
37840B6219978o283475l745406k100369N5455J195200j450442o410875r272193
$$ 26219978 19936503 16191097 14090728 14146183 15341383 13890941 7480066 -1792127
37832a792127p752900k905021J922140K173210l170304p110406j555108R853080
$$ -1792127 -9545027 -12450048 -10527908 -8354698 -11525002 -18635408 -20190516 -10337436
37824a0337436J4382790Q575693L619215O691857Q314565j448916j3750553j2341621
$$ -10337436 4045354 12621047 16240262 22932119 31246684 29797768 16047215 3705594
37816C705594N94985N764354n363848j8021635j4415963L742724J9595003K1312039
$$ 3705594 4300579 10064933 4701085 -13320550 -27736513 -23993789 -4398786 16913253
37808A6913253J1116750j941727j1144311j3960935r921507m68875R016339J0629142
$$ 16913253 28030003 26088276 14943965 983030 -8938477 -9407352 -391013 10238129
37800A0238129J873148q460725q617557N3123K917677p288564j8031877j3928987
$$ 10238129 12111277 3650552 -4967005 -4913882 -1996205 -9284769 -27316646 -41245633
37792d1245633J327325J2260663J5095411J7871419J9602163R323918j0151856
$$ -41245633 -39918308 -27657645 -12562234 5309185 24911348 34235266 24083410
37785B4083410j8106454n830815P606703L991509o203916l957259M222361k192561
$$ 24083410 5976956 146141 7752844 11744353 5540437 1583178 5805539 3612978
37777C612978j9371190k1072511m37407J7688264J4205038R34458l912963l099614
$$ 3612978 -15758212 -36830723 -37268130 -19579866 -5374828 -4440370 -8353333 -11452947
37769a1452947o223503o976189M104513J6860395J4035255n50238p513467j594868
$$ -11452947 -17676450 -24652639 -20548126 -3687731 10347524 9797286 2283819 688951
37761F88951M260388K606995m74317j567581m923605q262393j813467J2942207
$$ 688951 4949339 7556334 7082017 5514436 590831 -7671562 -9485029 3457178
37753C457178J9959228J1152820k119917p553006q049186j0434969j1016214m178466
$$ 3457178 23416406 34569226 32449309 24896303 16847117 6412148 -4604066 -8782532
37745h782532M066110L636866l978670q398833n403031m99713O70024j396122
$$ -8782532 -4716422 -1079556 -5058226 -13457059 -18860090 -19359803 -18689779 -20085901
37737b0085901k665093k85857M605622P635748O851496O256539Q885089R289226
$$ -20085901 -22750994 -23036851 -18431229 -10795481 -3943985 2312554 11197643 20486869
37729B0486869J614893p537545p074255j579080p048113k2835521k6449221o181419
$$ 20486869 22101762 14564217 7489962 5910882 -1137231 -23972752 -50421973 -56603392
37721e6603392J8097362K1571135Q565788K101496Q296877J1275166J047815j2358250
$$ -56603392 -38506030 -16934895 -8369107 -6267611 2029266 13304432 14352247 1993997
37713A993997j5890641j0210278l415278K145114R121734J5605021J3861366Q83101
$$ 1993997 -13896644 -24106922 -27522200 -25377086 -16255352 -650331 13211035 14094136
37705A4094136j3152270j3316738P10194J1137500N398905m863710j450022J0389550
$$ 14094136 941866 -12374872 -11664678 -527178 4871727 8017 -1442005 8947545
37697H947545R478993n686832j3202353l929415M771352J800743J731826J4272197
$$ 8947545 18426538 12739706 -462647 -4392062 379290 2180033 3911859 18184056
37689A8184056K0190766K177722k1412555k2364375o128218J134327l184433j14091
$$ 18184056 38374822 40552544 19139989 -3224386 -9352604 -8218277 -11402710 -11516801
37681a1516801J1768451J3956000L897547k4339P010119P919996l565242j1280721
$$ -11516801 251650 14207650 18105197 18080858 25090977 33010973 29445731 18165010
37673A8165010o908363m016411r946582r999737M870926J7661508J0826894n944184
$$ 18165010 11256647 7240236 -2706346 -12706083 -7835157 9826351 20653245 14709061
37665A4709061j1778479m428153L015702M114948K389749J210879K638151Q065733
$$ 14709061 2930582 -1497571 1518131 5633079 8022828 9233707 11871858 19937591
37657A9937591J1036949P77501j7829271k2212734l039487J7207206J3595825
$$ 19937591 30974540 31752041 13922770 -8289964 -11329451 5877755 19473580
37650A9473580n381392j1947506j217052M527386o470854j6623021o711768J4162190
$$ 19473580 14092188 2144682 927630 5455016 -1015838 -17638859 -24350627 -10188437
37642a0188437K0633942N901646j0179882r282159J218894J477133r864684j3166926
$$ -10188437 10445505 16347151 6167269 -3114890 -1895996 -418863 -10283547 -23450473
37634b3450473J171136J5587580J0873705m437818q040003J330814M931883l116732
$$ -23450473 -22279337 -6691757 4181948 -255870 -8295873 -6965059 -2033176 -5149908
37626e149908p851794j300838N014815L085279K264867Q748943J0754988r28721
$$ -5149908 -13001702 -14302540 -9287725 -6202446 -3937579 4811364 15566352 14637631
37618A4637631j3633808j0976011J519839O039066n99548o160845m231478j139803
$$ 14637631 1003823 -9972188 -8452349 -2413283 -3012831 -9173676 -13405154 -14544957
37610a4544957k795642n955000l673872O113642J6924146J7656319N035194q606756
$$ -14544957 -17340599 -23295599 -26969471 -20855829 -3931683 13724636 18759830 10153074
37602A0153074r126032j135182j090434r638931r720327L142253J0612464K227181
$$ 10153074 1027042 -108140 -1198574 -10837505 -20557832 -17415579 -6803115 -4575934
37594d575934n709125J801430J1612477M913751r878520j1424862r54292K935525
$$ -4575934 -10285059 -8483629 3128848 8042599 -1835921 -13260783 -14215075 -11279550
37586a1279550k107032j107752P418056O446791r135122k0065857r752586J2867375
$$ -11279550 -13386582 -14494334 -7076278 -629487 -9764609 -29830466 -39583052 -26715677
37578b6715677K6926363K4238575J2195743R87382m519666n128098m640266n247342
$$ -26715677 210686 24449261 36645004 37632386 33112720 27984622 23344356 18097014
37570A8097014n547764n047456o680594j0441104r810448j010249R400156J3139131
$$ 18097014 12549250 7501794 821200 -9619904 -19430352 -20440601 -11040445 2098686
37562B098686J0636253N878673j245627q573283p207452M221870J0122121j590683
$$ 2098686 12734939 18613612 17367985 8794702 1587250 5809120 15931241 14340558
37554A4340558j7311183j4525177M355175J5480069Q993591r10724l292547n177467
$$ 14340558 -2970625 -17495802 -13140627 2339442 11333033 10422309 7129762 1952295
37546A952295j1823532j3322030l087204P122845N372345j02351M983474J5440910
$$ 1952295 -9871237 -23193267 -26280471 -19157626 -13785281 -13887632 -8904158 6536752
37538F536752J3264582l546034j6481899j3076065k726653N05118j601349J062314
$$ 6536752 19801334 16255300 -226599 -13302664 -16029317 -15524199 -17125548 -16063234
37530a6063234P186400O186899k001265m488387L532250R566999L908083l972528
$$ -16063234 -8876834 -2689935 -4691200 -9179587 -5647337 3919662 7827745 3855217
37522C855217j671632M424524L63439j0170428j1654458l665700l28460l625027
$$ 3855217 2183585 6608109 6971548 -3198880 -14853338 -18519038 -18847498 -22472525
37514b2472525q40360Q421787P998340m259200p257779Q793863K2261488J2119958
$$ -22472525 -23312885 -14891098 -6892758 -11151958 -18409737 -9615874 12645614 24765572
37506B4765572r825682j8399371j0300355L8965N614078P770689M143290m879632
$$ 24765572 14939890 -3459481 -13759836 -13720871 -8106793 -336104 3807186 -1072446
37498a072446q339893q61649N124117j39134n698325p32236L662986m088900j0485005
$$ -1072446 -9412339 -10273988 -5149871 -5289005 -10987330 -11719566 -8056580 -12145480 -22630485
37489b2630485P0895J3083624O488495q129328k793580J7206445J9937476O98072
$$ -22630485 -22559590 -9475966 -2987471 -11116799 -13910379 3296066 23233542 23931614
37481B3931614j0287447J455468J3304197N000373j2298224j8908350j2626712
$$ 23931614 13644167 15099635 28403832 33404205 21105981 2197631 -10429081
37474a0429081q41227J0759362J3387544J025806j2987192q159392R903720J3778977
$$ -10429081 -11270308 -510946 12876598 13902404 915212 -7244180 2659540 16438517
37466A6438517l367474j7530632j3235158l966563k848785j856720O014119J0556431
$$ 16438517 13071043 -4459589 -17694747 -21661310 -24510095 -26366815 -20352696 -9796265
37458i796265N420195J286870L965981L012316m832112o114397J880513J404245
$$ -9796265 -4376070 -3089200 876781 3889097 -943015 -7057412 -5176899 -3772654
37450c772654j2334455j6701504K94839J6261196J1470355J631411P124077J5854313
$$ -3772654 -16107109 -32808613 -32513774 -16252578 -4782223 -3150812 3973265 19827578
37442A9827578P540409p470596o842620M393733O434368J243298K745319L998352
$$ 19827578 27367987 19897391 13054771 17448504 23882872 25126170 27871489 31869841
37434C1869841j0143082k7474600k2360703K29422J0696177K656941r09646R269305
$$ 31869841 21726759 -5747841 -28108544 -27879122 -17182945 -14526004 -15435650 -6166345
37426f166345J4938809N857395l369467j766369J326527j096166o57047M806031
$$ -6166345 8772464 14629859 11260392 9494023 10820550 9724384 9067337 13873368
37418A3873368J373477j4956389k4612263j3053611N747943J1375706O278603
$$ 13873368 15246845 290456 -24321807 -37375418 -31627475 -20251769 -13973166
37411a3973166M819012O367059k96404j3274934j7746348p905008O557891J5724361
$$ -13973166 -9154154 -2787095 -3083499 -16358433 -34104781 -42009789 -35451898 -19727537
37403a9727537J8639848J6595574Q850162j658477p331922n612127l699449q148843
$$ -19727537 -1087689 15507885 24358047 22699570 15367648 9755521 6056072 -2092771
37395b092771j3775432r782532M016007J4781847J3351246O232373M463734O523555
$$ -2092771 -15868203 -25650735 -21634728 -6852881 6498365 12730738 17194472 23718027
$$ [...]
##END NTUPLES=NMR SPECTRUM
##END=
