##TITLE=31Pdec_LR-0154-BK2
 D2O, 64 sc
 22.3.2023
##JCAMPDX= 6.0         $$ Bruker NMR JCAMP-DX V2.0
##DATA TYPE= NMR SPECTRUM
##DATA CLASS= NTUPLES
##ORIGIN= UXNMR, Bruker Analytische Messtechnik GmbH
##OWNER= root
$$ XWIN-NMR		Version 3.5
$$ Wed Mar 22 14:30:58 2023 Russian Standard Time (UT+4h)  she@DPX200
##.OBSERVE FREQUENCY= 81.013821
##.OBSERVE NUCLEUS= ^31P
##.ACQUISITION MODE= SIMULTANEOUS
##.ACQUISITION SCHEME= undefined
##.AVERAGES= 64
##.DIGITISER RES= 16
##SPECTROMETER/DATA SYSTEM= spect
##.PULSE SEQUENCE= zgpg30
##.SOLVENT NAME= D2O
##.SHIFT REFERENCE= (INTERNAL, D2O, 0, 248.564)
##AUDIT TRAIL= $$ (NUMBER, WHEN, WHO, WHERE, WHAT)
$$ ##TITLE= Audit trail, XWIN-NMR		Version 3.5
$$ ##JCAMPDX= 5.01
$$ ##ORIGIN= Bruker BioSpin GmbH
$$ ##OWNER= she
$$ F:/spectra/data/she/nmr/P31/1/pdata/1/auditp.txt
$$ ##AUDIT TRAIL=  $$ (NUMBER, WHEN, WHO, WHERE, WHAT)
(   1,<2023-03-22 14:30:05.21 +0400>,<she>,<DPX200>,
      <continue with go, POWCHK disabled, PULCHK disabled
       configuration hash MD5:
       00 E9 B6 7A A2 85 ED C7 34 08 36 98 17 FE 4E 26
       data hash MD5: 32K
       A3 56 DD 92 B1 8F 45 35 E5 11 C9 12 BC 01 5E 4E>)
(   2,<2023-03-22 14:30:07.40 +0400>,<she>,<DPX200>,
      <Start of raw data processing
       efp BC_mod = 2 LB = 1 FT_mod = 6 PKNL = 1 PHC0 = -10638.44 PHC1 = 103.6848 SI = 64K 
       data hash MD5: 64K
       2F 78 47 59 0E 27 83 84 FF 5A DE 32 C6 08 9B 8C>)
(   3,<2023-03-22 14:30:28.10 +0400>,<she>,<DPX200>,
      <pk PHC0 = 0.7306868 PHC1 = 0 
       data hash MD5: 64K
       9D 2A 5C E5 F7 07 5C 2D 79 B5 3E 47 2A E4 BF 67>)
(   4,<2023-03-22 14:30:33.04 +0400>,<she>,<DPX200>,
      <abs ABSG = 5 
       data hash MD5: 64K
       3F 50 DA A4 D4 4E D9 6A 38 95 A6 5B 66 F9 A9 73>)
$$ ##END=
$$ 
$$ hash MD5
$$ C1 86 7C 18 99 42 29 65 3F 06 A9 37 9C D0 44 E3
##$RELAX= 
##$RELAX= 
##$RELAX= 
##$RELAX= 
##$RELAX= 
##$RELAX= 
##$RELAX= 
##$RELAX= 
##$RELAX= 
$$ Bruker specific parameters
$$ --------------------------
##$DU= <F:/spectra>
##$EXPNO= 1
##$NAME= <P31>
##$PROCNO= 1
##$TYPE= <nmr>
##$USER= <she>
##$AMP= (0..31)
100 100 100 100 100 100 100 100 100 100 100 100 100 100 100 100 100 100 
100 100 100 100 100 100 100 100 100 100 100 100 100 100 
##$AQSEQ= 0
##$AQ_mod= 1
##$AUNM= <au_zg>
##$AUTOPOS= <>
##$BF1= 81.014009
##$BF2= 200.13
##$BF3= 200.13
##$BF4= 200.13
##$BF5= 200.13
##$BF6= 200.13
##$BF7= 200.13
##$BF8= 200.13
##$BYTORDA= 1
##$CFDGTYP= 0
##$CFRGTYP= 5
##$CHEMSTR= <none>
##$CNST= (0..31)
1 1 145 1 1 1 1 1 1 1 1 1 1 1 1 1 1 1 1 1 1 1 1 1 1 1 1 1 1 1 1 1 
##$CPDPRG= <waltz16>
##$CPDPRG1= <>
##$CPDPRG2= <waltz16>
##$CPDPRG3= <>
##$CPDPRG4= <mlev>
##$CPDPRG5= <mlev>
##$CPDPRG6= <mlev>
##$CPDPRG7= <mlev>
##$CPDPRG8= <mlev>
##$CPDPRGB= <>
##$CPDPRGT= <>
##$D= (0..31)
0 1 0 0 0 0 0 0 0 0 0 0.03 2e-05 3e-06 0 0 0 0 0 0 0 0 0 0 0 0 0 0 0 0 
0 0 
##$DATE= 1679480898
##$DBL= (0..7)
120 120 120 11 120 120 24 19 
##$DBP= (0..7)
150 150 150 150 150 150 150 150 
##$DBP07= 0
##$DBPNAM0= <>
##$DBPNAM1= <>
$$ [...]
##$SUBNAM3= <"">
##$SUBNAM4= <"">
##$SUBNAM5= <"">
##$SUBNAM6= <"">
##$SUBNAM7= <"">
##$SUBNAM8= <"">
##$SUBNAM9= <"">
##$SW= 501.771253377433
##$SWIBOX= (0..15)
0 1 3 0 0 0 0 0 0 0 0 0 0 0 0 0 
##$SW_h= 40650.406504065
##$TD= 32768
##$TD0= 1
##$TE= 0
##$TE2= 300
##$TE3= 300
##$TEG= 300
##$TL= (0..7)
0 120 53 12 22 120 120 120 
##$TP= (0..7)
150 150 150 150 150 150 150 150 
##$TP07= 0
##$TPNAME0= <>
##$TPNAME1= <>
##$TPNAME2= <>
##$TPNAME3= <>
##$TPNAME4= <>
##$TPNAME5= <>
##$TPNAME6= <>
##$TPNAME7= <>
##$TPOAL= (0..7)
0.5 0.5 0.5 0.5 0.5 0.5 0.5 0.5 
##$TPOFFS= (0..7)
0 0 0 0 0 0 0 0 
##$TUNHIN= 0
##$TUNHOUT= 0
##$TUNXOUT= 0
##$USERA1= <user>
##$USERA2= <user>
##$USERA3= <user>
##$USERA4= <user>
##$USERA5= <user>
##$V9= 5
##$VALIST= <valist>
##$VCLIST= <CCCCCCCCCCCCCCC>
##$VD= 0
##$VDLIST= <DDDDDDDDDDDDDDD>
##$VPLIST= <PPPPPPPPPPPPPPP>
##$VTLIST= <TTTTTTTTTTTTTTT>
##$WBST= 1024
##$WBSW= 4
##$XGAIN= (0..3)
0 0 0 0 
##$XL= 0
##$YL= 0
##$YMAX_a= 3299
##$YMIN_a= -4559
##$ZGOPTNS= <>
##$ZL1= 120
##$ZL2= 120
##$ZL3= 120
##$ZL4= 120
##$ABSF1= 248.5645
##$ABSF2= -253.2056
##$ABSG= 5
##$ABSL= 3
##$ALPHA= 0
##$AQORDER= 0
##$ASSFAC= 0
##$ASSFACI= 0
##$ASSFACX= 0
##$ASSWID= 0
##$AUNMP= <proc_1d>
##$AZFE= 0.1
##$AZFW= 0.5
##$BCFW= 0
##$BC_mod= 2
##$BYTORDP= 0
##$COROFFS= 0
##$CY= -3
##$DATMOD= 1
##$DC= 0
##$DFILT= <>
##$DTYPP= 0
##$F1P= 0
##$F2P= 0
##$FCOR= 1
##$FTSIZE= 65536
##$FT_mod= 6
##$GAMMA= 0
##$GB= 0
##$INTBC= 1
##$INTSCL= 6.047779e-11
##$ISEN= 30
##$LB= 1
##$LEV0= 0
##$LPBIN= 0
##$MAXI= 10000
##$MC2= 0
##$MEAN= 0
##$ME_mod= 0
##$MI= 50
##$NCOEF= 0
##$NC_proc= -8
##$NLEV= 6
##$NOISF1= 182.463
##$NOISF2= 159.3651
##$NSP= 0
##$NTH_PI= 0
##$NZP= 0
##$OFFSET= 248.5645
##$PC= 4
##$PHC0= -10637.71
##$PHC1= 103.6848
##$PH_mod= 1
##$PKNL= yes
##$PPARMOD= 0
##$PSCAL= 0
##$PSIGN= 0
##$REVERSE= no
##$SF= 81.0140089999694
##$SI= 65536
##$SIGF1= 159.3651
##$SIGF2= -187.1042
##$SINO= 113.3802
##$SIOLD= 16384
##$SREGLST= <1H.CDCl3>
##$SSB= 0
##$STSI= 65536
##$STSR= 0
##$SW_p= 40650.406504065
##$SYMM= 0
##$S_DEV= 0
##$TDeff= 32768
##$TDoff= 0
##$TI= <>
##$TILT= no
##$TM1= 0
##$TM2= 0
##$TOPLEV= 0
##$USERP1= <user>
##$USERP2= <user>
##$USERP3= <user>
##$USERP4= <user>
##$USERP5= <user>
##$WDW= 1
##$XDIM= 65536
##$YMAX_p= 440901148
##$YMIN_p= -360827176
$$ End of Bruker specific parameters
$$ ---------------------------------
##NTUPLES= NMR SPECTRUM
##VAR_NAME=  FREQUENCY,     SPECTRUM/REAL,   SPECTRUM/IMAG
##SYMBOL=    X,             R,               I
##VAR_TYPE=  INDEPENDENT,   DEPENDENT,       DEPENDENT
##VAR_FORM=  AFFN,          ASDF,            ASDF
##VAR_DIM=   65536,         65536,           65536
##UNITS=     HZ,            ARBITRARY UNITS, ARBITRARY UNITS
##FACTOR=    0.620285442955139, 1,           1
##FIRST=     20137.2065510682, 0,            0
##LAST=      -20513.1999529968, 0,           0
##MIN=       -20513.1999529968, -360827176,  0
##MAX=       20137.2065510682, 440901148,    0
$$ Real data points
##PAGE= N=1
##DATA TABLE= (X++(R..R)), XYDATA
$$ [...]
41859b560366M343934m384353p332631k389059L476631L350259j718260n247337
41851a2461182l672308L01517K325726J759077R13478P12290o9121j409580j127644
41842a2727747J277534K812461J472984j8022J556449L917870K093932l583081
41834c197620p231288n499854j104475K492053M869882N766035L886988Q67393
41826H49114P89760K867566R32001n632963p646467M04776R326948P174823k489629
41817F575929n771296L35948M729379J211457k533036J21084K811531k226896
41809E254100r493511p885599J602871O575428Q83807p286798o898738K308390
41801a4940050J0583339R776106J947634l412833n49321N342839M743069k933099
$$ y = [-2560366, 1783568, -2600785, -9933416, -12322475, -8845844, -5495585, -7213845, -12461182, -16133490, -15831973, -13506247, -11747170, -10833692, -10121402, -10190523, -11600103, -12727747, -11450213, -8637752, -7164768, -7182790, -5626341, -1708471, 385461, -3197620, -10428908, -15928762, -17033237, -14541184, -9671302, -3905267, -18279, 849114, 1638874, 4506440, 5438441, -194522, -7840989, -7436213, 1890735, 9065558, 6575929, 804633, 1140581, 5869960, 7081417, 4548381, 4669465, 7480996, 5254100, -4239411, -12125010, -10522139, -3946711, -3062904, -10349702, -17248440, -14940050, -4356711, 5419395, 7367029, 3954196, 3404875, 8747714, 13490783, 10557684]
41793A0557684p911110l741328L446474L897472k187271o120524l212154K383482
41785b887275M544574J867040k507667m186830j178501L136466K640566k981775
41777a553402n747129j02790P521751O883265p48999m226621M52568M264106m07339
41768F335410p908157p975804l59534O564693Q432598Q152684P201459J967396
41760B2410745q033811j4698090j0269060J065210P302836M263860R7784J813125
41752C952599M701846J268450n173879n113354J595881N222364J544185k720974
41744E277118k386370j315365k897439k952267J392978M737979K846846N66433
41736E269913J970408J448118n122009r200481k627434N914411L247464n257156
$$ y = [10557684, 2646574, -1094754, 2351720, 6249192, 4061921, -2058603, -5270757, -2887275, 1657299, 3524339, 1016672, -3170158, -4348659, -1212193, 1428373, -1553402, -7300531, -7403321, 118430, 7001695, 6252696, 2026075, 2478643, 6742749, 6335410, -1572747, -9548551, -9908085, -3343392, 5089206, 13241890, 20443349, 22410745, 14376934, -321156, -10590216, -9525006, -2222170, 2041690, 2139474, 3952599, 8654445, 9922895, 4749016, -364338, 1231543, 6453907, 7998092, 5277118, 2890748, 1575383, -1322056, -4274323, -2881345, 1856634, 4703480, 5269913, 7240321, 8688439, 3566430, -5634051, -8261485, -2347074, 900390, -4356766]
41728d356766l450170P475568R526299j335880o653534M355890J5826501R617634
41720C1005542o626329j1937832k739785N395137J964496p130874j1412139p631557
41712i113341O36876P152456O780442Q33824k964099n85952K046622j311652o394367
41703b919191n299927O0046J295869j911894j265752N729449J0794466P185340
41695A3668406q94319n067239l276200M35216K696952L534437M124345M444428
41687A9666026L033391j103909o043517p897844n518496k167164o94515K09960
41679e16068K422680M195466L040614k3523k682549m681479n319220j791032M950976
41670d04135P297292Q73157o571085m563028M543549Q877094M444294j173626
$$ y = [-4356766, -7806936, -331368, 9194931, 7859051, 1205517, 5561407, 21387908, 31005542, 24379213, 12441381, 9701596, 15096733, 17061229, 9930355, -1481784, -9113341, -8476465, -1324009, 5456433, 6290257, 3326158, 2740206, 4786828, 3475176, -2919191, -8219118, -8159072, -6863203, -8775097, -10040849, -4311400, 6483066, 13668406, 12774087, 7706848, 4430648, 4865864, 7562816, 11097253, 15221598, 19666026, 22699417, 21595508, 15551991, 7654147, 2135651, -31513, -726028, -516068, 1906612, 6102078, 9142692, 9119169, 6436620, 1755141, -3564079, -5355111, -404135, 6893157, 7766314, 1195229, -3367799, 1175750, 10052844, 14497138, 13323512]
41662A3323512k665862l330783n153177l799282J503957L311109j922982n968643
41654d702151j541713M657224J964243o519018q053834k04O630386M485654n01605
41645c581018q60499P57956j451307m807092k344955M426719N875723j996150
41637c980623j1099647j1286057k329869P164999R870171N711117k88220l001763
41629i239892p69337L509498M890996J598353k544358k260480K945169Q013369
41621F143318P653432J645978m808908n765840n51006M917899M668797K05795
41613A4109465j948903l87210q73789n868898q579621k946825O012833R121143
41605H638195N842139J854455k092070q548128j3244293q694964K218254Q326514
$$ y = [13323512, 10657650, 7326867, 2173690, -1625592, -121635, 3189474, 1266492, -4702151, -6243864, -1586640, 377603, -6141415, -14195249, -14195453, -7565067, -3079413, -3581018, -4441517, -3683561, -5134868, -9941960, -12286915, -7860196, -1984473, -3980623, -15080270, -26366327, -28696196, -21531197, -11661026, -5949909, -6238129, -9239892, -10009229, -6499731, -1608735, -10382, -2554740, -4815220, -1870051, 6143318, 13796750, 15442728, 10633820, 4867980, 4316974, 9234873, 13903670, 14109465, 12160562, 11773352, 10899563, 5030665, -3548956, -6495781, -482948, 8638195, 14480334, 16334789, 14242719, 5694591, -7549702, -16244666, -14026412, -5699898]
41597e699898O762392M947450M744236l87321q615309p127287N531036J1356958
41589A1512257m55156j4040458j0078177M419519Q714067J077443k738728J728782
41581A39549L349700r58056q26783N869878O750802k937379j0378817o237104
41573e228210N20592p16325m720177j659831N178359N621087q58765o198344o193458
41564a4255072k703388K041303N768268N398661K127604J831699N127052M367948
41556I704075l230097q160356k764115N462371M954295k485656o546220m982074
41548h047777l343036k409984J544209O297336N681668J214018M86304M175364
41540E598102N374431K021275o36691p09271k194769n350252m995275q39156O11052
$$ y = [-5699898, 1062494, 6009944, 10754180, 10366859, 1751550, -5375737, 155299, 11512257, 11057101, -2983357, -13061534, -8642015, 72052, 1149495, -1589233, 139549, 3489249, 2531193, 1704410, 7574288, 14325090, 11387711, 1008894, -5228210, -4707618, -5423943, -10144120, -11803951, -6625592, -1004505, -1863270, -8061614, -14255072, -16958460, -14917157, -9148889, -3750228, -1622624, 209075, 5336127, 9704075, 6473978, -1686378, -4450493, 1011878, 5966173, 3480517, -3065703, -8047777, -11390813, -13800797, -12256588, -5959252, -277584, 936434, 1422738, 5598102, 10972533, 12993808, 12357117, 11647846, 9453077, 4102825, -892450, -1731606, -1120554]
41531a120554k362185l005771J964777O216838M692287J801779K518198L208912
41523A3914281j189731p096677p435435k628807J157555J819300K121516K487705
41515C149707L3411n108968q152411n635534M47632N467276O873844N590945M130449
41506F796351L640877K686083k57534l568002m005718j486588O23167M97990j62364
41497D764262k9322l50014j680553j960297O1160K421927K842188J409751p48316
41488F730786k432038j509931K733301N882822K586784m226589n081839K266942
41480F950238Q121017M556752l310772o172568m095481l173128l845071j939520
41472b908533J819966K809087J351637J657353K929923M19595m918552o674090
$$ y = [-1120554, -3482739, -6488510, -4523733, 1693105, 6385392, 8187171, 10705369, 13914281, 12724550, 5627873, -1807562, -4436369, -3278814, -1459514, 662002, 3149707, 3183118, -1925850, -10078261, -15713795, -15266163, -9798887, -2925043, 2665902, 6796351, 10437228, 13123311, 12865777, 9297775, 5292057, 3805469, 4428636, 4926626, 4764262, 4734940, 4384926, 2704373, 744076, 805236, 3227163, 6069351, 7479102, 6730786, 4298748, 2788817, 5522118, 11404940, 13991724, 9765135, 4683296, 6950238, 15071255, 19628007, 16317235, 10144667, 6049186, 2876058, -969013, -2908533, -1088567, 1720520, 3072157, 4729510, 7659433, 8079028, 3160476, -3513614]
41464c513614l410681l20374L32573J646348L660523J869505l195859m136975
41456g068554J622845O852422N793509K253268J214330N13303k613219m224054
41448D343850p10464L127600J470507k163446q34371L550733L285983k292947
41440I777445o317799n573672l303023j166729K732990O888832O048339K90278
41432I376661l158537p09090J623353k156802p632785n608959L946375J0094443
41424E774659M789062n749276p994387J243686R767886O131190m221977o846700
41416B894143O7346L332442l705201r823869l696379P758401J0037311K406868
41408I271062m078460m644652l519551k120100J402749K699884l962494j1723491
$$ y = [-3513614, -6924295, -7244669, -6912096, -5265748, -1605225, 264280, -2931579, -7068554, -5445709, 1406713, 7200222, 9453490, 10667820, 11181123, 8567904, 4343850, 3633386, 6760986, 8231493, 6068047, 5233676, 8784409, 12070392, 9777445, 3459646, -2114026, -5417049, -6583778, -3850788, 3038044, 9086383, 9376661, 6218124, 5509034, 7132387, 4975585, -2657200, -8266159, -4319784, 5774659, 10563721, 4814445, -3179942, -1936256, 7831630, 13962820, 9740843, 2894143, 2961489, 6293931, 2588730, -7235139, -10931518, -3173117, 6864194, 9271062, 5192602, 547950, -2971601, -5091701, -3688952, -989068, -4951562, -16675053]
41400a6675053p442725O452815J2600819M912493k605633K24191L956601j844589
41392d21081r324002n771715M793690Q579899L196516k306398l357691k612705
41384g223487o09112L899201O804110L024982l909084o368279m076865j807375
41376a0265909N53167N258116P916847L159873l906703m195633r0024j085962
41368b656228n746960l193467O586950R828143N98395r258114q429747j859826
41360a4130854m2695k856170l116257J057540N733184P910265O480838J210896
41352B246747m360894m273646J279669M558204J620996j616015M09026L675401
41344C539488J855012l339918n999525n180838l435977n70071M300166P949189
$$ y = [-16675053, -24117778, -17664963, -5064144, -151651, -2757284, -2533093, 1423508, -421081, -9745083, -15516798, -10723108, -2143209, 1053307, -1253091, -4610782, -7223487, -7832599, -3933398, 2870712, 5895694, 1986610, -4381669, -8458534, -10265909, -9712742, -4454626, 3462221, 6622094, 2715391, -1480242, -1570266, -2656228, -8403188, -11596655, -5009705, 4818438, 5416833, -3841281, -12271028, -14130854, -14173549, -17029719, -20145976, -19088436, -13355252, -5444987, 1035851, 2246747, -2114147, -6387793, -5108124, -549920, 1071076, -544939, -135913, 3539488, 5394500, 2054582, -3944943, -9125781, -12561758, -13131829, -8831663, -882474]
41336h82474O700395K195506j574478l714296m364239j703351L572437N486290
41328E715790P70571m752594m442344j081479j321353m008911k853370K034562
41320i939128M508096K956245J629277J908756R09653r89998K71887M264193N437511
41311A0956492K198514r09066j635540k832323m785073l106574K231621L957825
41303F075876j342960o426606m036965J809862K578234j431568k779674O78372
41295d875429L507291K409023N00792O29716R99842j44891q85329J58882K53959
41286B553856k958789o282828m484039K171472P526785O725535J252301l551700
41278B952593m171812j614713N12924K82445j40252K559127P113726P524438J023161
$$ y = [-882474, 5817921, 8013427, 6438949, 2724653, -1639586, -3342937, 229500, 5715790, 6486361, 1733767, -2708577, -3790056, -5111409, -9120320, -11973690, -9939128, -5431032, -2474787, -845510, 1063246, 1972899, 982901, 1254788, 5518981, 10956492, 13155006, 12245940, 10610400, 7778077, 2993004, -113570, 2118051, 6075876, 4732916, -1693690, -5730655, -3920793, -1342559, -2774127, -5553801, -4875429, -1368138, 1040885, 1541677, 2171393, 3171235, 3026344, 2141015, 2299897, 2553856, -404933, -6687761, -11171800, -9000328, -1473543, 5251992, 6504293, 2952593, -1219219, -2833932, -2321008, -2038563, -2178815, 380312, 7494038, 15018476, 16041637]
41269A6041637o327521o364322l0281L612608J83251m201244k654868K455882
41261B715142L966041M62521l204013l678090j897048O15218L074836L594539
41253E649146O74999l636362n848716n346380l015092J932886Q508917J0329272
41245I248670L143062n813690n318782L105492O433769j05014o022788k912795
41237A757924K727357J700335l036996l818222k365154m620879p412892l304727
41229a8373254M512110N594688k29535j952031M367945R095628M805608k724547
41221E096612n209523l926160l797815l225523J605588P474631P847228L117747
41213H982785m27558l64965n9931j444338k191391q33546M19845m85080k318948
$$ y = [16041637, 9714116, 3349794, 3319513, 6932121, 7115372, 2914128, 259260, 2715142, 6681183, 7143704, 3939691, 261601, -1635447, -1020229, 2054607, 5649146, 6324145, 2687783, -3160933, -8507313, -11522405, -9589519, -1080602, 9248670, 12391732, 6578042, 1259260, 4364752, 10798521, 10693507, 4670719, 1757924, 4485281, 6185616, 3148620, -669602, -3034756, -7655635, -15068527, -18373254, -13861144, -8266456, -8495991, -10448022, -6080077, 3015551, 7821159, 5096612, -112911, -4039071, -7836886, -11062409, -9456821, -1982190, 5865038, 8982785, 8555227, 8190262, 8130331, 6685993, 4494602, 3661056, 4080901, 3595821, 1276873]
41204A276873k646389p34169K157604L472449P17753n324027r120313n368074
41196a5568293L972675J0518622Q463063N60206n793959o285500k396479J425312
41188e104353J603303k089813o133988o096392j130566M880125P321722N078031
41180a671931L49933m016914n803817l757401J172869N556603O205772L067261
41172A102375j314755m185836l670653M96416N534309O926118L577019k79788
41164H185205r68134m88314j938804l028607k28751K979385J61598o276481o862401
41155h465304m12631K699769k763843p210477j005715R698625J2052215N225035
41147I817674r66999j948910j451046j134816J207726L725482J840735k182899
$$ y = [1276873, -1369516, -2103685, 53919, 3526368, 4244121, -1079906, -10200219, -15568293, -11595618, -1076996, 7386067, 7946273, 2152314, -4133186, -6529665, -5104353, -3501050, -5590863, -11724851, -17821243, -18951809, -14071684, -6749962, -1671931, -1321998, -5338912, -11142729, -14900130, -13727261, -8170658, -1964886, 1102375, -212380, -4398216, -8068869, -7572453, -2038144, 4887974, 8464993, 8185205, 7217071, 6728757, 4789953, 1761346, 1532595, 4511980, 4673578, -1602903, -8465304, -8877935, -6178166, -8942009, -16152486, -17158201, -7459576, 4592639, 9817674, 8850675, 6901765, 5450719, 4315903, 5523629, 9249111, 11089846, 8906947]
41139H906947j559139K706613K923665r58889n61989M758830M408161n196781
41131A5427418j1809511n324972O334101R467066L987776m22865o44635p51422
41123A6262956q85033K405002O508648M528036k966512p279239m163839N78864
41115A4988883J96032m373657p498711o227745k182062J409426K577831J351999
41107B41996j214706l762536l875050Q71442Q037697R522498J521841p267963
41099D075219n906034J928112K676690n053735p328270J979481J0063236N757811
41091H192510k955734l811177o1366j146729m187625j120991L803398J066508
41083b21206n300397l595013M726051P712092L729636J682582K140138k784899
$$ y = [8906947, 7347808, 10054421, 12978086, 12019197, 11457208, 16216038, 20624199, 15427418, 3617907, -1707065, 4627036, 14094102, 18081878, 17659013, 17014378, 16262956, 15377923, 17782925, 24291573, 28819609, 25853097, 18573858, 14410019, 14988883, 15184915, 10811258, 3312547, -2915198, -5097260, -3687834, -1110003, 241996, -972710, -4735246, -8610296, -7738854, 298843, 9821341, 11343182, 4075219, -1830815, 97297, 2773987, -2279748, -9608018, -7628537, 2434699, 8192510, 5236776, 1425599, 1364233, 217504, -3970121, -5091112, -1287714, -221206, -5521603, -9116616, -4390565, 3321527, 7051163, 8733745, 10873883, 8088984]
41075H088984j0555813q895592K009479P231850J458857l135086Q13079M445011
41067A460769J299144j061892K184591K391542m789830p716391J209179R221829
41059D198941L199236p254145n052570O246326R163290O39065n889294l809170
41051A441679l98834o03872j35919L030995M021442J051040j080082k45105j18973
41042F962371j819348j406822J852518K796639j358126o562816p880929m696420
41034a2112933P81354N321652N360708R87612j931600R94550N362561M148008
41026H911912j315565l954218k272083p20903n49821O41947J370839j975460o120840
41017e984192l743825L999012P952358N195650K230186K031194n02470o340346
$$ y = [8088984, -2466829, -11362421, -9352942, -2121092, -662235, -3797321, -2984242, 1460769, 2759913, 1698021, 3882612, 6274154, 1484324, -6232067, -5022888, 4198941, 7398177, 144032, -4908538, 1337788, 10501078, 11140143, 5250849, 1441679, 1042845, 438973, 303054, 3334049, 7355491, 8406531, 7326449, 7081344, 6962371, 5143023, 3736201, 5588719, 8385358, 7027232, 464416, -7416513, -12112933, -11331579, -6009927, -649219, 338393, -1593207, -598657, 4763904, 8911912, 7596347, 3642129, 1370046, 649143, 99322, 741269, 2112108, 136648, -5984192, -9728017, -5729005, 2223353, 7419003, 9649189, 11680383, 11177913, 4837567]
41009D837567p387408j36573O255397L580932k565150k525707K161296L120830
41001G341184o91375l407350l321610l517654l320422J043495P254646P476631
40993H857545Q4856o534520m958761J831564N199124J446549n205659q169799
40985g449101n030171N25242K782502O66688q86836J981413N638478L467272m057432
40976b361945q607671m573613L571021P045949L479043j217456j118480K307625
40968a475527K759892j606548m451946K95549Q014202P403708l300029j1059441
40960c420140m940746P366546R545802M76337m301372L093320J0258108L814068
40952B1891923r516323j3009493m417319L426704L709622K707967M569451L664491
$$ y = [4837567, -2549841, -2686414, 3568983, 7149915, 4584765, 2059058, 4220354, 7341184, 6649809, 3242459, -79151, -3596805, -6917227, -5873732, 1380914, 8857545, 8942401, 2407881, -2550880, -719316, 4479808, 5926357, 720698, -7449101, -12479272, -11954030, -9171528, -8504840, -9391676, -7410263, -1771785, 1695487, -2361945, -10969616, -15543229, -11972208, -4926259, -1447216, -2664672, -3783152, -1475527, 1284365, -322183, -4774129, -4478580, 3535622, 10939330, 7639301, -3420140, -8360886, -994340, 8551462, 9027799, 4726427, 7819747, 18077855, 21891923, 12375600, -633893, -5051212, -1624508, 2085114, 4793081, 9362532, 13027023]
40944A3027023k402245n101187R42713O627105K010610o737017o634803J223685
40936B955884M121453j134707m342981p30927Q58481n734708j1767930o465908
40928b2241343O307776J3683024J0919323M348162N47690L01408J385321R29343
40920A6180704l450711r615202j0374936k576229O070540N946816r07942l978439
40912b705399m4197L019633l97402n027627l546295K464592N691032L277996j110241
40903A622092l103217j411964K577229N517569L734884k559381p633624o059736
40895g316148K69411M145307K188863j314950r07938K685195M190735J120920
40887E061395l500892n487453l889903n57304K275760K876938O65660k485631
$$ y = [13027023, 10624778, 5523591, 6466304, 13093409, 15104019, 8367002, 1732199, 2955884, 7077337, 5942630, 1599649, 868722, 1727203, -4007505, -15775435, -22241343, -15933567, -2250543, 8668780, 13016942, 13564632, 13866040, 15251361, 16180704, 12729993, 3114791, -7260145, -9836374, -3765834, 2180982, 1273040, -2705399, -2749596, 270037, -127365, -5154992, -8701287, -6236695, -545663, 2732333, 1622092, -1481125, -2893089, -315860, 5201709, 8936593, 6377212, -1256412, -7316148, -7046737, -2901430, -712567, -2027517, -2935455, -250260, 3940475, 5061395, 1560503, -3926950, -7816853, -8374157, -6098397, -3221459, -2555799, -5041430]
40879e041430l383677j383895Q69379J868508L259735N169736L729522k332604
40871B755274o712431l668965J980367J214107m780433o444488j826783Q10778
40863a6672574j469314q73298N602962Q221688J086434n287174l69736P421782
40855b339230L559700p858133r896481j19431O498913K815790q04365L211886
40847d931351O885737K561772l051623j351503L210834K203427j798709j235334
40839B493250K253981J641615k221849k584410J069592L302914K772354K248700
40831A0976147Q30063m032536q531047o606126q48264J002262n03806J959798
40823e753509P398703N981725l348239p972304o67482Q142359O061018k939256
$$ y = [-5041430, -8425107, -9809002, -8939623, -7071115, -3811380, 1358356, 5087878, 2755274, -3957157, -7626122, -5645755, -4431648, -9212081, -15656569, -17483352, -16672574, -18141888, -19015186, -13412224, -5190536, -4104102, -9391276, -9761012, -2339230, 1220470, -6637663, -16534144, -16653575, -10154662, -7338872, -8143237, -4931351, 1954386, 4516158, 1464535, 113032, 3323866, 5527293, 3728584, 2493250, 4747231, 6388846, 4166997, 1582587, 2652179, 5955093, 8727447, 10976147, 11806210, 7773674, -757373, -7363499, -8211763, -7209501, -7713307, -5753509, 1645194, 7626919, 4278680, -3693624, -4361106, 3781253, 9842271, 6903015]
40815F903015o478940k890706l57144j140480O06582N799705O981859O71152o093006
40806D002037n828834n64093K764753J900703k88376j510014j806524j480159
40798b810507p10827k22998j08669O85240J856270P00981l760442p209824m248735
40789a5829511L808565Q947195N969883n99308k214583K145130M408463r86200
40781E649634q153175p280939J041575N980492J937579l699377k582258J772237
40773e334232P28250m692423n594323j53461L651881J620197l30518K714713N909569
40764a480347K825802m177917p926784n787700L65541Q386857J4235244J1557550
40756A7998246K34189r044542o868876J510213L437492l018341p725134m498341
$$ y = [6903015, 424075, -2466631, -2823775, -3964255, -3357673, 2442032, 9423891, 10095043, 4002037, -1826797, -2390890, 373863, 2274566, 1986190, 476176, -1330348, -2810507, -3521334, -3744332, -3853001, -3167761, -1311491, -610510, -4370952, -11580776, -15829511, -12020946, -3073751, 2896132, 2296824, 82241, 2227371, 6635834, 5649634, -2503541, -9784480, -8742905, -2762413, -824834, -4524211, -7106469, -5334232, -4605982, -9298405, -14892728, -15046189, -11394308, -9774111, -10104629, -7389916, -1480347, 1345455, -2832462, -10759246, -16546946, -16181405, -7794548, 6440696, 17998246, 18232435, 9187893, 2319017, 3829230, 7266722, 4248381, -3476753, -7975094]
40748g975094J462681L720104L241581L474223L727999J665864k040184m726474
40740B550700m591156j459032K352468K526713j830183m736127q07336N579282
40732d14671N815129M45618j875567J232797K724577p69472l263335p54728J795725
40723D936073J43203j824935m58159O21700j363694j770605K158676L766668k055005
40714D153922p978463m948676K435993K912844l518221o698481k638086L091557
40706a3187611O802336R740381R948243K996310p400610j0441435l236445M437255
40698c41576M077051q31049k084447J904689O196990N941512Q8439p518960r814389
40689b381740l917225L400413L610663j167642j718853K801986L458125k504904
$$ y = [-7975094, -6512413, -2792309, 449272, 3923495, 7651494, 9317358, 7277174, 2550700, -2040456, -3499488, -1147020, 1379693, -450490, -5186617, -5993953, -414671, 5400458, 5846076, 3970509, 5203306, 7927883, 7158411, 3895076, 3140348, 4936073, 5079276, 3254341, 2796182, 3417882, 2054188, 283583, 2442259, 6208927, 4153922, -3824541, -8773217, -6337224, -3424380, -6942601, -13641082, -16279168, -13187611, -6385275, 3355106, 13303349, 16299659, 8899049, -1542386, -4778831, -341576, 3735475, 2904426, 819979, 2724668, 8921658, 14863170, 14951609, 7432649, -2381740, -6298965, -2898552, 712111, -455531, -2174384, 627602, 4085727, 1580823]
40681A580823n912921r71885M649679K714704k089613j129560L339074L358693
40673E538994j24680J41644L422192J719030n308095q083711k337594L920819
40665a111401K968845k130674n093702o348821q186428o765458J660177J0585155
40657a4422307R756437Q64983l575180J442002O324907K368702n052879o003086
40649h296421j274724J258830P00790K688307O847784N965879j218612o621794
40641E0039n066160r55878P15343J333994K439354J244738k187627j722675M315058
40632A66186P481137J879621n210466m580762J08015l70255m561388l868345J421903
40623g534354K908955n50675j358354K466623M064768R58027m39253K903058M753449
$$ y = [1580823, -4332098, -5303983, -654304, 2060400, -29213, -1158773, 2180301, 5538994, 5414314, 5555958, 8978150, 10697180, 5389085, -2694626, -5032220, -1111401, 1857444, -273230, -5366932, -11715753, -19902181, -26667639, -25007462, -14422307, -4665870, -3800887, -7376067, -5934065, 390842, 2759544, -2293335, -8296421, -9571145, -8312315, -7611525, -4923218, 1924566, 7890445, 6671833, 50039, -5016121, -5971999, -5256656, -3922662, -1483308, -238570, -2426197, -4148872, 166186, 7647323, 9526944, 4316478, -264284, -156269, -526524, -5087912, -8956257, -7534354, -4625399, -5176074, -6534428, -4067805, -3037, 954990, 515737, 3418795, 8172244]
40614H172244Q56347l389835k085478J979387K766827m00438m164060n851719
40606b116725l722273K049295O375803L535491l520870n344063K35460M644957
40598B137075K038286k542436k928405r36194M7556K077091O026048N631418l086074
40589H464365j2149184j0607267J59692Q275774O398844j825816q400555q142576
40581a7826723j091582O971607Q200429J228301o272746p174895l288606r708
40573a9263923K459564O311348Q813841N618703p04818k947364N60813M518769
40565E366933N111445L713814J780876j901826o966725r203330n615973O41102
40557g073684L276592M87304k576772n46033M013878L060297m710156r355955
$$ y = [8172244, 9028591, 5638756, 3553278, 5532665, 8299492, 7899054, 3734994, -2116725, -5838998, -3789703, 2586100, 6121591, 2600721, -2743342, -2507882, 2137075, 4175361, 1632925, -1295480, -2231674, -2184118, -107027, 5919021, 11550439, 8464365, -3684819, -14292086, -14132394, -5856620, 542224, -1283592, -9684147, -17826723, -18918305, -11946698, -3746269, -2517968, -8790714, -15965609, -19254215, -19263923, -16804359, -10493011, -1679170, 3939533, 3234715, 287351, 848164, 5366933, 10478378, 14192192, 15973068, 14071242, 7104517, -2098813, -7714786, -7073684, -3797092, -3309788, -5886560, -6432593, -2418715, 641582, -4068574, -13424529]
40549a3424529k863838P632694Q572218l11748n821630j461887L972594J711922
40541a994204m187205n497959j984776J898810M525930M913792Q86675m408117
40533e847054k728431N937211R935987L611816k503661O28262M168317l267147
40525I935300j3697558j0693091L667459J1240218N188791k888912l956655k785397
40517c989845m621474n425343j259990L791288M749168K574097K22185j052358
40509e012272J77832L953707N545247J441101k958183j160740J722505l386338
40501C22859j1476279q720033L920550R881744L300347k005097L243777Q431996
40493F899864K610028o406686o088391K10695J420182k041980k066829J204263
$$ y = [-13424529, -16288367, -8655673, -83455, -395203, -6216833, -7678720, -3706126, -1994204, -6181409, -11679368, -13664144, -11765334, -7239404, -2325612, -1438937, -5847054, -8575485, -2638274, 7297713, 10909529, 8405868, 9034130, 13202447, 9935300, -3762258, -14455349, -10787890, 452328, 5641119, 2752207, -1204448, -3989845, -8611319, -14036662, -15296652, -11505364, -6756196, -4182099, -3959914, -5012272, -4834440, -880733, 4664514, 6105615, 3147432, 1986692, 3709197, 322859, -11153420, -19873453, -15952903, -6071159, -2770812, -4775909, -1532132, 6899864, 9509892, 3103206, -2985185, -2774490, -1354308, -3396288, -5463117, -4258854]
40485d258854J562228k82688O97528K353157o76312m806396k029242N655028Q643499
40476F857948N136478K120663J771043q19985n734304o193008q38575K813850
40468E114110N74705k304209q78572K265472L390439L180509J958495k750161
40460A0550788r198195r680135j786276N290770K668295n291140p529058j946853
40452a6921804L600423M036670K631879L466003N339037N228765K768378q00011
40444I349340m119994m544698J62550O585664O677798j947324j0397234q624848
40436f858746R04305O042573J291953n556653n329487L78449L499392J158940
40428d469274k826698n196816n679621l569775J687199O401588N234238q27908
$$ y = [-4258854, -2696626, -2979314, -2281786, 71371, -604941, -5411337, -7440579, -1785551, 6857948, 11994426, 14115089, 15886132, 15066147, 9331843, 3138835, 2300260, 5114110, 5688815, 3384606, 2506034, 4771506, 8161945, 11342454, 13300949, 10550788, 1352593, -8327542, -10113818, -4823048, -2154753, -7445893, -14974951, -16921804, -13321381, -9284711, -6652832, -3186829, 2152208, 7380973, 10149351, 9349340, 5229346, 684648, 847198, 7432862, 14110660, 12163336, 1766102, -6858746, -5954441, 88132, 1380085, -4176568, -9506055, -9127606, -5628214, -4469274, -7295972, -12492788, -18172409, -21742184, -20054985, -13653397, -8419159, -9247067]
40420i247067m433485j596550L410583M995431L305463J617525J101006J501218
40412F54124L119422M486794J829315m801733q229490k441866P767913J1258095
40404A3642574M311891n330618q897689o133898k527150j186654r09054j73835
40396g204433O01289P23900O23543Q45664J148364J399706K152451L191041K574677
40387F056202j022674n420044o548132l232056J687267N236388O711773N805466
40379I274190K033642k362484l016073K20605J490530k728027p434000o170496
40371h692113o21462K958411L830988N960033R006705Q185768K741350l035030
40363B0334650p126397j0387131j0241014l204271N379177M769532m746680r436527
$$ y = [-9247067, -13680552, -15277102, -11866519, -6871088, -3565625, -1948100, -847094, 654124, 3773546, 8260340, 10089655, 5287922, -2941568, -5383434, 2384479, 13642574, 17954465, 12623847, 3726158, -2407740, -4934890, -6121544, -7030598, -7204433, -6603144, -5879244, -5255701, -4410037, -3261673, -1861967, 290484, 3481525, 6056202, 5033528, -386516, -6934648, -10166704, -8479437, -3243049, 3468724, 9274190, 11307832, 8945348, 5929275, 6149880, 7640410, 4912383, -2521617, -8692113, -9313575, -6355164, -2524176, 3435857, 12442562, 20628330, 23369680, 20334650, 13208253, 2821122, -7419892, -10624163, -5244986, -475454, -5222134, -14658661]
40355a4658661j474438R148796R279873O09602n544739m614019o95400K776715
40347e172271M952270L699427j412507m844678j839863L006813J953945l371104
40339c027968m337309R66410N278430L893612N68399k38687q2774k362146o008034
40330e350067o340068m15595R041451J4056494Q134480m852519j2088519o438772
40322d253115M078420P027346J827642k202149r83985N14937j068269k585593
40314B355234j767523j296576k793462l449653j419794J056320K160785K886918
40306b267751L209173J304776j693855j742852J428659L189362J472054k74772
40298D624794L34146R60127p3322o82275k21537j740138n439514n817772O8494
$$ y = [-14658661, -16133099, -6984303, 2295570, 2905172, -2639567, -7253586, -7948986, -5172271, -220001, 3479426, 2066919, -2777759, -4617622, -1610809, 343136, -3027968, -7365277, -6398867, -1120437, 2773175, 3341574, 3102887, 3020113, 657967, -5350067, -11690135, -12105730, -3064279, 10992215, 19126695, 14274176, 2185657, -4253115, -174695, 6852651, 8680293, 6478144, 5494159, 6009096, 4940827, 2355234, 587711, -708865, -3502327, -6951980, -8371774, -7315454, -5154669, -2267751, 941422, 2246198, 552343, -1190509, 238150, 3427512, 4899566, 4624794, 4958940, 5919067, 5845745, 5163470, 4941933, 3201795, -2237719, -8055491, -7986997]
40289g986997O614392O979407K239705j620391k076214m86344K315791N350189
40281A1329538N007102j008607q381003r844960m044667K951443M985419J904805
40273B899070j641058j574001J477114K922791q2447m432432n196749k926705
40265h554417k123665k735756K2487N702336O482721m90956o268926k635132M773185
40256e828123M808753k048482n202593q67800L236710J281918k479209k509479
40248i608305p30531j117707j637713J966829P673340Q721079K902342m405125
40240C764209p005056m503258j180211l71092j599834k677955k764716k014553
40232a8352466O80946O416185J1854054J0034539p29284j1471340j1442851j626459
$$ y = [-7986997, -1372605, 5606802, 7846507, 6226116, 4149902, 3663558, 5979349, 11329538, 16336640, 15328033, 6947030, -2897930, -6942597, -3991154, 994265, 2899070, 1258012, -315989, 1161125, 4083916, 4001469, -430963, -5627712, -8554417, -10678082, -13413838, -13391351, -7689015, -1206294, -1697250, -7966176, -10601308, -5828123, -1019370, -3067852, -8270445, -9138245, -5901535, -4619617, -7098826, -9608305, -10338836, -11456543, -13094256, -11127427, -3454087, 5266992, 8169334, 3764209, -3240847, -7744105, -8924316, -9295408, -10895242, -13573197, -16337913, -18352466, -17671520, -11255335, 598719, 10633258, 9903974, -1567366, -13010217, -14636676]
40224a4636676O333904N358629Q01694M10697K788276J677922k446515k887972
40216b600041J903936N081688J668401m155414n879992l814035k148487o59984
40208a0603928L546653P575822M556004m260425p539023Q77088J1455376J1145707
40200A6753274J343367n509038m745717l885166p328557q499426k794163J785646
40192a2879780l589551j2558953j0660150L452876J4728784J1543216L7181n633966
40184a5560343j249401M928603M711940l44859k386284K485507R251973R631546
40176A1468682K075480n827510o261527n59268L187611Q87187k991237k485576
40168e06158J447724K218692l436244j0079447q934835J184129J0710604J0041244
$$ y = [-14636676, -8302772, -2944143, -2142449, -1731752, 1056524, 2734446, 287931, -2600041, -696105, 4385583, 6053984, 1898570, -3981422, -7795457, -9943944, -10603928, -7057275, 518547, 5074551, 814126, -6724897, -5847809, 5607567, 16753274, 18096641, 12587603, 7841886, 3956720, -3371837, -11871263, -14665426, -12879780, -16469331, -29028284, -39688434, -36235558, -21506774, -9963558, -9926377, -15560343, -16809744, -11881141, -7169201, -7514060, -9900344, -7414837, 1837136, 11468682, 13544162, 7716652, 1455125, 895857, 4083468, 4970655, 1979418, -506158, 941566, 3160258, -275986, -10355433, -19290268, -18106139, -7395535, 2645709]
40160B645709J900443k245759J599942M555223q34626q439159p897203m19249
40152i134679M175342K818746J094943J165237q52974m490555l421296K481468
40144f163768M605787j48062l387811J57736K983243j371811n216992N13211Q615356
40135E86889N564312n571078q308554J757857J0544575P596911m0702k231852
40127I898358j240637l809507p477606n501092N32228L372235K052020J676886
40119d97115K982795J277973l807423n812782j250680M403869M315103k76287
40111A335453k549977j10635J947708j161038o197206n297186L081907J0542911
40103A591937Q984595J564056j759258J446160L079272k370342q701858o934611
$$ y = [2645709, 4546152, 2300393, 3900335, 8455558, 7620932, -818227, -8715430, -9134679, -4959337, -2140591, -1045648, 119589, -733385, -5223940, -8645236, -6163768, -1557981, -1706043, -5093854, -4936118, -1952875, -3324686, -8541678, -8028467, 586889, 6151201, 580123, -7728431, -5970574, 4574001, 12170912, 12130210, 9898358, 8657721, 4848214, -2629392, -8130484, -7598256, -4226021, -2174001, -497115, 2485680, 3763653, -43770, -5856552, -7107232, -2703363, 1611740, 1335453, -1214524, -1325159, 622549, -538489, -6735695, -12032881, -8950974, 1591937, 10576532, 12140588, 10381330, 11827490, 14906762, 12536420, 3834562, -3100049]
40095c100049J618113P449242N384420q53337n161158m865643q99081L115307
40087B687814K758200j965905m840114j637965K230682r13850p633305o498867
40079a5813310M213811J1837706O961962k984168n271003l51805J076587l711619
40071d041839n345902J931089R962870P654046l348345j0706899p262877J359144
40063i798713N851452M629160K648931K166076L50281l731193n533715j857410
40055e275131K820351K007427k939694m554334m19967L733642L366829J327636
40047F6759J771986L395443K860005N17906j744197m269345o340974l542759M998327
40038b286849J0488300M284226p749376j0532328n67866Q535166N382356l706739
$$ y = [-3100049, -1481936, 5967306, 11351726, 10498389, 5337231, 471588, -427493, 2687814, 5446014, 3480109, -1360005, -2997970, -767288, -1681138, -9314443, -15813310, -11599499, 238207, 7200169, 4216001, -1055002, -1406807, -330220, -4041839, -9387741, -7456652, 2506218, 10160264, 6811919, -3894980, -11157857, -9798713, -3947261, 681899, 3330830, 5496906, 5847187, 2115994, -3417721, -5275131, -2454780, -447353, -3387047, -7941381, -8361348, -4627706, -1260877, 66759, 1838745, 5234188, 8094193, 8612099, 6867902, 2598557, -3742417, -7285176, -2286849, 8201451, 12485677, 4736301, -5796027, -6363893, 2171273, 7553629, 3846890]
40030C846890n788998o19581J340939l027502m832816J661699Q779324O055553
40022G415508m503648j0705117n897677L710763Q169522N353925Q54900n38389
40014C859787O12739J622342J737422J649238J301584J93075j227652k132939
40006G615596k449730j982111K82100L724727M239975j495207r764904j1989513
39998a1819067n063627L984762O673787L633980K393874O096576R380053O308146
39990B1588484j663399p822855p802372k859655K697413N094645L120831j144663
39982A1208429l725634k438206P50632K079117L73818k200315l463632l478936
39974h94727k994781j431100J962574N653920O450987L164761j568177m177096
$$ y = [3846890, -1942108, -2561689, -1220750, -4248252, -9081068, -7419369, 1359955, 7415508, 2911860, -7793257, -13690934, -9980171, -1810649, 3543276, 4398176, 3859787, 4472526, 6094868, 7832290, 9481528, 10783112, 10976187, 9748535, 7615596, 5165866, 3183755, 3465855, 7190582, 11430557, 9935350, 170446, -11819067, -16882694, -12897932, -6224145, -2590165, -196291, 5900285, 15280338, 21588484, 19925085, 12102230, 4299858, 1440203, 4137616, 9232261, 12353092, 11208429, 7482795, 5044589, 5795221, 7874338, 8248156, 6047841, 2584209, -894727, -3889508, -5320608, -3358034, 2295886, 8746873, 11911634, 10343457, 6166361]
39966F166361m132011l583550l429033k095548Q19420K308788J03882k626548
39958f468239p44636M889493P496051L738581j676962l434524k792852k916775
39950a909863j794667L184745O927710K279389o654347p526874J332888O276082
39942B115063j005477q876869k735144J1245443J3886204J537265q990211o083561
39934A092713J392765J220981l195805k047749K490120J085831m595040l566942
39926f123126M989156Q419420P88912o401048j579625Q594818R155926o31680
39918A7212753p015082l046988K015221j603548q924994q153142J663523R433726
39910A581469O986790k019375q729949q739487l557293K559620M912959J533587
$$ y = [6166361, 2034350, -1549200, -4978233, -7073781, -6254361, -3945573, -3841691, -6468239, -7212875, -2323382, 5172669, 8911250, 7234288, 3799764, 1006912, -1909863, -3704530, -519785, 6407925, 8687314, 2032967, -5493907, -4161019, 2115063, 1109586, -7767283, -10502427, 743016, 14629220, 16166485, 7176274, 1092713, 2485478, 3706459, 510654, -1537095, 953025, 2038856, -2556184, -6123126, -1133970, 7285450, 8074362, 1673314, 93689, 8688507, 17844433, 17212753, 10197671, 7150683, 9165904, 7562356, -1362638, -9515780, -7852257, 1581469, 8568259, 6548884, -2181065, -10920552, -14477845, -11918225, -7005266, -5471679]
39902e471679l518031l530380K075610O389824M847936J307167M08526l14881
39894B194092m248020o804991j881551N861863O025767o57454k265787N029416
39886C253335R687343K690651q218099j0943447o669042m162547l325657K389305
39878a5298158J0490303J0510914J429751m842376j211963M378504K365008l905421
39870C916562m890548R4133L150916K40493m304241n167243k140329J637883L462890
39861c999484K578988P45199J216343M702027O990547L610995l441243p156719
39853E246653m513603o36355j644791n748095n317030K146483R127474P042776
39845E703512k215066q164045n189491Q68031J905926j367770k273546J076960
$$ y = [-5471679, -8989710, -12520090, -10444480, -4054656, 793280, 2100447, 2508973, 2194092, -2053928, -8858919, -10740470, -4878607, 1147160, 489706, -1776081, 3253335, 12940678, 15631329, 7413230, -3530217, -10199259, -14361806, -17687463, -15298158, -4807855, 5703059, 7132810, 2290434, 1078471, 5456975, 7821983, 3916562, -973986, -879853, 2271063, 2511556, -1792685, -6959928, -9100257, -7462374, -3999484, -1420496, -675297, 541046, 5243073, 12233620, 15844615, 12403372, 5246653, 733050, 96695, -1548096, -7296191, -12613221, -10466738, -1339264, 5703512, 3488446, -4675599, -9865090, -8997059, -7091133, -8458903, -10732449, -9655489]
39837i655489M084352L836798K625648K327690J074310k108549m077887k092454
39829c985581J890349M302477M498820L657077J939900m83537j848609q59762
39821I111134J208392K062262K91378m620664j0848155j2524561m826777P455355
39813a2691636J2587821O515908j516556k480983M57009J84083j577476K98938
39805A777108K113443k670604q602646m225268P310173R759720m91846o985180
39797b015100M80449Q388083J788604r664716o599698P509634J0498189l073469
39789G311976j2633536l450039J1385016J1970944J38384p296915m537036o09393
39781B279401j363607k503706q77798j36493k005742j794960K895651O572465
$$ y = [-9655489, -5571137, -1734339, 891309, 3218999, 4293309, 2184760, -1893127, -3985581, -2095232, 2207245, 6706065, 10363142, 12303042, 11819505, 9970896, 9111134, 10319526, 12381788, 12673166, 8052502, -2795653, -15320214, -20146991, -12691636, -103815, 6412093, 4895537, 2414554, 2871563, 3055646, 1478170, 1777108, 3890551, 1219947, -7382699, -11607967, -4297794, 5461926, 4970080, -2015100, -1534651, 6853432, 8642036, -1022680, -7622378, -112744, 10385445, 7311976, -5321560, -8771599, 2613417, 14584361, 14722745, 7425830, 2888794, 2279401, 915794, -1587912, -2465710, -2602203, -4607945, -6402905, -3507254, 3065211]
39773C065211M149414p48739j366304J963082K780276j882519p576280q213350
39765g829209k799567M014285O542826L241703j874988l434259n83804K614887
39757a08126K906302J570942J109582Q66143j053304l019501j070717M507710
39749E709031P409400K784520n371045p928549j967141N173322N254127n57371
39741A0506294m637214l968456k348848j715793J334993P369550R656454L804456
39733B0001436l748842m358746J5545J348940m05166J547750O877967P350493
39725B8629377J655007j299866J791828J773983o711468j3433973p584635M155068
39717H975321P033288M1604m910006k788651q77771l900018o126153k026089M549482
$$ y = [3065211, 7214625, 6465886, 5099582, 7062664, 9842940, 7960421, 384141, -7829209, -10628776, -6614491, -71665, 3170038, 1295050, -2139209, -2723013, -108126, 2798176, 4369118, 5478700, 6344843, 5291539, 2272038, 1201321, 5709031, 13118431, 15902951, 10531906, 2603357, 636216, 5809538, 11063665, 10506294, 5869080, 1900624, -448224, -2164017, -829024, 6540526, 16196980, 20001436, 16252594, 11893848, 11909393, 13258333, 12853167, 14400917, 21278884, 28629377, 30284384, 28984518, 30776346, 32550329, 25838861, 12404888, 4820253, 8975321, 16008609, 16050213, 11140207, 8351556, 7473785, 3573767, -2552386, -4578475, -28993]
39708b8993O466169K398665l575762o759566m400032J896050N537026J779571
39700C313128m732387n162929R36948N377157M043302J572151J575708J049632
39692G972710j875190l026366j43437J630618j782895n649194l609992K413762
39684d069984N914626N120909K470009j091404m757744m646418Q57975N519903
39676E317872K617936m206129n442886P3121M031023K207729K08791K622374M557681
39667A1987512j62998p818585r027916k088526M762622M939240J494928Q83493
39659D969770L257748L620290L42831l047486m487699n970153p751233n858523
39651a4924455Q14022O200272N181002J470205J037178K093547k15158l048429
$$ y = [-28993, 6437176, 8835841, 5260079, -1499487, -5899519, -4003469, 1533557, 3313128, -1419259, -6582188, -5645240, -268083, 3775219, 5347370, 6923078, 7972710, 6097520, 3071154, 2927717, 4558335, 2775440, -2873754, -6483746, -4069984, 1844642, 6965551, 9435560, 8344156, 3586412, -1060006, -202031, 5317872, 7935808, 3729679, -1713207, -1640086, 2390937, 4598666, 4807457, 7429831, 11987512, 11824514, 4005929, -5021987, -7110513, -2347891, 2591349, 4086277, 4969770, 8227518, 11847808, 12190639, 9143153, 4655454, -1314699, -9065932, -14924455, -14110433, -7910161, -2729159, -1258954, -221776, 1871771, 1656613, -1391816]
39643a391816k87653M509200J906705o465229q209524k47389N362040J397033
39635c426633k660885K289635Q739781N479570l287003n379149j60676K999132
39627D593772Q03295k446443n345913q660144p803169P24203Q500954M789634
39619d843811n258758o825936J338511N896675J738267j178367K835030N830953
39611d67436K335134o13040K509531N400049K475936q50143J81786j70992n900931
39602D899894q645135j383763P389146O421271M3667l40290M005637L098388l038389
39593A2450426n253851k331077j922619n083409m529358O68653K609096q26443
39585d218582k081193J734150L266249j095489l494115J905686P703275M354094
$$ y = [-1391816, -1679469, 2829731, 4736436, -1728793, -9938317, -10185706, -4823666, -3426633, -6087518, -3797883, 4941898, 10421468, 7134465, 1755316, 1594640, 4593772, 5397067, 2950624, -2395289, -11055433, -18858602, -18134399, -9633445, -4843811, -10102569, -16928505, -15589994, -9693319, -7955052, -9133419, -6298389, -467436, 1867698, 1254658, 3764189, 9164238, 11640174, 10790031, 10971817, 10800825, 4899894, -3745241, -5129004, 2260142, 8681413, 8725080, 8384790, 12390427, 15488815, 12450426, 7196575, 4865498, 2942879, -2140530, -6669888, -6001235, -3392139, -4218582, -6299775, -4565625, -1299376, -2394865, -5888980, -3983294, 3719981, 8074075]
39577H074075m777456q604489l941586K554051N378087N368111M712974L315780
39569A2079547J104905l86237l09635j19363j647289m340920n295361k678399
39561a592752J059077J398787j720930k540334K429825P874218N954655k615785
39553A0246761r097181p697722j100586M485386N083063O13759m317803k817916
39545d602239N556292J0787515M370132p142168r953491k844568K310165Q8931
39537a429431j678295K206019N426143L392006K301931O332257P680071L6363
39529B4267064q428675p654141k288265k394542n263602j489836O298096O896274
39521I942373M4352l402501k78740J340027j467438j725853K540426L060879l642767
$$ y = [8074075, 3296619, -5307870, -9249456, -6695405, -1317318, 4050793, 8763767, 12079547, 13184452, 12798215, 12488580, 12369217, 10721928, 6381008, 1085647, -1592752, -533675, 865112, -855818, -3396152, -966327, 6907891, 12862546, 10246761, 1149580, -6548142, -7648728, -3163342, 1919721, 2533480, -1784323, -4602239, 954053, 11741568, 16111700, 8969532, -983959, -3828527, -1518362, -1429431, -3107726, -901707, 4524436, 7916442, 10218373, 16550630, 24230701, 24267064, 15838389, 8184248, 5895983, 3501441, -1762161, -3251997, 3046099, 9942373, 9986725, 6584224, 6305484, 7645511, 6178073, 4452220, 6992646, 10053525, 6410758]
39512F410758q569866m279204L793834O844931M703493J885623m56117k315791
39504H017661j426836K112514L770689J728502p2171L86382j87057k467079j826253
39495A0036352J888897J489076m541323o231798K280690J0714846O796109m954766
39487A7478083j0266299n691173j29453J008885J191199L022353L691257J334286
39479A1639138j900249m069020m776630k770281K145465N935657M660250M88919
39471A1353249j808458j994958k486268k452822j72529J741358K10859k145802
39463B244629j461501K64965k49388o9153M306714Q031421M791105r22233J66810
39454A7103369O218362O779982K36858m155995k336184n48513k216469k399358
$$ y = [6410758, -2159108, -6438312, -2644478, 4200453, 8903946, 10789569, 10333452, 8017661, 6590825, 8703339, 12474028, 14202530, 14130359, 14516741, 14329684, 11862605, 10036352, 11925249, 13414325, 8873002, 2641204, 4921894, 15636740, 22432849, 17478083, 7211784, 1520611, 1391158, 2400043, 3591242, 6613595, 10304852, 11639138, 9738889, 5669869, 893239, -1877042, 268423, 6204080, 10864330, 11353249, 9544791, 7549833, 5063565, 2610743, 2438214, 4179572, 4390431, 2244629, 783128, 1048093, 798705, 729552, 5036266, 13067687, 17858792, 16936559, 17103369, 23321731, 30101713, 30338571, 26182576, 23846392, 23297879, 21081410, 18682052]
39446A8682052R27894J942234j863215m317610j596053J290662L73934l98972
39438A5040926K142637L920254J967244P10809L371564N067631J473040k808537
39430C0885568j764938K208747L012230K96198k023471k244351o78710K556775
39422C2248048N354060M207605M37777j67148K914677K936624k549001o398124
39414C8984518l147481K730332N465872O409929P611109N880547O53981q81972
39406F3706835N166216J1361078J0618339P811382J0304661J4995090J5369353
39399A39332954J4058217J7001434K1818107K3831015K7215723L7145320M6357429
39392C26760199M3598032L1476312K1625474J5043081K398050j6934453l1276056
$$ y = [18682052, 19609946, 21552180, 19688965, 15371355, 13775302, 15065964, 15439898, 15040926, 17183563, 21103817, 23071061, 23781870, 27153434, 32221065, 33694105, 30885568, 29120630, 31329377, 34341607, 34637805, 32614334, 30369983, 29691273, 32248048, 37602108, 41809713, 42247490, 42080342, 44995019, 47931643, 45382642, 38984518, 35837037, 38567369, 44033241, 50443170, 58054279, 63934826, 64588807, 63706835, 68873051, 80234129, 90852468, 98663850, 108968511, 123963601, 139332954, 153391171, 170392605, 192210712, 216041727, 243257450, 280402770, 326760199, 370358231, 401834543, 423460017, 438503098, 440901148, 423966695, 392690639]
39385C92690639l3881456l0783187k8898421k7623265k4920591k1855291j8643841
39378B06084587j4491359j2110872j4119792j5603394r630759P87486O398483
39371A47314380O174622P033900J0430565J1734760J2307590J8308670K6843156
39364B40147643K7990183K2531190K2161000K8581045K8683944J6303846K394585
39357C88793436m511511j1758688k5526461l5497487l1037996k0911049k0646018
39350B38904226k8273122k9061701j9634026j1198274j0182539j0506565o823143
39343A23224856l099306m219813q049574r958843r008376o303569k004765K973748
39335H3554358N694798M454280J569848Q75240K891794L809853K53125n139965
$$ y = [392690639, 358809183, 328025996, 299127575, 271504310, 246583719, 224728428, 206084587, 191593228, 179482356, 165362564, 149759170, 140128411, 140915897, 147314380, 153489002, 160522902, 170953467, 182688227, 194995817, 213304487, 240147643, 268137826, 290669016, 312830016, 341411061, 370095005, 386398851, 388793436, 384281925, 372523237, 346996776, 311499289, 280461293, 259550244, 238904226, 210631104, 181569403, 161935377, 150737103, 140554564, 130047999, 123224856, 120125550, 115905737, 107856163, 97897320, 88888944, 82585375, 80580610, 83554358, 89249156, 93703436, 95273284, 96148524, 99040318, 102850171, 103103296, 97963331]
39327I7963331n432702J326569P596701N412469k669385p735383p457472o815389
39319H2188739o950917l560219K069939J602119o291378j1076920o366166r24381
39311E0690816m489430j0920066p386744M434913R322876M08062j1186202j1832380
39303A9041845k469826M797223K812639l277497m442210L46662L745357R65624
39295B1519817l579776l698692j165289j820138m732232l553743J954463M798690
39287I723100K309047j62288P39285J694901R17362J626095L609923J182842n571408
39278A6068859p701989j806060K680558j501697o991479m153666K754149L125680
39270B474355k699888n385997j611453L677526O970364Q357438O560327Q13862
$$ y = [97963331, 92530629, 93857198, 101453899, 106866368, 104196983, 96461600, 89004128, 82188739, 75237822, 71677603, 73747542, 75349661, 69058283, 57981363, 51615197, 50690816, 46201386, 35281320, 27894576, 32329489, 41652365, 42060427, 30874225, 19041845, 16572019, 21369242, 24181881, 20904384, 16462174, 16808836, 20554193, 21519817, 17940041, 14241349, 13076060, 11255922, 6523690, 2969947, 4924410, 9723100, 12032147, 11869859, 12609144, 14304045, 15221407, 16847502, 20457425, 21640267, 16068859, 8366870, 6560810, 9241368, 7739671, 748192, -3405474, -651325, 2474355, -225533, -5611530, -7222983, -3545457, 3424907, 11782345, 18342672, 19156534]
39262A9156534m437981m595902k092731j567156j779606K08653J600164p30113
39254E761862k164256K546794Q224544N822305l046425q591982p286449l466089
39246b199696Q94512O847712J0558709O213212l229434q391027o492309k714210
39238A487469J65983L208241L708067k205325r371032p888482J093079N387540
39230d414460k42570p181155p025530k110103J758975L615531M270188L158186
39222h170938K009205M374715Q534241P882273P79521o613222q707961n125033
39214e037199K633091J1012717J2181115K438945p833503n003642O725366R424158
39206B6541048j172596q797089k983650M620443N92526q509872q583036r93345
$$ y = [19156534, 14718553, 10122651, 8029920, 6462764, 4683158, 4891811, 6491975, 5761862, 3597606, 6144400, 14368944, 20191249, 17144824, 8552842, 1266393, -2199696, -1305184, 5542528, 16101237, 22314449, 19085015, 10693988, 4201679, 1487469, 1653452, 4861693, 8569760, 6364435, -3006597, -10895079, -9802000, -4414460, -4657030, -11838185, -18863715, -20973818, -19214843, -15599312, -11329124, -8170938, -6161733, -1787018, 6747223, 14629496, 15409017, 8795795, 87834, -5037199, -2404108, 8608609, 20789724, 23228669, 15395166, 10391524, 17116890, 26541048, 25368452, 16571363, 13587713, 18208156, 18800682, 10290810, 1707774, 714429]
39198G14429K245295q69407j719099K565185N781398M330487Q51585k928608o993845
39189C977420p749456j829283N358539M879944j559623k960981L482177O773636
39181A0372373r74148j1095369j0077236P80971P272110K713728l392746n56447
39173d956764P073530P935645J235083k462073J377914M421791K27707m547367
39165A0305466j659121M340108L627888k890782o589118n925131n961410o063980
39157a0816080j530182L966559K100463l737298j449469Q112615R373105k563676
39149C456037j1651718n275558O430708P824806J491566K80391M947809N214307
39141A2718348j827496q182623p761677k082940M969205R540499P569370k02740
$$ y = [714429, 2959724, 2090317, 371218, 2936403, 8717801, 13048288, 13899873, 10971265, 3977420, -3772036, -5601319, -242780, 4637164, 3077541, 116560, 3598737, 10372373, 9398225, -1697144, -11774380, -10993409, -3721299, -1007571, -4400317, -4956764, 2116766, 10052411, 11287494, 8825421, 10203335, 14625126, 14852833, 10305466, 8646345, 12986453, 16614341, 13723559, 7134441, 1209310, -4752100, -10816080, -12346262, -8379703, -6279240, -10016538, -11466007, -3353392, 6019713, 3456037, -8195681, -13471239, -7040531, 784275, 2275841, 2556232, 7504041, 12718348, 10890852, 2708229, -5053448, -7136388, -2167183, 7373316, 14942686, 14739946]
39133A4739946o057205m775221r93370p41651j745707R5172J425214j691341l961395
39124c705558Q88590P284096N429840k026473l784145J699026M463053l22884
39116I925545n912803n753150j707824J424233J593665j302077m970054l978570
39108a0681035L517605J0073847P816701M53155k649755j353376k595483n651081
39100a069422k806384N055346P284672N95828n447014m190468j095042j854640
39092c527124k688510N66411L528735J466323j472424M70524M237034L041958
39084E622927k304528m798108j626257L021358M339039J716338k051780l722096
39076A96893k613614j421942k286160k896075j50861L584821L381669J28955p09599
$$ y = [14739946, 8682741, 3907520, 2914150, 2172499, 426792, 521964, 1947178, 255837, -3705558, -2816968, 4467128, 9896968, 7870495, 4086350, 5785376, 10248429, 9925545, 4012742, -1740408, -3448232, -2023999, -430334, -1732411, -6702465, -10681035, -7163430, 2910417, 10727118, 11180273, 8530518, 7177142, 4581659, -1069422, -3875806, 1179540, 8464212, 9060040, 3613026, -577442, -1672484, -3527124, -6215634, -5649223, -2120488, -654165, -2126589, -1656065, 2580969, 5622927, 3318399, -1479709, -3105966, -84608, 4254431, 5970769, 3918989, 196893, -2416721, -3838663, -6124823, -9020898, -9171759, -5586938, -2205269, -2076314, -2785913]
39067b785913J441672J901872M93654K550816P744288P530399j483850j0213497
39059G179441r242509j263208M827131N901115M207360Q83754l008900l659369
39051E824815L10271L686453K038765q39316M23132K857274q4862o639398q235556
39042f58422k234541M581779N921512K908690j35272j394279j288972n90793m73326
39033F636376j662804k777603j996070m20871q23193k748303k129258K832297
39025c089429P855709O942549j13366o628273o375780q29196L080616K171576
39017C014406L61674J238166J900663j306286m863088k739320L166388N214503
39009E987106K078465Q564J288483P86829l357707n144299j438765J519873j512285
$$ y = [-2785913, -1344241, 557631, 1051285, 3602101, 11346389, 18876788, 17392938, 7179441, -2063068, -3326276, 1500855, 7401970, 11609330, 12493084, 9484184, 5824815, 6135086, 9821539, 11860304, 11020988, 11444120, 14301394, 14216532, 7577134, -658422, -2892963, 1688816, 7610328, 10519018, 10383746, 8989467, 7700495, 7109702, 6636376, 4973572, 2195969, 199899, -220972, -1044165, -3792468, -5921726, -3089429, 4766280, 11708829, 11595463, 4967190, -1408590, -2237786, 842830, 3014406, 3376080, 4614246, 6514909, 5208623, 345535, -2393785, 772603, 5987106, 8065571, 8074135, 9362618, 10149447, 6791740, 1647441, 208676, 1728549, 216264]
39000B16264n608831l936590J318770L765024L067835K941658L663167L812202
38992I239499M846092O773229M307040m669598j1784045q492738L96178L385487
38984D001144p58880l289772p33724J266799n23747j853255Q46146N342770Q070410
38975A2367891P190675J626335o098704p957973M1350Q421838M712770p790470
38967A2513712j3508052o933365J419591L230686K553117L390581J247500n347512
38959a433742p548248l59593O240767J587961q163753q716339J374429R928331
38951g090187Q754734J920504k786507k622745K5377J026661j511041l913815
38943f197019p98519N555272N960189j711068p364464l753655J982279P94104
$$ y = [216264, -5392567, -9329157, -8010387, -4245363, -1177528, 1764130, 5427297, 9239499, 14085591, 20858820, 25165860, 20496262, 8712217, 219479, 615657, 4001144, 3242264, -47508, -781232, 485567, -38180, -1891435, -1045289, 4297481, 12367891, 19558566, 21184901, 15086197, 7128224, 7169574, 15591412, 20304182, 12513712, -994340, -7927705, -6508114, -3277428, -724311, 2666270, 3913770, -1433742, -8981990, -9341583, -3100816, -1512855, -9676608, -18392947, -17018518, -7090187, 1664547, 3585051, 798544, -1824201, -1798824, -772163, -2283204, -6197019, -6995538, -1440266, 4519923, 2808855, -4555609, -8309264, -6326985, -5532881]
38935e532881k667013J148107Q813754Q982433J704415k037120Q46082J742006
38927A2999783l262808p050906n052075k700862m415360n943571l287947J08907
38919a8604839Q44717J863100N396668P126503L599221q28021n24992L009052
38911A881409M608086L018358O74147k74448J234298M212874M081800k245260
38903A7191264r043955p380940P59693L812309j295968m045321J607864O549486
38895H154432K211118m688253l970857J335526K475172P44266K350926M360910
38887A2973240K52480n614623m172972J290316m0368o595054n955502L165951
38879d696532P316000K73147o942877m063819L830668O942524M673912J300269
$$ y = [-5532881, -8199894, -7051787, 1761967, 10744400, 12448815, 10411695, 11257777, 12999783, 9736975, 2686069, -2366006, -5066868, -9482228, -15425799, -18713746, -18604839, -17760122, -15897022, -10500354, -3373851, 225370, -602651, -1127643, 1881409, 6489495, 9507853, 10182000, 9907552, 11141850, 15354724, 19436524, 17191264, 8147309, 766369, 1526062, 5338371, 4042403, -2918, 1604946, 8154432, 10365550, 5677297, 1706440, 3041966, 5517138, 6261404, 8612330, 12973240, 13225720, 7611097, 3438125, 4728441, 4688073, -1906981, -7862483, -4696532, 2619468, 2892615, -4050262, -8114081, -4283413, 2659111, 7333023, 8633292]
38871H633292k625829o770108o930018j838595K608797K196700Q82777K660734
38863a182250L881491J42529n394257p070951m739854j038781L679447Q189540
38855c533086Q211638L238033m51781O21655J170660k863207n769207j688569
38847a063864M171067L672982o68521j002992J516965l77497n426459m642444
38839c820763L066291P809741L719420k848583l719800N19638M383065N497875
38831A4606884M567660K069845j161597l148435l205300k902227l377767m090878
38823C358185m673416n322923n235273l363196n21623J761154L446138M351699
38815f199255K524478j814411l266027K159569R149824Q488159J07960o095387
$$ y = [8633292, 6007463, -762645, -7692663, -9531258, -6922461, -4725761, -3842984, -1182250, 2699241, 2841770, -2552487, -9623438, -14363292, -15402073, -11722626, -3533086, 4678552, 7916585, 7464804, 8086459, 9257119, 6393912, 624705, -1063864, 3107203, 6780185, 6111664, 5108672, 6625637, 6248140, 821681, -3820763, -754472, 7055269, 10774689, 7926106, 4206306, 4725944, 9109009, 14606884, 19174544, 21244389, 20082792, 16934357, 13729057, 10826830, 7449063, 3358185, -1315231, -6638154, -11873427, -15236623, -15758246, -13997092, -10550954, -6199255, -3674777, -5489188, -8755215, -6595646, 2554178, 11042337, 11150297, 5054910]
38807E054910l593069L026576N655541K296993l501273p749204p444587j362463
38799g616576O801166R343836K621077p560870j1850538p522841p2207M400704
38791a1456249N238007N082421M493928J606650l130552n364629k398916K177118
38783c752222L266621J785919K084446L134503k02223o466638p154082k94682
38775g598358M762190J766130k467649n64634J870020l531554j1130731q602530
38767b5497116K524831Q283611L978255K28703M509161R563804N951986l604045
38759E939190r049449o015069J128498N129818J970479n243236p915262j726516
38751a5781547O562579P920641M029920L039892M932820K452459m079410n887520
$$ y = [5054910, 1461841, 4488417, 10143958, 12440951, 8939678, 1190474, -6254113, -7616576, -815410, 8528426, 11149503, 3588633, -8261905, -15784746, -15856953, -11456249, -6218242, -1135821, 3358107, 4964757, 1834205, -3530424, -5929340, -3752222, -485601, 1300318, 3384764, 6519267, 6317044, -149594, -7303676, -7598358, -2836168, -1070038, -3537687, -4102321, -2232301, -5763855, -16894586, -25497116, -22972285, -14688674, -10710419, -10481716, -5972555, 3591249, 9543235, 5939190, -3110259, -9125328, -7996830, -2867012, -896533, -6139769, -14055031, -15781547, -9218968, -1298327, 2731593, 5771485, 10704305, 13156764, 9077354, 3189834]
38743C189834j435576L33205l817603n325384L91600M967803J532107l570129
38735c734143k303257K175795L414986K851660L400591J075083o329244j0644704
38727a0093233n049751K996216K820368j883949J49802Q178985J0740933M306249
38719A2165620k637769l814575j786645n2994J109148N88071k368982l270622
38711f8748J853885O835337K351079p712102r127972J327247R727161N145282
38703A0331169m868188o360386J319249O464311J812331p053280r678628k835446
38695a0868868O224562P818305R22182n669289m779870K07942J855451n0340m75264
38686d815189P45546m69699k935852q78556N213264P960095N306629L758500O011678
$$ y = [3189834, 1754258, 2087463, -1730140, -7055524, -6663924, -1696121, -164014, -3734143, -6037400, -3861605, -446619, 2405041, 5805632, 6880715, 551471, -10093233, -15142984, -12146768, -9326400, -11210349, -11060547, -2881562, 7859371, 12165620, 9527851, 5713276, 3926631, 3873637, 4982785, 5570856, 3201874, -68748, 1785137, 8620474, 10971553, 3259451, -5868521, -4541274, 5185887, 10331169, 5462981, -897405, 421844, 6886155, 8698486, 1645206, -8033422, -10868868, -4644306, 3173999, 4096181, -1573108, -6352978, -6145036, -4289585, -4339925, -4815189, -4069643, -4539342, -7475194, -8353750, -3140486, 4819609, 10126238, 13884738, 19896416]
38677A9896416N121762l221728j1184358r324478n70317M453029K011559k632430
38669D549455m962577n238905l834274P6529M350491M449378J57116k792315l46022
38660c591124L832128L122817k766133o685209k950636N004167Q234586K902627
38652G103223n567451r674577p987256l862211P33494N686612Q644441N991252
38644A067527j159020o323479m896809R26849N887308P350091N587067J337290
38636I776824m097943p785056o950781k119158K717317L582899L33976k991961
38628g533883k314098J797947M871751M411872K761363K651279K646305R151l874489
38619E427198m704997j249868L096298M525860K155075k209311n273825m133802
$$ y = [19896416, 25018178, 21796450, 10612092, 1287614, 717297, 5170326, 7181885, 4549455, -413122, -5652027, -9486301, -9409772, -5059281, -609903, -452787, -3245102, -3591124, 241004, 3363821, 597688, -6087521, -9038157, -4033990, 4200596, 7103223, 1535772, -8138805, -16126061, -19988272, -19254778, -13568166, -4923725, 1067527, -91493, -6414972, -11311781, -10384932, -4497624, 2852467, 8439534, 9776824, 5678881, -2106175, -9056956, -11176114, -8458797, -4875898, -4541922, -7533883, -9847981, -8050034, -3178283, 1233589, 3994952, 6646231, 9292536, 9301687, 5427198, 722201, -527667, 2568631, 7094491, 9249566, 7040255, 1766430, -2367372]
38611b367372O13111M543205M304878J410169q26408j694824j803412m90844J737034
38602E425537J303855l214503o790917m255022J588282M059564K487167J291123
38594A895086J256289l59567j990809J104789P064018P568089L37996o383779
38586A0492112n488779m47496J144500j896303m624863k992557K844096R242776
38578H273486J0949083N377195l542064q834801q045121l830007J526795O444342
38570H318908O500808j199817j0152184j0220570k545512J346984k443268m628317
38562a5022968L80155M565302J027559l328081n74251L217587q32574o449867
38554a7017138j403926J0059103J1347697l60607r156520m925086K912022K944160
$$ y = [-2367372, -1754261, 2788944, 7093822, 8503991, 7677583, 5982759, 4179347, 3688503, 5425537, 6729392, 3514889, -3276028, -7531050, -5942768, -1883204, 603963, 1895086, 3151375, 2791808, 800999, 1905788, 8969806, 16537895, 16875891, 10492112, 5003333, 4555837, 5700337, 3804034, -820829, -3813386, -969290, 8273486, 19222569, 24599764, 21057700, 12222899, 4177778, 347771, 1874566, 8318908, 14819716, 13619899, 3467715, -6752855, -9298367, -7951383, -10394651, -15022968, -14642813, -10077511, -9049952, -12378033, -12952284, -9734697, -10567271, -17017138, -18421064, -8361961, 2985736, 2625129, -6531391, -11456477, -8544455, -5600295]
38546e600295q09957Q00556M985416K975341l111126k869711M512442P637836
38538H520502N92276p321972n150318L944270P907390K571142m728931o938456
38530f04097m937639k371610Q2364K177198J651831j443724k719763l55430O90510
38521g830360k919818n210990L64689Q244218P111937k231064o645827J4162Q449484
38512f53569Q881718M096733J300824J39627k898383n185159k381750K330656
38504E630697K323677j966058m492481l388551j819384o81525K147094N779975
38496C533444O149694K208278k686559n432494n239257k358068J123989J306306
38488a394667k153528l370215J731790P777169O956051R37047k120134n84126
$$ y = [-5600295, -6410252, -5609696, -624280, 2351061, -760065, -3629776, 882666, 8520502, 9112778, 1790806, -3359512, 584758, 8492148, 11063290, 6334359, -604097, -5541736, -7913346, -7830982, -5653784, -4001953, -5445677, -8165440, -8520870, -7830360, -10750178, -15961168, -15596479, -7352261, -240324, -2471388, -9117215, -9103053, -653569, 8228149, 12324882, 13625706, 13765333, 10866950, 5681791, 3300041, 5630697, 7954374, 5988316, 1495835, -1892716, -3712100, -4393625, -2246531, 3533444, 9683138, 11891416, 9204857, 3772363, -1466894, -3824962, -2700973, -1394667, -3548195, -6918410, -5186620, 2590549, 9546600, 10483647, 8363513, 7779387]
38480G779387l06291k852577k607192K286404N368035K394551j386207L1218L517270
38471A4224598K066571l950530p353942m545974J34273Q98450k265355m292324
38463e084233j579420L521339N440400K417340j192487j049137J154360R76271
38455D604433j378803j578096J376339L215450R88193k879646m990718n493398
38447f136246n487977l231677K989587R447022Q926128j03120r070378p979170
38439a0645831J580239P023282J365312o132414l045549O478021O753974m440712
38431a063678j0338865q16961J0684868P736334l316282m547037M211375O611076
38423I160830k007579p831222k860107K864113K48899m069572j655687K654302
$$ y = [7779387, 7473096, 4620519, 2013327, 4299731, 9667766, 12062317, 10676110, 10707328, 14224598, 16291169, 12340639, 4986697, 440723, 574996, 1473446, -791909, -5084233, -6663653, -3142314, 2298086, 4715426, 3522939, 2473802, 3628162, 4604433, 3225630, 1647534, 3023873, 6239323, 7227516, 4347870, -642848, -6136246, -11624223, -14855900, -11866313, -2419291, 6506837, 6403717, -2666661, -10645831, -9065592, -2042310, -676998, -6809412, -9854961, -3376940, 3377034, -1063678, -11402543, -12219504, -1534636, 6201698, 2885416, -1661621, 2549754, 9160830, 7153251, -677971, -3538078, -673965, -425066, -4494638, -6150325, -3496023]
38415c496023J059549k536915l85933M474288L555391k497113n764136l765233
38407i356125n71635J734516L980874M949660L247489J469934J832935J287742
38399H575390k444852m723421j304979L359571L482722K064796M047342N064665
38391A8121234j231081r224066q165326k84247K080753l420675o424308k083012
38383a0630728K508780K645494K516403L523443K15422o724272p248971J253513
38375a1940916P016786K194174m137490j078212P065576R692976O146475J875106
38367A6834475k622433p342928n959438L741968J0519267M546724n601859n771948
38359H343828P67920L31037o353546n992057K353417M891578k258426o193852
$$ y = [-3496023, -2436474, -4973389, -5359322, -885034, 2670357, 173244, -5590892, -9356125, -9927760, -8193244, -4212370, 737290, 3984779, 5454713, 7287648, 8575390, 6130538, 1407117, 102138, 3461709, 6944431, 9009227, 13056569, 18121234, 16890153, 7666087, -499239, -783486, 1297267, -2123408, -8547716, -10630728, -8121948, -5476454, -2960051, 563392, 778814, -5945458, -13194429, -11940916, -4924130, -2729956, -6867446, -7945658, -880082, 8812894, 14959369, 16834475, 14212042, 6869114, 909676, 4651644, 15170911, 19717635, 14115776, 8343828, 9111748, 9442785, 3089239, -2902818, -549401, 4342177, 2083751, -4110101]
38351d110101k66205M912279J292373l162246o09515K876701Q86485m76186L851832
38342E195417M817904n284503j5434116j0706710L629001R988454M784045m09211
38334c419719l46165q86931l056854q6168P068511P453611j596018q040939l687347
38325f598019L066022J339734n174522n066439K995589Q935990N566737l013512
38317B051580p504302l916492K793302M696257L09994l754968k159682J766252
38309e718059K151602k5240l71886k00400l234363n794014j235996O592830O748751
38300a086775n81017k733518M400926Q061815p31139j1104714q621791K057275
38292a0338938M863466k760296p233064l85307R221648R568384O85300p428352
$$ y = [-4110101, -4376306, 535973, 1828346, -1333900, -1943415, 933286, 1819771, 1343585, 5195417, 10013321, 4728818, -10705298, -21412008, -17783007, -7794553, -3010508, -3419719, -3765884, -4652815, -7709669, -7795837, -727326, 6726285, 5130267, -2910672, -6598019, -3531997, -2192263, -7366785, -12433224, -9437635, -501645, 5065092, 2051580, -5452722, -9369214, -6575912, -1879655, -1569661, -5324629, -7484311, -5718059, -3566457, -3591697, -3963583, -4163983, -7398346, -13192360, -14428356, -7835526, -1086775, -1667792, -4401310, -384, 8061431, 7330292, -3774422, -12396213, -10338938, -5475472, -8235768, -15468832, -15854139, -6632491, 2935893, 3621193, -3807159]
38284c807159p034672P52717Q605508R882955M428795j623228k636540N11853
38276I080229K360562k11558m579184n664167k048463J516448m93905n651918
38268e691956m545219N480443J2661371N095440j0678858j6381280o654811N171568
38260a5543302P628477M130612J161419k604543p555707o435709L001129R451987
38252f765637M137417l897285j723891O219558N796214l352851p958844k728914
38244a0274233L307788K801463n86265j063916J505219M790547O673252M161407
38236A1315262k667362o622700j722866O127075O268252o20849m223637j311715
38228F541460Q18576k075422n690768o515998n707712k416009N503233J2636477
$$ y = [-3807159, -10841831, -10089114, -1483606, 8399349, 12828144, 11204916, 8568376, 9080229, 11440791, 11229233, 6650049, 985882, -1062581, 453867, -40038, -5691956, -10237175, -4756732, 7904639, 13000079, 2321221, -14060059, -20714870, -15543302, -7914825, -3784213, -2622794, -5227337, -12783044, -19218753, -16217624, -6765637, -2628220, -6525505, -8249396, -2029838, 3766376, 413525, -7545319, -10274233, -6966445, -4164982, -4751247, -5815163, -4309944, 480603, 7153855, 11315262, 8647900, 2025200, 302334, 6429409, 12697661, 12076812, 7853175, 6541460, 7360036, 5284614, -406154, -6922152, -12629864, -15045873, -9542640, 3093837]
38220C093837R873400m15650n326876r23333J956547l721244r701857o701204
38212a1866380J409299O163936P288982P914420N829228p14205n650266l390329
38204F984685J288711R60753k182112j542410R04641k308658j0136532j2633230
38196a8664152n234254N012810R300688O795054K572295P52213J800771L329154
38188E664579J917823l541119r284994r524279l111466M006529M708795j007422
38180a0171554n470234k580281L992969N446185K27491l702057p34089M577304
38172h414266N523556K729301M4963k650513n395750l502436L978035P711519
38164B4409J181112o057241k049752O364707L417959p943947r012151L230575
$$ y = [3093837, 12967237, 12551587, 7224711, 6301378, 8257925, 4536681, -5165176, -11866380, -10457081, -4293145, 2995837, 10910257, 16739485, 16025280, 10375014, 6984685, 8273396, 9234149, 7052037, 5509627, 6414268, 4105610, -6030922, -18664152, -23898406, -18885596, -9584908, -2789854, -217559, 534654, 2335425, 5664579, 7582402, 4041283, -5243711, -14767990, -17879456, -13872927, -9164132, -10171554, -15641788, -18222069, -14229100, -8782915, -8555424, -12257481, -12991570, -8414266, -2890710, -161409, -116446, -2766959, -8162709, -11665145, -7687110, 24409, 1205521, -4851720, -6901472, -536765, 2881194, -5062753, -14074904, -10844329]
38156a0844329J0013060J995361n708152n22662O258383O20242q963197o419269
38148a3570563M249432O439232j429014n438808K5647N799499M992121J520910
38140B588456J75378J57665K47138R51388O11661k707117n720385l745232J079773
38131f361275K736911Q96703N2931Q83291K99598j300092o21572J606821J551065
38122b55619p24623j887607j874911l149298m511228k398095K161758M183452
38114h456171K351214P03987K379439N573619N910855R01737o783654j0201008
38106g619982n859693q9924j156281n339570j121177J0893612J5448970N788212
38098A0944167m730065l683968J505191j163300o596122k978111N487952N019146
$$ y = [-10844329, -831269, 1164092, -4544060, -5066722, 1191661, 1811903, -7151294, -13570563, -9321131, -2881899, -4310913, -9749721, -9724074, -3924575, 1067546, 2588456, 2763834, 2921499, 3168637, 4120025, 4731686, 2024569, -3695816, -7441048, -6361275, -3624364, -2727661, -2674730, -1791439, -1491841, -2791933, -3413505, -1806684, -255619, -980242, -2867849, -4742760, -7892058, -12403286, -14801381, -12639623, -8456171, -6104957, -5400970, -3021531, 2552088, 8462943, 9364680, 2581026, -7619982, -13479675, -13569599, -14725880, -20065450, -21186627, -10293015, 5155955, 10944167, 6214102, 2530134, 4035325, 2872025, -3724097, -6702208, -1214256, 3804890]
38090C804890l907254p757506k607578J883471O77199o89017Q38575J503230P71089
38081e482901K502878N235473L590655p76722j943255j910091o273880r761091
38073a4818934k424845J0247736J1534584k13452p973796l054712K871250l83612
38065d215781n556390l519317J071723J251853J352283O544339R884423L080012
38057I893145p916330j0678768l964880L377498O381776O668070M993968Q73431
38049I627910k379322n27517M374810N813882J359053n074073q748758q488840
38041d042855o086013l556453j158944J654963L256804J028159k514692k70261
38033a1689292P974038J1278028K750050p732797p016624J223730L658230m69419
$$ y = [3804890, -102364, -7859870, -10467448, -8583977, -7906778, -8595795, -7757220, -6253990, -5482901, -2980023, 2255450, 5846105, 5069383, 3126128, 1216037, -5057843, -14818934, -17243779, -6996043, 4538541, 4325089, -3648707, -6703419, -3832169, -4215781, -9772171, -13291488, -12219765, -10967912, -9615629, -3071290, 6813133, 9893145, 1976815, -8701953, -12666833, -9289335, -2907559, 3760511, 8754479, 9627910, 7248588, 6721071, 11095881, 16909763, 18268816, 13194743, 4445985, -4042855, -10128868, -13685321, -14844265, -13189302, -9932498, -8904339, -11419031, -11689292, -3715254, 7562774, 10312824, 2580027, -4436597, -3212867, 445363, -24056]
38025b4056j026020K084731q96071q097718n554786P461778J3257122L631328
38017A0836308o269470k368273P464523R024563K995582k261578n629375p937498
38009E854782m087662O231784J1060034K597308q924786j0272607l905293P82894
38001f63546L930362Q912926R974300J771107p061477n408051K240829L921813
37993A7618263m99995k983259l393444o318136p882472j955293N317940L324857
37985C228461m634554o627742k092245l87353k412141m59994N241252O473828
37977a670488K975046K414550M585639J730951m791145m650899K632757N179785
37969H406196j444741p153160m611167O10243K438838L559788O109438N174176
$$ y = [-24056, -1050076, 1034655, 138584, -7959134, -13513920, -6052142, 7204980, 10836308, 4566838, 2198565, 9663088, 18687651, 21683233, 19421655, 13792280, 5854782, 1767120, 7998904, 19058938, 21656246, 12731460, 2458853, -1446440, -663546, 3266816, 12179742, 22154042, 23925149, 16863672, 11455621, 13696450, 17618263, 17118268, 14135009, 10741565, 4423429, -3459043, -5414336, -96396, 3228461, -1406093, -8033835, -10126080, -10513433, -12925574, -13385568, -8144316, -1670488, 1304558, 3719108, 8304747, 10035698, 5244553, 593654, 3226411, 8406196, 6961455, -191705, -4802872, -4192629, -1753791, 1805997, 7915435, 13089611]
37961A3089611j381219o631885m995470p28698j93524k739876m065872k361575
37953a0008508K201058P861687R389439L054677n373526o000753O05361L659270
37945E388705j149048n560249k709466L029619N033882M179125L890930K961788
37937A5065286q33970n478181p605653o254468j450450N607470R627354N162445
37929A3839833m715544j0318363p544572j616611K127051L567112L120439J21024
37921a419631k752118j681281Q00903o94664l518989m23541N824424M506255m147192
37912c505834o926900N69905N627545l469n421521O94990R809787O949798m933830
37903B860471j0147091m393752J840075J693570o48517r87456q33251m00191L090388
$$ y = [13089611, 11708392, 5076507, 81037, -647661, -841185, -3581061, -7646933, -10008508, -7807450, 54237, 9443676, 12498353, 7124827, 1124074, 1729435, 5388705, 4239657, -1320592, -4030058, -1000439, 4033443, 8212568, 12103498, 15065286, 14231316, 8753135, 1147482, -5106986, -6557436, -949966, 8677388, 13839833, 9124289, -1194074, -8738646, -10355257, -8228206, -4661094, -1540655, -1419631, -4171749, -5853030, -5052127, -5746791, -9265780, -9689321, -3864897, 641358, -3505834, -10432734, -9862829, -4235284, -4238753, -9660274, -8965284, 844503, 7794301, 2860471, -7286620, -11680372, -9840297, -8146727, -8795244, -9782700, -10615951, -11016142, -7925754]
37894g925754P396257N321603l328624q316297k745496O311559P360943L58164
37886D432355m296689j304787K647787P3645n591568n672172l64390J519080k417743
37877a0974482l107394M822108J1759557O386854n817900r257783r01693O326511
37869g64222L630021k366909k203727K849020N477300L089351j644205n689650
37861B376979o824802m167020j89608J779269K766381N670778Q018597M459008
37853A3889582l359049p636857n855191k715304j88316M257548Q259971M852750
37845A1505134m819795j0248309o646954l42758L896596Q143353J0212235K542990
37837A4242492j1063085j3528189N64827J3192966Q660610k984952l666886M015115
$$ y = [-7925754, -529497, 4792106, 1463482, -6852815, -9598311, -3286752, 4074191, 4432355, 135666, -1169121, 1478666, 1552311, -4039257, -9711429, -10075819, -8556739, -10974482, -14081876, -9259768, 2499789, 8886643, 3068743, -6189040, -7090733, -764222, 2865799, 498890, -1704837, 1144183, 6621483, 9710834, 8066629, 2376979, -4447823, -8614843, -8804451, -7025182, -4258801, 1411977, 9430574, 13889582, 10530533, 2893676, -2961515, -5676819, -5865135, -1607587, 6652384, 11505134, 6685339, -3562970, -10209924, -10552682, -6656086, 1487267, 11699502, 14242492, 3179407, -10348782, -9783955, 3409011, 12069621, 9084669, 5417783, 9432898]
37829I432898M220719m611705r302006m841392M32207J283403J235058J881622
37821b69196P06147j72353L961540R288519O635592l564104j0868224r869276
37813d151355m919120r1718M264498N121956r27884q022104n815353M064722Q125086
37804b351272N29173q656441q549175o10811P370472J1000577Q704724M28166
37796G865413q255349q689481n80058O117681M786108L22383m64191J074572N25926
37787B703004j106245n34060J026649M47505j245409q43173J317418K172457R13869
37778D852015m86531o91041k00755K27954N20066P48527L83671j503485m289090
37769d38669m499809L94108O411581O302690M09134k243428K183319N224323O2165
$$ y = [9432898, 13653617, 9041912, -260094, -5101486, -4669279, -3385876, -2150818, -269196, 436951, 264598, 4226138, 13514657, 20150249, 16586145, 5717921, -4151355, -9070475, -9162193, -4897695, 224261, -703623, -8725727, -14541080, -10476358, -2351272, -1822099, -10478540, -19027715, -19638526, -12268054, -1267477, 7437247, 7865413, -389936, -9079417, -9659475, -3541794, 1244314, 1566697, 1102506, 2177078, 2703004, 1596759, 1062699, 2089348, 2536853, 1291444, 448271, 1765689, 3938146, 4852015, 4365484, 3674443, 3473688, 3701642, 4221708, 4970235, 5353906, 3850421, -438669, -4938478, -4544370, 1867211, 8169901, 8579035, 6335607, 8518926, 13743249, 13805414]
37760A3805414n512948j146055P389550N712128n794890j1412310l640328P176274
37752F576835R781445N210021j089351p433868j0703145n325147N482294Q734194
37744A1233278n6355q165745m296530M112557L445311m376560n998160J916821
37736b185383Q461822N206594l528684q616911o651593p20408M110281M763418
37728H39136K636639J804141K933627J859727l081702o622565l943617J704938
37720a869676M331423M231956N001858M915152l45323p658434q111025j81770
37712C14161O402694L451893m710341p539449k129076M120615L941645r31320
37704B920822l255718m59475K437616R91796j657162k05418L076867R94033n998319
$$ y = [13805414, 8292466, 7146411, 14535961, 20248089, 14453199, 3040889, -599439, 6576835, 16358280, 21568301, 20478950, 13045082, 2341937, -2983210, 2499084, 11233278, 11176923, 3011178, -1285352, 2827205, 6272516, 1895956, -4102204, -2185383, 6276439, 11483033, 7954349, -662562, -7314155, -8034563, -3924282, 839136, 3475775, 5279916, 8213543, 10073270, 6991568, 369003, -3574614, -1869676, 2461747, 6693703, 11695561, 16610713, 16265390, 8606956, 495931, 314161, 6716855, 10168748, 5458407, -2081042, -4210118, -89503, 3852142, 2920822, -334896, -794371, 1643245, 2635041, 977879, 772461, 3849328, 4843361, -1154958]
37695a154958p967865Q8659R247387Q335246o45031o355353m161669q4544K32273
37686b465855j673551k450767k046944r49427J995106N892620O540688K328345
37678G170215k289559k831540j105168j359421k831565j422329K377364L206050
37670I14047n58039l486106j198635K872087L011810j3381j051412P60571J522081
37661B773023N3206o29053N8493j146162m196200l991098P91513L703249K70353
37652b312676m211056k831067J968917K897668l21481j544216J155562L104240
37644b094109J093432k483183l981851k423639P24479K426445M81187k327934
37636h585173n15466M549736M090675l674790p200782J241560J0827941P452768
$$ y = [-1154958, -9122823, -9034164, 213223, 8548469, 7903438, 1548085, -2613584, -2698128, -2465855, -4139406, -6590173, -8637117, -9586544, -7591438, -1698818, 4841870, 7170215, 4880656, 2049116, 943948, -415473, -3247038, -4669367, -2292003, 914047, 356008, -3130098, -4328733, -1456646, 1555164, 1541783, 490371, 1250942, 2773023, 2826229, 2197176, 2255669, 1109507, -3086693, -7077791, -6286278, -2583029, -2312676, -6523732, -9354799, -7385882, -4488214, -4809695, -6353911, -5198349, -2094109, -1000677, -3483860, -7465711, -9889350, -9164871, -6738426, -6257239, -8585173, -9100639, -4550903, -460228, -4135018, -11335800, -10094240, 733701, 8186469]
37628H186469l579742o115765P01323L444286n77906j7426O875274O670840m853403
37619A0733950j2861081p560810J21046j281823m784761l32317N565368J982464
37611h417964o082836o492254n34026J827645N76235L168698Q233740P675399
37603d5363K292739N61088L260300K748578k937450p185014n926117j604084L091480
37594e743843O433873M790662k342854p396904m135313J776158J550467k073363
37586g141117n49587M610824M865097K11979j948940r51077j738210j923969M631707
37577F6707J2482771R360896k961184r253308m571065n81397m255108p364053
37569g075741l603020K23209j134436l45661Q134346J5116156J0056197j950550
$$ y = [8186469, 4606727, -1509038, -807715, 2636571, 2058665, 2041239, 8916513, 15587353, 10733950, -2127131, -9687941, -9566895, -10848718, -15633479, -15965796, -10400428, -8417964, -14500800, -20993054, -21527080, -19699435, -19123200, -15954502, -7720762, -45363, 2247376, 2808464, 6068764, 8817342, 5879892, -1305122, -7231239, -8835323, -5743843, 690030, 5480692, 3137838, -4259066, -8394379, -6618221, -5067754, -7141117, -7690704, -3079880, 1785217, 1997196, 48256, -902821, -2641031, -4565000, 66707, 12549478, 21910374, 18949190, 9695882, 5124817, 4543420, 288312, -7075741, -10678761, -10455552, -11589988, -11935649, -3801303, 11314853, 21371050, 19420500]
37561A9420500q125430n931747k457040j413713p23315M84436Q27295N80529R50544
37552C612059J595188K217701L235658K901505j205058o339060o734738k959829
37544c676574j312866k536204p93698L876794L551536k924143n447743O97524
37536h565374N622014P64382o791911n902528J959327P958740R738147R511600
37528A4294397N660822k847263r615250q709587m120707k151280o17982M554321
37520c552529Q556376M687084l165713o029896l236438r8449K476987N448615
37512E086037M616536k084283o050117K91065Q626403N828426m717253q425815
37504C170999k893513P41479j620755k521858K32431l03543m296952k299510O600990
$$ y = [19420500, 11295070, 5363323, 2906283, 1492570, 769255, 1253691, 2080986, 2661515, 3612059, 5207247, 7424948, 10660606, 13562111, 12357053, 6017993, -716745, -3676574, -4989440, -7525644, -8319342, -4442548, -891012, -3815155, -9262898, -8565374, -2943360, -2178978, -8970889, -14873417, -12914090, -4955350, 4782797, 14294397, 19955219, 17107956, 7492706, -1216881, -5337588, -7488868, -8106850, -3552529, 5003847, 9690931, 6525218, 495322, -2741116, -2839565, -362578, 5086037, 9702573, 7618290, 1568173, 1859238, 10485641, 16314067, 11596814, 3170999, 277486, 1018965, -601790, -3123648, -2891217, -3194760, -7491712, -9791222, -3190232]
37495c190232R726052R09845q542420p228511K45948L239571P42651j642469j771878
37486g511443q9622L843538P316697M476212l680590p314016j719313N064574
37478C86037M946443J367527R55703K139822N13080j828411j026641P45507M84054
37469H683121J254093N575923P842506K266005o467531r167497m809733L63625
37461E540512K222012L06574m872034r061819m969657O316960J1656388L320886
37453A0459822p096038m372610O952487R507697j71014p808892m343372K657978
37445E786058L714245L58345j571117j136739N3463J195247P832n022739q330524
37436d945929k485362Q302678J0648187J489047o187712k617148M851549M851249
$$ y = [-3190232, 6535820, 7445665, -1096755, -8325266, -8079318, -4839747, -4097096, -5739565, -7511443, -7601065, -3757527, 3559170, 8035382, 4354792, -2959224, -4678537, 386037, 5332480, 6700007, 7655710, 9795532, 10308612, 8480201, 7453560, 8199067, 8683121, 9937214, 15513137, 23355643, 25621648, 19154117, 9986620, 5176887, 5540512, 7762524, 8069098, 3197064, -5864755, -10834412, -4517452, 7138936, 10459822, 3363784, -1008826, 5943661, 15451358, 15280344, 7471452, 3128080, 5786058, 9500303, 9858648, 8287531, 7150792, 7204255, 8399502, 8407334, 3384595, -4945929, -7431291, 871387, 11519574, 13008621, 6820909, 4203761, 9055310, 13906559]
37428A3906559r16339l405868j488316r48156l109972m355360l895481l438014
37420g650947j807043K111606L853259p55491o414313m083663M975121R991247
37412B19776N998710n04660k968839l087634l961778k897772K872471Q671699
37404D341973P640390J023590l272942j718861J166756R96089k53488Q15749K198045
37395A2937301l44033n158186n575123L26132O107230N676883J166721j539619
37387A3597306j282835r46424j533264k474416n111477r384143r517646j174537
37379a7827436Q506824P906336j493138n558776J429954P871710L247490n594385
37371a511421o061504R35861M699626J865977j857716l380414m207462k960469
$$ y = [13906559, 12990220, 9584352, 8096036, 7147880, 4037908, -317452, -4212933, -7650947, -9457990, -7346384, -3493125, -4248616, -10662929, -14746592, -9771471, 219776, 6218486, 5713826, 2744987, -342647, -4304425, -7202197, -4329726, 4341973, 11982363, 13005953, 9733011, 8014150, 9180906, 10176995, 9923507, 10739256, 12937301, 12593268, 7435082, 1859959, 2186091, 8293321, 13970204, 15136925, 13597306, 12314471, 11368047, 9834783, 7360367, 2248890, -7135253, -16652899, -17827436, -9320612, -1414276, -2907414, -8466190, -7036236, 835474, 4082964, -1511421, -7572925, -6637064, -1937438, -71461, -1929177, -5309591, -9517053, -12477522]
37363a2477522K845908Q524701O620822m74732k963512Q77047K756852o02091
37355E107473k290152J351409L582573n94877n165582l313583J307514J653274
37347A638049q31920k3885L714072M642625J344951k133529l395321l574269k956300
37338a575527l02081L491948N263057L249594j622067o992714r387108n573060
37330a3447958L115724R590714P668335p92781p848147p836529k244035K732612
37322i062065K547239p15661l73188N603686R652166M160347o079321r242379
37314c509176m111396j678810o313194p493488K412932J3344037J1764452J618472
37306F033829k217474L060057N581566j500273j0368742j1042079l950040L237631
$$ y = [-12477522, -9631614, -1106913, 5513909, 5039177, 2075665, 2952712, 5709564, 5107473, 2817321, 4168730, 7751303, 7156426, 1990844, -1322739, -15225, 1638049, 806129, 782244, 4496316, 9138941, 10483892, 8350363, 4955042, 1380773, -1575527, -1877608, 1614340, 6877397, 10126991, 8504924, 1512210, -7874898, -13447958, -10332234, -741520, 6926815, 6134034, -1714113, -9550642, -11794677, -9062065, -6514826, -7230487, -7603675, -1999989, 7652177, 11812524, 5733203, -3509176, -7620572, -9299382, -15612576, -23106064, -20693132, -7349095, 4415357, 6033829, 3816355, 6876412, 12457978, 10957705, 588963, -10453116, -14403156, -11165525]
37298a1165525M747225M83249m375481l142995M442966R552695N155733l036810
37290B661057m107145J957630N154766J546481k146460j324803m06990l416933
37282h2397o598334n085302j91225M059630O138118N739785K628293j008199k264719
37273C335650k660684n494858p842402l294844O164280J0357684N695408K37168
37265F497402J37763Q31565k768016o567658m802972M60719M271179O188757O284467
37256A0533206J555682o247887p491644J348685Q276336J704084j0427726j0794422
37248a1543686J489077R582197L800601n940475o687789j93824K905252o35537
37240g224184m281480k868046P09634R52158k115270l361461l30771L219821L789639
$$ y = [-11165525, -6418300, -5935051, -10310532, -13453527, -9010561, 542134, 5697867, 2661057, -1446088, 511542, 5666308, 7212789, 5066329, 3741526, 3334536, -82397, -6680731, -11766033, -11957258, -7897628, -1759510, 3980275, 6608568, 5600369, 3335650, 674966, -4819892, -12662294, -15957138, -9792858, 564826, 6260234, 6497402, 6635165, 7466730, 4698714, -1868944, -6671916, -6211197, -1940018, 4248739, 10533206, 12088888, 5841001, -1650643, -301958, 7974378, 9678462, -749264, -11543686, -10054609, -472412, 3328189, -2612286, -9300075, -9493899, -6588647, -7224184, -11505664, -14373710, -13664076, -12711918, -14827188, -18188649, -18519420, -15299599, -11509960]
37231a1509960M129356P250599P757533j453984j4223544j4801189m70864J1578564
37223a1743489P699107l077273m369513K590938L882584k885885n616709J462020
37215a2058220Q831540O918199r42194n302198k599931L257622N897194J568997
37207E571009o092621p335729J882376J1654839R531402k053961r294809o574600
37199b712094j562165n94551q53642L70110K6501k653240k360168K903124P060923
37190c75202N505709J699998k41818j773019m024022l565117N29215K675028m27440
37181C332l695353k123729J114234J172681J97136K830855P683972R437748O024585
37172B2645461o63895p260211r012108l060328N023622M873983m369204j1144992
$$ y = [-11509960, -7380604, -130005, 7627528, 6173544, -8050000, -22851189, -23322053, -11743489, -4044382, -7121655, -11491168, -8900230, -5017646, -7903531, -13520240, -12058220, -3226680, 3691519, 2749325, -2552873, -5152804, -1895182, 4002012, 5571009, -521612, -7857341, -5974965, 5679874, 15211276, 13157315, 3862506, -2712094, -4274259, -4868810, -5722452, -5352342, -5325841, -7979081, -10339249, -7436125, -375202, 5130507, 6830505, 6588687, 4815668, 791646, -2773471, -2244256, 430772, 3332, -3692021, -5815750, -4701516, -3528835, -3331699, -500844, 7183128, 16620876, 22645461, 21981566, 14721355, 5709247, 2648919, 7672541, 12546524, 8177320, -2967672]
37164b967672p894922j639121j290590l557937r68739L929024L717996j90935
37156a0862896o86421K112973K392793J74531K01534J683266M08342q25290M140484
37147a260684J1597748J0986445J982557l920106j254828K252235K28910k597918
37139A8014359j124722L94688k974290p072444n916704k034027j138022j875342
37131c726504M55621L913561K653471k241971l254324J962741O567468L933424
37123A0263487l801848q679033n685080K536174Q156346N573296k184783n829352
37115C49207p08732O670542O532616j143144o162117j269705Q376204J1189395
37107B3834266K520181j0175358j5137805q326528K491215N995712l47357p864233
$$ y = [-2967672, -10862594, -12501715, -13792305, -17350242, -18318981, -14389957, -10671961, -10862896, -11549317, -9436344, -7043551, -6869020, -6667486, -4984220, -4575878, -5401168, -1260684, 10337064, 21323509, 23306066, 19385960, 18131132, 20383367, 20612277, 18014359, 16889637, 17284325, 14310035, 7237591, 1320887, -713140, -1851162, -3726504, -3270883, 642678, 3296149, 1054178, -2200146, -237405, 6330063, 10263487, 6461639, -2217394, -7902474, -5366300, 2790046, 8363342, 6178559, 349207, -359525, 6311017, 12843633, 11700489, 5538372, 4268667, 12644871, 23834266, 26354447, 16179089, 1041284, -7285244, -4794029, 1201683, 854326, -7009907]
37099g009907p605996j025497L526566K844218J808185L930907N332243J719105
37091C519824l604181m262849m91076J927315J199568J319771L705774L802856
37083G117002j160928o605203o769904k392022J743662L477055L545159K357322
37075A312143N30414k36309l39530k564632n595666k888433O292521J1341296
37067G851804M629085m732556l391561M498916L229292q083216j2690515l281060
37059a1969811O031118L043404l535697n95898P484055Q376280K930941N31533
37051A2295925P65594l256846q200284m882049K844151J738978p554616r062303
37043a5311450K626149J2306830P537222l062604n068523M60641K947289N79129
$$ y = [-7009907, -14615903, -15641400, -12114834, -9270616, -7462431, -3531524, 1800719, 3519824, -84357, -4347206, -4838282, -2910967, -1711399, -391628, 3314146, 7117002, 5956074, -649129, -7419033, -9811055, -8067393, -4590338, -1045179, 1312143, 1842557, 1606248, 1266718, -1297914, -6893580, -9782013, -3489492, 7851804, 12480889, 7748333, 4356772, 8855688, 12084980, 4001764, -8688751, -11969811, -5938693, -2895289, -6430986, -7026884, 457171, 8833451, 11764392, 12295925, 13061519, 9804673, 1604389, -3277660, -433509, 1305469, -6249147, -15311450, -12685301, -378471, 7158751, 4096147, -972376, -511735, 2435554, 3014683]
37035C014683k33712J632131J361021j190716j048673J950280K107970j939385
37027E653599l865742O03222O468684O019151o45059n803377m175329N67418J038305
37018E860872l717243o711250k820312L406586L659455k311661o085657k128874
37010a0848084N039348P266370K774148k709473k939764K217760O294081K866315
37002I960701n941455j0038945l817110N129867N702806p10118k441462M348438
36994B192722R633919M889567m529785q278659n367347k426487k161410j118014
36986g165494K643055N795207M245218j556119o139147l867289L770673P075291
36978D801395n87687j1299965j0395026K950053J2776019Q339087j396664l077671
$$ y = [3014683, 2780971, 4413102, 5774123, 4583407, 3534734, 5485014, 7592984, 5653599, 1787857, 2391079, 8859763, 14878914, 14233855, 8430478, 4255149, 4822567, 5860872, 2143629, -4567621, -7387933, -3981347, -321892, -2633553, -8719210, -10848084, -5808736, 1457634, 4231782, 1522309, -1417455, 800305, 7094386, 9960701, 4019246, -6019699, -9836809, -4706942, 995864, 285746, -2155716, 2192722, 11826641, 16716208, 12186423, 3907764, -1459583, -3886070, -6047480, -7165494, -4522439, 1272768, 5517986, 3961867, -2177280, -6044569, -2273896, 4801395, 4213708, -7086257, -17481283, -14531230, -1755211, 6583876, 5187212, 2109541]
36970B109541R69039m38641p333375r398706l984446P31491J088327L094202Q926545
36961d236023J0512165K842862o002710o051330K45249L188086N17745j834935
36953h18891j089209o58454j759286n27990L692058M528545j605087p253869l141189
36944h633372O800876Q832736q73399r430132n406839M720626P298690K227053
36936E536239M53819L718099K073128o084608p348130N171627J6861245J0480654
36928C0862073q720263k0153031j4832834j965598P957088J2710517J1663741
36921A7521693L491713o639944r111932l005970K140803R75766q43854J617426
36913F145701L941170J386355k166454j562446L57999j442573m762511m423980
$$ y = [2109541, 3078580, 2639939, -4693436, -14092142, -18076588, -17345097, -16256770, -13162568, -4236023, 6276142, 9119004, 3116294, -2935036, -2689787, 498299, 1016044, -818891, -1908100, -2566554, -4325840, -4853830, -1161772, 3366773, 1761686, -5492183, -8633372, -1832496, 7000240, 6126841, -3303291, -8710130, -3989504, 3309186, 5536239, 5990058, 9708157, 11781285, 5696677, -1651453, 3520174, 20381419, 30862073, 22141810, 1988779, -12844055, -14809653, -6852565, 5857952, 17521693, 21013406, 14373462, 5261530, 2255560, 4396363, 5372129, 4528275, 6145701, 10086871, 11473226, 9306772, 7744326, 8102325, 6659752, 1897241, -2526739]
36905b526739j493388k89674J68200L402244O839208M825193q76996k684985K81749
36896G644812N39665m408395o266005R22301R327682P461849k398091o683467
$$ y = [-2526739, -4020127, -4309801, -4141601, -739357, 6099851, 10925044, 10048048, 7363063, 7644812, 8184477, 3776082, -2489923, -1567622, 7760060, 15221909, 12823818, 6140351]
$$ [...]
##END NTUPLES=NMR SPECTRUM
##END=
