##TITLE=31Pdec_LR-0149-OB
 H2O, 64 sc
 22.3.2023
##JCAMPDX= 6.0         $$ Bruker NMR JCAMP-DX V2.0
##DATA TYPE= NMR SPECTRUM
##DATA CLASS= NTUPLES
##ORIGIN= UXNMR, Bruker Analytische Messtechnik GmbH
##OWNER= root
$$ XWIN-NMR		Version 3.5
$$ Wed Mar 22 14:09:35 2023 Russian Standard Time (UT+4h)  she@DPX200
##.OBSERVE FREQUENCY= 81.013821
##.OBSERVE NUCLEUS= ^31P
##.ACQUISITION MODE= SIMULTANEOUS
##.ACQUISITION SCHEME= undefined
##.AVERAGES= 64
##.DIGITISER RES= 16
##SPECTROMETER/DATA SYSTEM= spect
##.PULSE SEQUENCE= zgpg30
##.SOLVENT NAME= CDCl3
##.SHIFT REFERENCE= (INTERNAL, CDCl3, 0, 248.564)
##AUDIT TRAIL= $$ (NUMBER, WHEN, WHO, WHERE, WHAT)
$$ ##TITLE= Audit trail, XWIN-NMR		Version 3.5
$$ ##JCAMPDX= 5.01
$$ ##ORIGIN= Bruker BioSpin GmbH
$$ ##OWNER= she
$$ F:/spectra/data/she/nmr/P31/1/pdata/1/auditp.txt
$$ ##AUDIT TRAIL=  $$ (NUMBER, WHEN, WHO, WHERE, WHAT)
(   1,<2023-03-22 14:08:39.89 +0400>,<she>,<DPX200>,
      <continue with go, POWCHK disabled, PULCHK disabled
       configuration hash MD5:
       00 E9 B6 7A A2 85 ED C7 34 08 36 98 17 FE 4E 26
       data hash MD5: 32K
       B6 13 FB 95 39 62 A8 1A 79 58 39 04 6D 5C 0B 9B>)
(   2,<2023-03-22 14:08:41.54 +0400>,<she>,<DPX200>,
      <Start of raw data processing
       efp BC_mod = 2 LB = 1 FT_mod = 6 PKNL = 1 PHC0 = -10601.43 PHC1 = -6.315186 SI = 64K 
       data hash MD5: 64K
       D0 51 B2 D3 D8 DF D4 F2 20 43 A4 E4 AB 17 2C 30>)
(   3,<2023-03-22 14:08:56.34 +0400>,<she>,<DPX200>,
      <pk PHC0 = -72.12587 PHC1 = 0 
       data hash MD5: 64K
       57 B9 2E 12 9D 8A 7A C2 D6 E7 66 E0 EF 08 BB FA>)
(   4,<2023-03-22 14:09:01.79 +0400>,<she>,<DPX200>,
      <abs ABSG = 5 
       data hash MD5: 64K
       2C 49 04 86 53 8B 9C 08 C1 2A D4 89 6E F8 DA 04>)
$$ ##END=
$$ 
$$ hash MD5
$$ B5 70 8C 13 D9 E0 22 01 6A BE 5C 39 CB D9 BE E0
##$RELAX= 
##$RELAX= 
##$RELAX= 
##$RELAX= 
##$RELAX= 
##$RELAX= 
##$RELAX= 
##$RELAX= 
##$RELAX= 
$$ Bruker specific parameters
$$ --------------------------
##$DU= <F:/spectra>
##$EXPNO= 1
##$NAME= <P31>
##$PROCNO= 1
##$TYPE= <nmr>
##$USER= <she>
##$AMP= (0..31)
100 100 100 100 100 100 100 100 100 100 100 100 100 100 100 100 100 100 
100 100 100 100 100 100 100 100 100 100 100 100 100 100 
##$AQSEQ= 0
##$AQ_mod= 1
##$AUNM= <au_zg>
##$AUTOPOS= <>
##$BF1= 81.014009
##$BF2= 200.13
##$BF3= 200.13
##$BF4= 200.13
##$BF5= 200.13
##$BF6= 200.13
##$BF7= 200.13
##$BF8= 200.13
##$BYTORDA= 1
##$CFDGTYP= 0
##$CFRGTYP= 5
##$CHEMSTR= <none>
##$CNST= (0..31)
1 1 145 1 1 1 1 1 1 1 1 1 1 1 1 1 1 1 1 1 1 1 1 1 1 1 1 1 1 1 1 1 
##$CPDPRG= <waltz16>
##$CPDPRG1= <>
##$CPDPRG2= <waltz16>
##$CPDPRG3= <>
##$CPDPRG4= <mlev>
##$CPDPRG5= <mlev>
##$CPDPRG6= <mlev>
##$CPDPRG7= <mlev>
##$CPDPRG8= <mlev>
##$CPDPRGB= <>
##$CPDPRGT= <>
##$D= (0..31)
0 1 0 0 0 0 0 0 0 0 0 0.03 2e-05 3e-06 0 0 0 0 0 0 0 0 0 0 0 0 0 0 0 0 
0 0 
##$DATE= 1679479609
##$DBL= (0..7)
120 120 120 11 120 120 24 19 
##$DBP= (0..7)
150 150 150 150 150 150 150 150 
##$DBP07= 0
##$DBPNAM0= <>
##$DBPNAM1= <>
$$ [...]
##$SUBNAM3= <"">
##$SUBNAM4= <"">
##$SUBNAM5= <"">
##$SUBNAM6= <"">
##$SUBNAM7= <"">
##$SUBNAM8= <"">
##$SUBNAM9= <"">
##$SW= 501.771253377433
##$SWIBOX= (0..15)
0 1 3 0 0 0 0 0 0 0 0 0 0 0 0 0 
##$SW_h= 40650.406504065
##$TD= 32768
##$TD0= 1
##$TE= 0
##$TE2= 300
##$TE3= 300
##$TEG= 300
##$TL= (0..7)
0 120 53 12 22 120 120 120 
##$TP= (0..7)
150 150 150 150 150 150 150 150 
##$TP07= 0
##$TPNAME0= <>
##$TPNAME1= <>
##$TPNAME2= <>
##$TPNAME3= <>
##$TPNAME4= <>
##$TPNAME5= <>
##$TPNAME6= <>
##$TPNAME7= <>
##$TPOAL= (0..7)
0.5 0.5 0.5 0.5 0.5 0.5 0.5 0.5 
##$TPOFFS= (0..7)
0 0 0 0 0 0 0 0 
##$TUNHIN= 0
##$TUNHOUT= 0
##$TUNXOUT= 0
##$USERA1= <user>
##$USERA2= <user>
##$USERA3= <user>
##$USERA4= <user>
##$USERA5= <user>
##$V9= 5
##$VALIST= <valist>
##$VCLIST= <CCCCCCCCCCCCCCC>
##$VD= 0
##$VDLIST= <DDDDDDDDDDDDDDD>
##$VPLIST= <PPPPPPPPPPPPPPP>
##$VTLIST= <TTTTTTTTTTTTTTT>
##$WBST= 1024
##$WBSW= 4
##$XGAIN= (0..3)
0 0 0 0 
##$XL= 0
##$YL= 0
##$YMAX_a= 5124
##$YMIN_a= -2547
##$ZGOPTNS= <>
##$ZL1= 120
##$ZL2= 120
##$ZL3= 120
##$ZL4= 120
##$ABSF1= 248.5645
##$ABSF2= -253.2056
##$ABSG= 5
##$ABSL= 3
##$ALPHA= 0
##$AQORDER= 0
##$ASSFAC= 0
##$ASSFACI= 0
##$ASSFACX= 0
##$ASSWID= 0
##$AUNMP= <proc_1d>
##$AZFE= 0.1
##$AZFW= 0.5
##$BCFW= 0
##$BC_mod= 2
##$BYTORDP= 0
##$COROFFS= 0
##$CY= -3
##$DATMOD= 1
##$DC= 0
##$DFILT= <>
##$DTYPP= 0
##$F1P= 0
##$F2P= 0
##$FCOR= 1
##$FTSIZE= 65536
##$FT_mod= 6
##$GAMMA= 0
##$GB= 0
##$INTBC= 1
##$INTSCL= 6.047779e-11
##$ISEN= 30
##$LB= 1
##$LEV0= 0
##$LPBIN= 0
##$MAXI= 10000
##$MC2= 0
##$MEAN= 0
##$ME_mod= 0
##$MI= 50
##$NCOEF= 0
##$NC_proc= -9
##$NLEV= 6
##$NOISF1= 182.463
##$NOISF2= 159.3651
##$NSP= 0
##$NTH_PI= 0
##$NZP= 0
##$OFFSET= 248.5645
##$PC= 4
##$PHC0= -10673.56
##$PHC1= -6.315186
##$PH_mod= 1
##$PKNL= yes
##$PPARMOD= 0
##$PSCAL= 0
##$PSIGN= 0
##$REVERSE= no
##$SF= 81.0140089999694
##$SI= 65536
##$SIGF1= 159.3651
##$SIGF2= -187.1042
##$SINO= 113.3802
##$SIOLD= 16384
##$SREGLST= <1H.CDCl3>
##$SSB= 0
##$STSI= 65536
##$STSR= 0
##$SW_p= 40650.406504065
##$SYMM= 0
##$S_DEV= 0
##$TDeff= 32768
##$TDoff= 0
##$TI= <>
##$TILT= no
##$TM1= 0
##$TM2= 0
##$TOPLEV= 0
##$USERP1= <user>
##$USERP2= <user>
##$USERP3= <user>
##$USERP4= <user>
##$USERP5= <user>
##$WDW= 1
##$XDIM= 65536
##$YMAX_p= 116989948
##$YMIN_p= -477066541
$$ End of Bruker specific parameters
$$ ---------------------------------
##NTUPLES= NMR SPECTRUM
##VAR_NAME=  FREQUENCY,     SPECTRUM/REAL,   SPECTRUM/IMAG
##SYMBOL=    X,             R,               I
##VAR_TYPE=  INDEPENDENT,   DEPENDENT,       DEPENDENT
##VAR_FORM=  AFFN,          ASDF,            ASDF
##VAR_DIM=   65536,         65536,           65536
##UNITS=     HZ,            ARBITRARY UNITS, ARBITRARY UNITS
##FACTOR=    0.620285442955139, 1,           1
##FIRST=     20137.2065510682, 0,            0
##LAST=      -20513.1999529968, 0,           0
##MIN=       -20513.1999529968, -477066541,  0
##MAX=       20137.2065510682, 116989948,    0
$$ Real data points
##PAGE= N=1
##DATA TABLE= (X++(R..R)), XYDATA
$$ [...]
14787 -4051569 -15673065 -20334493 -9591777 5663353 8629016 164932 -6920066 -10545235
14779 -10545235 -18709431 -29933734 -32887588 -25880414 -19728576 -18634884 -14318912 -4204545
14771 -4204545 -376267 -11865638 -29262394 -36394168 -29651629 -17435626 -6865528 323545
14763 323545 2851833 -711572 -8392823 -15533428 -18548718 -16376594 -11367048 -10227711
14755 -10227711 -18842619 -32811007 -38279183 -26963540 -6710715 7210621 8026057 863675
14747 863675 -5651426 -6210984 -535217 6267313 7152460 1542552 -2296185 1790825 7566645
14738 7566645 3753899 -9967921 -21752473 -22671889 -16047052 -10376564 -9881471 -14746787
14730 -14746787 -23693037 -31108275 -27178798 -8137419 16064604 30956641 32941180 28762666
14722 28762666 21262794 5912069 -15656980 -29634160 -26326365 -15341804 -13205159
14715 -13205159 -19449151 -18038964 -2718526 13323882 18254699 18724206 25941321 34472925
14707 34472925 28925466 7807317 -13049367 -21469485 -21689688 -22916095 -24614344 -19156893
14699 -19156893 -4308335 12160104 19589814 14988796 6819898 5953389 11177316 9212518
14691 9212518 -5492114 -17749683 -9175439 14960757 29851900 22302804 4020108
14684 4020108 -8863802 -14586899 -17133438 -13206809 -266459 11778120 10812953 67081
14676 67081 -6563007 -3863638 1515567 5575578 12162656 21460494 24130573 12695855
14668 12695855 -7301616 -22481327 -24431837 -14311843 1215209 14177268 17721567
14661 17721567 9662344 -4910262 -16966904 -21377400 -20819230 -20787007 -21841428 -19325316
14653 -19325316 -10509702 1616248 12649554 20386669 22038925 13992610 -474237 -9315111
14645 -9315111 -5757621 461397 -3875104 -14706175 -15811232 -3837548 6414626 4649201
14637 4649201 -1438246 -1417907 2453053 3695458 4011189 6838522 7596273 1260283 -7256207
14628 -7256207 -10598375 -10809423 -13529224 -15673108 -9574916 3635469 13959772 14186310
14620 14186310 5631765 -4751111 -8995375 -5268232 -3360090 -14178049 -30363115 -30476820
14612 -30476820 -9171008 12267773 15700878 9192576 6036476 397607 -14128509 -19802567
14604 -19802567 1134936 29350441 30035911 6790039 -2850062 12823669 23465580
14597 23465580 10411322 -1969139 10885041 32251878 32924513 16895877 7891067
14590 7891067 7610836 -422702 -14636106 -14424103 5654360 26867564 34349678 32978956
14582 32978956 31198549 27260682 17753744 6104192 -3141371 -8549624 -7664063 1072828
14574 1072828 10275550 8545659 -3404865 -11971441 -9672893 -4513882 -5238100 -7739193
14566 -7739193 -4748290 -1126830 -7721335 -22304165 -28427770 -16895260 122493 3724017
14558 3724017 -7309739 -15972782 -10489473 2506251 12691227 22583621 38427680 52778934
14550 52778934 51943172 38239743 28302856 28013167 26086943 16798330 10940347 15310920
14542 15310920 18666971 11428297 4179276 9428686 17028793 8452041 -11347171 -18276632
14534 -18276632 -4008606 13972368 19836257 18005421 17898363 16628765 7577854 -4753156
14526 -4753156 -9832903 -5375961 2439117 9517436 16884996 24401242 27608872 22374871
14518 22374871 10457683 -652326 -3910537 496667 5180035 3259943 -5413852 -16712492
14510 -16712492 -27626898 -36165979 -38905403 -33520339 -22979518 -13304124 -7171606 -2353800
14502 -2353800 3750369 9981758 11939991 6636831 -2592003 -7841878 -6304363 -5028915
14494 -5028915 -10390092 -16769249 -15147498 -9545706 -11222997 -17607618 -14567193 -2463028
14486 -2463028 646448 -9932648 -13121689 4564438 23709271 20543735 3657209 -2457798
14478 -2457798 2874438 1379840 -8397506 -10767439 -4967463 -6365090 -13989048 -8032946
14470 -8032946 13191015 23264177 6572520 -18278137 -27825630 -23758624 -18457091 -11970036
14462 -11970036 -1523951 3813457 -2673050 -10175050 -7123394 -651569 -2266089 -6643267
14454 -6643267 -3183859 2628047 -618854 -7900217 -6183689 1757835 3009817 -853604
14446 -853604 3517310 15635687 19516517 9388697 -1701761 -2465234 3477986 8280403
14438 8280403 8984660 3179624 -9742444 -19871840 -14350372 2095947 9211346 -492252
14430 -492252 -10418933 -4896934 8340384 11589057 2636148 -5288453 -3207770 3935173
14422 3935173 4635039 -7618748 -26696336 -35609829 -22632592 2732399 19392609 21934239
14414 21934239 24533498 33339075 33448198 15544107 -2491554 -436713 11061444 6788896
14406 6788896 -11113043 -15775469 136346 12507017 6374380 466618 14549732 34996676
14398 34996676 35730275 18457861 6851720 8426816 7538467 -4742763 -17179507 -19142087
14390 -19142087 -15369635 -12968710 -10001586 -5781907 -8606249 -22205663 -34480767 -31187412
14382 -31187412 -15038782 -1897153 -1867447 -11099751 -18715065 -16509383 -5413461 4284489
14374 4284489 3899019 -1217084 1468997 11065125 12628232 2137737 -4279180 2674916
14366 2674916 6010347 -11198903 -32811895 -27993488 2418273 24474808 18359563 1628771
14358 1628771 -3102405 -24083 -4442358 -13751258 -14485620 -7940222 -7630132 -14456821
14350 -14456821 -13793495 131244 13047969 10627823 -2122158 -10434453 -10389070 -8437686
14342 -8437686 -4546761 9556112 31494343 40668912 21074235 -14521332 -36224347
14335 -36224347 -31328241 -14531337 -4255775 -3999844 -10538751 -22859176 -33157085 -25652170
14327 -25652170 382359 19912572 12832687 -5519030 -5952840 10653865 16633576 2219320
14319 2219320 -10727309 -4723415 9015618 12755683 7560488 3320014 742743 -2340495
14311 -2340495 -402623 9374437 16425643 10383942 -2028037 -5476192 4281955 18265124
14303 18265124 26212043 23826738 14671258 9885167 17639559 29100208 26358545 8341191
14295 8341191 -6337132 -8559009 -11976103 -25920626 -35160883 -24755121 -8041546 -7069083
14287 -7069083 -17309657 -16745584 -2655495 6370735 2608887 -1358681 2813384 7476632
14279 7476632 6417215 4729394 5231983 2094216 -4689046 -3469353 11359429 27135015
14271 27135015 27555037 12424184 -3881829 -8627407 -1368680 7310391 5820494 -6183689
14263 -6183689 -16777474 -17062203 -12824043 -13748726 -17119679 -13408181 -3271678 4417589
14255 4417589 8285929 13574172 17619059 12516630 2436598 1134579 9372256 11660753
14247 11660753 687980 -10758216 -9269730 1564818 10405949 12713075 9010868 350947
14239 350947 -7612531 -7200333 -1261960 -1074824 -6479567 -3190681 12399294 22785364
14231 22785364 15989030 6432682 12406207 25718598 24012494 5487448 -9398372 -7911894
14223 -7911894 2301986 10677362 16662277 22141022 24666578 22240213 15153099 2089084
14215 2089084 -15628546 -26688296 -19253679 1360670 17334826 21898056 23743241 25744529
14207 25744529 17944743 349986 -6056584 12593332 37436450 39630373 21119927
14200 21119927 10556493 20440021 31555159 24967734 7449297 -6289814 -17630504
14193 -17630504 -33111638 -43319760 -34106272 -12317648 1288174 3342301 10510326
14186 10510326 27709184 35706824 20952394 -101923 -1945926 15879578 31320281
14179 31320281 30109135 19049353 11836199 13825162 20435018 22200912 12694457 -2619032
14171 -2619032 -9663376 -3937609 2072672 -1472192 -4276407 7597538 25410182 27140273
14163 27140273 10894498 -1668092 1627031 6979282 -567079 -13154458 -13980404 -3338082
14155 -3338082 3865171 1001178 -2860073 2387479 14842342 23660083 20702271 8076719
14147 8076719 -4887852 -12387742 -17658896 -24368915 -26642146 -16631102 -820984 3061702
14139 3061702 -10851388 -27035221 -28586956 -18404838 -12167770 -15816242 -19417929 -12485240
14131 -12485240 1677217 9322478 1986801 -12856783 -18708684 -8497111 7168872
14124 7168872 13018724 5863743 -6566811 -17636948 -24121812 -21595166 -9191970 3135498
14116 3135498 3782215 -5194479 -13063493 -17909296 -24900477 -29388087 -20098391 -991815
14108 -991815 9382700 5551105 2838430 9643801 11832236 -3065162 -23864965 -32945414
14100 -32945414 -30643536 -26717776 -20950049 -9963948 -2425042 -8311617 -19952250 -21180420
14092 -21180420 -10162812 2263957 10987511 17568679 18814451 11480926 4292962 8781485
14084 8781485 21355485 29777581 32754822 36302387 36132056 24119737 9142053 8450868
14076 8450868 17619834 13147727 -9940927 -26894784 -19438899 -1663060 4037159 -1307884
14068 -1307884 -2619183 1827377 1921743 -2413297 370240 13667358 25461342 23449722
14060 23449722 8663802 -8243213 -18464916 -20772155 -19037496 -16022240 -10333400 -500482
14052 -500482 10418614 18471625 24272833 28044092 22511503 2193486 -20794109 -25201234
14044 -25201234 -9687406 1751975 -6979209 -19265581 -9021148 20803455 41090247
14037 41090247 34829554 14979774 2181575 393935 1351470 1326099 3194684 6924825
14029 6924825 6799302 -1818371 -16433343 -27738413 -25751632 -9217189 9849356 15636658
14021 15636658 5623427 -5693899 -3914602 7946714 14207175 6220405 -8483398
14014 -8483398 -16219503 -10858569 2714284 13171085 9617643 -9706406 -32286020 -40547742
14006 -40547742 -30801033 -17908190 -15764210 -19307769 -14950727 -4058300 -2472607 -15541723
13998 -15541723 -27103050 -20049945 1408730 17814365 16568856 1345004 -14647411
13991 -14647411 -17951379 -3458349 18109109 26353673 13571008 -3780690 -5893658
13984 -5893658 2949113 1388708 -15878886 -28142258 -17422690 6098967 17682765
13977 17682765 9332376 -3695233 -4787803 6066350 17800996 23787220 26374984 28691810
13969 28691810 27825573 18773119 2870907 -11488937 -17070855 -14191481 -8728080 -6968546
13961 -6968546 -12509938 -23240814 -30032921 -24604309 -11411709 -4282586 -6757873 -5260740
13953 -5260740 9635945 25084941 23351388 10425682 8364260 20313071 24295400 7470042
13945 7470042 -13794291 -19984017 -17194104 -22686967 -34506023 -36785131 -29030977 -27062792
13937 -27062792 -34102788 -33304486 -16262778 849810 2330401 -1848584 6669795 22894081
13929 22894081 25400369 11486322 2600664 9789200 14682366 -2204502 -29671621 -40308597
13921 -40308597 -28604468 -14988063 -13130930 -12681292 -627859 16003970 20577538 11085615
13913 11085615 1262822 158169 1431170 -4906198 -17010904 -22478759 -14284888 -1741834
13905 -1741834 -1297251 -15676381 -28455023 -25258593 -14467303 -15468415 -28503231 -31334858
13897 -31334858 -10386645 18808690 31562732 24032546 12206566 8324007 10454283
13890 10454283 11885194 9749083 4879088 662886 1014418 4243257 2220976 -8980608
13882 -8980608 -22198803 -28558990 -27586929 -21379487 -7257512 13133335 25205246 16303799
13874 16303799 -4922665 -18551881 -20144415 -21840268 -27593224 -25652763 -11149326 -136414
13866 -136414 -10334144 -36738521 -56085030 -51455907 -26619705 371806 13358186
13859 13358186 10405617 2744806 580295 2045092 116036 -3635092 -852758 9381057
13851 9381057 17735701 17335600 11220371 5627234 3154086 4096439 8010862 12739613
13843 12739613 17055343 23184307 31018406 33333296 25020092 13062709 6916030 3353563
13835 3353563 -5784571 -14720585 -9911394 5578684 12998920 6146993 -810406 534647
13827 534647 -629497 -11549017 -19463972 -13053475 -3880756 -8119249 -19209607 -18961581
13819 -18961581 -7964423 -3497164 -9595689 -10001993 5380509 23956094 28304135 19436409
13811 19436409 12791890 16254485 21002743 15002033 272380 -8265986 -1667868 10631980
13803 10631980 12491446 1564684 -9650543 -11078340 -3278148 10986261 30490480
13796 30490480 47734998 50827094 40275571 32681447 39216654 49858338 47645517 30033047
13788 30033047 7658247 -9334651 -14880883 -6450768 8264611 12629494 823400
13781 823400 -11126726 -6095918 10042729 18807406 16335977 13603658 14063314 9913093
13773 9913093 749948 -2403023 3907326 8282069 2934245 -3977339 -3381054 -1833996
13765 -1833996 -11474573 -29319963 -38512387 -29938897 -13533266 -5055359 -7480697 -10607532
13757 -10607532 -6637884 543784 3636564 3371728 5561802 9991667 10351030 5158678
13749 5158678 962363 2898908 8586647 13068077 13762652 9710765 2468737 -2377778
13741 -2377778 -2102739 -3281386 -10774054 -13289250 3677687 30169624 37468954 17681000
13733 17681000 -3053727 -1596043 11988389 15786503 8590469 2451865 -1026873 -5584244
13725 -5584244 -4534767 7345366 16565755 8353264 -7564167 -11630355 -5895681 -5268655
13717 -5268655 -5627494 9213836 32337216 38063618 23888966 16106194 26169469 32270458
13709 32270458 17195321 -3033516 -5548821 6310146 14727280 15334491 15730604 18486260
13701 18486260 20588304 20412861 15314486 3190269 -7081243 -2428199 10077665 5837969
13693 5837969 -19294681 -36424001 -25891696 -9318956 -15555371 -34153206 -33107440
13686 -33107440 -10535282 4692034 -419823 -8624707 -7452071 -7752376 -17496169 -23186384
13678 -23186384 -12665193 2409968 3689440 -6562510 -11205630 -3993386 4706380 5132911
13670 5132911 -446557 -4368318 -4506790 -6046702 -13933490 -24250599 -25444275 -11955277
13662 -11955277 5458364 9821565 -1757235 -15311623 -18176212 -11318948 -1754215 6833929
13654 6833929 10617984 3226648 -13617169 -24236226 -15356608 4762823 14496446 5319834
13646 5319834 -10249012 -17670049 -16082814 -11246732 -3809492 6842103 14014223 9716219
13638 9716219 -2254552 -7994976 216190 14673750 20639907 10746430 -8611267 -22051500
13630 -22051500 -18100169 -1583018 9180724 2929412 -10111040 -12210477 -2878180 2794192
13622 2794192 -105071 1588459 15370711 27141363 21010689 3482913 -6714828 -5093340
13614 -5093340 -1756162 -23993 7568361 21306337 28960285 24032192 16801088 19392680
13606 19392680 28146446 29137705 17250022 2570693 -2534996 860188 -1484796 -19006794
13598 -19006794 -41335765 -48840723 -38909081 -30210063 -34625452 -38281199 -24035484 -2069672
13590 -2069672 1620827 -16798460 -33155751 -28863916 -11246498 4624319 16494356
13583 16494356 28026455 35026973 30221139 15062926 -828171 -7875252 -2067010 11188241
13575 11188241 18723049 14023326 8509505 16059117 28004092 21171529 -6798658 -30134955
13567 -30134955 -30417853 -20028600 -18534275 -23410802 -20041664 -7099627 5572941 15021573
13559 15021573 24246682 29528171 24196845 11378263 422369 -5719583 -9024491 -7588199
13551 -7588199 457598 8888725 10121880 5898087 1936036 -2193406 -7706992 -7955641
13543 -7955641 2592159 16013479 20013439 15020109 10396260 8557921 5940595 5367014
13535 5367014 12664227 22800990 23779870 14592488 6533171 5702407 5831014 50533
13527 50533 -10465785 -21317201 -29571770 -32435506 -28764018 -22422894 -18014908 -14616130
13519 -14616130 -9716695 -6081206 -7540802 -11719097 -14313300 -15833596 -16437341 -10869633
13511 -10869633 1739424 10742951 8687035 5269632 12111519 21262392 16656007 1314625
13503 1314625 -6987103 -4268925 -3218867 -7901185 -8034355 -1533890 -217501 -6358531
13495 -6358531 -4932949 10680327 23893367 17644162 -3296453 -23654977 -36633470
13488 -36633470 -40478359 -31260108 -13208534 -3945376 -14269612 -31505742 -36195929 -26853016
13480 -26853016 -15126928 -5249561 6323608 16793395 18387767 11724266 4923043 1101054
13472 1101054 -1797256 -874736 9650156 26157574 36461815 34605959 26208713 18063259
13464 18063259 10942306 4779435 3102074 8015909 15215332 17921156 14423687 9799130
13456 9799130 9991780 14292505 15215672 8395420 689496 2667913 13382348 20305316
13448 20305316 16057209 6485664 -1325788 -9242730 -19883466 -27663319 -27402285 -24702540
13440 -24702540 -27043842 -29471782 -20438071 417171 20383418 28317627 22676386 7477121
13432 7477121 -9550007 -16115910 -4429894 16484623 26981251 18809875 3742354
13425 3742354 -2526107 2150080 8628009 9840786 7106594 6825418 14177438 27051934
13417 27051934 34520208 25689816 2775132 -18368436 -23616765 -13744607 -600592 5939050
13409 5939050 4598410 238860 -1250298 2216199 6072588 3239429 -6122895 -12152051
13401 -12152051 -7059737 3102297 4687035 -5827573 -17119663 -18072841 -10907606 -4639818
13393 -4639818 -1348372 2967501 6891353 3649226 -5266310 -6639978 7576715 26710733
13385 26710733 33265282 24557115 13432538 9421912 9668012 9797368 12586141 19409468
13377 19409468 21107558 7068237 -18791513 -39146743 -41208940 -28382936 -13303720
13370 -13303720 -4326425 -1122162 677828 4760614 12201013 19733087 19985745 7938976
13362 7938976 -11232594 -24955779 -26881698 -23801801 -24844860 -28290179 -26142404 -18334203
13354 -18334203 -12419749 -9814579 -3529057 8449306 19067496 25246411 32526914 40519347
13346 40519347 37214493 17914516 -2627689 -10080801 -11601643 -21519974 -35400681 -36916551
13338 -36916551 -24648166 -12831985 -8822757 -8694431 -12173759 -20944921 -23293291 -3945955
13330 -3945955 27619152 41686051 27179493 4453381 -7194498 -11277219 -13998599
13323 -13998599 -7958197 7823972 14140583 -1268311 -20000379 -18004984 -526243
13316 -526243 9720314 7587250 5565461 7094446 3509374 -5787740 -11002845 -8740354
13308 -8740354 -4200089 1016833 7565929 8854888 -390328 -10093028 -6807404 4289723
13300 4289723 7927768 5079670 9367974 19135834 16995204 -6661 -12913879 -9875654
13292 -9875654 -1586255 522780 1781934 9229514 16488068 16497520 15303422 19795753 22825597
13283 22825597 14108128 -1741108 -10541824 -7559955 -1665699 -3044307 -12535699 -20810161
13275 -20810161 -16747695 -1928370 4655932 -12850618 -41861207 -51559854 -32514427
13268 -32514427 -9587491 -6880759 -16436359 -15571811 -1479117 9697070 10317494 8809061
13260 8809061 11854053 15485263 15708159 15366866 17268039 19461165 19898169 18925018 15794853
13251 15794853 9021580 1209855 -2558745 -2569421 -5164005 -13368896 -21218310 -20645622
13243 -20645622 -11987467 -4435875 -5338138 -10984234 -11404375 -5117463 -3864012 -17319412
13235 -17319412 -37072779 -44446755 -33208890 -15156051 -2681437 3517760 6628020
13228 6628020 5222156 -922046 -5628420 -4316970 -161787 3760774 10453500 20445764
13220 20445764 26267578 24217359 22794139 28355125 30497361 15996843 -7794340 -19819361
13212 -19819361 -15036609 -11107162 -21302683 -35024846 -34170426 -19433271 -8959658 -13687835
13204 -13687835 -24080564 -24072774 -11943139 -973944 -351363 -3264404 565446 6569051
13196 6569051 781219 -17070301 -29605471 -26675405 -21676304 -31813223 -50707679 -55097752
13188 -55097752 -35915312 -8940749 6616961 8331030 5413190 2899175 -1637305 -9154264
13180 -9154264 -13692925 -8512905 3372056 9069414 1314847 -8085462 22969 24780109
13172 24780109 41509280 33012292 13714058 10067847 24854908 36862085 32566283
13165 32566283 20833941 14310654 12266412 8577861 4710932 5741922 10242448 12063625
13157 12063625 9240900 6143873 8158070 16138522 24628671 26049075 19115748 10955990
13149 10955990 7247791 4158691 -3897228 -12887896 -14304153 -8531515 -3167177 -419224
13141 -419224 2679300 3485542 -3411291 -12454015 -10848640 1274831 9057352 5697078
13133 5697078 1913489 5882173 9377312 4623908 917709 10059893 25311759 30364147
13125 30364147 22881473 14145123 9412229 3687703 -4021693 -6150398 1692585 14681438
13117 14681438 26272246 33592111 34919149 30250840 25149139 25625517 27759061 20632807
13109 20632807 2299605 -14514937 -16870375 -7008062 701141 -4123541 -17189998 -24050149
13101 -24050149 -15101077 3312202 14895737 12035191 4571882 6616357 19145656 31173893
13093 31173893 34140297 27991021 15772509 317743 -14219020 -24113838 -29045261 -28902477
13085 -28902477 -21171517 -7567458 2411278 4202292 8535938 25089075 40080728 29569604
13077 29569604 -3061241 -24175598 -13621550 7734234 9073669 -7258570 -13497880
13070 -13497880 2120892 23832662 35777698 39444853 39777294 32513399 14909031 -3319118
13062 -3319118 -10325151 -6438462 -179582 3985951 6271679 5256422 -250732 -5651698
13054 -5651698 -5083039 -810384 -831163 -6638900 -10520057 -7645018 -4641447 -10940328 -25100497
13045 -25100497 -36111136 -37739957 -35014158 -34127408 -32351261 -24168926 -13222466 -8740922
13037 -8740922 -10207918 -6284741 6568077 14775948 6346788 -8560933 -8836966 8328965
13029 8328965 23228498 20635053 8185614 2242037 6137823 10630981 8360393 -860562
13021 -860562 -13773689 -24204038 -23996475 -12002641 689502 2826249 -1800408 257045
13013 257045 12680825 24554034 25961596 20010888 16307871 18750933 23312733 23898065
13005 23898065 17826695 8167026 1592646 1641613 4938652 6868867 8079262 10304397
12997 10304397 9381900 633389 -10773497 -14615152 -10694358 -8785371 -12194270 -12654387
12989 -12654387 -5133103 3680606 7472390 10143597 15803425 18528470 11790665 906966
12981 906966 -3683470 -27706 7180005 15894824 24392083 25482988 14636237 378265
12973 378265 -4529872 157086 4628456 5210666 6220761 7408793 2724373 -7140697
12965 -7140697 -12891406 -10127647 -4672975 -1643389 1470370 7643982 14522109 18804644
12957 18804644 19354648 14332386 2884744 -9095753 -13189254 -9769259 -6765072 -6519971
12949 -6519971 -3734212 2228371 4016051 -1726318 -9321678 -14147493 -17819381 -20914562
12941 -20914562 -21448040 -22724432 -30200964 -38300340 -35347895 -25200887 -26078640 -40991616
12933 -40991616 -48890678 -36398093 -18708300 -13641658 -14034052 -6037863 2175558 -4841295
12925 -4841295 -18656337 -18448613 -6944505 -6468227 -20880364 -29186776 -19782715 -5485418
12917 -5485418 900967 2286088 1550343 -7039589 -20892525 -24168694 -11504052 742649
12909 742649 -1727794 -12005079 -16991610 -15170002 -8379661 6744479 25581043 30592988
12901 30592988 15651221 241613 2050679 9860404 3905247 -9781938 -9739905 4151783
12893 4151783 10238767 -175528 -11641839 -10968321 -4140813 -1265891 -1393686 910201
12885 910201 6161517 12025561 15257697 10733042 -650718 -4855999 9791349 30895417
12877 30895417 33921878 17861475 8495645 19475687 31354281 21939370 -1203886
12870 -1203886 -15763321 -17600969 -18429604 -20279091 -14743889 -4742804 -5432377 -19951842
12862 -19951842 -31575427 -26593464 -11900369 -2260525 -512497 402586 2509491 -160795
12854 -160795 -11369610 -26567939 -37416130 -38683666 -31028154 -20116953 -13054412 -13173280
12846 -13173280 -17592093 -20754015 -19991542 -16540576 -11993208 -6243077 354514 5227435
12838 5227435 6631497 7624939 13456952 23548930 29010379 21367846 2859609 -14780331
12830 -14780331 -21668712 -17769882 -10018681 -4230368 -739715 3443934 9375841 13995527
12822 13995527 14503997 13644553 16282159 20322061 17556018 6807085 -1132511 1976952
12814 1976952 9484987 11161552 10201687 16191842 25618381 25465585 15797951 11459659
12806 11459659 17721599 21409309 13303900 3142328 2532296 7778823 11094184 14320783
12798 14320783 17883715 10865905 -10213868 -25750618 -17688840 78872 390138 -14605592
12790 -14605592 -17393747 -593972 11594758 4097559 -5782791 223551 11387974 8810843
12782 8810843 -2537725 -5101828 -133226 -4689466 -22000398 -35003148 -29815667 -10981135
12774 -10981135 7562518 15520536 10371476 -1612914 -8473174 -4523216 2070266 394590
12766 394590 -7925108 -12302079 -8098435 651053 9416594 14920895 12957954 4383001
12758 4383001 -1239094 1093156 192270 -15904941 -37145897 -40996184 -24152638 -7155143
12750 -7155143 -4670894 -8484812 -5847688 1512786 5422200 4509237 -438501 -12396607
12742 -12396607 -28564197 -35269943 -24343808 -6530579 3171662 6380881 14706210 27696296
12734 27696296 31938787 21329693 5733860 -2452502 -1131222 4063459 7519895 6339513
12726 6339513 852527 -5118182 -7603302 -6685353 -5101263 -3929640 -2430700 -320549
12718 -320549 2493992 5884691 6946679 1896953 -6276932 -8080903 -763921 5001717
12710 5001717 -823449 -12529425 -16621276 -10109920 -579337 7642922 14704706 15172307
12702 15172307 2051602 -17230433 -23865410 -12563876 -544329 -3342560 -12444423
12695 -12444423 -7905330 13782868 35852682 41943205 30686915 11266430 -6063080
12688 -6063080 -13915532 -9981406 983772 10498424 13559732 11254554 7072925 3429280
12680 3429280 1372813 680350 -225525 -2550241 -5325973 -6678630 -6043273 -3628583 566957
12671 566957 4553746 3148585 -6253615 -16910841 -17892505 -9141637 -5682155 -19651467
12663 -19651467 -40673625 -44041457 -21245975 7157065 16506660 8072465 2522016 8092827
12655 8092827 11391843 1864697 -11249378 -14840549 -11050409 -8707466 -7082545 -2834323
12647 -2834323 -3904229 -18283515 -34099753 -31164836 -11942622 -416510 -6462595 -12193595
12639 -12193595 -2417632 11090372 10257202 164871 -775191 8919118 12911888 3989833
12631 3989833 -5572966 -3472244 5734491 8638780 184001 -12273269 -18618410 -16628262
12623 -16628262 -13630463 -17315779 -25046714 -26023467 -15623317 -2455861 2260260 -2591496
12615 -2591496 -10001465 -14651246 -16172129 -16806753 -19537603 -23986014 -22342848 -7534681
12607 -7534681 11512696 14439903 -3473544 -21064721 -19237910 -7345938 -6378260 -15799407
12599 -15799407 -16998706 -4736169 6552111 8265647 8481362 12359922 10918999 -1110393
12591 -1110393 -11144871 -4561218 14112922 26181993 20391487 3233188 -8562742
12584 -8562742 -2817831 16122865 29458541 24179305 9839153 5526609 11997159 11394337
12576 11394337 -3379701 -16200687 -12583326 -2066410 -3740919 -19553722 -34223785
12569 -34223785 -35504392 -24549366 -10804605 -4127646 -7420924 -12159669 -7547676 2914449
12561 2914449 4527527 -4569384 -6840164 7983554 24484341 23792447 11421895 5332589
12553 5332589 6111858 -16985 -13156028 -16618226 -3597051 11392283 12642870 844350
12545 844350 -14278324 -26879165 -34856274 -35998042 -30041988 -19483963 -6240797 7748678
12537 7748678 17418904 18698738 14911220 12481003 12001343 10356272 8335286 7517623
12529 7517623 3253124 -8884776 -22662048 -28352540 -27468561 -28077211 -28127847 -17713058
12521 -17713058 2751780 20933584 29460399 30545236 24299844 8474799 -9116640
12514 -9116640 -14915185 -9094866 -4157985 -2180028 6757166 19351363 15515193 -9658380
12506 -9658380 -31851094 -29754408 -13114965 -3191338 -2210841 144756 4655231 6304711
12498 6304711 8736288 16584084 23011592 21308521 17913789 17607094 10043618 -8541203
12490 -8541203 -15874977 6595859 36427284 35472571 6972145 -7890317 8046399 25341994
12482 25341994 16863816 -3921426 -10371469 -1729348 5194993 3700785 -2461996 -10941111
12474 -10941111 -16121856 -6758747 15917321 31466185 27196221 17713048 20862150 29111574
12466 29111574 25438550 14685493 14421848 22296350 18273886 -2319297 -21287059 -24723672
12458 -24723672 -17680891 -9373883 -2325665 633777 -3589292 -7046221 3528793 24546564
12450 24546564 35632247 28074672 16876992 16671441 21978859 21871752 18881059 19689237
12442 19689237 19656121 12282000 4840022 8155475 16923136 16861558 8399512 6630835 17170661
12433 17170661 27292533 24820317 13388782 3696491 -474488 -1656417 -1998872 -3315429
12425 -3315429 -7991365 -14073920 -13905458 -3170898 11657899 19539108 16426462 7210350
12417 7210350 -1461738 -6774318 -10006764 -14260767 -20561812 -24646021 -20668151 -10372988
12409 -10372988 -4380909 -9891478 -20254676 -22199507 -11558710 3670750 14378006
12402 14378006 18076051 16246961 11540013 9392301 15280665 26473380 31984979 25122616
12394 25122616 11757568 2058147 -1348006 -2066789 -1682167 364305 1945845 560681
12386 560681 -1880922 -3825292 -10660189 -26860261 -43085127 -43173975 -26037280 -8669270
12378 -8669270 -3172751 -3089024 746308 4214881 1668012 2086009 16337820 34450537
12370 34450537 34815101 15699896 -1018531 -1297112 3870110 589308 -5498123 -2355194
12362 -2355194 5543029 4615927 -4156335 -6876153 -731560 1046078 -7689041 -13152008
12354 -13152008 -1430110 18806507 25599448 12267825 -4819895 -8998667 -4636102
12347 -4636102 -8516439 -23639129 -31675189 -16269228 12599474 27114094 13852078
12340 13852078 -12480689 -30393809 -35408916 -34301352 -26262462 -5654768 19706912
12333 19706912 30480728 20301399 4847029 23209 2708744 1240508 -5830313 -12606400
12325 -12606400 -19157953 -28474832 -34295848 -25696492 -3986372 15663274 20466754 9854178
12317 9854178 -9484703 -28492359 -36840750 -30911704 -21473883 -21599997 -26191397 -17996653
12309 -17996653 3160646 14919920 4535701 -11351849 -13285417 -9418004 -19278758
12302 -19278758 -38286740 -42998670 -27999152 -12737997 -9329567 -7142471 3133585
12295 3133585 11397854 6088031 -6624047 -14846476 -18413658 -20968038 -17501768 -4996578
12287 -4996578 5606050 4758994 2203600 11257784 23402547 20199072 6105175 5045518
12279 5045518 22720488 36488260 29935191 15366691 10108465 9773829 1421983 -11079823
12271 -11079823 -13634241 -5510886 1388047 2342344 2684588 3338764 -513540 -5938951
12263 -5938951 -2809724 8301154 12180411 -115225 -16430228 -18368993 -5070617 6733915
12255 6733915 4316099 -7204891 -14016403 -11181294 -6659801 -8807094 -14697919 -14584341
12247 -14584341 -5766433 4009840 8026900 8946841 11649808 13428256 8182640 -2379483
12239 -2379483 -8919579 -5775396 3166266 10165505 11183483 7833968 5133361 6944760
12231 6944760 11531256 13730907 13581747 18047753 29585196 38321643 33181397 17214599
12223 17214599 3470699 -1709765 -2211809 -1356991 1482691 3912127 1691988 -1706459
12215 -1706459 1652566 8579077 4644582 -14838312 -34576498 -36875628 -20462158 3876120
12207 3876120 25506852 34172487 20437550 -11099426 -37548157 -40842005 -29687577
12200 -29687577 -25044059 -29458462 -27585851 -14669835 -5037396 -8269042 -14439120 -11705608
12192 -11705608 -4655329 -3897749 -7786367 -7696587 -5367609 -10968586 -24899012 -33885372
12184 -33885372 -28527402 -16375871 -12790512 -23205334 -38078353 -42839276 -30861149
12177 -30861149 -9507186 4859477 1546834 -11678056 -14184627 3980845 26872942
12170 26872942 28638499 4812384 -21519998 -28426349 -19875078 -13191902 -11252808 -2825075
12162 -2825075 12896489 21487106 17595004 15619472 25077138 31111293 16482527 -7804339
12154 -7804339 -14787430 -701769 9446317 -1914878 -22364371 -30638895 -24495405 -16320194
12146 -16320194 -11974651 -6772923 2572233 12533380 18051652 17299951 12535591 8950834
12138 8950834 9626554 10767066 7500926 4225951 9346778 17675348 11264640 -14901857
12130 -14901857 -40442682 -43863631 -29269047 -15974436 -10301685 -3830743 5389906 7797770
12122 7797770 -853802 -12161357 -16949641 -13344081 -2458326 12419058 22102639 19391729
12114 19391729 11373879 11056680 16679303 14980203 6477468 8104888 24133217 34602485
12106 34602485 25136703 10553697 12126387 25472222 30433943 22617861 14042784 8804015
12098 8804015 327996 -8864585 -6547948 6917500 14564841 6746555 -6394510 -11884030
12090 -11884030 -8990821 -1710525 9259364 19458032 18940875 6828826 -3378093 -1757430
12082 -1757430 4824716 5434173 256792 -5402386 -10735170 -13373410 -6428905 6210526
12074 6210526 5057017 -18156071 -40948866 -37710043 -17139672 -7764732 -12316552 -6315566
12066 -6315566 15935860 25999036 5408976 -21485142 -20133197 6278510 24923705
12059 24923705 19700663 6586663 5240387 15036485 22408717 18478757 5437710 -6336597
12051 -6336597 -6140145 5681649 15452607 11856141 823526 -3386675 1815326 6867914
12043 6867914 7059916 7605903 11305162 12992493 8767434 753043 -9260831 -20509020
12035 -20509020 -25694573 -15302312 5462758 16324623 6804263 -8704593 -10778743
12028 -10778743 -1681309 16057 -12895690 -26722506 -25309121 -8118313 12511847
12021 12511847 25125130 26878790 21840428 15303963 9632113 4933921 2168796 2135627
12013 2135627 1469282 -4636859 -13290836 -13744708 -1217414 14443371 19911790 13817078
12005 13817078 4804474 -1165496 -3813743 -2812375 1647142 4768282 3023904 2493804
11997 2493804 10984414 22439563 21156782 3740124 -14751308 -20598142 -16185841 -9742140
11989 -9742140 -2451134 5270664 5568811 -5901501 -17664615 -14948368 -1085378 7396945
11981 7396945 5750740 6027766 14485960 19241107 9102599 -6614834 -9528785 1870929
11973 1870929 10333865 3869453 -9115109 -12849075 -4977453 2587296 849155 -5630512
11965 -5630512 -7520441 -5065665 -7808575 -20453129 -34979363 -40184427 -35144687 -28217601
11957 -28217601 -24730706 -21456065 -13110514 1343153 19690799 37821767 48152805
11950 48152805 43293824 25996509 10699596 9499186 19381897 28248849 30414179 30000686
11942 30000686 31176558 32237600 29480973 21057296 6870509 -9681859 -20377087 -19826048
11934 -19826048 -14981464 -18386791 -29491689 -32441285 -18217915 444225 5762875 -578566
11926 -578566 -1957768 7889167 18511898 22515288 26500695 35405011 38781844 25200685
11918 25200685 3546436 -4290815 8248068 23353971 21543477 4082351 -12541212
11911 -12541212 -17050332 -10875776 -374405 8753642 10150406 -232782 -15965466 -21784795
11903 -21784795 -9423804 11516825 23749854 20929231 10833389 2531704 -1746404
11896 -1746404 -1601914 5626372 18733563 28256450 25146687 11863857 -355590 -3942371
11888 -3942371 -413333 4710911 7154190 5181418 1224076 1706028 9290900 15507437
11880 15507437 8759721 -8219335 -17269800 -6816360 11660983 17470987 7213338
11873 7213338 -2649788 90430 7135251 3052775 -12200076 -22982809 -18572351 -5694634
11865 -5694634 1994940 561519 -3390090 -5017761 -7322617 -14355399 -24083184 -30854992
11857 -30854992 -31487705 -26320706 -17346601 -8118669 -2466579 22380 4254311 11561061
11849 11561061 14928295 8071300 -3189117 -6007934 2957716 12898286 12225692 952594
11841 952594 -11997971 -18653227 -17109055 -11264868 -7362057 -7302458 -5303551 4073935
11833 4073935 15356282 16836801 6479196 -5008394 -8842138 -7051663 -3825966 1824875
11825 1824875 9185050 11324836 5224740 -1543346 -2138471 -768662 -3290033 -5462420
11817 -5462420 -577350 8299188 14320649 18217516 22446826 21607496 12134183 4188962
11809 4188962 7780622 13247542 4593039 -11610198 -12462742 5675984 20045014 14332667
11801 14332667 -2206748 -14898183 -22312515 -25839271 -20492223 -8053695 -2166300 -8119397
11793 -8119397 -13642227 -11123843 -10689498 -17762863 -18148948 -3847103 6381366 -4210355
11785 -4210355 -18638443 -11183111 9840586 15781594 4570615 -503666 5322806 2409242
11777 2409242 -12620805 -17148343 -3338945 5573582 -4844886 -14936659 -5508359 9046371
11769 9046371 5847679 -9970299 -19525974 -23657071 -34473401 -45377022 -38308803 -16273203
11761 -16273203 -2808418 -8675153 -19961117 -21030054 -11786093 90534 9185939 12070983
11753 12070983 8702905 5366792 7003280 8549072 3591348 -2521292 29440 9333315
11745 9333315 15680754 17376840 18528050 15458705 1867354 -14860486 -19739288 -12009026
11737 -12009026 -4222273 -335285 7033115 17171955 19337646 13399308 11943818 16342615
11729 16342615 11738163 -5532424 -16389767 -7622122 6116670 4309212 -9860279
11722 -9860279 -17924721 -12775436 -1403775 9685219 16764546 13985212 406323 -13374907
11714 -13374907 -17186674 -14161985 -12014663 -9561542 -2706907 4882502 8896043 13323798
11706 13323798 20038399 19444482 5725916 -9016137 -12580426 -14138395 -27344817 -40631333
11698 -40631333 -29423969 4886648 33734991 40964646 39079516 40554936 37190118 19648049
11690 19648049 -1634446 -9681940 -3219098 5914315 8553342 2949944 -7480555 -14088970
11682 -14088970 -8929411 4023207 12181886 11870686 11584199 15361359 17134128 15775391
11674 15775391 19229150 26632135 24086292 8756203 -709239 7877767 18677284 12167436
11666 12167436 -3678934 -8226601 -2919443 -6291515 -20089380 -26354270 -18447551 -10345892
11658 -10345892 -9954220 -5328288 13132200 34688657 43879138 40603011 33600974 25572799
11650 25572799 16719024 13339847 19014881 23138889 12608581 -6844086 -14510047 -1867202
11642 -1867202 16068019 22145003 19933513 25116221 39285831 45679997 33278303 13088943
11634 13088943 2657522 3643745 6286169 8964473 16720424 22553387 10608052 -16386506
11626 -16386506 -32437479 -22684235 -5600821 -5405049 -17413578 -21024028 -15132082 -15303249
11618 -15303249 -21692550 -17999294 -4031435 -1640722 -19459823 -35922240 -30946485 -14764811
11610 -14764811 -8944683 -14238561 -15322245 -6704488 3881382 10927238 13921289 10058117
11602 10058117 -581326 -6785723 1607315 15762591 16952370 2778880 -10023919
11595 -10023919 -9557160 -1576534 3782657 4619737 2539129 -2385279 -6162945 -903926
11587 -903926 13149790 24390829 25149720 22049883 24065798 28217809 25876599 16771683
11579 16771683 6757945 -3490558 -16325331 -26317599 -24095290 -12192646 -5527837
11572 -5527837 -11779811 -20873935 -20100993 -11630470 -6872223 -9316168 -12741956 -13467690
11564 -13467690 -13863547 -13667124 -8373577 254886 1227300 -11663896 -28899164 -35655476
11556 -35655476 -29908179 -22980677 -23061526 -24647685 -16080457 5577140 28656413 36002039
11548 36002039 22121894 1578541 -4358617 8328228 21342999 16815314 -1276591
11541 -1276591 -14457468 -12044517 2209942 19526658 30980272 27619269 9413366
11534 9413366 -7475223 -6508921 5744179 6485704 -11330495 -30100764 -34938150 -32307041
11526 -32307041 -32814840 -32842306 -26774730 -22796411 -29309790 -35897250 -26126866 -3092958
11518 -3092958 15237316 21623139 22771987 19779097 4666633 -21374093 -42922125 -47968077
11510 -47968077 -37995276 -18671414 4874485 20453840 13450193 -12137850 -30282228
11503 -30282228 -21261813 4877963 21868522 17022126 -381488 -13733557 -13464555 -998452
11495 -998452 14118057 22415483 22795678 19869489 13877543 1623005 -11581912 -12721033
11487 -12721033 756100 14573270 16961705 14085216 17021855 23313816 23470117 18383474
11479 18383474 17048389 21478026 26468312 31141694 38193246 43479757 38974368 26447472
11471 26447472 16999124 15561328 15530304 10258445 1002682 -8091546 -14754370 -17036468
11463 -17036468 -14763460 -13452430 -18786175 -26233485 -24646995 -12000868 631919 3298768
11455 3298768 -1884841 -6359662 -5163655 438590 4415666 -161838 -11950106 -17421723
11447 -17421723 -5766756 13024626 17279271 2548087 -11984282 -10096499 2424477
11440 2424477 12009253 16137589 17337464 11343602 -3985896 -16366992 -11561225 5527930
11432 5527930 15957371 11049089 -492931 -8153969 -9934315 -6978542 43556 6444057
11424 6444057 5210903 -2826552 -7405212 -723841 13988268 27623756 34459907 35052066
11416 35052066 33599414 33177290 31796166 25438372 17005216 16326827 25723172 32278073
11408 32278073 23802677 7279094 -227258 4258227 7902111 3762169 -204238 3417194
11400 3417194 10452708 14782859 17404117 19295721 15489621 4419066 -4666960 -2357449
11392 -2357449 7861262 14711698 13624115 9325637 6069607 1359502 -9718447 -25982617
11384 -25982617 -37209585 -32663110 -15061329 -1311111 -3189124 -12302547 -13546823 -8219578
11376 -8219578 -9640359 -18335327 -19391537 -7298137 4129877 3193105 -3809464 -5746113
11368 -5746113 -1184531 8021765 22554791 36247421 36809095 26197238 23525660 35927464
11360 35927464 45103646 37391680 26146581 24117953 15688803 -14759168 -45082286 -41842347
11352 -41842347 -14106226 -2119716 -15561108 -23435321 -9777869 1593329 -8154725
11345 -8154725 -20245892 -11979594 6136355 11334541 4514268 1020297 2636939 1619391
11337 1619391 -1099415 -2539387 -9893393 -26506701 -38311226 -34280668 -27824948 -36176589
11329 -36176589 -50206032 -48689548 -33207290 -23218038 -22785457 -18793747 -9368373 -7389724
11321 -7389724 -14792528 -18368988 -14338903 -13703617 -18757990 -17150143 -5565573 2654330
11313 2654330 1368995 2010802 10856583 16539588 11650300 7378647 13329825 20675187
11305 20675187 19921946 18134761 21874087 19749751 2204303 -15439362 -13037501 1260686
11297 1260686 2930959 -9547167 -13281637 1282342 16191187 14305474 76474 -14835474
11289 -14835474 -26906324 -32964802 -25734924 -8914412 -626628 -8264339 -13897604 -175560
11281 -175560 21539619 27460662 17024621 11144634 18339314 24453064 18458933 8073198
11273 8073198 2308953 -3891738 -16056067 -24602506 -17138840 1162095 12631954 8748440
11265 8748440 -3603710 -13623674 -14327500 -2900756 15086047 24292413 14849549 -1616904
11257 -1616904 -3915366 10023120 20369783 14647158 4541403 5405710 12816850 12357954
11249 12357954 3034750 -4186171 -5976663 -8995923 -13404345 -9272416 6269568 20048673
11241 20048673 18115496 3122186 -9988358 -11651880 -5779004 -2285918 -5665507 -11328102
11233 -11328102 -12619376 -11050305 -15919079 -29986324 -39833146 -29348924 -2444180 17917000
11225 17917000 16962069 5012270 745166 6046034 7947332 952658 -5349868 -2354922
11217 -2354922 4571307 4505315 -4277776 -13906661 -17333929 -13716803 -6219698 -76814
11209 -76814 -1076830 -9895849 -18281777 -16948665 -7971237 -3128772 -8366043 -16791529
11201 -16791529 -20037789 -18655451 -15845653 -9458331 589166 4539663 -4273720 -13401646
11193 -13401646 -4799989 15775413 21399439 1441659 -21871952 -25268895 -16323282 -17172852
11185 -17172852 -28758464 -32114579 -19833051 -5182046 378799 -94476 -1916221 -6674930
11177 -6674930 -11116954 -4405329 13929528 26599150 20804456 7767178 7089657 18589863
11169 18589863 23820221 12935098 -3533076 -11271761 -9409790 -6448946 -6632404 -7149172
11161 -7149172 -6091388 -6664726 -11381949 -15438005 -10915853 1030926 7268964 -2200671
11153 -2200671 -18665761 -22605551 -8425997 7368866 7378263 -4774569 -10998619 -1955219
11145 -1955219 15394592 31242169 43763264 53927938 57281719 47269924 25106017
11138 25106017 2059757 -9589533 -7626597 -1489962 -1868565 -8763966 -12186518 -5662370
11130 -5662370 4613066 7689960 2019969 -4166784 -5957895 -7955928 -14370319 -19348978
11122 -19348978 -13915063 284637 11758580 13929256 11822833 11683216 11509208 7706391
11114 7706391 4976192 10531035 20984352 24564500 16723040 4989758 -2628714 -5108588
11106 -5108588 -2940589 3828416 8456528 930186 -14138375 -15749296 5662062 29667170
11098 29667170 30526993 12238888 651875 5598594 12329711 11004558 11498726 20742280
11090 20742280 25565032 12276545 -10410327 -23138302 -21456076 -15160465 -8915188 803946
11082 803946 11715150 13652054 3435481 -8465359 -10450440 -2765856 5415091 7497864
11074 7497864 4669562 1768521 1123408 1474330 2105661 5111134 11001622 14617585 10446007
11065 10446007 925272 -6306101 -8662967 -9127346 -7192053 1009241 11592683 12673872
11057 12673872 451715 -13806338 -19307877 -19484261 -22364954 -25504383 -20775699 -8631559
11049 -8631559 2971836 10482923 15631553 16675273 8988352 -5206055 -15938443 -16040697
11041 -16040697 -7445509 2908742 8219815 3580518 -10757086 -25984122 -29644320 -17887967
11033 -17887967 -1580056 3312304 -6487247 -15614029 -7762325 10169404 12029545 -12261834
11025 -12261834 -37132507 -32932319 -8571166 461721 -15244057 -26107492 -10533665
11018 -10533665 13103803 17523885 5865629 -1328344 412979 2894333 7169430 16381327
11010 16381327 17999952 -30981 -23201087 -27167918 -14764269 -8944453 -13138631 -8749918
11002 -8749918 7688697 15882927 6097937 -6110751 -8059563 -7167031 -10164465 -9420882
10994 -9420882 -1820394 885745 -6702498 -12126239 -6999158 -820017 -594469 3103533
10986 3103533 15661517 23760783 17148345 7102426 6700164 9694215 5991418 1501844
10978 1501844 4490702 7845636 3493193 -688936 2947153 4710896 -3213129 -7339597
10970 -7339597 3985555 14313466 2837531 -19612320 -27499340 -21289360 -19238425 -18645558
10962 -18645558 -1908245 23043906 26966545 6719879 -8129995 -2894335 3510500
10955 3510500 -2106416 -4336523 7858823 16917572 6496281 -10381931 -14773938 -10972128
10947 -10972128 -10312924 -6980354 5645479 12766445 -747005 -20529961 -21202380 -5231465
10939 -5231465 3368968 -2218591 -6051199 -193493 5111987 4118747 4793396 10002366
10931 10002366 10040675 1650467 -2923093 4429571 12606181 6723194 -10310225 -21805173
10923 -21805173 -18288669 -6785121 -602870 -4155149 -8460198 -2176559 12677954 20656810
10915 20656810 12084846 -3680019 -10786831 -6633699 -72607 4171768 7225498 6459142
10907 6459142 -1303828 -8145699 -1940283 13377300 19604731 10534590 1401363 4811123
10899 4811123 11258076 4838779 -11939417 -22293156 -18802752 -10772257 -9548745 -16070135
10891 -16070135 -23315932 -24110792 -15452777 35062 15371079 23978928 23963527 18435378
10883 18435378 13843097 16735752 27010252 34291422 27779071 11310316 762054 3020633
10875 3020633 6485421 -696508 -11155468 -7840731 10772961 26351235 22407699 2116291
10867 2116291 -17490405 -23100086 -14935361 -3612761 725266 -1383826 616899 13722494
10859 13722494 30182029 35194817 25573342 14388250 14619289 23528243 27601060 19702521
10851 19702521 6140805 -2329443 -1479755 5341514 12263098 13527871 4743576 -12235236
10843 -12235236 -26121788 -25034877 -11320876 -935951 -3058187 -7060525 1631448 17896239
10835 17896239 21627309 5694446 -13701139 -18406946 -8875140 2459000 8264421 8741534
10827 8741534 4961016 -786761 -2846075 1507227 7534594 11208895 16388838 26410467
10819 26410467 34817418 34065223 27979432 24341495 19616867 4593067 -16515055 -27136132
10811 -27136132 -20485621 -7659447 -63029 3779003 8179761 8918562 1343191 -8003177
10803 -8003177 -8433704 -549061 4292788 -587882 -9297402 -12533632 -9878077 -9000719
10795 -9000719 -13160234 -13915062 -1316432 19466318 29754508 19945179 2983998 -2497455
10787 -2497455 4015976 8782033 6420744 4368893 5844713 3931394 -4043308 -10427010
10779 -10427010 -11198280 -13084665 -19426331 -20993934 -10455782 4009018 10272242 9528374
10771 9528374 10906466 15125239 15436601 11220555 9172942 11936782 14935978 14601427
10763 14601427 12446806 10863808 10453574 10913726 9998751 3225750 -10865666 -26762222
10755 -26762222 -36653231 -36604300 -26273073 -8300038 8387069 12133338 2120495 -7605106
10747 -7605106 -4468520 8325877 20508881 29499088 36563578 36393747 24248426 8553567
10739 8553567 1644895 549356 -7728391 -22661400 -28937772 -21681468 -15831810 -22456257
10731 -22456257 -30221643 -22508078 -3384666 7507106 2777076 -2544212 8815533 33647991
10723 33647991 50730860 44179002 20559750 978383 -2008077 4650887 7004231 1365476
10715 1365476 -5128824 -5985388 -1059690 5873509 9325392 5217390 -2621514 -4071755
10707 -4071755 2325571 3078080 -10913289 -25654356 -20224843 1801692 15363678 9373370
10699 9373370 -117293 1860539 6854868 1050855 -9300339 -7280743 7233646 15729045
10691 15729045 6132204 -11667226 -17976462 -5790547 10515571 8921612 -15129845
10684 -15129845 -39128194 -36947564 -11981889 4735804 -6597107 -30500364 -39282399
10677 -39282399 -28023273 -13844809 -8798116 -8666546 -6016885 -1124750 1380951 -1300026
10669 -1300026 -7527601 -10152187 -1736326 13977568 22157293 15594559 5448568 3570269
10661 3570269 3254867 -8078665 -24680540 -29301225 -20113768 -10518980 -3476724 10595863
10653 10595863 27132577 25035600 2292077 -11200059 4661908 27010929 23735292
10646 23735292 3772823 1543615 19220817 21785844 -5667715 -31864061 -27189386
10639 -27189386 -7555600 -5118860 -17059530 -15210655 4589883 16521936 7530997
10632 7530997 -4939550 -4771741 371434 36582 501900 7310235 8781312 -3011137
10624 -3011137 -11371999 1124332 19535685 14385319 -12305396 -26776728 -11589529
10617 -11589529 12279632 19525980 13369815 10872068 13997442 12710895 5316687 -1414285
10609 -1414285 -6046870 -11661922 -15201663 -10911666 -2489606 93926 -4247317 -6005236
10601 -6005236 296749 8417150 9927170 5249972 1992306 5277235 11811098 13296071
10593 13296071 6551931 -503054 2584468 13696794 18993318 12653813 7125195 15317108
10585 15317108 29441700 29539036 10435333 -12245986 -23618850 -24847434 -23122155 -17948358
10577 -17948358 -5814947 8815762 16906177 16097056 10364500 706079 -14622277 -30408046
10569 -30408046 -34951741 -24425097 -9014180 962590 8083001 19103268 29562442
10562 29562442 29117913 20143984 17466902 26776676 35289539 29246376 10580282 -9703288
10554 -9703288 -24712099 -31330531 -27168572 -16893538 -12196949 -15978256 -16571281 -8048984
10546 -8048984 -3658816 -14077860 -25016981 -17356072 -307510 627177 -15166110 -21233158
10538 -21233158 -4945701 15442514 20970040 15211766 8164318 -733473 -11100142 -12436333
10530 -12436333 -734232 10885309 11399101 8628492 14561040 25911912 31005143 25971878
10522 25971878 14774102 2986103 -1664486 6022091 18099931 20388966 13391776 10287005
10514 10287005 11781599 4024877 -14076046 -25910233 -26276111 -28496202 -33859031 -24727625
10506 -24727625 -652499 11844193 1824016 -8784380 -8820843 -18396794 -41720230 -45385846
10498 -45385846 -17468148 249155 -17553941 -29215951 -1996265 16841751 -18854508
10491 -18854508 -56211107 -32091013 -20547004 -151791965 -379238627 -477066541 -327457389
10484 -327457389 -84547909 32191599 3883429 -33309527 -15603249 539726 -18850966
10477 -18850966 -29282667 -4630690 15520295 3225957 -12121588 -4638472 6213313
10470 6213313 3903894 8690632 31823677 44433309 25929520 3134084 6666657 22011367
10462 22011367 19495219 5713412 7874403 25245610 31935241 18547424 776971
10455 776971 -8714648 -11777610 -10619134 -3892878 3072146 1948821 -3543680 -987760
10447 -987760 10671704 17396080 9826419 -3734102 -9524435 -6413202 -4729993 -9488697
10439 -9488697 -12535090 -5475470 4403589 723849 -17754637 -30247216 -19435742 4409335
10431 4409335 16660054 10613648 2410518 4806435 10918891 8223591 -2943141 -11701727
10423 -11701727 -10980584 -4297116 -1369000 -8888070 -23219534 -33094721 -32104643 -25049806
10415 -25049806 -18656284 -12775960 -6861328 -6259023 -11713131 -11239801 3411082 19057208
10407 19057208 16782491 1116212 -5187246 5494916 16709677 14404706 3814839
10400 3814839 -4826723 -10589805 -15366482 -17245789 -16543314 -16513590 -14504063 -5358001 4365437
10391 4365437 1457109 -11446428 -15959351 -5360558 6699450 11056306 15868130 25144441
10383 25144441 26218140 12837425 677259 2527869 6405119 -1507508 -9132242 1727536
10375 1727536 20680458 21582254 3782006 -7058912 1254018 12567824 11333566 3782580
10367 3782580 2197779 5888311 7456801 5394960 1988636 -2371376 -7054864 -10819370
10359 -10819370 -16142075 -25290179 -31004382 -22544560 -3940151 6276793 -460696 -9681296
10351 -9681296 -3451488 15616932 29283381 27059065 15495295 6697757 5634767 9184532
10343 9184532 12237629 12324302 9472985 3141179 -8207349 -22396554 -31181997 -27890405
10335 -27890405 -17055363 -10712325 -13426234 -15839113 -6362498 13173540 26820277 20268771
10327 20268771 -2729729 -21046347 -16563654 5696009 22316305 17606075 -1242038
10320 -1242038 -17533968 -24678131 -26108949 -24865440 -23588844 -27726256 -36545020 -36845863
10312 -36845863 -19623531 1772565 6393202 -4377847 -10171389 -4129190 -465044 -5949666
10304 -5949666 -7522271 1445203 5130230 -7957557 -20733769 -10806637 15176476 32355791
10296 32355791 33425510 30520502 27470604 15748045 -1390600 -5323528 10400036 28518152
10288 28518152 32962844 29151384 29481552 32525852 28770394 17617288 7327816 3900387
10280 3900387 8055221 17076565 22863361 15730661 -1926714 -13202020 -6845706 7092594
10272 7092594 11885443 7880701 9056876 19557829 27536861 23134938 10848297 1124716
10264 1124716 -1115565 3438736 11452044 16013023 9999667 -4464847 -14918119 -11867192
10256 -11867192 118682 8743332 8669307 5480582 6090306 9397194 8308927 2073
10248 2073 -8254628 -6194321 6604246 18929725 20941991 14512970 7240481 1967140
10240 1967140 -1143884 2230737 14582638 26253165 23714069 9158429 -802449 1037902
10232 1037902 3729785 -857018 -3534074 4108192 10588549 725874 -17604442 -22923259
10224 -22923259 -13059635 -7333101 -13800473 -15954211 -677835 19377489 24699143 15710899
10216 15710899 5520129 -2066303 -9386729 -8988562 7588089 28574240 31904276 18014088
10208 18014088 10639698 19091272 22554527 4425194 -18590897 -20965020 -6372825 2354915
10200 2354915 1783750 9593062 29491957 41573321 34328900 22873703 23326321 28113856
10192 28113856 22255327 9491038 3883697 4815872 -123999 -10966905 -12709219 1277525
10184 1277525 18127236 22480966 13608084 513926 -10581757 -16766681 -13041300 3863877
10176 3863877 26067578 36254192 24450639 1839581 -8556886 1849480 16555590
10169 16555590 16642455 7468092 9150554 23529220 29869837 17686709 3160418 1707194
10161 1707194 3903184 -4058291 -13386946 -9136289 -385495 -6650085 -21762580 -21146275
10153 -21146275 -3474412 5690770 -3778967 -10874680 -622443 10629759 3122136 -15504616
10145 -15504616 -25794419 -25851594 -26782134 -31669896 -35949091 -38746700 -39774964 -34320893
10137 -34320893 -22814526 -14527922 -11670816 -3825113 10514273 14125780 -1456486 -15733696
10129 -15733696 -6483929 17090227 29716010 25509085 15423244 2181184 -15687101
10122 -15687101 -24747924 -11165082 10687635 13167892 -3448437 -13538630 -8662420
10115 -8662420 -6335560 -13724789 -15368335 -5589940 -1672651 -11090793 -14150063 3091655
10107 3091655 23129237 24198734 12793913 7974115 9928136 6292449 -2230801 -3862893
10099 -3862893 3992070 13587641 19421807 18374329 5976077 -13765390 -24412954 -17381881
10091 -17381881 -6398484 -6991481 -12959350 -11026543 -7479968 -17404022 -34391470 -35966688
10083 -35966688 -18144974 -1577975 -1302473 -11415720 -22949947 -35437119 -44031290
10076 -44031290 -35851668 -10788778 9880942 8502695 -6655203 -15240593 -10613265 -473683
10068 -473683 8663612 14311544 12018744 565695 -9958134 -8138858 1700009 4342958
10060 4342958 -3942510 -9904202 -3374003 8574320 14173535 14311314 17333874 22069731
10052 22069731 18328755 4403513 -7252779 -6243233 2546196 8356461 9943212 12232494
10044 12232494 12285737 1116578 -19492083 -33832682 -31745195 -22839180 -23525381 -35033758
10036 -35033758 -42711914 -35288087 -17602820 -3900155 -3277302 -11976246 -16837639 -7523457
10028 -7523457 11319122 22260676 14058058 -3930384 -12533856 -6081176 3688477 7195862
10020 7195862 9265463 16287084 21578504 14919362 1360706 -3032975 5579840 12629590
10012 12629590 6209814 -7061401 -14065493 -12850810 -8759768 -1948315 8278182 13214442
10004 13214442 4873380 -6373238 -2077734 14887948 19741718 523692 -24406660
9997 -24406660 -33262436 -28479527 -24225744 -21441454 -12752577 -1153411 5147411 8982121
9989 8982121 16916235 22523655 16909449 10125829 18818539 34781489 31766238 7006024
9981 7006024 -10457975 -2620324 10545482 2443660 -21434786 -35515689 -31246802 -21231746
9973 -21231746 -13636625 -3331861 11756722 22705855 22732750 17091761 14156577 13571357
9965 13571357 9340952 1237198 -3731089 -2400267 -1684558 -7451962 -11308998 -68189
9957 -68189 20903602 28828260 14942179 -1030658 -342959 6727891 1083158 -11079616
9949 -11079616 -9746388 2337402 3747752 -8074996 -13469126 -6170611 -2060341 -7167480
9941 -7167480 -7095737 2875938 6558046 -2584324 -7740011 818909 8913878 7072756 8792402
9932 8792402 23210051 36020600 35880843 33498003 35741444 29393277 12277306 9644012
9924 9644012 32266978 48678254 32246944 8063028 14747231 43007758 53792274
9917 53792274 39466587 24207778 17070947 7507075 -1545459 2916494 13993836 15668803
9909 15668803 15203495 28025167 41848360 36075332 24276908 32545204 47896275 38367486
9901 38367486 13906726 11509693 27342622 25140308 8207159 14508497 38318455 33420400
9893 33420400 5230550 14909254 67074219 84653407 39425753 14475348 67585918
9886 67585918 116989948 58321574 -66011469 -123645258 -83862781 -39748971 -49156364
9879 -49156364 -66013282 -47440956 -27461593 -42251398 -61224639 -44997358 -15280929
9872 -15280929 -14365278 -35229659 -41576485 -29162113 -21262080 -21633499 -13890343 1754166
9864 1754166 6931899 -2268399 -9138921 -3826208 3896609 2010911 -7860143 -14665481
9856 -14665481 -9999603 4402057 17217050 18026290 8910769 747558 -1538725 -1708428
9848 -1708428 -1239373 2373345 5539244 567981 -9153782 -9810011 2538422 15733545
9840 15733545 20331806 20158106 17760148 5046030 -20653209 -43674494 -46401006 -31474571
9832 -31474571 -16839504 -13658958 -18031315 -20672133 -16942141 -8894213 -2069431 417714
9824 417714 763494 689418 -3972379 -15685582 -25688158 -23389191 -14044055 -13697953 -25115152
9815 -25115152 -32644981 -24711190 -7990850 5523387 11874103 9322750 -6386667 -30765826
9807 -30765826 -45892455 -38680819 -16902296 2044237 11415263 15437970 16101707 10019448
9799 10019448 -3979572 -21043297 -32745121 -31210885 -15873861 1965028 8608851
9792 8608851 4500660 2544654 7135366 6731839 -6082724 -19381349 -18068385 -6700050
9784 -6700050 -2900688 -11899225 -20058463 -14152379 1874418 11794929 4421018 -15159213
9776 -15159213 -30208245 -28856278 -15666605 -4256015 -737380 -600739 133698 359029
9768 359029 764788 4446981 8387202 5224727 -3607664 -8408601 -8288415 -13412930 -24026333
9759 -24026333 -23462679 -3600076 17121293 16736824 407544 -9012433 -4073109 1637614
9751 1637614 -1792591 -7737339 -7000223 -1111518 2477420 -242546 -8021166 -15793100
9743 -15793100 -17261641 -10992841 -2799046 1984734 4574448 6192524 2402919 -7547725
9735 -7547725 -12719215 -3633259 11343523 15905992 9235396 5569041 11231124 16652844
9727 16652844 13281174 4932657 -1579845 -5259255 -5879721 -1130544 6004545 7161839
9719 7161839 1651091 9326 7852302 15128824 9759626 -4802039 -14123029 -10261050
9711 -10261050 2411420 14412677 17585586 9201965 -2967384 -4233050 10010204 24713831
9703 24713831 22030357 4784106 -7896473 -7045136 -2719098 -4115567 -5481151 -248784
9695 -248784 3210033 -6134640 -20798199 -21904558 -6485786 7657349 7444458 450710
9687 450710 -1272310 306879 -1822575 -3012806 5183504 15757026 11840482 -7885089
9679 -7885089 -24708298 -25071535 -16950613 -14170925 -16075564 -13458777 -6923067 -5972917
9671 -5972917 -11250616 -10009228 5976153 25562264 29189228 13118019 -5211395 -9645264
9663 -9645264 -6239466 -12384461 -28231376 -33521107 -17320453 4008497 9483983 1183518
9655 1183518 -6423219 -13477821 -28873809 -43305980 -35241319 -7101817 10408111 137329
9647 137329 -17714189 -17221139 -2335050 6533190 5287608 4506137 5201997 -2077100 -17113009
9638 -17113009 -26652006 -21479107 -5009108 13736477 25879784 24519924 10800791 -4162902
9630 -4162902 -10966795 -11473443 -10644755 -6632362 2455514 10298315 11228897 9759185 11035800
9621 11035800 10050964 1129834 -10683002 -18842118 -25857154 -32946921 -31565255 -19569563
9613 -19569563 -12021990 -18222039 -22618161 -10385434 2911950 -5136148 -23180976 -22567327
9605 -22567327 -7101832 -8744504 -33407543 -49508269 -38095984 -18110954 -9395753
9598 -9395753 -5054767 2330352 -650912 -20691621 -35845445 -26598998 -7835758 -4640366
9590 -4640366 -13794702 -14857291 -5413544 551447 -451149 -491812 213460 -5498948 -15050128
9581 -15050128 -18730291 -15243686 -10032353 -4078173 2018594 1286621 -7551267 -11027430
9573 -11027430 -466480 9576478 1249519 -17463204 -24189876 -14867843 -2950587 7142833
9565 7142833 20856790 31400810 23724765 2510232 -8902622 -2822054 2541073 -5497327
9557 -5497327 -14303338 -8732164 4584660 9442664 3484691 -3748808 -7093466 -8444133
9549 -8444133 -9109915 -8777680 -8514984 -8969170 -8755178 -7192193 -4105731 3357308 16236954
9540 16236954 25701298 19708045 853706 -12607328 -8979460 2220061 3997651 -7267018
9532 -7267018 -22245530 -34392998 -45951695 -58543354 -64856872 -54341436 -27260388
9525 -27260388 125007 9206361 -1288771 -14562364 -16852934 -12099067 -10829300 -13128556
9517 -13128556 -11968861 -6992081 -3515466 -1460145 3544818 10378672 14333334 16531860
9509 16531860 20742074 23114625 16764489 5236278 -527076 1616456 3129120 -1064386
9501 -1064386 -7558770 -13264596 -18213203 -20031861 -16541920 -12801305 -14417889 -16361679
9493 -16361679 -11537590 -7375069 -17272276 -36232948 -43343121 -31194093 -15320837 -9943960
9485 -9943960 -11186218 -10363596 -8053999 -7370877 -6486707 -4405970 -2518974 3064835 16882801
9476 16882801 29332461 23947114 4370782 -4827885 7652495 23087349 20099278 1533217
9468 1533217 -16979329 -28478170 -32343067 -26408701 -15064977 -11477671 -19028203 -23801820
9460 -23801820 -16613060 -6916238 -2965040 3558618 17776526 25422075 15997257 5043402
9452 5043402 10655921 22162403 16963901 -2630366 -15206510 -14829974 -13946638 -16817232
9444 -16817232 -15406556 -9616337 -8191570 -10261472 -7307373 -2116747 -4644906 -10743606
9436 -10743606 -7007203 4427263 8844918 5962420 9029502 15738225 7634826 -15077492
9428 -15077492 -25564485 -9298374 12674607 14631115 630900 -9146119 -10624811 -14582403
9420 -14582403 -22276984 -21608195 -6729792 11159928 15135657 248387 -20216982 -26538208
9412 -26538208 -13965670 612886 283092 -8627439 -7245135 5632491 11503693 1684425
9404 1684425 -9818394 -9603503 -4653263 -8960784 -22828886 -35677826 -40515688 -37289506
9396 -37289506 -29244846 -22126800 -19997831 -18153677 -8567820 5485693 11289545 5856176
9388 5856176 261717 579521 -1217637 -10444811 -17775644 -13646967 -3168899 3092940
9380 3092940 3699334 2860288 1407633 18598 3555599 13905449 24565600 28033555
9372 28033555 22598431 9677771 -6418486 -15055202 -8496666 3243425 1861641 -11890394
9364 -11890394 -18265479 -10812464 -7155755 -17848449 -26989693 -19240059 -5732344 -4027228
9356 -4027228 -9915305 -10473827 -9767608 -17630163 -24980697 -16314471 505028 2551737
9348 2551737 -13102585 -25935097 -22953884 -12257330 -5089697 -3337919 -6521428 -14614137
9340 -14614137 -22055605 -22548100 -19401172 -18673886 -15963017 -4866474 6318497 4163488
9332 4163488 -7102030 -11267441 -6209737 -4471234 -9229336 -10933403 -8550497 -12405910
9324 -12405910 -23060345 -28783151 -28170084 -33596235 -46242563 -49543472 -36031927 -20117144
9316 -20117144 -14103105 -11242036 -4306338 -1876684 -11533424 -22807854 -22243567 -12832546
9308 -12832546 -5038134 -848529 517855 -5626996 -17820949 -21620550 -10107473 774920
9300 774920 -5586550 -20013992 -22261716 -12932697 -9385571 -15427682 -17321818 -8757166
9292 -8757166 1173329 6711122 12749907 19242641 16136171 732551 -14823411 -21030496
9284 -21030496 -22834094 -25674413 -22501452 -6310702 13482798 20241151 11242780 -1653119
9276 -1653119 -9613884 -13679543 -14549199 -7772337 6357089 17484076 17322015 11605405
9268 11605405 11634245 16958305 16274858 6065134 -2028357 2646241 14795634 22233871
9260 22233871 23344547 24913018 26050174 17177696 -3177174 -22008186 -27584678 -23351184
9252 -23351184 -20033528 -20495336 -19958814 -17363488 -18042458 -24184397 -28026068 -18452003 5070561
9243 5070561 26985216 28266872 7043349 -17199696 -24368241 -14889282 -4290648 -1435154
9235 -1435154 -1685167 776087 4998565 7898352 6936562 -1416306 -15214772 -20829557
9227 -20829557 -7824119 10011982 6798405 -18048210 -34234485 -21060422 6109150
9220 6109150 22276571 25936904 27964946 25439567 10857750 -4044800 1497 19218987
9212 19218987 31977550 31656964 30240561 30185867 19052117 -3408629 -18180607 -16333450
9204 -16333450 -13166127 -20949435 -27631851 -18404963 -2227730 1701278 -6599870 -10449936
9196 -10449936 -3049605 5350992 5784564 2449122 3967424 11359514 17662249 16093554
9188 16093554 7865121 1846587 3536227 5909941 -1562707 -15670967 -22136538 -16982446
9180 -16982446 -11947413 -14227460 -15634286 -9712393 -4385411 -6312402 -7427005 -1267869
9172 -1267869 1691835 -7055018 -13015076 1004957 23067715 25883406 7146619 -10631390
9164 -10631390 -18525240 -29711231 -45788194 -45919414 -22286095 808551 1405710 -8036090
9156 -8036090 -3092012 15452456 28505423 29848895 28640545 29546349 30461704 33235313
9148 33235313 38174818 34586314 15324929 -5876185 -10995716 -4880877 -4247048 -5962559
9140 -5962559 7279412 31210925 38821308 20630621 29660 -1041175 11284818 21021085
9132 21021085 24836405 23444077 11840193 -5888429 -10929203 3351017 15637231 6564498
9124 6564498 -11441236 -15134083 -6556511 -3684153 -6521287 -441128 12474425 14046125
9116 14046125 1948055 -5431276 307767 6307176 3983840 3080095 11143940 19185668
9108 19185668 19046104 17740379 21884753 22434376 8982850 -11188994 -21605649 -17359549
9100 -17359549 -7332143 -1800517 -5589108 -16698582 -24839402 -18947610 -2811203 5300033
9092 5300033 -4303615 -19244422 -22833624 -15900484 -11026998 -13519413 -19351091 -25298617
9084 -25298617 -29611528 -27729097 -18373350 -9882488 -10470438 -16306582 -18942336 -19675946
9076 -19675946 -25406799 -34155842 -36777345 -31014538 -22384140 -12537820 1320570 15115456
9068 15115456 17725284 5435950 -11505472 -19655429 -14500399 -1710443 8404647 8864679
9060 8864679 3789893 5586253 18761564 31498391 31101343 21324319 13076558 4674738
9052 4674738 -12359893 -31432100 -34706750 -20907933 -9544436 -11056520 -11960814 -590073
9044 -590073 10077590 1667164 -19866825 -32257010 -28015018 -19714623 -17110421 -16254586
9036 -16254586 -12633171 -9695363 -9499414 -7004539 -141888 3697056 -1205133 -7638867
9028 -7638867 -3664219 10612165 21919185 20143977 10645951 7407476 15770433 25643292
9020 25643292 24056757 12599279 7044433 17152898 31880980 31139032 10515642 -13033619
9012 -13033619 -20989070 -11461227 5219973 21191436 34153956 40774676 36994084 25405893
9004 25405893 14349774 7242737 -484534 -10594368 -15560898 -9692436 -1571583 -5719507
8996 -5719507 -22323954 -34167517 -26473376 -3301291 19047002 29156050 26889700 18035150
8988 18035150 8825573 3436089 1466369 -1415830 -7049667 -11039384 -8993366 -3442070
8980 -3442070 807376 5512686 15522443 26649275 25824781 7700011 -14708977 -22009688
8972 -22009688 -9057369 11155545 23585992 26544756 29178226 36553821 41993626 36508549
8964 36508549 22889023 14438568 18042676 24361943 20202761 6640095 -3093571 -2720387
8956 -2720387 -507632 -4627307 -9629815 -5098421 7216957 14707768 12130915 8945235
8948 8945235 13882771 19432580 10601261 -12733049 -32136520 -32967100 -22291994 -16658875
8940 -16658875 -17464520 -10722185 8199390 23172822 18508581 1895827 -5787413 895903
8932 895903 6767716 115611 -10723785 -10848262 -208034 7086268 1732975 -9847749
8924 -9847749 -14402918 -7953730 -1084239 -7592145 -27400786 -43182234 -38061700 -15566620
8916 -15566620 3853552 6470472 -1823875 -8510740 -11431390 -15849806 -21262891 -21287480
8908 -21287480 -14559105 -6390032 436603 7907878 14667158 14620647 7432341 2780434
8900 2780434 8371142 18821535 22213951 14113538 188198 -11281103 -14383758 -7551261
8892 -7551261 2776598 4532375 -5753553 -14587762 -7440953 9441327 15919661 6734765
8884 6734765 -1932577 653981 2671399 -9557538 -27346447 -31707039 -21035107 -10084790
8876 -10084790 -6397613 -4978321 -4274909 -9586452 -19067862 -22991783 -20468496 -21377660
8868 -21377660 -27405562 -27284104 -17123167 -8939252 -9975709 -9721483 638645 11136907
8860 11136907 10190222 5166235 8056623 12058523 3440710 -10768354 -10188909 5991145
8852 5991145 16373384 9996144 343096 881095 6174054 6752913 5955613 9580101 11659648
8843 11659648 4481440 -5486183 -4917697 7666133 21265386 26994625 23991372 14337778
8835 14337778 2270025 -3407486 3129089 13712359 12797202 -847942 -7868952 8045082
8827 8045082 35036155 42817355 19469723 -11911339 -21171325 -8181902 791687 -9006114
8819 -9006114 -23204775 -23137156 -11562012 -2077536 3161526 8219792 5765807 -13703206
8811 -13703206 -37887015 -40520411 -17597136 3630556 141055 -18450728 -27444365 -19542136
8803 -19542136 -6611968 2052056 8887750 17992178 26580036 27943695 19080659 5906568
8795 5906568 611763 8856395 20058853 18533762 4661476 -5790405 -5462276 -5124480
8787 -5124480 -13829304 -23017538 -20341591 -8470756 755277 2044327 -3531585 -14654787
8779 -14654787 -24225866 -18161614 5313903 23607705 14484000 -12229974 -25989676 -16381338
8771 -16381338 -3433541 -5393682 -15255621 -16543665 -7348543 1500077 2775489 -1739353
8763 -1739353 -6579573 -7005430 -2238293 2076231 -888242 -9485928 -14622930 -11463630
8755 -11463630 -3484142 5402217 13468983 14439714 239308 -23520948 -36088913 -25444772
8747 -25444772 -5546099 1496813 -5239664 -6941722 6237735 21938105 24669525 16793840
8739 16793840 12641462 18027095 24505441 22491259 12665156 2992021 -109777 4875330
8731 4875330 15133700 22959836 18402326 -449081 -20653266 -25969630 -17331027 -13435458
8723 -13435458 -25790159 -41494569 -40270724 -22663400 -8259389 -7454134 -10010816 -5904189
8715 -5904189 -3067477 -13635579 -31982473 -40236006 -32405140 -20402616 -15906809 -17663087
8707 -17663087 -19608402 -21355327 -24775737 -27166377 -24057488 -14566708 57237 17663628
8699 17663628 30794307 28943708 12943054 -328984 1656480 8430672 2445064 -11344683
8691 -11344683 -11455458 3750662 8568443 -11540830 -34642348 -31760337 -5662353 18827316
8683 18827316 30166503 33267559 27086135 5732956 -20730157 -32518572 -28596912 -24878056
8675 -24878056 -22525416 -5720954 22889978 34680397 16760468 -6274272 -10500108
8668 -10500108 -6866585 -14451523 -23395375 -13901288 5538068 11304559 4315845 3626965
8660 3626965 8248831 -33014 -18612087 -24384896 -14699349 -12961754 -25961040 -30135177
8652 -30135177 -13362464 2237402 -2468573 -12935361 -9677399 -1543640 -3999207 -6523716
8644 -6523716 7434824 24137571 16885916 -8784030 -20377833 -6884736 9032273
8637 9032273 9806406 4533745 4108431 1354642 -10906461 -22409286 -20898279 -10509584
8629 -10509584 -1779956 4222578 9455463 8177930 -3693255 -17338958 -22561598 -23566245
8621 -23566245 -30021258 -38349544 -36586881 -24951099 -16807176 -18571887 -21734756 -17624332
8613 -17624332 -8728304 -830961 6518542 15458479 22489618 22319848 15340290 6251635
8605 6251635 -2011023 -8881853 -13116067 -13366638 -11145106 -10597385 -15245190 -24996652 -34838732
8596 -34838732 -37316824 -29791177 -18933808 -13666024 -14007933 -12875238 -8663298 -6901679
8588 -6901679 -6872744 1929798 22017402 36544131 27990201 2190947 -19625654 -28893609
8580 -28893609 -34433855 -39995246 -35173638 -15204355 5182762 8832314 -1990790 -11565243
8572 -11565243 -12455350 -10768539 -12753316 -15663526 -12400367 66368 17026165 28730088
8564 28730088 29247399 23765919 22171855 24423415 20627491 8821165 1637227 7292236
8556 7292236 14341778 7743955 -7129003 -11309287 165499 12718849 14936417 12321893
8548 12321893 13901849 17049914 13192188 1487540 -10216656 -14512035 -10003599 -628643
8540 -628643 7110684 8181488 2882945 -3816129 -7048512 -5242313 364406 7435944
8532 7435944 14092898 19079760 19263453 9738538 -7536891 -17888834 -8801583 7800657
8524 7800657 4190255 -24342076 -46565821 -36198335 -9960462 -2851702 -17003152 -23398271
8516 -23398271 -10667640 -678640 -9154773 -19590104 -11035100 9727442 20953322 15816885
8508 15816885 3685256 -6747493 -11369236 -7997839 -2929758 -9990102 -29848302 -40645462
8500 -40645462 -24317420 6504495 24172300 21868404 16449279 19210688 21749070 12596215
8492 12596215 -5789956 -20222349 -19052450 -1243404 20161395 26812417 15091812
8485 15091812 2706418 6287222 18931085 22370034 15109818 11760655 16907799 18143828
8477 18143828 7813972 -4742809 -8259305 -3560925 3210572 9586525 13202903 10353000
8469 10353000 4317899 4820579 13002116 17512182 12428831 7581371 11564596 15671827
8461 15671827 8046617 -4386932 -4218196 9604004 19660354 16217157 10230001 14200261
8453 14200261 22559094 21277912 9518618 -56893 -464915 907475 -5229564 -17534437
8445 -17534437 -28514500 -34929507 -37068884 -32243141 -18189630 -2177646 3254499 -2922624
8437 -2922624 -6278130 4025929 19086376 21881982 10762628 809016 2366584 8783654
8429 8783654 8488517 356596 -8338419 -12762301 -12755387 -8397742 -403723 6421342 6119688
8420 6119688 -1485863 -10550807 -15885087 -16503025 -12877676 -4890166 6242019 17084283
8412 17084283 24438668 26523996 21532902 8854863 -6713026 -16310128 -16085418 -11693406
8404 -11693406 -9863177 -9169330 -4908838 451349 615139 -1972982 1924650 11264877
8396 11264877 11475334 -4832230 -24372453 -30432343 -25063792 -21644950 -22073409 -17030657
8388 -17030657 -6244066 -1411806 -6623494 -11144222 -6781946 660593 3414174 3438155
8380 3438155 5143400 7062718 8157926 12492693 19856813 21323205 12448375 1656608
8372 1656608 -3058601 -6047941 -13124485 -19275402 -19098397 -19447446 -27248107 -33277496 -24839911
8363 -24839911 -8502625 -1902213 -6051365 -4890145 7447507 17955751 17046609 12093162
8355 12093162 12030733 13061663 8005205 -1388884 -9397763 -14710039 -17546083 -16793771 -15332840
8346 -15332840 -19388822 -27231301 -27833047 -17050563 -5964966 -5660687 -11899335 -12979247
8338 -12979247 -5562769 5786509 18285114 30661568 37678165 34116430 22281146 9403780
8330 9403780 570476 -1270561 5498597 14970953 13531754 -4012477 -22978968 -25006866
8322 -25006866 -12685161 -5151833 -9915669 -13784551 -5652246 6098724 8039054 2499499
8314 2499499 1380418 5747045 6207942 2139375 5098265 18488659 27445533 18867569
8306 18867569 1781270 -5403286 -2025201 -3475432 -13323125 -15570771 -1495745 12325802
8298 12325802 6302367 -12965417 -22231926 -14688937 -6080239 -8324198 -14123842 -12997345
8290 -12997345 -9015022 -13546221 -27641438 -39493681 -36789185 -18534640 2275769 7792943
8282 7792943 -6929160 -25221620 -25409118 -6551162 11698215 16155871 14919060 19997425
8274 19997425 27566707 25811503 14101286 2494211 -3699534 -7789632 -11493534 -10774867
8266 -10774867 -3765961 3538797 2443214 -9360625 -23932758 -28186716 -16255077 1812020
8258 1812020 8569023 -643279 -11315444 -7851264 7381230 19229954 19762981 15428380
8250 15428380 15514373 20234513 21639999 13072262 -3119365 -16671875 -19732336 -15953767
8242 -15953767 -15693881 -22495334 -30295528 -34291920 -35848840 -34193424 -24015001 -7369955
8234 -7369955 2870483 775516 -1382854 8142906 19322126 14090685 -3289179 -8126698
8226 -8126698 11082280 37566096 49581254 44399521 32179053 19060814 6899792
8219 6899792 853457 5188245 14954675 20921719 20787373 18202562 12911272 426555
8211 426555 -17577685 -29893280 -26951504 -12336491 536829 2840448 -1052701 -482629
8203 -482629 7650671 15295260 14502038 8372582 6579744 12193006 18954618 21775142 23129782
8194 23129782 25865949 25634980 16626321 1859279 -9119029 -12395081 -12660708 -12345312
8186 -12345312 -5508953 10984930 25463321 21298469 -263138 -17320251 -13071368 3337656
8178 3337656 9941653 368176 -11413712 -12156349 -3455965 5639193 8459796 543452
8170 543452 -18283383 -36152205 -35110913 -13549105 6722117 5947637 -8793785 -15798827
8162 -15798827 -9486103 -5137255 -14883609 -31790296 -39399345 -28319138 -3191443 18967964
8154 18967964 19106639 -5354746 -32987815 -39218427 -24068497 -8566810 -5262079 -7162357
8146 -7162357 -7598997 -12899526 -26082250 -33551146 -23142482 -6055471 -4114577 -18869956
8138 -18869956 -29505250 -22459774 -8283431 -3286494 -6254898 -3436849 9471165 21380277
8130 21380277 21234547 10287571 -3324362 -14478017 -20496100 -17114736 -3667665 9989843
8122 9989843 11061438 -288692 -10236217 -8631994 302723 7073973 8349796 5345275
8114 5345275 -313088 -3463856 2725038 14630615 17460323 5405088 -8058201 -11370469
8106 -11370469 -14398425 -29900018 -45858051 -39103872 -12057526 8724331 11185260 9914238
8098 9914238 15165677 16073144 5943286 208 10536689 23240845 18429415 2563893
8090 2563893 -2063509 9045322 18374315 11897098 -6347512 -22443882 -24138261 -8731587
8082 -8731587 11013408 15736994 3383870 -5710872 1980103 12785416 10171939 4269563
8074 4269563 13955636 30647186 28548263 7096917 -6396760 898972 10441412 5415134
8066 5415134 -4822247 -5314651 931812 3916836 3635182 1924761 -7351723 -24825642
8058 -24825642 -34812741 -23540960 721031 19128789 25505083 25481550 21092910 10964661
8050 10964661 477156 -2461884 297832 69070 -5332817 -10144610 -10404375 -7585944
8042 -7585944 -4861285 -5382175 -10431616 -14939285 -11309832 -2291891 -801150 -10601730
8034 -10601730 -18545202 -15125253 -9742752 -12271774 -12903187 342922 14195085 4575120
8026 4575120 -24764673 -42927460 -34216639 -17218424 -14695394 -24747808 -32287234 -31866404
8018 -31866404 -26048928 -14689703 -472618 4384049 -7967830 -25202986 -25998182 -5522415
8010 -5522415 19627203 30404248 21456960 538090 -19577978 -28389144 -23883205 -13642759
8002 -13642759 -6907232 -5746350 -6094320 -4949264 -2608311 502329 4827813 9758149
7994 9758149 13715678 15817107 15273227 10407600 1465858 -5952134 -4106684 7883339
7986 7883339 20110196 20879854 10811437 3710805 9009919 17454404 13439718 310195
7978 310195 -467382 19312879 38539206 33997271 11709798 -4903788 -8375565 -8204572
7970 -8204572 -5196757 9206368 27236180 26168779 4337275 -9321989 4007631 24651316
7962 24651316 24853405 8671429 -366141 3249560 6533441 5556983 7928853 11942274
7954 11942274 7527150 -2575110 -4962330 276278 -214172 -6122154 -453309 19431858
7946 19431858 31114070 20490251 6176754 13056468 35456962 46301601 35208133
7939 35208133 18215394 11722043 14052532 15701357 14174762 12277434 10216917 6609389
7931 6609389 3390611 3779104 6573612 7008971 3421515 -1009568 -4562591 -10282286 -18600517
7922 -18600517 -21091574 -10298121 5638501 9841859 979625 -2379517 11005211 26786285
7914 26786285 26230443 13620968 5500603 2097980 -8642112 -23043384 -22667776 -5538899
7906 -5538899 7875450 6906647 5574862 13872367 16857126 573566 -18864687 -14986466
7898 -14986466 9708382 26325925 18510792 91657 -6965223 2299759 15320687 16963632
7890 16963632 3523475 -12374625 -13019786 3090273 16986650 13278539 484682 -3111260
7882 -3111260 3966538 7954064 2770325 -4023910 -6011203 -3857821 2912876 15634307
7874 15634307 27117540 26393970 15153754 7188933 9264244 14327083 15616106 15084092
7866 15084092 15042272 13766672 12781632 16489685 21369346 18375437 9584023 7932204 15198522
7857 15198522 16403992 4763890 -4117782 4219421 19673867 23658240 17113650 13968217
7849 13968217 14741577 7796310 -5623016 -8998519 3048685 14113113 9719692 -1958270
7841 -1958270 -3103573 8872433 19793683 18168380 7911222 1722808 5927902 13076873
7833 13076873 10172512 -5104653 -20062338 -22885002 -17810238 -16207179 -17183405 -10593672
7825 -10593672 1334253 2529909 -10697808 -18661952 -5850103 14049730 17662627 7469441
7817 7469441 7418812 25734875 43313783 43078948 31890855 24652992 22385394 17958654
7809 17958654 11879747 9123233 8078288 5080412 3790675 8098730 11574783 7149009
7801 7149009 2213306 8764306 21369622 22316492 9638528 2004255 10345972 21575592
7793 21575592 20107624 11366037 11042096 20844020 28581839 26459965 16697800 2779364
7785 2779364 -12689350 -22702659 -19439196 -4592227 11041256 18856287 18153136 12227305
7777 12227305 5049074 770895 686275 1431871 533792 974119 5068929 7758668 3198158
7768 3198158 -5183762 -9333851 -8836063 -9823244 -13367715 -14355843 -11503331 -9177706 -8781828
7759 -8781828 -7290848 -5010378 -5388549 -5981880 -112076 9572809 10201656 -2925270 -16754140
7750 -16754140 -17268804 -8347813 -4269146 -8099566 -8452076 2223396 15440763 16855702
7742 16855702 3776858 -12100253 -17756293 -10633004 2304259 12162908 12112109 -475723
7734 -475723 -18276486 -23764859 -6349186 19012096 23515965 540167 -23390065 -23142958
7726 -23142958 -6724271 2119842 254207 2866630 12394633 15062898 8279271 6234652
7718 6234652 12547909 11224873 -4406151 -15174949 -3889254 16998577 23167860 12197261
7710 12197261 1796933 1699444 4202352 -290685 -11793357 -23764163 -28442224 -21346087
7702 -21346087 -7158972 2800245 3921992 2381809 1681193 -3551071 -13047747 -14237672
7694 -14237672 -2409276 5911864 -3860040 -19341502 -18858028 -5065820 1531325 -2981196
7686 -2981196 -2876806 6386312 9572342 -1147209 -13256780 -16206591 -15993048 -17222230
7678 -17222230 -10355524 8683979 22426911 13329647 -8703600 -17797650 -5949083 9880936
7670 9880936 12059166 204578 -14935861 -23683915 -21065679 -7326299 10163404 19070280
7662 19070280 10132852 -15102366 -42517808 -52681849 -36325347 -5678413 14962679
7655 14962679 14156861 4237224 3299045 12265118 17092304 9821442 -1790895 -5791203
7647 -5791203 601261 11782993 22216032 29447732 31173981 24748867 11698696 -394
7639 -394 -2123016 4819926 11869550 11936006 6400273 82478 -5114775 -7813171 -4152861
7630 -4152861 6082273 14306654 11845029 1303492 -8113827 -13505242 -17774819 -19451891
7622 -19451891 -13960468 -3531297 5678409 15272533 30386529 44230104 42766794 27655889
7614 27655889 17861749 22670502 29901970 29020528 28013327 34681662 38178939 26895174
7606 26895174 11815696 11761727 23511797 27119918 16466318 4540660 6625 -2056992
7598 -2056992 -4785139 -3003799 3806681 7110255 2953584 -1933490 -1483246 2891083
7590 2891083 8901189 15683736 18300381 12409854 5791201 11148780 24969246 29264134
7582 29264134 19215718 12364558 21627420 34642355 31990871 13933513 -3712319 -10934808
7574 -10934808 -8649003 -922942 5417092 497434 -16525233 -30465669 -27218406 -13071836
7566 -13071836 -5205868 -7935138 -11588111 -11194255 -11338809 -12964740 -10011821 -2128145
7558 -2128145 1405507 -4971882 -14813075 -18805131 -15049846 -7204809 847347 5465378
7550 5465378 4396981 381409 -1210625 -76126 -1376090 -7274386 -13683791 -17149077
7542 -17149077 -19308935 -21782494 -21360705 -14021646 -1667744 7591765 6139781 -4870656
7534 -4870656 -13392981 -6899893 11781065 24042333 16639738 -1400962 -10455631 -4514005
7526 -4514005 5739246 10691835 10904063 8871577 3671293 -3480735 -7771355 -7567275
7518 -7567275 -5007940 556488 10496188 18349555 14858755 3033948 -4112464 -3197186
7510 -3197186 -3907715 -8776943 -5786659 9855326 21754731 13812902 -5033458 -12300780
7502 -12300780 -1585653 12741111 15987764 6424711 -8150877 -16355574 -9386412 8429343
7494 8429343 19048041 11074637 -3359446 -3523228 11770373 24251348 23182721 18087715
7486 18087715 21485241 30625423 32593203 21244771 3946548 -6373918 -4288261 2568842
7478 2568842 3280469 -835729 2486293 16721668 28200803 24934835 13599946 7060638
7470 7060638 5073431 1738820 2892468 16881082 32842229 29450093 6024412 -14472642
7462 -14472642 -16594980 -8839410 -5147888 -7886382 -14991116 -26417757 -35153260 -27907871
7454 -27907871 -4992513 14038144 14631910 4667906 -1909408 -5390986 -12094769 -18015282
7446 -18015282 -15452262 -7895172 -4415373 -5041282 -4151739 -3284382 -8335959 -17552737 -23360116
7437 -23360116 -23776093 -22943778 -22999729 -23237031 -23933575 -23889484 -18523965 -7310226 2287017
7428 2287017 5151175 5791434 7590073 4057877 -7865196 -14974283 -4089713 14223272
7420 14223272 15826364 -3884747 -23614209 -25317114 -14902656 -8896575 -12853534 -20093943
7412 -20093943 -23481779 -21545919 -17301586 -14926503 -14773515 -11536494 -1719528 8851329
7404 8851329 11749156 8267734 6216608 5963760 1365345 -4580784 590857 17135599
7396 17135599 24579027 7221266 -20134911 -27243416 -7699836 11485055 4202735 -22489724
7388 -22489724 -39808152 -33880542 -18037734 -9289115 -7036659 -2722606 899977 -5204481
7380 -5204481 -16105269 -14268774 5081417 23564929 22493841 6427169 -5213423 -2997151
7372 -2997151 5939363 11653989 11467109 7367519 1824221 -2519174 -3893104 -3042623 -1594220
7363 -1594220 101096 2013094 3860137 6566347 10565027 12230503 7810948 1756347
7355 1756347 3339480 12748743 19448931 18042628 16014913 20195709 25326702 23525274
7347 23525274 16627728 11284137 9110366 8567313 8938798 6433239 -4437620 -19412498
7339 -19412498 -25333874 -19469348 -15410212 -21191019 -25689349 -17731095 -4050787 4628261
7331 4628261 10121782 14795667 9837124 -6460611 -15729554 -6450822 2862477 -7294247
7323 -7294247 -21636158 -14121448 5957463 8002985 -8181402 -14042522 -3299531 -231444
7315 -231444 -12246044 -14695335 4797281 23094963 19192185 4403039 -2550847 -3877517
7307 -3877517 -8736157 -14159850 -15619622 -15870404 -11875637 4143671 21764980 18597100
7299 18597100 -375511 -2713958 18287871 28055839 9180165 -5318107 11801504
7292 11801504 31729229 17431364 -10893397 -8702627 16816359 18694951 -11718180
7285 -11718180 -32985167 -21032420 1019147 8829975 8910669 11424110 8832055 -1509809
7277 -1509809 -4662747 4791919 9242834 -1953392 -12557711 -6638417 4525883 683478
7269 683478 -17229411 -31138176 -29312794 -14168966 3623852 10639841 626229 -15254392
7261 -15254392 -19392546 -12118406 -10348566 -18605825 -20331809 -5750177 10648557 12064491
7253 12064491 2516130 -4724635 -7363224 -9114480 -7212269 416291 5270490 -526366
7245 -526366 -10920322 -15773661 -15718095 -15212017 -10021462 3462187 13291458 3411655 -21729423
7236 -21729423 -39305658 -36385422 -23551738 -17257238 -19779886 -22968514 -24019076 -27932031
7228 -27932031 -35098227 -34971864 -18319568 6850179 20135231 12610938 -2030985 -6993514
7220 -6993514 -5494352 -12718936 -28891835 -35448514 -20130597 6835506 25967608 27718375
7212 27718375 14620767 -5169675 -20927550 -24926784 -20787663 -19169884 -21753329 -19102108
7204 -19102108 -9158535 -6301901 -22498456 -47510196 -58793680 -47520935 -26221841
7197 -26221841 -12574884 -12087160 -15700031 -10404452 6728604 23992517 27756009 19113453
7189 19113453 10993187 8757849 4483418 -5905806 -12595715 -8444280 -5256159 -19305443
7181 -19305443 -44892565 -57326984 -44378522 -22540623 -15254670 -22827077 -24220743 -7465891
7173 -7465891 12716961 14305688 -2119677 -15202210 -13822716 -11212252 -21198127 -34525566
7165 -34525566 -32735907 -16183498 -1222261 5656326 12976936 24777985 33513567 34142918
7157 34142918 29451240 19418252 1572000 -15440012 -16275053 -1941185 8541910 5079229
7149 5079229 -2770276 -8282255 -19617755 -37824797 -43767001 -24751606 1888686 11345935
7141 11345935 5337541 3940573 13188601 21382336 21427018 16623972 7377711 -8793321
7133 -8793321 -24469785 -26736606 -16105211 -7032016 -7784694 -11919847 -11505060 -7893905
7125 -7893905 -6655585 -9421787 -12214873 -7664971 7947737 25407740 27825052 12845525
7117 12845525 208134 5859600 18536603 17619247 5375648 1476886 10634970 18274880
7109 18274880 17958765 19797505 26819781 24862006 5615359 -17686205 -28317172 -25781417
7101 -25781417 -17736759 -5938766 8407070 17151783 15467135 10388959 8076926 2564224
7093 2564224 -10008686 -16164362 -1618253 22498760 29314321 12327822 -6534447 -9516793
7085 -9516793 -6035613 -12707544 -24819868 -24154950 -8372163 5187092 4859179 -2695223
7077 -2695223 -9443558 -19286786 -34041786 -39850746 -24285750 24602 7192506 -8010654
7069 -8010654 -25559307 -30478258 -28665248 -26947495 -17274930 6370099 30336932 36378221
7061 36378221 25117731 10807223 1101489 -4465949 -4454341 611551 1100077 -9185582
7053 -9185582 -19123562 -15297095 -5147790 -6239726 -16299233 -15463636 1465435 17080606
7045 17080606 19840867 19345050 25295385 30278213 24603499 13038812 4949945 -52311
7037 -52311 -5434680 -7265129 -1410689 7281328 12482904 15173739 17037523 14179818 5746169
7028 5746169 -708999 -1268205 -3012998 -9754843 -11674065 -1639256 8804559 5214880
7020 5214880 -6330051 -8847589 -1604106 1267701 -3363961 -3452692 4354777 6186949
7012 6186949 -6515032 -21812713 -24305163 -15411640 -6824960 -3635569 -4340020 -9113635
7004 -9113635 -16048269 -15211519 159854 19196991 23636297 12831761 4859208 9067598
6996 9067598 11992275 262234 -14711981 -11386636 7730806 15953366 -39270 -20587437
6988 -20587437 -21718328 -8942369 -5420663 -14648444 -16028873 1788782 23387183 30237762
6980 30237762 25654658 23875359 25955486 21659701 9086291 -2863614 -9593715 -14360035
6972 -14360035 -16310541 -8801173 6534129 16398488 13341934 6957481 9325066 17079275
6964 17079275 18109234 11018716 6276485 9105272 12249625 7894748 -2354228 -12945501
6956 -12945501 -21642028 -25966579 -19445724 422481 23281250 32349913 20242653 -4716368
6948 -4716368 -26140919 -30953760 -17731380 669681 6442131 -4651299 -17223910 -15608723
6940 -15608723 -4688510 -1267051 -8623161 -14078187 -11755761 -10961287 -16793334 -19013070
6932 -19013070 -10299909 -1186934 -3017295 -7478194 -14166 13648139 13106049 -6424258
6924 -6424258 -26933202 -32922798 -28711924 -25687556 -25170135 -21561117 -14171481 -8364257
6916 -8364257 -8898329 -16232140 -25875304 -29318312 -20149982 -1743757 14665902 21166866
6908 21166866 19351917 14882501 9736945 1392752 -12126908 -26966440 -33792357 -26821858
6900 -26821858 -12654986 -3824179 -2063810 2774975 13380187 17144003 6609776 -5163105
6892 -5163105 -3603778 4284069 3448373 -2180778 1988832 11917631 9133634 -6505066
6884 -6505066 -14058546 -5347701 3566301 1726438 -890486 2624343 1110284 -10459228
6876 -10459228 -14567335 1427563 20255449 19126561 4312888 -1916730 2583553 1686564
6868 1686564 -7840910 -12078290 -5524144 1300437 1737426 1658282 4920068 6193824 2642891
6859 2642891 -41902 2814754 9040856 14726789 16273729 8841937 -6389966 -15535910
6851 -15535910 -5756039 14862322 24876623 17258481 5036016 -2149062 -10256845 -23678798
6843 -23678798 -31590409 -22358863 -1685788 14043499 16504408 9757186 1467782 -2641303
6835 -2641303 467051 9312832 18628484 25092029 28975429 28175046 16723656 -6145741
6827 -6145741 -30228801 -43017743 -41562215 -31937809 -19783117 -5597360 11692752 29397011
6819 29397011 39774708 35362979 18225955 1893390 -1616263 3787966 3926605 -4690196
6811 -4690196 -8532522 3716736 23724720 33357267 27257606 16767026 13094218 15372003
6803 15372003 16757751 14897077 12340116 11198671 11945086 15110233 20001579 23045971
6795 23045971 21449400 17772416 16430747 16088005 11747720 5744397 8402639 22275198
6787 22275198 33745762 30228656 19940782 20877931 32204056 33417607 15958490 -1349292
6779 -1349292 1170606 15654336 19359320 6855287 -6826769 -11231602 -12140408 -17221816
6771 -17221816 -24237306 -27941574 -28263384 -26477957 -21030563 -12384208 -6328213 -7175806
6763 -7175806 -10740785 -8267892 3353568 16927567 20538310 8925239 -9725993 -20575876
6755 -20575876 -17138754 -6240271 3198827 9887011 14471974 11865369 -1547429 -17053940
6747 -17053940 -20155553 -7983068 6931780 10386846 -812668 -18035926 -28037454
6740 -28037454 -24396174 -16551440 -21775963 -41764984 -55274031 -44734696 -22615905 -16199934
6732 -16199934 -30268778 -42178703 -34176211 -13525882 3248770 10536383 11456594 8310957
6724 8310957 3205989 -611002 -3955682 -10688387 -18231852 -18454293 -11399887 -7676021
6716 -7676021 -12705027 -19008292 -18916229 -14001235 -6457492 6831592 23781196 31885884
6708 31885884 23305646 6566709 -5486750 -10538164 -10583459 -904342 21868337 46617499
6700 46617499 55264512 41538857 14693222 -10822935 -22186758 -12332987 11424995
6693 11424995 27568288 20456820 -1881138 -18164111 -17824568 -6421868 6336148 12884065
6685 12884065 8106536 -3342264 -4429837 14986986 39164731 42403932 22711570 2746362
6677 2746362 -3116303 -3240951 -5838408 -2679849 12468171 26379931 23937720 12073173
6669 12073173 9038439 16682663 20457520 13488939 3797785 -2120124 -6687631 -9740577
6661 -9740577 -5399429 3412377 1496537 -17547130 -37236763 -37100530 -19045853 -2771791
6653 -2771791 1011209 -297041 1768570 3882157 -349893 -8495050 -12915325 -11084125
6645 -11084125 -6670243 -3513691 -3023932 -5566900 -10838214 -17456640 -23598062 -27363400
6637 -27363400 -27323929 -24805053 -23378222 -22050814 -12630796 8332291 27968667 29368253
6629 29368253 15899954 9236259 18594011 26841214 16597854 -3527736 -12697626 -7800960
6621 -7800960 -3430612 -7638046 -14004885 -15887147 -14053925 -10351842 -6090811 -6250138
6613 -6250138 -13836004 -21383139 -19843568 -13704336 -13704534 -16543466 -8178231 11900212 26886443
6604 26886443 27035624 21509994 19985770 18137206 10144967 2303420 3530802 11387311
6596 11387311 16395336 13454184 3387564 -9017468 -14533110 -6828524 5808092 7508152
6588 7508152 -2156220 -5967752 3775083 11665628 3606262 -9792621 -9088709 5498986
6580 5498986 17567396 19334016 17107282 16108966 14778612 13060801 13750005 14977755
6572 14977755 11087567 1900130 -6134914 -8484878 -6961287 -5784357 -6663341 -7196038
6564 -7196038 -3832406 652047 -4500800 -23720405 -41565845 -37434909 -14982477 -68642
6556 -68642 -4479769 -10619325 -1868230 11808830 14307670 11689652 19054843 31481141
6548 31481141 30847986 14969725 -956012 -7759538 -8059708 -2287200 11700298 26314185
6540 26314185 29387709 21867125 15284870 12797556 7775612 -529015 -5618244 -6541324
6532 -6541324 -6367195 -90337 18250362 37222993 36146785 14293369 -5794387 -8231768
6524 -8231768 -617239 3593971 2942998 839892 -5288213 -18199360 -32931327 -41810611
6516 -41810611 -41929981 -35099237 -26342991 -22420184 -24912249 -26524472 -21619059 -15913101
6508 -15913101 -16138188 -16473528 -8210143 3294024 6371582 1797900 -2442058 -7806195
6500 -7806195 -17293985 -19146248 -2904203 14658710 8586104 -12611431 -17146035 -2205839
6492 -2205839 1330416 -16447486 -25315699 -6979915 12227333 5778085 -9697039 -6792663
6484 -6792663 4735888 -1494366 -20194687 -24755460 -13601729 -8953096 -15339697 -14874744
6476 -14874744 -3189585 3046599 -1533161 -1004117 11709859 20727669 14179190 3949083
6468 3949083 5695107 15513043 19831042 16867671 15058671 16768140 15323026 7058327
6460 7058327 -1362444 -225917 10406224 18525019 14607344 5995824 8244864 21661252
6452 21661252 29141413 22332904 15137346 20690116 29119255 23565025 7024378 -4613810
6444 -4613810 -7813053 -10631828 -13162683 -9246743 -4217272 -9904334 -22372497 -24833661
6436 -24833661 -14116008 -4500612 -2395218 2511360 14871469 21847846 13283306 -2037721
6428 -2037721 -10911869 -13699579 -17032288 -19289734 -15195389 -8187760 -7435701 -14965170
6420 -14965170 -22231088 -18380810 -620148 19959877 24255235 4692001 -21434837 -28158600
6412 -28158600 -11846901 4578066 1147454 -16776735 -30639962 -32283066 -27351722 -22689236
6404 -22689236 -19105842 -13855907 -4998607 5445812 11644539 10117224 4566589 -73437
6396 -73437 -5324734 -13489442 -18253465 -12158261 -1157210 1533098 -4556180 -8009906
6388 -8009906 -6817353 -11151527 -20859293 -19533596 -895170 15888476 10912005 -9161604
6380 -9161604 -22637396 -21472169 -14098241 -7927025 -4241972 -5284086 -11848213 -16195701
6372 -16195701 -9641011 4033951 12434056 9773214 -41899 -11607648 -19970427 -18583714
6364 -18583714 -5894483 9045824 17455340 23260611 33430294 40739019 31582687 9754562
6356 9754562 -4572171 -2969649 233132 -7854150 -18025789 -13907718 2765973 15301516
6348 15301516 15241528 9643359 7202298 9112993 14312318 22172658 26274478 16176260
6340 16176260 -7312522 -26735342 -27567452 -17820587 -16473677 -25193539 -26243303 -10837674
6332 -10837674 6225747 8900167 3061837 3521758 8062162 2650967 -11592073 -16109586
6324 -16109586 -1860837 17950442 26998041 23705912 14536805 2807620 -8633654 -15099022
6316 -15099022 -17559137 -21951505 -25496953 -16843847 2911292 14592900 7441336 -3767059
6308 -3767059 -2598226 2588668 -4784954 -18396564 -18077512 -3431302 6939603 8389204
6300 8389204 16042376 32827218 37252350 15651374 -12972439 -20424100 -4869531 12685306
6292 12685306 18845068 19150321 22445234 27420826 26499852 16266485 2815405 -1512518
6284 -1512518 10029435 28287007 35690819 27160305 16254415 15726792 20313534 16744226
6276 16744226 3615162 -9277543 -16940388 -22670102 -26468690 -21554263 -5743453 11707707
6268 11707707 19106641 13904814 2985864 -4361658 -1884879 10146539 23005615 24507483
6260 24507483 11027458 -5966571 -9511845 5137188 24483754 30495079 19588277
6253 19588277 5706316 4116892 14831738 24536908 23280499 15018123 10338544 12063690
6245 12063690 11821722 1221800 -16317641 -28012553 -26561702 -19036680 -16826001 -18931583
6237 -18931583 -13091187 4495707 19490265 16424433 -1223644 -17401677 -25314556 -31115929
6229 -31115929 -37545007 -37625145 -28071425 -17328389 -14234770 -17215410 -20307296 -22206810
6221 -22206810 -23836535 -24385717 -25364110 -31088625 -39513760 -41019059 -33012631 -26479415
6213 -26479415 -29493688 -33989710 -30027944 -23556932 -25332426 -29993728 -24187253 -11255715
6205 -11255715 -7713383 -14904823 -14892537 314036 14903187 13837272 4221160 -184965
6197 -184965 -1223845 -7491224 -13817082 -7792553 7490070 14230006 4169915 -11249981
6189 -11249981 -17349989 -11967855 -1533926 8934725 16361274 16830255 9392429 660536
6181 660536 -30561 8485907 15858374 10796897 -4909509 -16747605 -14519428 -4556159
6173 -4556159 1082667 2983038 10918587 23574264 26593815 14875732 1578305 -3266107
6165 -3266107 -7557929 -17632688 -19286784 1516546 28988060 33003110 11581123 -6484578
6157 -6484578 -3922393 4290660 558701 -7672285 -4453982 7511482 13688224 10996597
6149 10996597 7930248 8394962 10088339 13623414 19212631 18237554 2297608 -20940462
6141 -20940462 -34043858 -31980192 -26139340 -25396578 -24944281 -17301240 -4576950 5345789
6133 5345789 8390635 5728640 265388 -4747159 -6448351 -3884283 2469919 11599375
6125 11599375 19558099 18781021 5435533 -13207005 -24160630 -21704308 -10939200 302702
6117 302702 7840348 10523988 9398247 7874924 8089313 7806604 5353341 4444605 6654975
$$ [...]
##END NTUPLES=NMR SPECTRUM
##END=
