##TITLE=31Pdec_LR-0149-C1-EtOAc-B-M
 CD3CN, 64 sc
 15.3.2023
##JCAMPDX= 6.0         $$ Bruker NMR JCAMP-DX V2.0
##DATA TYPE= NMR SPECTRUM
##DATA CLASS= NTUPLES
##ORIGIN= UXNMR, Bruker Analytische Messtechnik GmbH
##OWNER= root
$$ XWIN-NMR		Version 3.5
$$ Wed Mar 15 14:12:17 2023 Russian Standard Time (UT+4h)  she@DPX200
##.OBSERVE FREQUENCY= 81.013821
##.OBSERVE NUCLEUS= ^31P
##.ACQUISITION MODE= SIMULTANEOUS
##.ACQUISITION SCHEME= undefined
##.AVERAGES= 64
##.DIGITISER RES= 16
##SPECTROMETER/DATA SYSTEM= spect
##.PULSE SEQUENCE= zgpg30
##.SOLVENT NAME= CD3CN
##.SHIFT REFERENCE= (INTERNAL, CD3CN, 0, 248.564)
##AUDIT TRAIL= $$ (NUMBER, WHEN, WHO, WHERE, WHAT)
$$ ##TITLE= Audit trail, XWIN-NMR		Version 3.5
$$ ##JCAMPDX= 5.01
$$ ##ORIGIN= Bruker BioSpin GmbH
$$ ##OWNER= she
$$ F:/spectra/data/she/nmr/P31/1/pdata/1/auditp.txt
$$ ##AUDIT TRAIL=  $$ (NUMBER, WHEN, WHO, WHERE, WHAT)
(   1,<2023-03-15 14:11:06.42 +0400>,<she>,<DPX200>,
      <continue with go, POWCHK disabled, PULCHK disabled
       configuration hash MD5:
       00 E9 B6 7A A2 85 ED C7 34 08 36 98 17 FE 4E 26
       data hash MD5: 32K
       C5 63 B4 BC F0 2B B3 35 D5 FF 0F 78 11 5C EF A5>)
(   2,<2023-03-15 14:11:07.90 +0400>,<she>,<DPX200>,
      <Start of raw data processing
       efp BC_mod = 2 LB = 1 FT_mod = 6 PKNL = 1 PHC0 = -10994.51 PHC1 = 147.4102 SI = 64K 
       data hash MD5: 64K
       D8 86 A1 29 F5 9E 36 2B 17 A3 31 42 60 8D 96 CB>)
(   3,<2023-03-15 14:11:17.79 +0400>,<she>,<DPX200>,
      <pk PHC0 = 0 PHC1 = 0 
       data hash MD5: 64K
       D8 86 A1 29 F5 9E 36 2B 17 A3 31 42 60 8D 96 CB>)
(   4,<2023-03-15 14:11:39.42 +0400>,<she>,<DPX200>,
      <pk PHC0 = -77.80257 PHC1 = -50.80001 
       data hash MD5: 64K
       C7 B3 88 91 56 43 6D 19 58 AB 46 1F FE 64 A1 57>)
(   5,<2023-03-15 14:11:42.85 +0400>,<she>,<DPX200>,
      <abs ABSG = 5 
       data hash MD5: 64K
       28 0F 0C CE 8A C8 65 A7 B3 F2 88 97 D5 36 97 BB>)
$$ ##END=
$$ 
$$ hash MD5
$$ 9B 38 8E 66 7E E8 A5 91 51 EB B8 AD 45 C3 A3 B6
##$RELAX= 
##$RELAX= 
##$RELAX= 
##$RELAX= 
##$RELAX= 
##$RELAX= 
##$RELAX= 
##$RELAX= 
##$RELAX= 
$$ Bruker specific parameters
$$ --------------------------
##$DU= <F:/spectra>
##$EXPNO= 1
##$NAME= <P31>
##$PROCNO= 1
##$TYPE= <nmr>
##$USER= <she>
##$AMP= (0..31)
100 100 100 100 100 100 100 100 100 100 100 100 100 100 100 100 100 100 
100 100 100 100 100 100 100 100 100 100 100 100 100 100 
##$AQSEQ= 0
##$AQ_mod= 1
##$AUNM= <au_zg>
##$AUTOPOS= <>
##$BF1= 81.014009
##$BF2= 200.13
##$BF3= 200.13
##$BF4= 200.13
##$BF5= 200.13
##$BF6= 200.13
##$BF7= 200.13
##$BF8= 200.13
##$BYTORDA= 1
##$CFDGTYP= 0
##$CFRGTYP= 5
##$CHEMSTR= <none>
##$CNST= (0..31)
1 1 145 1 1 1 1 1 1 1 1 1 1 1 1 1 1 1 1 1 1 1 1 1 1 1 1 1 1 1 1 1 
##$CPDPRG= <waltz16>
##$CPDPRG1= <>
##$CPDPRG2= <waltz16>
##$CPDPRG3= <>
##$CPDPRG4= <mlev>
##$CPDPRG5= <mlev>
##$CPDPRG6= <mlev>
##$CPDPRG7= <mlev>
##$CPDPRG8= <mlev>
##$CPDPRGB= <>
##$CPDPRGT= <>
##$D= (0..31)
$$ [...]
##$SUBNAM3= <"">
##$SUBNAM4= <"">
##$SUBNAM5= <"">
##$SUBNAM6= <"">
##$SUBNAM7= <"">
##$SUBNAM8= <"">
##$SUBNAM9= <"">
##$SW= 501.771253377433
##$SWIBOX= (0..15)
0 1 3 0 0 0 0 0 0 0 0 0 0 0 0 0 
##$SW_h= 40650.406504065
##$TD= 32768
##$TD0= 1
##$TE= 0
##$TE2= 300
##$TE3= 300
##$TEG= 300
##$TL= (0..7)
0 120 53 12 22 120 120 120 
##$TP= (0..7)
150 150 150 150 150 150 150 150 
##$TP07= 0
##$TPNAME0= <>
##$TPNAME1= <>
##$TPNAME2= <>
##$TPNAME3= <>
##$TPNAME4= <>
##$TPNAME5= <>
##$TPNAME6= <>
##$TPNAME7= <>
##$TPOAL= (0..7)
0.5 0.5 0.5 0.5 0.5 0.5 0.5 0.5 
##$TPOFFS= (0..7)
0 0 0 0 0 0 0 0 
##$TUNHIN= 0
##$TUNHOUT= 0
##$TUNXOUT= 0
##$USERA1= <user>
##$USERA2= <user>
##$USERA3= <user>
##$USERA4= <user>
##$USERA5= <user>
##$V9= 5
##$VALIST= <valist>
##$VCLIST= <CCCCCCCCCCCCCCC>
##$VD= 0
##$VDLIST= <DDDDDDDDDDDDDDD>
##$VPLIST= <PPPPPPPPPPPPPPP>
##$VTLIST= <TTTTTTTTTTTTTTT>
##$WBST= 1024
##$WBSW= 4
##$XGAIN= (0..3)
0 0 0 0 
##$XL= 0
##$YL= 0
##$YMAX_a= 1584
##$YMIN_a= -1593
##$ZGOPTNS= <>
##$ZL1= 120
##$ZL2= 120
##$ZL3= 120
##$ZL4= 120
##$ABSF1= 248.5645
##$ABSF2= -253.2056
##$ABSG= 5
##$ABSL= 3
##$ALPHA= 0
##$AQORDER= 0
##$ASSFAC= 0
##$ASSFACI= 0
##$ASSFACX= 0
##$ASSWID= 0
##$AUNMP= <proc_1d>
##$AZFE= 0.1
##$AZFW= 0.5
##$BCFW= 0
##$BC_mod= 2
##$BYTORDP= 0
##$COROFFS= 0
##$CY= -3
##$DATMOD= 1
##$DC= 0
##$DFILT= <>
##$DTYPP= 0
##$F1P= 0
##$F2P= 0
##$FCOR= 1
##$FTSIZE= 65536
##$FT_mod= 6
##$GAMMA= 0
##$GB= 0
##$INTBC= 1
##$INTSCL= 6.047779e-11
##$ISEN= 30
##$LB= 1
##$LEV0= 0
##$LPBIN= 0
##$MAXI= 10000
##$MC2= 0
##$MEAN= 0
##$ME_mod= 0
##$MI= 50
##$NCOEF= 0
##$NC_proc= -10
##$NLEV= 6
##$NOISF1= 182.463
##$NOISF2= 159.3651
##$NSP= 0
##$NTH_PI= 0
##$NZP= 0
##$OFFSET= 248.5645
##$PC= 4
##$PHC0= -11072.31
##$PHC1= 96.61019
##$PH_mod= 1
##$PKNL= yes
##$PPARMOD= 0
##$PSCAL= 0
##$PSIGN= 0
##$REVERSE= no
##$SF= 81.0140089999694
##$SI= 65536
##$SIGF1= 159.3651
##$SIGF2= -187.1042
##$SINO= 113.3802
##$SIOLD= 16384
##$SREGLST= <1H.CDCl3>
##$SSB= 0
##$STSI= 65536
##$STSR= 0
##$SW_p= 40650.406504065
##$SYMM= 0
##$S_DEV= 0
##$TDeff= 32768
##$TDoff= 0
##$TI= <>
##$TILT= no
##$TM1= 0
##$TM2= 0
##$TOPLEV= 0
##$USERP1= <user>
##$USERP2= <user>
##$USERP3= <user>
##$USERP4= <user>
##$USERP5= <user>
##$WDW= 1
##$XDIM= 65536
##$YMAX_p= 582733853
##$YMIN_p= -138861383
$$ End of Bruker specific parameters
$$ ---------------------------------
##NTUPLES= NMR SPECTRUM
##VAR_NAME=  FREQUENCY,     SPECTRUM/REAL,   SPECTRUM/IMAG
##SYMBOL=    X,             R,               I
##VAR_TYPE=  INDEPENDENT,   DEPENDENT,       DEPENDENT
##VAR_FORM=  AFFN,          ASDF,            ASDF
##VAR_DIM=   65536,         65536,           65536
##UNITS=     HZ,            ARBITRARY UNITS, ARBITRARY UNITS
##FACTOR=    0.620285442955139, 1,           1
##FIRST=     20137.2065510682, 0,            0
##LAST=      -20513.1999529968, 0,           0
##MIN=       -20513.1999529968, -138861383,  0
##MAX=       20137.2065510682, 582733853,    0
$$ Real data points
##PAGE= N=1
##DATA TABLE= (X++(R..R)), XYDATA
$$ [...]
##PAGE= N=2
##DATA TABLE= (X++(I..I)), XYDATA
12748B0213470J6889786J0257353j303218N56619J6091171J7261299r051753l0208890
12740D0705837j2526113K1597720K2447613j1282599l1919011j7625439K85299
12733A1683307n083859j7027458j2677844j70685N274380R204736J7039437J4693353
12725B2935367m151817j7658396q808041N542212M970067N10216R676087J9007765
12717C2023460N974715j8228937k3294457o975048N420043J944070n929366q929050
12709a7994570p318871K593000K1796922L2844515J8025498j0382515k4484053
12702A5079926k0575845j6450343j4474897p84004J9565312K2767683P587215
12695A2715047J758959J5847575K3396155M095049k1422728k1635685J344499
$$ plain form
12748 20213470 37103256 47360609 46057391 46614010 62705181 79966480 70914727 40705837
12740 40705837 28179724 49777444 72225057 60942458 29023447 11398008 11683307
12733 11683307 6599448 -10428010 -23105854 -23276539 -18002159 -8797423 8242014 22935367
12725 22935367 18783550 1125154 -7682887 -2140675 2829392 3339608 13015695 32023460
12717 32023460 37998175 19769238 -3525219 -10500267 -5080224 -3136154 -9065520 -17994570
12709 -17994570 -25313441 -22720441 -923519 31920996 49946494 39563979 15079926
12702 15079926 -5495919 -21946262 -36421159 -37205163 -17639851 5127832 12715047
12695 12715047 14474006 30321581 53717736 57812785 36390057 14754372 16098871
12688A6098871J8976205J4548438m168655k0912853k4624401j4115874M05194
12681a3793075O553184N439366Q572252J6699645J6605757L767357q645314j0746188
12673B4452984r098629j0342582q843510r92404M730346L091363J556785L889533
12665H443886J728685o433940q043181j837771p263131k9189314l7094498p011754
12657h6701018L5058345M4661291K0903293J305573J798037Q79717j3914588k2172402
12649a8181752o697822J6869771K4738891J7415075R192246J929082j1240774
12642C4024717k5725142k6981087j0346903J1348544K0401362J0998449m988264
12635H731676r749271p57778N102634l387178j1940941k445596J3790353R768026
$$ plain form
12688 16098871 35075076 49623514 45454859 24542006 -82395 -14198269 -13793075
12681 -13793075 -7239891 -1800525 6771727 23471372 40077129 43844486 35199172 24452984
12673 24452984 15354355 5011773 -3831737 -4824141 -93795 2997568 4554353 8443886
12665 8443886 10172571 3738631 -4304550 -6142321 -13405452 -42594766 -79689264 -86701018
12657 -86701018 -51642673 -6981382 13921911 15227484 17025521 17905238 3990650 -18181752
12649 -18181752 -24879574 -8009803 16729088 34144163 43336409 45265491 34024717
12642 34024717 8299575 -18681512 -29028415 -17679871 2721491 13719940 8731676
12635 8731676 -1017595 -1775373 3327261 -59917 -12000858 -14446454 -656101 9111925
12627I111925j1580945j5685074J1384111L8195916L1967086K510495j8467236
12620D7436278k1094932j6373832q465583M720469J4003501R088750k4765K936681
12612C2226567J0252377O31685k2144914k9284272r617880J3685451J6939442
12605A2688456M314508o853096r541220n751467J169853L471203n732841j6367963
12597b2602567r057594J2183288J6973136p121309k9646031j8153186J4723253
12590d2701010L1606553K3682304J2889600R066767j62400j5392101j6092619
12583B897094L539784J8715954J0429270o602920j1427592j0112117j7117910
12576i678437k1827218n181496J9951142K0528251l250015j1464982J6280472
$$ plain form
12627 9111925 -2469020 -18154094 -6769983 31425933 63393019 65903514 47436278
12620 47436278 26341346 9967514 1501931 6222400 20225901 29314651 29289886 32226567
12612 32226567 42478944 43110629 20965715 -8318557 -17936437 -4250986 12688456
12605 12688456 17002964 10149868 608648 -5142819 -3972966 -501763 -6234604 -22602567
12597 -22602567 -31660161 -19476873 -2503737 -9625046 -39271077 -57424263 -42701010
12590 -42701010 -11094457 12587847 25477447 34544214 34381814 18989713 2897094
12583 2897094 6436878 25152832 35582102 28979182 17551590 7439473 -9678437
12576 -9678437 -31505655 -36687151 -16736009 3792242 542227 -10922755 5357717
12569E357717M6234372L7013152k869653l2117181l5391664l1462626k9111797
12562d2347680j3178854J6878447K9729060O057733k4360147j8422116J9680578
12555b5962979M3169152K5463024q988512k1864798o465834J4195580J8594392
12548C8140025M447517j4398699j9889217o426523R476850O370133j1829947j7837732
12540a1947593m80326J6046859O679889j7372212k6342148j4342280M13881J0095494
12532c7248436K3233039L6373879L0123433L015410j7081617j1014261L606657
12525C1008104J202659j3067974j6475768o957988p93959Q14028J2186140K8837192
12517C6752434K4541469n343169k6225652j1498525J4759608J1619324j5827513
$$ plain form
12569 5357717 51592089 88605241 85735588 53618407 18226743 -13235883 -42347680
12562 -42347680 -55526534 -38648087 -8919027 -2861294 -27221441 -45643557 -25962979
12555 -25962979 17206173 42669197 33680685 11815887 5350053 19545633 38140025
12548 38140025 42587542 28188843 8299626 1873103 11349953 17720086 5890139 -11947593
12540 -11947593 -12427919 3618940 10298829 -7073383 -33415531 -47757811 -47343930 -37248436
12532 -37248436 -14015397 22358482 52481915 55497325 38415708 27401447 31008104
12525 31008104 32210763 19142789 2667021 -4290967 -5084926 -4270898 7915242 36752434
12517 36752434 61293903 55950734 29725082 18226557 32986165 44605489 28777976
12510B8777976k3709026J330982J9129834k253271l5431679l3582684L94978K1343013
12502b3999877R855909o432139m186291Q30209j1542201k6332723j6167771J4082051
12494f3892833L3916948L0013139J6482392O168020l340448j3389132j5819280
12487i861194o860359N770183J3704995J3911287M816712q774178j0269568Q432890
12479A0870768K2823510k39980m8088172o2865120j4832716N1322599P0028188
12472B9019077L5885196l31553n803895J046662o013357k0135168k1970964j6261315
12464d565317k1046557l0890242j9805877J5050443L7805796J9086237j8960698
12457b3326215k8261258r50832K0372936O873663j4156315n356264J8865178J5094016
$$ plain form
12510 28777976 5068950 6399932 25529766 23276495 -12155184 -45737868 -45342890 -23999877
12502 -23999877 -14143968 -20576107 -24762398 -23932189 -35474390 -61807113 -77974884 -63892833
12494 -63892833 -29975885 37254 16519646 22687666 19347218 5958086 -9861194
12487 -9861194 -16721553 -10951370 2753625 16664912 21481624 12707446 2437878 10870768
12479 10870768 33694278 33454298 -14633874 -77498994 -92331710 -41009111 29019077
12472 29019077 64904273 64572720 58768825 59815487 53802130 33666962 11695998 -4565317
12464 -4565317 -25611874 -56502116 -76307993 -61257550 -23451754 -4365517 -23326215
12457 -23326215 -51587473 -52538305 -32165369 -25291706 -39448021 -44804285 -25939107 -10845091
12449a0845091j7893594l5819248j7687168O830196J0416803O357729J3454805
12442d5185568K0451314J1984419j869588r606564k1083377l6856242k8196951
12435a10362557J4833279M7585073K9453550r140253j1874918J4024397J6055977
12428i425452r604535j3665997J5337110K8504386J808798k3904092j5622441
12421b6572223M50247n274340j4337775n006440K033633j1949211j9410134L728685
12413g6337558K6137941J4019239l118550J6625549M4191565K2042594l0750983
12406A2809797l8843272P343637L4579399O200333k3539908p044291J9045655
12399A0551350M181023k7591053k2521860R273751J3440153j5310895k6694083
$$ plain form
12449 -10845091 -28738685 -64557933 -82245101 -75414905 -64998102 -58640373 -45185568
12442 -45185568 -24734254 -12749835 -14619423 -24225987 -45309364 -82165606 -110362557
12435 -110362557 -95529278 -47944205 -18490655 -27630908 -39505826 -25481429 -9425452
12428 -9425452 -19029987 -32695984 -17358874 11145512 12954310 -10949782 -26572223
12421 -26572223 -26121976 -31396316 -45734091 -50740531 -48706898 -60656109 -80066243 -76337558
12413 -76337558 -50199617 -36180378 -39298928 -22673379 21518186 43560780 12809797
12406 12809797 -26033475 -18689838 15889561 22089894 -1450014 -8494305 10551350
12399 10551350 14732373 -12858680 -35380540 -26106789 -12666636 -27977531 -54671614
12392e4671614j31324K4131152J2595529j3148400j8916091r019322n021923l343937
12384f7525930J0428623K3994679J4180898p552375n961238J8763490K4100693
12377A0428840p259451l3291716j5476343J8979716K0985183O09441Q061372M2828659
12369D5865701M6623903m19734l9459041k0843860K0576401K2746464j1481461
12362F3608373l1366754j9690468l146933K355388N009214M419093o608643j3092973
12354A486297M075213K6168544J8478717j0494556k0650059q421598r071194k7593556
12346b6022192k5979902O987939L0702032J9708382K670308O909608J3400376
12339B8376551m95538j8076689j8369479j3695790j6081945n824159K6142994
$$ plain form
12392 -54671614 -54802938 -30671786 -18076257 -31224657 -50140748 -59160070 -64181993 -67525930
12384 -67525930 -57097307 -33102628 -18921730 -26474105 -32435343 -13671853 10428840
12377 10428840 3169389 -30122327 -45598670 -26618954 -5633771 -5024330 3037042 45865701
12369 45865701 92489604 92069870 52610829 31766969 52343370 75089834 63608373
12362 63608373 32241619 12551151 9404218 11759606 16768820 21187913 14579270 1486297
12354 1486297 5561510 31730054 50208771 39714215 19064156 10642558 1571364 -26022192
12346 -26022192 -52002094 -45014155 -14312123 5396259 8066567 14976175 28376551
12339 28376551 27881013 9804324 -8565155 -22260945 -38342890 -44167049 -18024055
12332a8024055M2388423J2524270k8434288k5890261J2737767L2836619J3950610
12325D2089085j2256669j7490179o886079L629461N505224l209563j0950142K798970
12317C230108L1756837L4573977n981633m3623729l0665046P916808J5074538
12310A2281860p010973r279388J4274488J9300971n845629j9972645m782619N368463
12302D334528q511429j3680429J1646116L3263944J7120483j3023688j5848109
12295A5301416K174079L550037j9072843l5786077k3094427J1168560L9383228
12288f376027L7070444O018146j9878153j0884616J5605420J7254660p837512
12281C0972362j8897313k353724O479976r693696j5913910R462638K6857645n62835
$$ plain form
12332 -18024055 24364368 36888638 8454350 -17435911 -4698144 28138475 42089085
12325 42089085 29832416 12342237 5456158 9085619 14590843 11381280 431138 3230108
12317 3230108 34986945 69560922 63579289 19955560 -10709486 -2792678 12281860
12310 12281860 5270887 -4008501 10265987 29566958 23721329 3748684 -1033935 4334528
12302 4334528 -4176901 -17857330 -6211214 27052730 44173213 31149525 15301416
12295 15301416 17475495 21025532 1952689 -33833388 -56927815 -45759255 -6376027
12288 -6376027 30694417 36712563 16834410 5949794 21555214 38809874 30972362
12281 30972362 12075049 9721325 16201301 6507605 -9406305 56333 26913978 26351143
12273B6351143l8630137l3324451K654705J4991648k213947m904587K0586297
12266a4489329L6625402J9112228p780191j3927346j458352J0771808J0801918
12259C9656138n094122k8790220l6646704j4759826J5183670K1960590R434514
12252I44040M106594P856302J797118r793039m660025R274929o3020k8354606
12244a8891707l1148885M124074L1599155J6024387j5918962k2472670o061451
12237d2746059P301393J4106429K2145224K0193780k686026k6491097k4502510
12230c2678866l845857R304921J0158955J0177095P258546n156344j2720634j20052
12222a7622236J4270389K328015k2534767k0499507R303055K4001136N815952
$$ plain form
12273 26351143 -12278994 -45603445 -42948740 -27957092 -30171039 -35075626 -14489329
12266 -14489329 22136073 41248301 33468110 19540764 18082412 28854220 39656138
12259 39656138 34562016 5771796 -30874908 -45634734 -30451064 -8490474 944040
12252 944040 5050634 12906936 14704054 4911015 250990 9525919 9462899 -18891707
12244 -18891707 -50040592 -45916518 -14317363 1707024 -14211938 -36684608 -42746059
12237 -42746059 -35444666 -21338237 806987 21000767 18314741 -8176356 -32678866
12230 -32678866 -36524723 -27219802 -17060847 -6883752 374794 -4781550 -17502184 -17622236
12222 -17622236 -3351847 -1023832 -23558599 -44058106 -34755051 -10753915 -4937963
12215d937963r728251N985932K6843342J5015325j7772950k8340942n207895K1493720
12207C350318K7227331J8656692J0292258K462913q461067j6831855j6577314
12200B0119276j2557011j2733464j4757797q930677P048302K1907294K0960533
12193B1056456K159062j8367058j9846626R52374K3708713K5446660N583667j5470009
12185B5223239k0952660j3107438l378575L396479R654347J5986613J8223045
12178C5045050J2369841m57811j2395328j2684718N93033J2405992N057344j5551158
12170B4382245k2021980l723481J2944848J417387k1371565j6956287J3976568
12163a1352265K7934487L070117k7480697k5072551J836826J9987924K0548595
$$ plain form
12215 -4937963 -14666214 -8680282 18163060 33178385 15405435 -12935507 -18143402 3350318
12207 3350318 30577649 49234341 59526599 61989512 53528445 36696590 20119276
12200 20119276 7562265 -5171199 -19928996 -28859673 -21811371 95923 21056456
12193 21056456 23215518 4848460 -14998166 -14045792 9662921 35109581 40693248 25223239
12185 25223239 4270579 -8836859 -12215434 -8818955 835392 16822005 35045050
12178 35045050 47414891 46957080 34561752 21877034 22470067 34876059 39933403 24382245
12170 24382245 2360265 -1363216 11581632 12999019 -8372546 -25328833 -11352265
12163 -11352265 16582222 19652339 -7828358 -32900909 -31064083 -11076159 9472436
12156I472436J4665185Q64300k5315848m2755719k7105322M374263J2242611k722191
12148e6280285k151157K0760919K6172712j518344j9488832N295899L8393684
12141A1184596L0837081m235244j6520972K077538J3443691j984931k3443297
12134A1358462k9970636k1284069J53598K9453184M3056793K1399876j2578659
12127D1588549j8611769k564799o956609l3205650l0495387J6940156M8977338
12120A5671829J5699167m1698368m7646572N35L4616909J9657683j1446361j6742198
12112c1887376j062959N640337n002092j4114188m014193J9451685L1398663J6097679
12104A6507556r482421j3607311N138063J3784387k158321j1851899R619444L2874799
$$ plain form
12156 9472436 24137621 25001921 -313927 -43069646 -70174968 -65800705 -53558094 -56280285
12148 -56280285 -58431442 -37670523 -11497811 -13016155 -32504987 -27209088 11184596
12141 11184596 42021677 37786433 21265461 23342999 36786690 34801759 11358462
12134 11358462 -18612174 -39896243 -39742645 -10289461 32767332 54167208 41588549
12127 41588549 22976780 20411981 13455372 -19750278 -50245665 -33305509 15671829
12120 15671829 31370996 -10327372 -57973944 -57973409 -23356500 -3698817 -15145178 -31887376
12112 -31887376 -32950335 -27309998 -32312090 -46426278 -50440471 -30988786 409877 16507556
12104 16507556 7025135 -6582176 -1444113 12340274 10181953 -1669946 7949498 40824297
12096D0824297J6133778k5744115m0744402j7328922O195258P224281L976223
12089i463602R491387R204816k012696m793832N124660L282940j7445320k6882543
12081c3494190p318685J4734298J3958896P175381J7031325K8177813J6376758
12074E6641596o756759j6534667j8259619k7764101l1550843j0355297J5619146
12067c8960544J2509090q370446o921378J7010504K3320549J717282j0663112
12060a0358055O310191K2872737J2150155o159840k654615J3740963J4917313
12053E0818849j797934j6205920j6905973p207922P359125J7457211R261690j4828922
12045B7950204k7874262j2149139J0427133O147158j9966239k9959465r913181
$$ plain form
12096 40824297 56958075 31213960 -9530442 -26859364 -20664106 -13439825 -9463602
12089 -9463602 27785 9232601 7219905 2426073 7550733 10833673 -6611647 -33494190
12081 -33494190 -40812875 -26078577 -12119681 -4944300 12087025 40264838 56641596
12074 56641596 49884837 33350170 15090551 -12673550 -44224393 -54579690 -38960544
12067 -38960544 -26451454 -34821900 -41743278 -24732774 -1412225 305057 -10358055
12060 -10358055 -4047864 18824873 30975028 24815188 22160573 35901536 50818849
12053 50818849 49020915 32814995 15909022 8701100 16060225 33517436 42779126 27950204
12045 27950204 75942 -12073197 -1646064 4501094 -15465145 -45424610 -55337791
12038e5337791Q485998l752399k7114580k0825420J5281586L7058273J9497687
12031b6706646n868601J677545K9661325L2042158J543095k0453287j1526141
12024C69448L29299o625893n573944K6498272N2233786K3019914l7447864n7690007
12016d886989k0026833J9848258J9135411j557368q305275l667073k629213j6590
12008b105672J0894341J8297140J3695499P147825L203832r236574k6952182k5553748
12000a0609539j708584J2598751L91384j1749097j933729P697844o248714k1340903
11992c2902587o472812K1709661K4439891L134453q486929j292248L058550m336649
11984a148670q269155Q71501J6179229K8877819L0588103J2278191j6537918k5861905
$$ plain form
12038 -55337791 -46851793 -50604192 -77718772 -98544192 -83262606 -46204333 -26706646
12031 -26706646 -32575247 -30897702 -1236377 30805781 32348876 11895589 369448
12024 369448 698747 -5927146 -11501090 14997182 67230968 90250882 52803018 -4886989
12016 -4886989 -24913822 -5065564 14069847 12512479 4207204 540131 -2089082 -2105672
12008 -2105672 8788669 27085809 40781308 47929133 51132965 41896391 14944209 -10609539
12000 -10609539 -12318123 280628 672012 -11077085 -13010814 -5312970 -11561684 -32902587
11992 -32902587 -39375399 -17665738 6774153 9908606 1421677 129429 3187979 -1148670
11984 -1148670 -9417825 -8546324 7632905 36510724 67098827 79377018 62839100 36977195
11976C6977195p827338L308470j4923811k9563680n121045L0384530K7963569
11969D1197890J814214M140112K9773109K1518939k7348317n3612623k5938130
11962h454806O180642k567296k3190476j0377271K0974063K7059030O856819o393397
11954A0087308j950866L524886K416951P71784k732570j2173950j7590207p887136
11946b5533800P356753R708619j450417r678419k111850J9286571L7010458K6861379
11938F1449294j3816469m7287374l3592028R976939K4952523m182157k6878489
11931b9377761o598058K4693580K5015157R728220J4660163K8117100J3704832
11924G9943233k1818400l7589232k3123271m407831N947472J6960459K2711518
$$ plain form
11976 36977195 29149857 32458327 17534516 -12029164 -17150209 13234321 41197890
11969 41197890 43012104 47152216 76925325 98444264 71095947 17483324 -8454806
11962 -8454806 -2274164 -4841460 -28031936 -38409207 -17435144 9623886 16480705 10087308
11954 10087308 8136442 11661328 14078279 14850063 12117493 -56457 -17646664 -25533800
11946 -25533800 -18177047 -8468428 -9918845 -19597264 -21709114 -2422543 34587915 61449294
11938 61449294 47632825 345451 -33246577 -23269638 1682885 -2499272 -29377761
11931 -29377761 -35975819 -11282239 13732918 23461138 38121301 66238401 79943233
11924 79943233 58124833 20535601 -2587670 -6995501 -1048029 15912430 38623948
11917C8623948N249387k4714537l3725268j6223922N45329N158291J3652250K6307296
11909A4872774J7062041j8428553m3141857k8195885Q361346L2155273L4957149
11902A7642288K6578367R484029j4355741k9014634k1221067k416368M040779
11895i262347p434604j9923304j5047657P776575K8944759K5224578l118883k4923415
11887a7764298j1488844K5469417M6198600L1237271j859381k7941254l7017340
11880F834171k7349438k564626J8886873J6539408l088199j3807610r403218p298336
11872b1250975r252677L990048K7686325K5832770q023320k5507546N816786M4229716
11864D3521127L2502879j4051318l2557508r195007P690517j0593283l4398195
$$ plain form
11917 38623948 43873335 19158798 -14566470 -30790392 -30245063 -25086772 -11434522 14872774
11909 14872774 31934815 13506262 -29635595 -57831480 -49470134 -17314861 17642288
11902 17642288 44220655 53704684 39348943 10334309 -10886758 -13303126 -9262347
11895 -9262347 -16696951 -36620255 -51667912 -43891337 -14946578 10278000 7159117 -17764298
11887 -17764298 -29253142 -3783725 42414875 73652146 71792765 43851511 6834171
11880 6834171 -20515267 -23079893 -4193020 12346388 9258189 -4549421 -13952639 -21250975
11872 -21250975 -30503652 -26513604 1172721 27005491 18982171 -6525375 -708589 43521127
11864 43521127 76024006 61972688 29415180 20220173 27910690 17317407 -17080788
11857a7080788l0330363o733838J3153208K3724414K3477813M746112k1972212
11850a1015654k6241178l004564J1680391m599915k2021428o643307K2177095
11843c9668560K2957167o32473r257877O593782J7132547O984778o312399j1590424
11835a3793459j8640057k4091168n413944L4365282N5527111L7125592P637904
11828G2717261m074896j1271936l0998331l9604966j0332537L1277518L8402877
11821D6114990J2191579r185406j7114261l3437070n1454570l7281938L702297
11814h6464379K2992040P647728K104153K6282113L5066630k0953k8872507q47021
11806b2112196M3720830L2179747k2146702m0657849n242775K0195145P02109
$$ plain form
11857 -17080788 -47411151 -54144989 -40991781 -17267367 6210446 10956558 -11015654
11850 -11015654 -37256832 -40261396 -28581005 -33180920 -55202348 -61845655 -39668560
11843 -39668560 -16711393 -17343866 -26601743 -20007961 -2875414 4109364 -2203035 -13793459
11835 -13793459 -32433516 -56524684 -61938628 -27573346 27953765 65079357 72717261
11828 72717261 68642365 57370429 26372098 -13232868 -23565405 7712113 46114990
11821 46114990 58306569 49121163 32006902 -1430168 -52884738 -90166676 -86464379
11814 -86464379 -63472339 -55824611 -53720458 -27438345 7628285 7607332 -21265175 -22112196
11806 -22112196 21608634 53788381 31641679 -9016170 -14258945 5936200 6638309
11799F638309j8417821J677451K6628940J2603824j8259201j8659828N547253
11792b241073J2607415k601656o858029R888011J9668762N295719j4849299j8620741
11784B289109p827086L861679Q738508M661741n467110j0461101k686243O980698
11776I0195K854246q946401q081176O128575J1995856J021695p825647P38251
11768b024406J4043624J2043683m476135k0690275k8994341k8723128j6736281
11761g5557259N014664K0946429J7719740L834187j609899M347308Q304612M383869
11753a2616349J635794O133289J1163960J0088362O029394K407921m610638j5422338
11745D809395j8215870l196418J8479999K3089228M022971j7326135j7479118
$$ plain form
11799 6638309 -11779512 -10102061 16526879 29130703 10871502 -7788326 -2241073
11792 -2241073 10366342 7764686 906657 10794668 30463430 35759149 20909850 2289109
11784 2289109 -5537977 -1676298 7062210 11723951 6256841 -4204260 -6890503 90195
11776 90195 2944441 -6001960 -14083136 -7954561 4041295 5062990 -2762657 -2024406
11768 -2024406 12019218 24062901 19586766 -1103509 -30097850 -58820978 -75557259
11761 -75557259 -70542595 -49596166 -31876426 -28042239 -29652138 -25304830 -17000218 -12616349
11753 -12616349 -10980555 -4847266 6316694 16405056 22434450 24842371 20231733 4809395
11745 4809395 -13406475 -16602893 1877106 24966334 28989305 11663170 -5815948
11738e815948j022221O715091l718966j2374213k657597P754966p936246l5794320
11730e4849454l0319156J5762249M6525345J7174332l4869746l8262270P404217
11723g1434483L1371640J255265k7836985k300374M5184622M8767232J0750025
11716C5756942j0459980L319546R659756j5350143l6643372j9343166J7219473
11709a5840944L2167123J7231054p951718k8236134l5186940j9732215J1373224
11702d6176550L0272299K3190980J2519579J9522053K6049534N151758k7388124
11695D3141529l1125860l254545J7236123R595427l008737J470564Q091037n523599
11687C6621939k8910037l3123170j2371099J1120762J8923512J5190190J3275905
$$ plain form
11738 -5815948 -6838169 -123078 -3842044 -16216257 -18873854 -11118888 -19055134 -54849454
11730 -54849454 -85168610 -69406361 -22881016 -5706684 -40576430 -78838700 -71434483
11723 -71434483 -40062843 -38807578 -66644563 -68944937 -23760315 25006917 35756942
11716 35756942 25296962 28616508 38276264 22926121 -13717251 -33060417 -15840944
11709 -15840944 16326179 33557233 25605515 -2630619 -37817559 -57549774 -46176550
11702 -46176550 -15904251 7286729 19806308 39328361 65377895 70529653 43141529
11695 43141529 12015669 8761124 25997247 35592674 32583937 34054501 42145538 36621939
11687 36621939 7711902 -25411268 -37782367 -26661605 -7738093 7452097 20728002
11680B0728002J6376273J6029545M781041j3448019k6146558k4970696j3485695
11673b0136107j215035N530697M367505m072781j1458342m859207J4889773K6120872
11665I167375J2306494j1328209j5805931K47988R741737j30472r292973L06816
11657d787175J4368011J0137808n797940q209444N744735J2219946o26491j3819060
11649I230390q456181L512742j816462k0769277k4784520l687750J6790607J2710792
11641a7269659j580706M023503K7057874L4534954J3816619p849668o320914L339388
11633D9751391m841117k3413047k4431452o440542L523215m633003p451636J2468963
11625e467228L5296491L1018825K508032j9242397j7074962n405657m009588j0673639
$$ plain form
11680 20728002 37104275 53133820 57914861 44466842 18320284 -6650412 -20136107
11673 -20136107 -21351142 -15820445 -11452940 -15525721 -26984063 -31843270 -16953497 9167375
11665 9167375 21473869 10145660 -5660271 -5412283 4329454 4198982 -5093991 -4787175
11657 -4787175 9580836 19718644 13920704 5711260 11455995 23675941 23049450 9230390
11649 9230390 774209 4286951 2470489 -18298788 -43083308 -46771058 -29980451 -17269659
11641 -17269659 -18850365 -14826862 12231012 46765966 60582585 52732917 46412003 49751391
11633 49751391 44910274 21497227 -2934225 -9374767 -5851552 -10484555 -17936191 -5467228
11625 -5467228 29829263 60848088 63356120 44113723 27038761 21633104 17623516 6949877
11617F949877j0387558k185077l36421p903965o985837J2366935K7767874J1485244
11609C0771072k3970826l5634216j0114776J5895992R779435j0354160p525271
11602c1152750J7354844L1312028J9288243k579454j7424775k2838198j8735299
11595b4775361o490279J527366m261631j0552410N31330J8530404J8857266M961118
11587a672197K429639J2566863J0151736q487725j6217995m622008r25373j7580943
11579b4358003k6132437p003138J3061145O422884o320217O890890K9938568K2611953
11571A5111645j0104642k1225700P094822L8821481L8088408J2423021j0311880
11564F9897155j9138914j8212090r531279M554039J3934561J0597075o95700j0859464
$$ plain form
11617 6949877 -3437681 -5622758 -5959179 -13863144 -20848981 -8482046 19285828 30771072
11609 30771072 6800246 -28833970 -38948746 -23052754 -13273319 -23627479 -31152750
11602 -31152750 -13797906 17514122 36802365 34222911 16798136 -6040062 -24775361
11595 -24775361 -31265640 -29738274 -33999905 -44552315 -44020985 -25490581 -6633315 -1672197
11587 -1672197 757442 13324305 23476041 14988316 -1229679 -5851687 -6777060 -24358003
11579 -24358003 -50490440 -57493578 -44432433 -38009549 -44329766 -37438876 -7500308 15111645
11571 15111645 5007003 -16218697 -9123875 29697606 67786014 80209035 69897155
11564 69897155 50758241 32546151 23014872 27568911 41503472 52100547 51404847 40545383
11556D0545383j8804705k6338313k6534393r120575K0857365L9000585K4927280
11549D4532627j1456554l6444057k9627653n641078Q800552Q637791O550604N180512
11541i467256l620835j4686033j1194059N086102J0964518j685984j1116497K95779
11533c5424265K0335264K9645945K7682587J9629060K42571k8712675m5186259
11526a1787772l3801340r466734O851078J7537142L0587843L2740777R973925
11519D2634919k0392352k9539841j8390871q748746l479583J1231590K9907439
11512C222555K8737671L704217k1360921k7116140j4922953P592647L1523505
11505A1380581L9432598K0664177o343224j3421805k766482L22653p956189o021518
$$ plain form
11556 40545383 21740678 -4597635 -31132028 -40252603 -19395238 19605347 44532627
11549 44532627 33076073 -3367984 -32995637 -38636715 -29836163 -21198372 -14647768 -9467256
11541 -9467256 -13088091 -27774124 -38968183 -33882081 -22917563 -24603547 -35720044 -35424265
11533 -35424265 -15089001 14556944 42239531 61868591 62111162 33398487 -11787772
11526 -11787772 -45589112 -55055846 -48204768 -30667626 -79783 32660994 42634919
11519 42634919 22242567 -7297274 -25688145 -34436891 -37916474 -26684884 3222555
11512 3222555 31960226 35664443 14303522 -12812618 -27735571 -20142924 11380581
11505 11380581 50813179 71477356 65134132 51712327 48945845 49268498 41312309 35290791
11497C5290791J0377551J7149887K263378j5322015j8595055j4763828j2440659
11490C960050n279799P583692J1527095J641774o818919o379393r220796j7326954
11482b0313250j1017825J3220989K4196272K217988k2982882j3496310J7789736
11475a0385282K6128297J069673k3543567k2505765p268181L203578Q815519J4507680
11467i978048J3856682J947032j0153555q798875K055669O167328l269435j6697872
11459b4871074k1249430j2475634O426401K7471767L6824683K2256455p872204
11452B6510964k2757861m531652J9715469P423131l5291187n2379251j6421427
11445g7731814K7277405K5922801l859973j0038010P928513O331436j6402505
$$ plain form
11497 35290791 45668342 62818229 65081607 49759592 31164537 16400709 3960050
11490 3960050 -1319749 6263943 17791038 19432812 12613893 6234500 -2986296 -20313250
11482 -20313250 -31331075 -18110086 6086186 8304174 -14678708 -28175018 -10385282
11475 -10385282 15743015 16812688 -6730879 -29236644 -36504825 -33301247 -24485728 -9978048
11467 -9978048 3878634 5825666 -4327889 -13126764 -11071095 -4903767 -8173202 -24871074
11459 -24871074 -46120504 -58596138 -52169737 -24697970 12126713 34383168 26510964
11452 26510964 3753103 -778549 18936920 26360051 -8931136 -61310387 -77731814
11445 -77731814 -50454409 -24531608 -28391581 -38429591 -30501078 -24169642 -40572147
11438d0572147r479543L9010644O5951295K3823675m3600896o1583825k4427872
11431e0878669J2518080J6380597L872789k743479k128403K151678R345225J1460441
11423b1741O93960j4249162j9468769j7432495j7230562j2945840N003899K5810845
11415d9839865L0349203K0549188J3230201J1934048Q674897N586650Q997033
11408D9481355R255731n981351k4062836k1649659k944539N677709k727914r496378
11400b447882n938793m037188p508775k292925J5747817K9368931K5106847Q624150
11392E6622182j0244958k5974047k8264287r967006J1833286J0340760r055516
11385d709586j1247289J4265027L3335032J8363880j0284808j7908431o571279
$$ plain form
11438 -40572147 -50051690 -11041046 54910249 78733924 35133028 -26450797 -50878669
11431 -50878669 -38360589 -21979992 -18107203 -20850682 -22979085 -20827407 -11482182 -21741
11423 -21741 672219 -13576943 -33045712 -50478207 -67708769 -80654609 -75650710 -49839865
11415 -49839865 -19490662 1058526 14288727 26222775 34897672 40484322 49481355
11408 49481355 58737086 52755735 28692899 7043240 4098701 9776410 7048496 -2447882
11400 -2447882 -8386675 -12423863 -19932638 -22225563 -6477746 22891185 47998032 56622182
11392 56622182 46377224 20403177 -7861110 -17828116 -5994830 4345930 -4709586
11385 -4709586 -15956875 -1691848 31643184 50007064 39722256 21813825 15242546
11378A5242546l822650j5155544j7721153J471243K4425446K4277164k470030
11371B6247022l0027982k8625620K403826L0818018K8876917P251307m434904
11364C2508584k537636q165730k3627674k4466867l142495J3807832Q294549j703682
11356i033119K190579O602512l235365r752025O569901K6074342J7597592q566334
11348B8448083j5753553m0242O920090p351035j8535511q764544P782399J3267950
11340E973637J0408957O041005l347043j5980001j7650576n130990K763509p162290
11332b4083792k0382872j5911895L940822K0600777K5222600K2560073J6757888
11325B8703601P653859k524727r151090r579217k764512R304997J6285787O366139
$$ plain form
11378 15242546 11419896 -3735648 -21456801 -19985558 4439888 28717052 26247022
11371 26247022 -3780960 -32406580 -30002754 815264 29692181 36943488 32508584
11364 32508584 29970948 21805218 -1822456 -26289323 -29431818 -15623986 -7329437 -9033119
11356 -9033119 -6842540 -240028 -3475393 -13227418 -6657517 19416825 37014417 28448083
11348 28448083 12694530 12654288 19574378 12223343 -6312168 -15076712 -7294313 5973637
11340 5973637 16382594 22423599 19076556 3096555 -14554021 -19685011 -16921502 -24083792
11332 -24083792 -44466664 -60378559 -56437737 -35836960 -10614360 11945713 28703601
11325 28703601 36357460 33832733 24681643 15102426 12337914 21642911 37928698 44294837
11317D4294837j4807414k4101361j0089373Q968431R766523l112052o233787O179114
11309A0864918J5017564P440638l664075o03272J1741916J2433103o717925l0260576
11301A6252291l7182989k2366094J336745J6732644J5705395L544105o390762
11294a2368665m368708O483012J3984387J1352993M392186J400889J224681j649635
11286B0451140m248780J615799J3186933J5887796K951393j4162211k0632003
11279A5050067j4497590k246234J1508117K1650696J9874204N391208r148474
11272D7581994j3100102j1815084j4541886j7463350j2550071m853489m516731
11265c1258719q119899n571711O9191j332477o153837l145459M072541M030284
$$ plain form
11317 44294837 29487423 5386062 -4703311 4265120 14031643 10919591 4685804 10864918
11309 10864918 25882482 33323120 29659045 29055773 40797689 53230792 46512867 16252291
11301 16252291 -20930698 -43296792 -41960047 -25227403 -9522008 -5977903 -12368665
11294 -12368665 -16737373 -10254361 3730026 15083019 19475205 20876094 22100775 20451140
11286 20451140 16202360 17818159 31005092 46892888 49844281 35682070 15050067
11279 15050067 552477 -1693757 9814360 31465056 51339260 56730468 47581994
11272 47581994 34481892 22666808 8124922 -9338428 -21888499 -26741988 -31258719
11265 -31258719 -39378618 -44950329 -44881138 -46213615 -52367452 -55512911 -51440370 -47410086
11257d7410086K677886J3534818K4762592J0746273j8969915k1509829J4327059
11250b1841202M4116143L2237356L112173l973111K648575q048662k8200990k4703036
11242d652754j166918N667671j0667558j6449681K575262J8670708J2295965J276159
11234G548854J532567o80667j3850500j6340989M257957K0249904O415473j4867446
11226e734847r294452J1934545J3121831m238316p302733R061985J7112275R646625
11218C4306913R794366J9545586Q017625k9649879m7952365j6695400K6168043
11211C534889K5802809j2198784l7450643k9695363j3378073n077280P601294
11204f0861151K9092679L7974443K0868674n260961j9679193k2255899j7752718
$$ plain form
11257 -47410086 -44732200 -31197382 -6434790 4311483 -14658432 -36168261 -21841202
11250 -21841202 22274941 54512297 57624470 53651359 56299934 48251272 20050282 -4652754
11242 -4652754 -5819672 -152001 -10819559 -27269240 -24693978 -6023270 6272695 7548854
11234 7548854 9081421 8400754 -5449746 -21790735 -17532778 2717126 9132599 -5734847
11226 -5734847 -15029299 -3094754 10027077 5788761 -1513972 7548013 24660288 34306913
11218 34306913 44101279 63646865 71664490 42014611 -5937754 -22633154 3534889
11211 3534889 29337698 17138914 -20311729 -50007092 -63385165 -68462445 -60861151
11204 -60861151 -31768472 6205971 27074645 21813684 2134491 -20121408 -37874126
11197c7874126j113802K3484333L1751201J0418920j7209629j9823068M39196
11190i926975J6948195J6828437O665363q611867k4897071k4756418M600224M0734901
11182A7584789M4931456J5050344j1453035j3018947q538574j4910086j7265849
11175A2380098m359662R92390j9126336l5538298j1709395L0517154L3675096
11168F831047r065341l9929108k1152305J2198231J1059369j2132737p229963
11161e9420807L1915503N4042928K3383926k8821609m4681513j2658761K3021575
11154a3218758K1841249n842760k0286193o637199J1190966R248261m443531p255111
11146a5403076L429741J0112438L085724q739335j3511105q421313L731640J6723826
$$ plain form
11197 -37874126 -38987928 -15503595 16247606 26666526 9456897 -10366171 -9926975
11190 -9926975 7021220 23849657 30515020 21903153 -2993918 -27750336 -23150112 17584789
11182 17584789 62516245 77566589 66113554 53094607 44556033 29645947 12380098
11175 12380098 8020436 9012826 -10113510 -45651808 -57361203 -26844049 6831047
11168 6831047 -2234294 -42163402 -63315707 -51117476 -40058107 -52190844 -59420807
11161 -59420807 -27505304 26537624 49921550 21099941 -23581572 -36240333 -13218758
11154 -13218758 8622491 2779731 -17506462 -24143661 -12952695 -3704434 -8147965 -15403076
11146 -15403076 -11973335 -1860897 1224827 -7514508 -21025613 -29446926 -25715286 -8991460
11138h991460J9880736P974747p911484j2154887o039714l524713p701879q007420
11130b6476074L62290J1980269K3909857L2360857K1121521j7408661n0162316
11123d312257l0822488K9355890N8368492J5103874n1086734o4868319k0463252
11116f8724794K5076464L2653062J3347058p661013j7524143r812709J1443759
11109b1202316K2894639Q206669j1304160m804505J6619334J5672947q520763
11102A7561845j9000444n093684P13955j7548307l0263434j3790716J1367812
11095e6052973J9117466J6112646J4851071O408237r490225n650990K3852512
11088I147744L3305020r048789n6257479m0544835K3404325N4977156K2207256
$$ plain form
11138 -8991460 10889276 18864023 10952539 -1202348 -7242062 -10766775 -18468654 -26476074
11130 -26476074 -26113784 -14133515 9776342 42137199 63258720 45850059 -4312257
11123 -4312257 -35134745 -5778855 52589637 67693511 16606777 -48261542 -68724794
11116 -68724794 -43648330 -10995268 2351790 -5309223 -22833366 -32646075 -21202316
11109 -21202316 1692323 9898992 -1405168 -6209673 10409661 26082608 17561845
11102 17561845 -1438599 -6532283 -5818328 -23366635 -53630069 -67420785 -56052973
11095 -56052973 -36935507 -20822861 -5971790 436447 -9053778 -14704768 9147744
11088 9147744 42452764 33403975 -22853504 -63398339 -39994014 14983142 37190398
11081C7190398k1469940k3045275L948561J8948019J3082815J206652j0300640
11074A9560590j9925063j8753426m475357J0025952J6661903K0933650K0451245
11067D4479494J363653k9259454l7035643p812002K5147705K6623298P380536
11060C0887587j890631q63161q249545j8217296r495677R992757R454018j2769230
11052a151178k2595406l481799J9117917J9917856R145633P426134J0990723L895630
11044D3265510j2878835k5231263k6181745j5779391N694406K7894929K9038089
11037B5821700N115115j3279902J192882K8183505K4048314j2198949l2296166
11030B6586499p326931K9332700K8458542q474762l5786343k5099918N728955
$$ plain form
11081 37190398 15720458 -7324817 -3376256 15571763 28654578 29861230 19560590
11074 19560590 -364473 -19117899 -23593256 -13567304 3094599 24028249 44479494
11067 44479494 45843147 16583693 -20451950 -28263952 -3116247 23507051 30887587
11060 30887587 28996956 28133795 19884250 1666954 -7828723 2164034 11618052 -1151178
11052 -1151178 -23746584 -27228383 -8110466 11807390 20953023 28379157 39369880 43265510
11044 43265510 30386675 5155412 -21026333 -36805724 -31111318 -3216389 25821700
11037 25821700 30936815 17656913 18849795 47033300 71081614 58882665 26586499
11030 26586499 19259568 48592268 77050810 68576048 32789705 7689787 13418742
11023A3418742K2648441J2595182j1717504k7594355j9536408O540067K4525208
11016B0879373J5757753n141974p860430R997098J8379571P45628j9317602j4175410
11008A9264007N328295Q232575q394596j9194265j4502254j3044564k4182794
11001d6493596k6938862l659883K6961841L2886025J2424187p675719j1839420
10994b4335427j0451533j4138245j4980470k710956J5286060K3068111J7691561
10987a0570899R742668N905940K697507k060287k805423L411776Q505704M019753
10979A8846739m296723l183762P531452J2849040M889458m577683k771217K801576
10971C2088880m318773k1538469k7041224j0352397J0729474J1554080q825449
$$ plain form
11023 13418742 36067183 48662365 36944861 9350506 -10185902 -3645835 20879373
11016 20879373 36637126 31495152 23634722 33631820 52011391 52757019 33439417 19264007
11008 19264007 24592302 32824877 24430281 5236016 -9266238 -22310802 -46493596
11001 -46493596 -73432458 -77092341 -50130500 -17244475 -4820288 -12496007 -24335427
10994 -24335427 -34786960 -48925205 -63905675 -66616631 -51330571 -28262460 -10570899
10987 -10570899 -828231 5077709 7775216 5714929 2909506 6321282 14826986 18846739
10979 18846739 14550016 11366254 18897706 31746746 36636204 32058521 29287304 32088880
10971 32088880 27770107 6231638 -20809586 -31161983 -20432509 -8878429 -17703878
10964a7703878k6574626k0071131O905921K9166900K6610443N920523q205392
10957c951240l863005N429207L829985m303984p144678p133561j0760048q275440
10949c6172764J0365098K7405084J7686595n531901l904888K1715827K4697593
10942E6260644j2463551m2371582k3331562J4750988J8136711q511875j8921918
10935a6452145m185511R08123j5816059k5022602q464703J5069851K5245006K3047199
10927e670841J1506611q895144k0282674k531934K5623839K3150793q053345k1853785
10919g006480l716565N646712j5656721k9074210l571686K6366717J7877978p629066
10911a6763321l786035K0433350J9138481j0489875k5484870q215249J2074861
$$ plain form
10964 -17703878 -44278504 -64349635 -57443714 -28276814 -1666371 4254152 -3951240
10957 -3951240 -7814245 -2385038 1444947 -2859037 -10003715 -17137276 -27897324 -36172764
10949 -36172764 -25807666 1597418 19284013 13752112 9847224 31563051 56260644
10942 56260644 43797093 1425511 -21906051 -7155063 10981648 2469773 -16452145
10935 -16452145 -20637656 -19729533 -35545592 -60568194 -69032897 -53963046 -28718040 -5670841
10927 -5670841 5835770 -3059374 -23342048 -25873982 -250143 22900650 14847305 -7006480
10919 -7006480 -10723045 -5076333 -20733054 -49807264 -53378950 -27012233 -9134255 -16763321
10911 -16763321 -20549356 -116006 19022475 8532600 -16952270 -25167519 -13092658
10904a3092658J0639424l098405j1612373j0239551P55841J6865281K3720835
10897A3938394J4884344O344541R111594N034050j9001768l5109190j3915458
10890a8713493K0562569K4369884M383120R5432Q864456n958353l7425313l6206057
10882d0027755L061011K6188798P527271j1999096J457234K4424453K6957774
10875C7589690J6228987J414883k7381352n6013568m2925121P150445K9294401
10868c4641635k145361k7084511j366087K6199606L397951k7140697k777353M2347399
10860b3210688L2940541j4187943j8256996K4254273L5570507n786184k9723356
10853A600154K120175L3942241J4246406k3209265k3961060L176194J5140936
$$ plain form
10904 -13092658 -2453234 -5551639 -17164012 -27403563 -26647722 -9782441 13938394
10897 13938394 28822738 35167279 44278873 49312923 30311155 -4798035 -18713493
10890 -18713493 1849076 26218960 30602080 30697512 39561968 33603615 -3821698 -40027755
10882 -40027755 -36966744 -10777946 -3250675 -15249771 -13792537 10631916 37589690
10875 37589690 53818677 55233560 27852208 -28161360 -71086481 -63936036 -34641635
10868 -34641635 -36786996 -63871507 -65237594 -39037988 -35640037 -62780734 -65558087 -23210688
10860 -23210688 9729853 -4458090 -22715086 1539187 37109694 31323510 1600154
10853 1600154 3720329 37662570 51908976 28699711 4738651 7914845 23055781
10846B3055781K886281j2690487k0500718k0448693j0375112L985995R200571
10839b4886382P384897J2210553J7448471O158800p369516O941536L2806236J9411620
10831G0106215l0780194n1106838j3673782K3251212R529705j9452823j1414966
10824b3541471J4118361R052803j6038137j6518744N875212J4999625J0383772
10817a668579J8980100L2173415J7027641j6687245k4194297j92098J4061384
10810C9500321K455762n071933O315812R930693r163062k3699600j1950823M428408
10802A2745578j799658j9003745j8603481K33344J4014636J0256998r85012m483052
10794g624392L500819J2254900P320583j0184739j9228479n132230J6661924J9121850
$$ plain form
10846 23055781 25942062 13251575 -7249143 -27697836 -38072948 -34086953 -24886382
10839 -24886382 -17501485 -5290932 12157539 18316339 10946823 17888359 50694595 70106215
10831 70106215 39326021 -11780817 -25454599 -2203387 7326318 -12126505 -23541471
10824 -23541471 -9423110 -370307 -16408444 -32927188 -27051976 -12052351 -1668579
10817 -1668579 17311521 49484936 66512577 49825332 25631035 25438937 39500321
10810 39500321 41956083 36884150 43199962 53130655 43967593 20267993 8317170 12745578
10802 12745578 10945920 -8057825 -26661306 -26427962 -12413326 -2156328 -3141340 -7624392
10794 -7624392 -4123573 8131327 15451910 5267171 -13961308 -19093538 -2431614 16690236
10786A6690236r87209k4357867l7044201l5595269j5075827J9999445M1303035
10779c5067657K6003025m366699r195835J0349607J5413429n016837j8141559
10772b0022526o466766M257719l946979o966370J5106461L5457723K1460066j0061437
10764B8817891j8271401o44319R248554l497073j8558807j6381503j099411J4014547
10756f371522K1112159J6307053K137995p830157k196227J1010099J3296325q5158
10748D7380567j6518955k3116572j6824456k793373P033520J251052j3863541
10741a7451758j4415420R643458L3621413K7194178l533466k4086627j7169426
10734f197648J986875J4303080J6965903J1052642o953879k9924156l5536406
$$ plain form
10786 16690236 15703027 -8654840 -45699041 -81294310 -96370137 -76370692 -35067657
10779 -35067657 -9064632 -13431331 -22627166 -12277559 3135870 -1880967 -20022526
10772 -20022526 -26489292 -22231573 -26178552 -33144922 -18038461 17419262 38879328 28817891
10764 28817891 10546490 9902171 19150725 15653652 -2905155 -19286658 -20386069 -6371522
10756 -6371522 14740637 31047690 33185685 25355528 23159301 34169400 47465725 47380567
10748 47380567 30861612 7745040 -9079416 -11872789 -4839269 -3588217 -17451758
10741 -17451758 -31867178 -22223720 11397693 38591871 35058405 10971778 -6197648
10734 -6197648 -4210773 10092307 27058210 38110852 31156973 1232817 -34303589
10727c4303589j3528119J4072445J7386363k073071j4082932k312220J3161307
10720b1679816N519484j9200256k9570521j2609333J0266996J7550452J7239906
10713c2483088K5324803L1893244J6000866j3322538k2931822m919944J1571572
10706A1133093P278405l38028N793119R422379p993921k8135012k1133593N797109
10698a8176449J9800405J3105047P330751J1209397R684916k270357q671641l040840
10690B8971229J34056n833431p910054j508172k005630j3356271j4198877M157440
10682a1549710J3770449p670250l3692943k3738366J3376662L0694953J3938186
10675d871019n76936J2863268K9668713J7801058j0564915k0771042r934385m905971
$$ plain form
10727 -34303589 -47831708 -33759263 -16372900 -18445971 -32528903 -34841123 -21679816
10720 -21679816 -16160332 -35360588 -64931109 -77540442 -67273446 -49722994 -32483088
10713 -32483088 -7158285 24734959 40735825 27413287 4481465 -438479 11133093
10706 11133093 18411498 18073470 23866589 33288968 25295047 -2839965 -23973558 -18176449
10698 -18176449 1623956 14729003 22059754 33269151 42954067 40683710 32012069 28971229
10690 28971229 29105285 23271854 15361800 13853628 11847998 -1508273 -15707150 -11549710
10682 -11549710 2220739 -5449511 -39142454 -62880820 -49504158 -18809205 -4871019
10675 -4871019 -5447955 7415313 37084026 54885084 44320169 23549127 13614742 8708771
10667H708771j3533749j3652643M562767J7632680N388687j6289717k0110126
10660b7293330o963566K456828K853464M963952Q622207L824456l319956L852585
10652a1003360J7498042Q395685k4499034m0494846j4043160K3400599K6490193
10645a4255881j218630j9953152j3389629l60615M604137O982253R908596P887049
10637a9795872M470746Q631910J3546731O298724m269283j118085L428521j6469624
10629e276232m5891929l8450394Q639106L9202879K0978437n283372O110558L3735364
10621A3764417L0826418L035775r266666k116765m853594j9199677j7559892J241240
10613d128744P077362p398724j5711210o773205L56337q11209P950270K7015555
$$ plain form
10667 8708771 -4824978 -18477621 -13914854 3717826 9106513 -7183204 -27293330
10660 -27293330 -34256896 -31800068 -28946604 -23982652 -15360445 -11535989 -14855945 -11003360
10652 -11003360 6494682 14890367 -9608667 -50103513 -64146673 -40746074 -14255881
10645 -14255881 -15474511 -35427663 -48817292 -49177907 -44573770 -37591517 -27682921 -19795872
10637 -19795872 -15325126 -6693216 6853515 13152239 8882956 7764871 11193392 -5276232
10629 -5276232 -51168161 -89618555 -80979449 -41776570 -20798133 -26081505 -19970947 13764417
10621 13764417 44590835 47626610 38359944 36243179 31389585 12189908 -5369984 -4128744
10613 -4128744 2948618 -4450106 -20161316 -26934521 -26578184 -27389393 -19439123 7576432
10605G576432K8926603P080995r076199o600940j2086315l7073566m5932898j3895563
10597h1081451K2877433J9299795p798698r639609J6200713L0129952K0950949
10590A0939084J6959679K6063446J8081386j8385916m6447144l3672208j733521
10583b8195194O956446q462933j1381202J2863347L3449848J8865837j6612750
10576G483399l0469703q217542K0046768K4276505J3877814J4713322K3405885
10569F5116448J3817540j6351667l8598008l7396526k7739584j9052796K258561
10562e7946032L5132272M5511841J6806864j2079067J209678L4912984L3021615
10555I6570155r785672m1471775l0582538m738345j24135j1237598j0726644O638301
$$ plain form
10605 7576432 36503035 43584030 34507831 27906891 15820576 -21252990 -67185888 -81081451
10597 -81081451 -58204018 -38904223 -46702921 -56342530 -40141817 -10011865 10939084
10590 10939084 27898763 53962209 72043595 53657679 7210535 -26461673 -28195194
10583 -28195194 -21238748 -29701681 -41082883 -28219536 5230312 24096149 7483399
10576 7483399 -22986304 -31203846 -11157078 13119427 26997241 41710563 65116448
10569 65116448 78933988 62582321 23984313 -13412213 -41151797 -60204593 -57946032
10562 -57946032 -22813760 22698081 39504945 27425878 28635556 63548540 96570155
10555 96570155 86784483 45312708 14730170 9991825 9867690 -1369908 -12096552 -5458251
10547e458251K0446876J2424049j4189446l5747425k7596118P231473L3508933
10540i379909K3713522m530384j2292911N879906J8911298R897654j281489N837929
10532C6755616K0419171J8833511k556832k5755768l1837094j6723156N437624
10525D573072J3381636J131622j4311554j6031062q545791m378930k621541K828962
10517b3973586P977432R709958J5076119K0612795O025303k6854009l8409698
10510b9835686q640108K1977059J3044198p949192N487124L4139059K6851801
10503E5074255o082719j2718417N013165K663613j2131873O307040L8764317K2074607
10495I8963988k3391060j2004005M5006412M0964820k2981057n341203J18393149
$$ plain form
10547 -5458251 14988625 27412674 13223228 -22524197 -50120315 -42888842 -9379909
10540 -9379909 14333613 9803229 -2489682 3390224 22301522 32199176 30917687 36755616
10532 36755616 57174787 76008298 73451466 47695698 15858604 -864552 4573072
10525 4573072 17954708 19086330 4774776 -11256286 -19802077 -24181007 -26802548 -23973586
10517 -23973586 -15996154 -6286196 8789923 29402718 35428021 8574012 -29835686
10510 -29835686 -38475794 -16498735 -3454537 -11403729 -5916605 28222454 55074255
10503 55074255 48991536 36273119 41286284 43949897 31818024 38125064 76889381 98963988
10495 98963988 75572928 63568923 108575335 149540155 126559098 121217895 239611044
10488B39611044J43255725o7293148l15573835l05299223n7138700J30775046
10482b31663091J03736665P426065M719210N2519966M3100015m810386j3837014
10475c8808570P085846J395336k2455793j6057118J6393073K9539029J0013482
10468a2894715j9248302l8448792l3365443N523373N1402034N1226305J195787
10461E390247l5543268k1022323K682190p124268j8748075J1373598N1994334
10454a0997565M3089918m535690k6224876k770397K1365275J3304202r503197
10447B3727670j8314418r315801L914257O656879p336206k4321973j9354139P732520
10439c6611211K4865272J4076068j189706K098688Q195449l571622j7215492j0232727
$$ plain form
10488 239611044 382866769 315573621 -214 -305299437 -362438137 -231663091
10482 -231663091 -127926426 -120500361 -115781151 -63261185 -20161170 -24971556 -38808570
10475 -38808570 -31722724 -30327388 -52783181 -68840299 -52447226 -22908197 -12894715
10468 -12894715 -32143017 -70591809 -103957252 -98433879 -47031845 4194460 5390247
10461 5390247 -30153021 -51175344 -48493154 -55617422 -74365497 -62991899 -10997565
10454 -10997565 32092353 27556663 1331787 -1438610 19926665 33230867 23727670
10447 23727670 5413252 -3902549 11708 6668587 -667619 -24989592 -44343731 -36611211
10439 -36611211 -11745939 2330129 1140423 3239111 11434560 7862938 -9352554 -19585281
10431a9585281R38060j1576834l3738159k8277394N248951L0790180K9016455
10424b7184022J2943229l573741j7545035k0888691n765601J4875158J9243496
10417b7895207P388123k444101k149613L091100J1103574J9955688J9008340M575295
10409C2633199p547265o778087q624295k5521594l5712439j4070532K1037646
10402d4583367K9102832P543013o801543N955852K5497280K7101602J1095149
10395E4910818q591463k1779827k3273424j4485666n595708l161314L6095J0420043
10387a1520446J8796394J5192058O745006M296529M351148J301967J541801O703952
10379D7408409J902172j7037164k5197106m193658K3350765K4567910L555745
$$ plain form
10431 -19585281 -18647221 -30224055 -63962214 -92239608 -86990657 -56200477 -27184022
10424 -27184022 -14240793 -17814534 -35359569 -56248260 -62013861 -47138703 -27895207
10417 -27895207 -20507084 -22951185 -25100798 -22009698 -10906124 9049564 28057904 32633199
10409 32633199 25085934 18307847 9683552 -15838042 -51550481 -65621013 -44583367
10402 -44583367 -15480535 -7937522 -14739065 -8783213 16714067 43815669 54910818
10395 54910818 46319355 24539528 1266104 -13219562 -18815270 -21976584 -21940489 -11520446
10387 -11520446 7275948 22468006 29213012 33509541 37860689 39162656 40704457 47408409
10379 47408409 49310581 32273417 7076311 2882653 26233418 50801328 54357073
10372E4357073j2862987j7993594k0257636j3875334P274297K1790488P051692
10365B5483999j8794067k1864353p971281q814389k1578076j1646940K4024308
10358d1160799M4290363K4022586j2542986k9876517k0744693P30951J7819135
10351a7461960J7253780N90739r656648K633044J9960144J6264778k346787j2321911
10343A4915179j3853788k0272516k0263140N214258L7631315L9336701J2316901
10336E5024910p039935o349056l596104k904900M313427K416494k5642126m6108583
10328b9885873j3327007M1778761M1101183j4812328l8079960N518602L9223776
10321C1517154L953989m3714047k8865643J9273939K3590446j3717641k6589438
$$ plain form
10372 54357073 41494086 23500492 3242856 -10632478 -3358181 18432307 25483999
10365 25483999 6689932 -15174421 -23145702 -31960091 -53538167 -65185107 -41160799
10358 -41160799 3129564 27152150 14609164 -15267353 -36012046 -35281095 -17461960
10351 -17461960 -208180 382559 -9274089 -6641045 13319099 29583877 27237090 14915179
10343 14915179 1061391 -19211125 -39474265 -34260007 3371308 42708009 55024910
10336 55024910 47984975 41635919 38039815 35134915 39448342 41864836 16222710 -29885873
10328 -29885873 -43212880 -1434119 39667064 24854736 -13225224 -7706622 31517154
10321 31517154 35471143 -8242904 -37108547 -17834608 5755838 -7961803 -34551241
10314c4551241J885298K4072604J3904854k605017k529392N283601R529499J0224927
10306B5215133L759372r442928r910756J2417840K7269060J865813m1581039m9770454
10298d0177959j3649932K2359011K4404128L540584j4099536j6364338l099065
10291c7087107J5046603J7160663k509870j6982220j960912K2962103K1294402
10284A7923662m013149j8303865r740111L052092R927644J4984899J0683100r961458
10276A4552814k1920784J875523L3056009J7449685l3452765m4579992J0051217
10269b2968293O0459424M2008270j2215280k9256336l656938J1650313l058073
10262D2963087j3120716M155158K4653248J9564890n058863k5138372k9790070
$$ plain form
10314 -34551241 -32665943 -8593339 5311515 2706498 177106 5460707 14990206 25215133
10306 25215133 28974505 19531577 9620821 22038661 49307721 51173534 9592495 -40177959
10298 -40177959 -53827891 -31468880 -7064752 -3524168 -17623704 -33988042 -37087107
10291 -37087107 -22040504 -4879841 -7389711 -24371931 -26332843 -3370740 17923662
10284 17923662 13910513 -4393352 -14133463 -11081371 -1153727 13831172 24514272 14552814
10276 14552814 -7367970 -5492447 27563562 45013247 11560482 -33019510 -22968293
10269 -22968293 37491131 79499401 67284121 38027785 34370847 46021160 42963087
10262 42963087 29842371 33997529 58650777 78215667 73156804 48018432 18228362
10255A8228362k3344410j3994320r999699j4029750j5637296j995196K0148362
10248d0623947K7660330J1958023p622865j0407237j377524J386910l688452k702322
10240b5417084N904170N193895j1295423k2115482n603740K5091606L4900334
10233F658276J2572131j6764580k7626061k1563487j0130882P046181K9263039
10226b0545383L7660886J6873832j4120258j9277057N770548K5509305J1031248
10219D2903121k4080285m3157276k8006653P524711L5061383L5066239J0818982
10212C6130222j4509638k0352726j0589836n491200j2329829j7105687q408654
10205e2657348O331546J6529395K4776009L4283581L3717978J3672474r934613
$$ plain form
10255 18228362 -5116048 -19110368 -29110067 -43139817 -58777113 -60772309 -40623947
10248 -40623947 -12963617 -1005594 -8628459 -19035696 -20413220 -19026310 -22714762 -25417084
10240 -25417084 -19512914 -14319019 -25614442 -47729924 -53333664 -28242058 6658276
10233 6658276 19230407 2465827 -25160234 -46723721 -56854603 -49808422 -20545383
10226 -20545383 17115503 33989335 19869077 592020 6362568 31871873 42903121
10219 42903121 18822836 -24334440 -52341093 -44816382 -9754999 25311240 36130222
10212 36130222 21620584 1267858 -9321978 -14813178 -27143007 -44248694 -52657348
10205 -52657348 -46325802 -29796407 -5020398 29263183 62981161 76653635 66719022
10198F6719022j1615330N730586J2282988l740155j7013769n855179R775380l106268
10190E3177275l6215905m6779478j9292123J1596589J1539789q496937j7588907
10183e2059697j1888742q895298r931437j01462J8990348K5894458J0862461j2512368
10175c9641737k8821157l2693045j9942298Q510552L2839369L0945888J2251404
10168c6551024P578432K1437225K5540759P117015j1033227j1672063q348968
10161e931851j1105583l859042J8730992K7719623N424414j8014548j0717735
10154B246270Q183733M357768j0239523j621319K0643080J7431162j0746522k4138741
10146F115908j0281365L713542N786597J0781156J3462838j1153108m7822793
$$ plain form
10198 66719022 55103692 60834278 73117266 69377111 52363342 46508163 56283543 53177275
10190 53177275 16961370 -29818108 -49110231 -37513642 -25973853 -34470790 -52059697
10183 -52059697 -63948439 -72843737 -82775174 -82876636 -63886288 -37991830 -27129369 -39641737
10175 -39641737 -68462894 -101155939 -121098237 -112587685 -79748316 -48802428 -36551024
10168 -36551024 -28972592 -7535367 18005392 25122407 14089180 2417117 -5931851
10161 -5931851 -17037434 -20896476 -2165484 25554139 30978553 12964005 2246270
10154 2246270 10430003 14787771 4548248 2926929 23570009 41001171 30254649 6115908
10146 6115908 -4165457 -451915 5334682 16115838 29578676 18425568 -29397225
10139b9397225m2375903J2904099N2561391L0060407j4728222k0253877R644626
10132a584704K9543942K5808158J5501162J49900k7273940m7483702l5753920
10125d1093104n918964Q391465L420321l208357j2050655k7222762k2108918K3489349
10117g6301625O4998391L8028624l8452159p3294493l0664086K2889107K5209491
10110f7586750M584659J5081394M3180509L8145155p76684k7760879k2082268
10103a7214864m323082P472291J2432540O536711j1174265k0333250n622431R570962
10095b2655388l071543k2313806o375827L1485700L4662106n455739l0652147
10088b4376644o089036K8306221K5954607J967402n244426J650408j798763r823871
$$ plain form
10139 -29397225 -71773128 -58869029 -6307638 23752769 9024547 -11229330 -1584704
10132 -1584704 27959238 53767396 69268558 69418458 42144518 -5339184 -41093104
10125 -41093104 -47012068 -38620603 -35200282 -38408639 -50459294 -77682056 -99790974 -76301625
10117 -76301625 -11303234 26725390 -11726769 -85021262 -115685348 -92796241 -67586750
10110 -67586750 -63002091 -47920697 -4740188 33404967 32628283 4867404 -17214864
10103 -17214864 -21537946 -14065655 -1633115 4903596 -6270669 -26603919 -32226350 -22655388
10095 -22655388 -25726931 -48040737 -54416564 -22930864 11731242 6275503 -24376644
10088 -24376644 -30465680 -2159459 23795148 25762550 20518124 22168532 20369769 10545898
10080A0545898j858781J0956052J653061k2526329k9311755j3331539J028146
10073d2845247L616102O303069R149172j549881j8733436j6533242N626695J6685179
10065c8281589L008059r851951p6323J6631878J7175884R314774J3796309K5329793
10057C7046834J9534592p045413k8287503k3137895k308074Q101766J504902k381603
10049C027606J1735932K8130718J8854281j3769911l4898741k4497859l714771
10042a5132745J498809q87676P970725J6889771J986597k6529702l2861406q143172
10034e5208799K0623947L3516098L4235291K3045174p403223m1559766m5309914
10027c8061192j5344835R859105M521987j0627684o547481J2204585K3894046
$$ plain form
10080 10545898 8687117 19643169 21296230 -1230099 -30541854 -43873393 -42845247
10073 -42845247 -39229145 -32926076 -23776904 -25326785 -44060221 -60593463 -54966768 -38281589
10065 -38281589 -35273530 -45125481 -45201804 -28569926 -11394042 -2079268 11717041 37046834
10057 37046834 56581426 49536013 21248510 -1889385 -4197459 3904307 5409209 3027606
10049 3027606 14763538 42894256 61748537 47978626 13079885 -11417974 -15132745
10042 -15132745 -13633936 -14521612 -6550887 10338884 12325481 -14204221 -47065627 -55208799
10034 -55208799 -34584852 -1068754 33166537 56211711 48808488 7248722 -38061192
10027 -38061192 -53406027 -43546922 -39024935 -49652619 -56200100 -43995515 -20101469
10020b0101469K1931724J1269329m225723j3911316l695266J7470349K0380651
10013B9118279n1449j2745684j12169J3628668O875855j461385J0358172K3221277
10005F8831564R430775j6530931k1646171j1174117j7900245m3068901n0369479
9998h2427505k0688202K1024831M0072880K9592845Q642743j307852M477265J0276920
9990I663925j93057j7690575j7291372J629375J1364962K152697m11142J6612722
9982E837535K4228551J06166k7169765k0256793Q565878K1957921J5721190R378032
9974C8368715J796990j6486363k6657739q118727J4840717O134093j6752590q828084
9966a5702988K1572926K3698940n366498j2165875J9318096L5650294K730144
$$ plain form
10020 -20101469 1830255 13099584 8873861 -5037455 -8732721 8737628 29118279
10013 29118279 29066830 16321146 16208977 29837645 36713500 35252115 45610287 68831564
10005 68831564 78262339 61731408 40085237 28911120 11010875 -32058026 -82427505
9998 -82427505 -103115707 -82090876 -42017996 -12425151 -3782408 -5090260 -612995 9663925
9990 9663925 9470868 -8219707 -25511079 -23881704 -12516742 -10364045 -10775187 5837535
9982 5837535 30066086 30172252 3002487 -17254306 -8688428 13269493 28990683 38368715
9974 38368715 40165705 23679342 -2978397 -11097124 3743593 9877686 -6874904 -15702988
9966 -15702988 5869938 29568878 24202380 12036505 31354601 67004895 69735039
9959F9735039l6383600l1225625o14462N755231j4861459k6036484j4482745o07471
9951d8721576K390326L872004J2356456K1997592K3833447J6393406N127335k889855
9943C4359135o971281j4907952k9101925l6023276k3650527k571972Q945906J2684696
9935e7237196K0050839K3671625R400619j0739191j2080740R05370L333746l899995
9927b6594923Q92766J0853210m098776l6661127m0002916j914124L0174590K0989201
9919d6362099l759869p863802J057863M10148l677859L167099J1921304J1488917
9911c3618298J1459660J4848081J977807k7600886l3964375M800619M7051354
9904a5046038M2530957L762534k0566175j7048032p471049j051322O277189M498887
$$ plain form
9959 69735039 33351439 2125814 1511352 7266583 -7594876 -33631360 -48114105 -48721576
9951 -48721576 -46331250 -42459246 -30102790 -8105198 15728249 32121655 37248990 34359135
9943 34359135 27387854 12479902 -16622023 -52645299 -76295826 -78867798 -69921892 -57237196
9935 -57237196 -37186357 -13514732 -4114113 -14853304 -26934044 -26028674 -22694928 -26594923
9927 -26594923 -25702157 -14848947 -18947723 -55608850 -95611766 -97525890 -67351300 -46362099
9919 -46362099 -50121968 -57985770 -56927907 -56517759 -60195618 -57028519 -45107215 -33618298
9911 -33618298 -22158638 -7310557 -5332750 -32933636 -66898011 -62097392 -15046038
9904 -15046038 27484919 31247453 10681278 -6366754 -13837803 -14889125 -8611936 -4113049
9896d113049j2129438j8213224L684302J7766238j5221752n9506134m2440613
9889a30173670L0969062P1915159L2089537k9849384l6668555N078814L2396506
9882b4242531J8818750o693894j6285694j5097570j6207163j5041695j46693K4636924
9874e0259566L9579560K9577514J933413j9295358j8389789l722131N251836J691827
9866a3632694m420564k092194P580751J3283705O290120o427897n910661J2747939
9858G418505K5031029P312128k1742210j9898679J4540461L3523706R168570k4788812
9850C0564698k7532123j1568055j1937014k4362822j9000666L259420J5027249
9843d5549313J1719155J1002321J0457065o826324k6734903j3923673K6940251
$$ plain form
9896 -4113049 -16242487 -34455711 -30771409 -13005171 -28226923 -87733057 -130173670
9889 -130173670 -99204608 -27289449 4800088 -25049296 -61717851 -56639037 -24242531
9882 -24242531 -5423781 -12117675 -28403369 -43500939 -59708102 -74749797 -74896490 -50259566
9874 -50259566 -10680006 18897508 20830921 1535563 -16854226 -20576357 -15324521 -13632694
9866 -13632694 -18053258 -20145452 -12564701 719004 7009124 581227 -5329434 7418505
9858 7418505 32449534 39761662 18019452 -1879227 12661234 46184940 55353510 30564698
9850 30564698 3032575 -8535480 -20472494 -44835316 -63835982 -60576562 -45549313
9843 -45549313 -33830158 -22827837 -12370772 -19197096 -45931999 -59855672 -32915421
9836c2915421M7627674K6584660k245083q055904o466931j8705797k7494879q908425
9828c0580106K0326756K5592142P111971o182411n257357p917352j9080332j7955056
9820c3941745O216460L1654192L2745509J4740330K252323K483866j84386j3969564
9812D1996985k4844168k0392344j0433197p790234l359620J5981241L4608503
9805B5767166K4484451p438131k3037721j0244987Q55878p870847j3235960J184814
9797i535337R037402j0944780k7676012m350518L5762091M1915589J4390479m491225
9789D4107689m405498j3188378l4064737l7633607k0419469j1450806j0854333
9782h7909139J5812660O3274330P0544961J2474164m9314730n0244046j0796931
$$ plain form
9836 -32915421 14712253 41296913 39051830 30995926 24528995 5823198 -21671681 -30580106
9828 -30580106 -10253350 15338792 22450763 16268352 11010995 3093643 -15986689 -33941745
9820 -33941745 -27725285 3928907 36674416 51414746 53667069 56150935 55966549 41996985
9812 41996985 17152817 -3239527 -13672724 -21462958 -24822578 -8841337 25767166
9805 25767166 50251617 42813486 19775765 9530778 10386656 2515809 -10720151 -9535337
9797 -9535337 -497935 -11442715 -39118727 -43469245 -7707154 34208435 48598914 44107689
9789 44107689 39702191 26513813 -7550924 -45184531 -65604000 -77054806 -87909139
9782 -87909139 -72096479 -8822149 61722812 74196976 24882246 -25361800 -36158731
9775c6158731P798910l329496q024183J337142j656912j9066348k0930448J96941
9767g9833125J3943743K961582q766472M344486K9577832L6656461K1386519O971815
9759B7242841O907394N700730j5288712m2671527m0074774J174016L9110974L0327127
9751A2428069r633933k5904516j079005K5060241J9756351L52054o095394o556905
9743H326962j4585179j3766400J0690321L0023085R276271k9113840l0486899
9736b9635679P889205L0573080R386930j6242686n725140K0492688J9536217m336848
9728C1937767j0862788R804335K4104575J0542374q219888m063215J1765617P108838
9720G2117615j9760955l4603192j5441537J6508381K5803915O717976j7121464
$$ plain form
9775 -36158731 -28359821 -31689317 -39713500 -38376358 -40033270 -59099618 -80030066 -79833125
9767 -79833125 -65889382 -62927800 -71694272 -67349786 -37771954 -1115493 20271026 27242841
9759 27242841 34150235 39850965 24562253 -18109274 -58184048 -57010032 -17899058 12428069
9751 12428069 2794136 -23110380 -24189385 870856 20627207 20979261 14883867 8326962
9743 8326962 -6258217 -20024617 -9334296 20688789 29965060 851220 -29635679
9736 -29635679 -21746474 8826606 18213536 1970850 -3754290 16738398 36274615 31937767
9728 31937767 21074979 30879314 54983889 65526263 57306375 53243160 65008777 72117615
9720 72117615 52356660 17753468 2311931 18820312 44624227 51342203 34220739
9713C4220739k5638404j7153693J367672J8725774J9285936n9235j6312174p343565
9705G093050J1446267P137038j5537790j7444008R461335K4238464L991432j6647345
9697A3738443n410847J1037176m078921k8154848j5934435J8723849K3188921
9690A3109338l246999r433501J4248920J6418182k1078960m1310525m291786M0606266
9682E020935K8951932j8382851l2979710o764367P465822q626200j4108290J1737568
9674b7685161K9077945M573765k9299274k0804447K3418152M6913968J9080308
9667D5275256l0095851n1433419l0112064P799867K8935574K4607317J1816385
9660F793065P165236O915269o70352j1188210r828772l23245n010949k7005761
$$ plain form
9713 34220739 8582335 -8571358 -7203686 11522088 30808024 30748789 14436615 7093050
9705 7093050 18539317 25676355 10138565 -7305443 2155892 26394356 30385788 13738443
9697 13738443 8327596 19364772 15285851 -12868997 -28803432 -10079583 13109338
9690 13109338 9862339 428838 14677758 31095940 10016980 -31293545 -35585331 5020935
9682 5020935 33972867 15590016 -17389694 -24154061 -16688239 -25314439 -39422729 -27685161
9674 -27685161 1392784 5966549 -23332725 -44137172 -20719020 26194948 45275256
9667 45275256 15179405 -36254014 -66366078 -58566211 -29630637 -5023320 6793065
9660 6793065 13958301 20873570 20203218 9015008 -813764 -1137009 -6147958 -33153719
9652c3153719l5594944q308293L0719101M0106660J7905782m18917K855735O631827
9644B0743232p999081k5336382k0687622K262841J9315042J8138722N795443n667188
9636F565007o016087R458777K7035929J8691567j9928897m8685499k8581668J9514564
9628b1946307L6356156N324316k6084231j7354435J0702984J7104798L550299
9621G653580K00429R689199P224679j0604616j8112402n528972M798967j357261
9613f036397n792579P928028K2198608J1848615j4069189k3514951p247080J0768386
9605c916559Q866094o144823j3888174p714315J974769N653824O597404J2148523
9597C576743J7727560R181209j4077735k8859029j5615094J0199401J5292858
$$ plain form
9652 -33153719 -68748663 -77056956 -46337855 -6231195 11674587 11255670 14111405 20743232
9644 20743232 12744151 -12592231 -33279853 -31017012 -11701970 6436752 12232195 6565007
9636 6565007 548920 10007697 37043626 55735193 35806296 -12879203 -41460871 -21946307
9628 -21946307 14409849 19734165 -6350066 -23704501 -13001517 4103281 7653580
9621 7653580 7854009 17543208 24767887 14163271 -3949131 -9478103 -4679136 -6036397
9613 -6036397 -11828976 -3900948 18297660 30146275 16077086 -7437865 -14684945 -3916559
9605 -3916559 4949535 -1195288 -15083462 -22797777 -20823008 -15169184 -8571780 3576743
9597 3576743 21304303 30485512 16407777 -12451252 -28066346 -17866945 -2574087
9590b574087l168590j2617531L348380J7407565K422321k2448541j9545384R608469
9582b7567398K8402387J9500903J018799j0542213j9349382k6383716j8629058
9575e3549678N090341K3085150J9876875N770129m753957j3674300k5197006l0407537
9567g3759983k1403874n312280Q224331J8366696K2784902J5251946L270193N385548
9559b7192521J9109267J7892592m457341j6777389l23148J6456391L954447j7848443
9551i186145j3783688P048848J1889883L917235R429247J9511664K797952k7696661
9543C928335k2849569J9167759L9286337P420173l1081824k8398135k650288M348846
9535a0828366n051245k681881J0867706J4531901P683811K506785o007727k4188340
$$ plain form
9590 -2574087 -5742677 -18360208 -15011828 2395737 4818058 -17630483 -37175867 -27567398
9582 -27567398 834989 20335892 21354691 10812478 -8536904 -34920620 -53549678
9575 -53549678 -48459337 -25374187 -5497312 272817 -4481140 -18155440 -43352446 -73759983
9567 -73759983 -95163857 -100476137 -92251806 -73885110 -51100208 -35848262 -32578069 -27192521
9559 -27192521 -8083254 9809338 5351997 -11425392 -11748540 4707851 8662298 -9186145
9551 -9186145 -22969833 -15920985 -4031102 -113867 9315380 28827044 31624996 3928335
9543 3928335 -18921234 246525 39532862 46953035 15871211 -12526924 -15177212 -10828366
9535 -10828366 -15879611 -18561492 -7693786 6838115 14521926 17028711 11020984 -13167356
9527a3167356l1391050q024513K1626032J6700441j7581809l5779179j8298233
9520h5915667Q104819J7909149J6573006J5189199J0380360J952810J431910R084656
9512e289758P276386r256474j9496477q472029P201104N515169n558367j856568
9504b9937014J6976823K5714634J1973865n223742l882541R783340J3299978K631839
9496D1337182m021156K389782P033330k097371j1415287m299882P868463K513456
9488C9308517j4789848j7740829m146151m55335j6106181k6326168j2337069J1660819
9480d0932245K5982261L0264464K5323222K863775k5860284k4994761J3887035
9473F533467M5409121K9321908j1379365k7885411j6290986r096989j5467924
$$ plain form
9527 -13167356 -44558406 -52582919 -30956887 -14256446 -31838255 -67617434 -85915667
9520 -85915667 -77810848 -59901699 -43328693 -28139494 -17759134 -15806324 -14374414 -5289758
9512 -5289758 1986628 -7269846 -26766323 -35238352 -28037248 -22522079 -28080446 -29937014
9504 -29937014 -12960191 12754443 24728308 19504566 15622025 25405365 38705343 41337182
9496 41337182 37316026 39705808 46739138 44641767 33226480 28926598 36795061 39308517
9488 39308517 24518669 6777840 2631689 2176354 -13929827 -40255995 -52593064 -40932245
9480 -40932245 -14949984 15314480 40637702 43501477 17641193 -7353568 6533467
9473 6533467 51942588 81264496 69885131 41999720 25708734 16611745 1143821
9466A143821j5545499l774337M838538N911435N882002j166629k0376801l0312847
9458e3400317j0046264J8397373J7853545l526198p460812O834550N087409j3180496
9450c9441210q349636K6464710M4940894K0481200j2321212j4623669L531717
9443B0682794J3913924J3343079Q821785l833433j9662824j7001048M473134J2050867
9435C2788278q994059k8142522j9629930k871310l169360q881515j570351O818497
9427c3652272M086816R600908L3703921M0298998R83705m3376374l4973994P477133
9419a5851159J4204452k3760913l8916022M553447N3051561M5246586K31378j9276410
9411A9482920Q3595J3991200n644693l2197746k8713458o41801J6143572O480611
$$ plain form
9466 1143821 -14401678 -18176015 -13337477 -7426042 -1544040 -2710669 -23087470 -53400317
9458 -53400317 -63446581 -45049208 -27195663 -30721861 -38182673 -31348123 -26260714 -39441210
9450 -39441210 -47790846 -21326136 23614758 44095958 31774746 17151077 20682794
9443 20682794 34596718 47939797 56761582 52928149 33265325 16264277 20737411 32788278
9435 32788278 23794219 -4348303 -23978233 -26849543 -30018903 -38900418 -40470769 -33652272
9427 -33652272 -29565456 -19964548 13739373 54038371 55022076 11645702 -23328292 -15851159
9419 -15851159 -1646707 -25407620 -64323642 -59770195 -6718634 38527952 38759330 19482920
9411 19482920 19566515 33557715 27913022 -4284724 -32998182 -33639983 -17496411 -11015800
9403a1015800q029171m709794R529341J4863934R582043N248878J517438j0457373
9395F529496k4716883k5953773j5426789m788757J1185979M1203774O0112966
9388D8146013L1505500k5079306m2717399l142992L0816693J1343132k2169454
9381B8702187j5487277Q360601l743814l4413326k2332867K8495093M8364290
9374C7944887J2175988k6160679k3902989n003664k046531m453366M006843Q342759
9366I03248k067201m738454J4137891K7934792J4513921l689577j584328J976099
9358D7386391j7428475l5823936j5758841K5688577L7151671J1345707r058075
9351D3503019l184453J387517j5930603l2114896k0437683O306154J6635924L120368
$$ plain form
9403 -11015800 -19044971 -23754765 -14225424 638510 10220553 15469431 16986869 6529496
9395 6529496 -18187387 -44141160 -59567949 -64356706 -53170727 -11966953 48146013
9388 48146013 79651513 54572207 11854808 8711816 39528509 50871641 28702187
9381 28702187 13214910 21575511 17831697 -16581629 -38914496 -10419403 37944887
9374 37944887 50120875 23960196 57207 -4946457 -6992988 -11446354 -7439511 903248
9366 903248 -1163953 -5902407 8235484 36170276 50684197 46994620 45410292 47386391
9358 47386391 29957916 -5866020 -21624861 4063716 41215387 52561094 43503019
9351 43503019 40318566 41706083 25775480 -6339416 -26777099 -20470945 -3835021 -714653
9343g14653j5934533k2386900j0600240J2691449K8975659K2059137R92472p407095
9335G675296K012743K729489j8904303l3957741j2345562K5295827L2560490N791807
9327A0858046j0891498P188756K9769597J8928306j6775451l8001985k7135973
9320b6060202k747878J0121587O138883j556637J416265J3176089J4222822p736204
9312F974725l3496005l0767186J055678K7187687K4740044P660703n361227j6483938
9304a8489519k4973287j2761207J8428820K8870897l136863l6276442k1634567
9297f9972168K1450682L6074173J5254284Q77788O470580M591951r135823m574098
9289A037369K0046948K5881874J296494j6552927q372257k881536j5910174j8441783
$$ plain form
9343 -714653 -16649186 -39036086 -49636326 -36944877 -7969218 14089919 15082391 7675296
9335 7675296 9688039 12417528 -6486775 -40444516 -52790078 -27494251 5066239 10858046
9327 10858046 -33452 7155304 36924901 55853207 39077756 1075771 -26060202
9320 -26060202 -28808080 -18686493 -12547610 -14104247 -12687982 488107 14710929 6974725
9312 6974725 -26521280 -57288466 -56232788 -29045101 -4305057 3355646 -2005581 -18489519
9304 -18489519 -43462806 -56224013 -37795193 -8924296 -12061159 -48337601 -69972168
9297 -69972168 -48521486 -12447313 2806971 3684759 10155339 14747290 5611467 1037369
9289 1037369 21084317 46966191 48262685 31709758 23337501 20455965 4545791 -13895992
9281a3895992L572403J5681168j809168j3781414M169645J6738612m762726k2618061
9273a6705533J115878K9807585J3153820k0657052j1888902K4514499K4060050
9266D3400345j5446559l3116701r755902R494630J153541o274819Q27073k172651
9258a1891043j7689915j1934715J6807922K2633513q177513k5639194J771602
9251c4119343L2214573J8581648j8936730l3226915k2086403j3626875j1687302
9244h2887347q25414J6038765K3633172K1928199J8376196J0217078j508026k352941
9236B619682Q165830O123826j4882818k2329143L032589K5680926P766916k3920067
9228g742259j4561105L0435430M9401394J6697755k1662082j9317373P017584
$$ plain form
9281 -13895992 -10323589 5357579 3548411 -10233003 -6063358 10675254 5912528 -16705533
9273 -16705533 -15589655 14217930 27371750 6714698 -5174204 19340295 43400345
9266 43400345 27953786 -5162915 -14918817 -5424187 -4270646 -10545465 -9718392 -11891043
9258 -11891043 -29580958 -41515673 -24707751 -2074238 -10251751 -35890945 -34119343
9251 -34119343 -1904770 16676878 -2259852 -35486767 -57573170 -71200045 -82887347
9244 -82887347 -83712761 -67673996 -44040824 -22112625 -3736429 6480649 4972623 2619682
9236 2619682 10785512 16909338 2026520 -20302623 -17270034 8410892 16177808 -7742259
9228 -7742259 -22303364 8132066 57533460 74231215 52569133 33251760 40269344
9221D0269344J1483900j2470082k9073314j4791509J1569062J7176342k993344
9214B1170399k3535448k2380580m552436J1038649J5629694J0191017o877598
9207F83697l1146809l8601048r086262L4868328M3885318P513292k6111563j5358329
9199c3353376J8200839K6151995M841634n516758J4372400L4941672K1752863
9192H1391269j7642808m4335022l3897211p54116K0515485J2716995q273481j6963845
9184g242734j0758319p234971j2317672j0881867N262228J9756456J4637170l663923
9176a2443632j4333865p192890J1967087K8557518K4382200o382530l6849950
9169a2296062k6948341J9621145M4261455P247296n0242094n6436893p795377
$$ plain form
9221 40269344 51753244 39283162 10209848 -4581661 6987401 24163743 21170399
9214 21170399 -2365049 -24745629 -29298065 -18259416 -2629722 7561295 683697
9207 683697 -30463112 -69064160 -78150422 -43282094 603224 8116516 -17995047 -33353376
9199 -33353376 -15152537 10999458 15841092 10324334 24696734 59638406 81391269
9192 81391269 63748461 19413439 -14483772 -15237888 5277597 17994592 9721111 -7242734
9184 -7242734 -18001053 -25236024 -37553696 -48435563 -43173335 -23416879 -8779709 -12443632
9176 -12443632 -26777497 -33970387 -22003300 6554218 30936418 24553888 -12296062
9169 -12296062 -39244403 -19623258 24638197 31885493 -18356601 -74793494 -82588871
9162h2588871K8625657J2326452j9032388j3275049K1267903L6621314J6614019
9155E59037r252859j4636788n233025L769270J0651269J6834863J5528861O532540
9147B4753168N969727K1081784K7342396j947365m6371140n1815421m262803M1704841
9139A6455187L2939866r201830k1985095P655087L0220369J2063986k0159047
9132D7988523k9588508k1860506j9104827j4717465P372729K9587470K0463675
9125B0141091j0269453j9668854J682551J2311302j4798204m5338044l1144225
9118h7083836J7934759M5050967K3152829j2630777j6712440R492753K8630747
9111G835002J8985517o251577k4262402k6223378j5350422K80106Q263609N37589
$$ plain form
9162 -82588871 -53963214 -41636762 -60669150 -73944199 -52676296 -16054982 559037
9155 559037 -8693822 -23330610 -28563635 -24794365 -14143096 2691767 18220628 24753168
9147 24753168 30722895 51804679 79147075 77199710 30828570 -20986851 -25249654 16455187
9139 16455187 49395053 40193223 18208128 25863215 56083584 68147570 47988523
9132 47988523 18400015 -3460491 -22565318 -37282783 -29910054 -322584 20141091
9125 20141091 9871638 -9797216 -8114665 4196637 -10601567 -55939611 -87083836
9118 -87083836 -69149077 -24098110 -945281 -13576058 -30288498 -20795745 7835002
9111 7835002 26820519 20568942 -3693460 -29916838 -45267260 -44987154 -36723545 -36185956
9103c6185956j2493476j0653250P053559J8176294J0172889J72632P860600K5556478
9095I659770L2495614K3656413N982078j6950385l4126489k1361488K1275253
9088B0630766M4336920M904003o1259194p3960794j7426989L8841164M1667189
9081b266935J9863605J8928458K4999360L388555k7700765k4134958M321876N655098
9073B3054294k6452875l8846846n285304L0379906K4004796l368779p902358N138175
9065G21009K40404j7399749m590657M4103547P3500078M1570786k0676198n2620520
9057F4848700m1974814k4311884k0147241j3958882M014524J5489808Q009971
9050h029818q06900O338120J6564719J1331884O77664M636399J4004077J093744
$$ plain form
9103 -36185956 -48679432 -59332682 -52279123 -34102829 -23929940 -23757308 -15896708 9659770
9095 9659770 42155384 65811797 71793875 54843490 20717001 -644487 20630766
9088 20630766 64967686 69871689 8612495 -65348299 -82775288 -43934124 -2266935
9081 -2266935 17596670 36525128 61524488 64913043 37212278 13077320 17399196 23054294
9073 23054294 -3398581 -42245427 -47530731 -17150825 6853971 3485192 -4417166 721009
9065 721009 961413 -16438336 -21028993 23074554 96574632 138145418 117469220 64848700
9057 64848700 22873886 -1437998 -21585239 -35544121 -31529597 -16039789 -8029818
9050 -8029818 -8836718 -2498598 14066121 25398005 26075669 30712068 44716145 45809889
9042D5809889l4132655n7002959m0787099L315759M1325216M6841124J8294622
9035B3663897j8595136k8968148n188190K0089530J3805094j3041599k2838549
9028c1073101n908496J0092060M583134r800201j1359280K177397J6466049J7114605
9020g707833J375061j4979718q343646K0431544L6445043J4954592j9223591k5609736
9012b658284p349026L42838r540207j1020415L127670J1994165J1387027J9571300
9004A5855068L0685842J3144749l0712608n3301612l0914703K876523J5821353
8997c6545388K0369993L0149417K3764423q442484k7144767k022498K9917878
8990C0046574J7746293j9631355k1733287J6820471L7700976P641072l6691980
$$ plain form
9042 45809889 11677234 -45325725 -86112824 -82797065 -41471849 5369275 23663897
9035 23663897 5068761 -23899387 -29087577 -8998047 4807047 -8234552 -31073101
9028 -31073101 -36981597 -26889537 -22306403 -32106604 -43465884 -41288487 -24822438 -7707833
9020 -7707833 -6332772 -21312490 -29656136 -9224592 27220451 42175043 22951452 -2658284
9012 -2658284 -10007310 -9664472 -19204679 -30225094 -27097424 -15103259 -3716232 15855068
9004 15855068 46540910 59685659 28973051 -24328561 -55243264 -52366741 -36545388
8997 -36545388 -16175395 13974022 37738445 29295961 2151194 128696 30046574
8990 30046574 47792867 28161512 6428225 23248696 60949672 68590744 31898764
8983C1898764m6082807k1600037L55911J789263k49495J5122051L9069258L9561947
8975E9864855M016320l6282587m1495002j5098280N220055L610400j295980J70518
8967b1289701m975642j3978553k468692K6135240L2813262P643088p397195R161789
8959B5643596J5662646k0013801n4812569l3397142K1857153M5087153K4166501
8952B4193537K547152K218915M362359k561608q423239j0085081j1367188m109957
8944c225110J2110722R961177k3025111m5574291j7814978K8001624L1183915
8937h382052k689339j6699219J885789J2899818M238789O079750K0053970R916641
8929B7304147k2903683k7405825J0332327L6152685J3039795k3495020k8618480
$$ plain form
8983 31898764 -14184043 -35784080 -35428169 -33638906 -33888401 -18766350 20302908 59864855
8975 59864855 63881175 27598588 -13896414 -28994694 -23774639 -20164239 -21460219 -21289701
8967 -21289701 -26265343 -40243896 -42712588 -16577348 16235914 23879002 16481807 25643596
8959 25643596 41306242 21292441 -33520128 -66917270 -45060117 27036 24193537
8952 24193537 26740689 28959604 33321963 30760355 22337116 12252035 884847 -3225110
8944 -3225110 8885612 18846789 -4178322 -49752613 -67567591 -39565967 -8382052
8937 -8382052 -11071391 -27770610 -25884821 -12985003 -8746214 -2666464 17387506 27304147
8929 27304147 4400464 -23005361 -12673034 23479651 36519446 13024426 -15594054
8922a5594054j2038921k766307R79192Q774849P610876p598456j0149311J5460887
8914a5321245L9691081L1502252N325370q082814q292733j0197047j0439287k455721
8906B1729856k49706j3837978k2745379o504118J7380038J7508678m840448k1947602
8898a3506659j9131255k934454J6521192K8047304J8006042j1113149l3166533
8891a7277512k8844663j0136985K589083R983361K0073904K3864528R620103j1451202
8883a579383j7939610q241275J919462M249264L545880N898532J3863368K4850002
8875B6566240K6246512O045765k3957783l4357055j7583253L21554k45728n364229
8867b2327977K074417J0854400M829181m286982K794463J5086617M984715k6989887
$$ plain form
8922 -15594054 -27632975 -30399282 -29420090 -20645241 -13034365 -20632821 -30782132 -15321245
8914 -15321245 24369836 55872088 61197458 53114644 44821911 34624864 24185577 21729856
8906 21729856 21480150 7642172 -15103207 -21607325 -4227287 13281391 8440943 -13506659
8898 -13506659 -32637914 -35572368 -19051176 8996128 27002170 15889021 -17277512
8891 -17277512 -46122175 -56259160 -53670077 -43686716 -23612812 251716 9871819 -1579383
8883 -1579383 -19518993 -27760268 -25840806 -21591542 -18045662 -12147130 1716238 26566240
8875 26566240 52812752 58858517 34900734 543679 -17039574 -16718020 -16963748 -22327977
8867 -22327977 -20253560 -9399160 -4569979 -8856961 -6062498 9024119 14008834 -12981053
8859a2981053m8274175l4102038P577889M8116832O0164091L3900866j2784682
8852D1617730m4548725m1328571j6246860N700446J4728724J3686818N703835
8845b0686603j224203O252856K5366272L0504456P378421k0446406k1383761p7208
8837E683824J2730972N647839m667227o118149n115491n593432P32463J4405332
8829A7706131J8113948n90036k8150537l9242284k6634507o033334P151105J4699466
8821d2980048K4240989L0105880J9233093m171622j6688133p168765N118907j054395
8813F635906j5549903j3303500M685290J2437689r37378j7307559j7942148l541955
8805d4823558J6738301L4540344L8122722K1060173k493195j3249738j6542167
$$ plain form
8859 -12981053 -61255228 -95357266 -87779377 -39662545 20501546 54402412 41617730
8852 41617730 -2930995 -44259566 -60506426 -54805980 -40077256 -26390438 -20686603
8845 -20686603 -21910806 -15657950 9708322 40212778 47591199 27144793 5761032 5683824
8837 5683824 18414796 24062635 19395408 13277259 8161768 2568336 3300799 17706131
8829 17706131 35820079 35230043 7079506 -32162778 -58797285 -64830619 -57679514 -42980048
8821 -42980048 -18739059 11366821 30599914 26428292 9740159 2571394 7690301 6635906
8813 6635906 -8913997 -22217497 -17532207 -5094518 -6031896 -23339455 -41281603 -44823558
8805 -44823558 -28085257 6455087 44577809 65637982 63144787 49895049 33352882
8798C3352882k9339615l9343739j4919296L6049790N8567808K2913882l0201233
8791C7080479m3972636j6905060R894745J4052453P342624L549221K817585L581965
8783A7441376O013803N222376k786649j2187519j5862740j5235924j1984195j843409
8775c1222881J2262139J5142736J445573j0815976m941388Q115771N753941j2149341
8767a6409426k2388886q658669J9413905L6072171K3165994j0943977l4537925
8760a4286813k4032276O572262K0521752M072138j8335817j8447229K456531K0797666
8752b0681786J8438061j370253j6509424o584530J9257928K6073434R95677k0656373
8744a037266n471637K1396574J2487529k2189315k6097052J3304178M3001414
$$ plain form
8798 33352882 4013267 -35330472 -50249768 -14199978 44367830 67281712 37080479
8791 37080479 -6892157 -23797217 -13902472 149981 7492605 11041826 13859411 17441376
8783 17441376 23455179 28677555 25890906 13703387 -2159353 -17395277 -29379472 -31222881
8775 -31222881 -18960742 -3818006 -2372433 -13188409 -18129797 -10014026 -4260085 -16409426
8767 -16409426 -38798312 -47456981 -28043076 8029095 31195089 20251112 -14286813
8760 -14286813 -38319089 -31746827 -11225075 -7152937 -25488754 -43935983 -41479452 -20681786
8752 -20681786 -2243725 -3613978 -20123402 -26707932 -7450004 18623430 19619107 -1037266
8744 -1037266 -6508903 14887671 27375200 5185885 -20911167 -7606989 35394425
8737C5394425K6125925r086531k2119242j2916973Q68516J4043616J8491369R66555
8729E1767660k3099289j8426973R627544J4889441j0739376j9448667N850381
8722A0420721J7159113q082269j7120115K2209503M8744545M019932o1930699
8715A5420731o5634894k0409321Q03699o391959J2627233N5863885O0884122J4301283
8707F7464779k6808667k9537982j9601326j3773869L367364K4385738J6759210
8700B2255247j0063048q444398K1223682K2543834j8066967m0310660q555215
8693a9417525K9335932K1298393j2085505k3458817r874230N195792J7191133
8686H185173K6324195J6098400j5027684l3560927j7362426Q853219J4758220
$$ plain form
8737 35394425 61520350 52433819 30314577 17397604 18266120 32309736 50801105 51767660
8729 51767660 28668371 10241398 19868942 34758383 24019007 4570340 10420721
8722 10420721 27579834 19497565 2377450 24586953 73331498 77351430 15420731
8715 15420731 -50214163 -70623484 -69819785 -76211744 -63584511 -7720626 53163496 67464779
8707 67464779 40656112 11118130 -8483196 -22257065 -18889701 5496037 22255247
8700 22255247 12192199 3747801 24971483 47515317 29448350 -10862310 -19417525
8693 -19417525 9918407 31216800 19131295 -4327522 -14201752 -9005960 8185173
8686 8185173 34509368 50607768 35580084 2019157 -15343269 -6490050 8268170
8679H268170Q074291O874969L277297j1515643j8898065n451145O057453n381337
8671h694010j8360129m720006J9755101K1461799N074139Q24488J0295296P794192
8663C3430870j1045942k1770755j2093396K879445R323983J1174677J3670846
8656B5569728J2939050P364621K408101l95169o334007j5996652k0746402j3499714
8648h690444J047938R870945N873029j468780L806676J8553846J7456612r848627
8640C6601195l2590227j6385269K1567045L0047448k452490l0356480j8591251
8633a2160029J0347070J7573466L220253o569523l000646M266031J1629341J9419640
8625D4725603J8074146J445712j6210205j8623851j2891687j5204446k1331764
$$ plain form
8679 8268170 16342461 23217430 26494727 14979084 -3918981 -9370126 -3312673 -8694010
8671 -8694010 -27054139 -31774145 -12019044 9442755 14516894 15341382 25636678 33430870
8663 33430870 22384928 614173 -11479223 -8599778 724205 11898882 25569728
8656 25569728 38508778 45873399 48281500 47886331 41552324 25555672 4809270 -8690444
8648 -8690444 -7642506 2228439 8101468 6632688 10439364 28993210 46449822 36601195
8640 36601195 4010968 -12374301 9192744 39240192 36787702 6431222 -12160029
8633 -12160029 -1812959 15760507 18980760 12411237 9410591 13676622 25305963 44725603
8625 44725603 62799749 64245461 48035256 29411405 16519718 1315272 -20016492
8618b0016492j4434049M750031J8667883K0125593J6869623J0962030l603151
8611C3321468j9691575j6195644R898031K7516521P047858l3844883m3081310
8604c5029534j706309M2123157L1033442k0764046m1851718l966079L6534403
8597F373316K3906871j3229755j2356112J9078018J7359286k7574265m9832253
8590c6274894j3357763K7816638J4689694k4320658k0123305K9927975O0166234
8583C8523921L2603025j6426972l3352229j3816715N338377K07239j3956074r210759
8575a0090187J4191666K5706887P038331j8724686j8713896Q72463O513445p064010
8567b69987j0071701Q179634J8427349J783377j6416736q899485R178859R641043
$$ plain form
8618 -20016492 -34450541 -29700510 -11032627 9092966 25962589 36924619 33321468
8611 33321468 13629893 -2565751 7332280 34848801 41896659 8051776 -35029534
8604 -35029534 -36735843 5387314 36420756 15656710 -26195008 -30161087 6373316
8597 6373316 30280187 17050432 4694320 23772338 41131624 13557359 -36274894
8590 -36274894 -49632657 -21816019 -7126325 -31446983 -51570288 -21642313 38523921
8583 38523921 71126946 54699974 21347745 7531030 12869407 13076646 -879428 -10090187
8575 -10090187 4101479 29808366 36846697 18122011 -591885 280578 6794023 -269987
8567 -269987 -10341688 -2162054 16265295 18048672 1631936 -7267549 1911310 11552353
8559A1552353o77678K605209J3879201O298141j9466954l1610742j4151883J1530397
8551b0041956J8406896N624920q836991j2157442n371587L515768Q529735R122606
8543a208051O666543J496082k303836M056498J8766272K0280484p305947m3357026
8535b908981m9408629k0097745J0387063J6468017P325204j436724r484552j2446815
8527f1603162M768574L4955165M0753528O070532l1863558l0886438r53562J7961937
8519b0796984J4227077O703517M228779q55028o664588k760586N419237J613164
8511A114588j2452922j7692918p047686O478057J0687673N638967l561517r889958
8503b6725716m666692J0462327J7829560M721224j7275688k8069867k4209867
$$ plain form
8559 11552353 10874675 13479884 27359085 33657226 14190272 -17420470 -31572353 -20041956
8551 -20041956 -1635060 3989860 -4847131 -17004573 -22376160 -18860392 -10330657 -1208051
8543 -1208051 5458492 6954574 4650738 8707236 27473508 47753992 40448045 -2908981
8535 -2908981 -52317610 -72415355 -62028292 -45560275 -38235071 -39671795 -49156347 -61603162
8527 -61603162 -56834588 -21879423 18874105 24944637 -6918921 -37805359 -38758921 -20796984
8519 -20796984 -6569907 133610 4362389 3507361 -3157227 -5917813 -498576 1114588
8511 1114588 -11338334 -29031252 -36078938 -29600881 -18913208 -13274241 -16835758 -26725716
8503 -26725716 -31392408 -20930081 -3100521 1620703 -15654985 -43724852 -67934719
8496f7934719j2812979O390508L1927144M4870592K7968917m173343j7994468
8489H241652l560965J5439306J4020360q680727l5005794m4315701k5694393R120962
8481g0435300K8663598J4066512j4061109j8084756Q753068L4883424L2520212
8474A6305649R487731p495141o953179R67846M678715M441554L675724j920858
8466B3188041j5395595k3432356q593847J8809107K3690743l428718k2548533
8459g711158J420584M0109410L7020510q939612m1280749k8014482J175563R846761
8451C626827J789637m040523n348031l376013O734324J5319264L641654j6125061
8443B222078q372814K2884746K8057210p996430l3991134j2866851J9896495J9940557
$$ plain form
8496 -67934719 -80747698 -74357190 -42430046 2440546 30409463 26236120 8241652
8489 8241652 4680687 20119993 34140353 25459626 -9546168 -53861869 -79556262 -70435300
8481 -70435300 -41771702 -27705190 -41766299 -59851055 -51097987 -16214563 16305649
8474 16305649 25793380 18298239 11345060 12312906 16991621 21433175 25108899 23188041
8466 23188041 7792446 -15639910 -24233757 -5424650 18266093 14837375 -7711158
8459 -7711158 -6290574 33818836 70839346 61899734 20618985 -7395497 -6219934 3626827
8451 3626827 5416464 1375941 -3972090 -7348103 -613779 14705485 18347139 2222078
8443 2222078 -6150736 16734010 44791220 36794790 2803656 -10063195 9833300 29773857
8435B9773857K882367k42973n313599l3347497n1598907k3766958J7702749K0053403
8427d3857558p55767N464061K7017967J2889484k4673467k0618352K8807221N0304962
8419C4578551Q330414m2817325m7153086j9178312J833180J0396762J4769055
8412c9240761P898718q591982j0913391Q581346K3734749J6616046L314417k04411
8404A194731k711183j0212348q765726O060942J4087023K676792j3685036j8936165
8396c0290970j3690591p58273J7781166K5437539P169533j7847837j7064582K603935
8388b6660080P073547j730918R948906L6492120K9945038j5688135m2737272j9601763
8380b2958557J0277075M040955j5220883j1097541K200494k689416j1045044O16004
$$ plain form
8435 29773857 32656224 32413251 27099652 -6247845 -57846752 -81613710 -63910961 -43857558
8427 -43857558 -44613325 -39149264 -12131297 758187 -23915280 -44533632 -15726411 34578551
8419 34578551 42908965 91640 -47061446 -66239758 -64406578 -54009816 -39240761
8412 -39240761 -31342043 -39934025 -50847416 -42266070 -18531321 -1915275 1399142 1194731
8404 1194731 -1516452 -11728800 -20494526 -14433584 -346561 2330231 -11354805 -30290970
8396 -30290970 -43981561 -44739834 -26958668 -1521129 5648404 -12199433 -29264015 -26660080
8388 -26660080 -19586533 -21317451 -11368545 25123575 55068613 39380478 -3356794 -22958557
8380 -22958557 -12681482 -8640527 -23861410 -34958951 -32758457 -35447873 -46492917 -45876913
8372d5876913J5286854J0010959L464829J7601192K6280108j729745l7789269
8365a2751985l1744455N631050J9823918l1981j1612411N087985J9548493O529001
8357D79615j6243007k0214466l091916J7657685K5719417J5397889k892089r246021
8349G567107m68178K447280j0550872j6823596O42153J7020200K886224k2764162
8341b0043844j9309334R492812K2783110R347505j305041L920827K216201j5792716
8333h690480k1705088L819542L3819856L0999015n03347k3668451j7040723N145933
8325B176257J6509690Q312805n344526o847307L484177R333975J775134r200517
8317B0199688j1118788n033808K039916P125613N472845q240246k2183211j2176354
$$ plain form
8372 -45876913 -30590059 -20579100 -17114271 486921 26767029 25037284 -12751985
8365 -12751985 -44496440 -38865390 -19041472 -19073453 -30685864 -25597879 -6049386 479615
8357 479615 -15763392 -35977858 -39069774 -21412089 4307328 19705217 16813128 7567107
8349 7567107 7098929 9546209 -1004663 -17828259 -17186106 -165906 2720318 -20043844
8341 -20043844 -39353178 -29860366 -7077256 2270249 965208 4886035 7102236 -8690480
8333 -8690480 -30395568 -26576026 7243830 38242845 37739498 14071047 -2969676 2176257
8325 2176257 18685947 26998752 21654226 14806919 18291096 27625071 29400205 20199688
8317 20199688 9080900 4047092 6087008 13212621 18685466 10445220 -11737991 -23914345
8309b3914345J9290464L2195444J500538m0313653m3795835j0030505J6406124
8302d8661768J2689781O70141N673734K3418786L2899950K0959316q160565l2982368
8294F507007k9675722j247078J9090476R612499j1560562j8985712j7251258j8227923
8286f1738273q337481K1414351L7350139O793682l6680711l1114170J7629599
8279e4682864M2510260K1896016Q860068L3671283M7610496N638303n2213522
8272E3290040n7263370j2539196K0152275J2240199o476559o789108M086895R893740
8264A6594916J1171929J2634950R251961l273918j7302995k0542095r718760M555643
8256C371631O458490n999381j2625847M929183L1693605L2729585K134389k6311971
$$ plain form
8309 -23914345 -4623881 27571563 29072101 -11241552 -55037387 -65067892 -48661768
8302 -48661768 -35971987 -35301846 -29628112 -6209326 26690624 47649940 39489375 6507007
8294 6507007 -23168715 -24415793 -5325317 4287182 -7273380 -26259092 -43510350 -61738273
8286 -61738273 -70075754 -48661403 -11311264 -4517582 -41198293 -72312463 -54682864
8279 -54682864 -12172604 9723412 18583480 52254763 99865259 105503562 53290040
8272 53290040 -3973330 -16512526 3639749 15879948 9403389 2614281 6701176 16594916
8264 16594916 27766845 40401795 49653756 46379838 29076843 8534748 -1184012 3371631
8256 3371631 9830121 3830740 -8795107 -3865924 27827681 60557266 62691655 36379684
8248C6379684k7345040j5558250j2272674r996180M588222J7337382R176628n897635
8240c587863j018309J6614508J5952307n914937j9496900j1939137l515771p084667
8232a9990769n971968J1781017K6440992J5942617q033613j6701533n024361N515789
8224C958171m4727j1809349j0414994Q755796K7906211K2489188r678620l6678391
8216e516715k4734000J4926587L2266258K810398l6653151l7937050o755903J3838976
8208d7754600J2183476J7375045L7954445L8229049k021272m3020790l6520067
8201b3574714K612361J7987485o488491k9193477j6129109J5929228L2628850
8194f227867K6088650J0305416k235457m169140N165259R496433r764968l7042096
$$ plain form
8248 36379684 9034644 -6523606 -18796280 -28792460 -24204238 -6866856 2309772 -3587863
8240 -3587863 -4606172 12008336 27960643 22045706 2548806 -9390331 -12906102 -19990769
8232 -19990769 -25962737 -14181720 12259272 28201889 20168276 3466743 -1557618 3958171
8224 3958171 3913444 -7895905 -18310899 -9555103 18351108 40840296 31161676 -5516715
8216 -5516715 -30250715 -15324128 16942130 19752528 -16900623 -54837673 -61593576 -47754600
8208 -47754600 -35571124 -18196079 19758366 57987415 55966143 12945353 -23574714
8201 -23574714 -20962353 -2974868 -9463359 -38656836 -54785945 -38856717 -6227867
8194 -6227867 19860783 30166199 27930742 23761602 28926861 38423294 28658326 -8383770
8186h383770l0548060J4307058M2674455J3010142l6533127l7161092J2785396
8179b9848998M7397667K6252510j9065485l8298066k1402363Q822959K8696238
$$ plain form
8186 -8383770 -38931830 -24624772 18049683 31059825 -5473302 -42634394 -29848998
8179 -29848998 17548669 43801179 24735694 -13562372 -34964735 -26141776 2554462
$$ [...]
##END NTUPLES=NMR SPECTRUM
##END=
