##TITLE=31Pdec_LR-0145-C1-EtOAc
 CD3CN, 64 sc
 14.3.2023
##JCAMPDX= 6.0         $$ Bruker NMR JCAMP-DX V2.0
##DATA TYPE= NMR SPECTRUM
##DATA CLASS= NTUPLES
##ORIGIN= UXNMR, Bruker Analytische Messtechnik GmbH
##OWNER= root
$$ XWIN-NMR		Version 3.5
$$ Tue Mar 14 14:45:25 2023 Russian Standard Time (UT+4h)  she@DPX200
##.OBSERVE FREQUENCY= 81.013821
##.OBSERVE NUCLEUS= ^31P
##.ACQUISITION MODE= SIMULTANEOUS
##.ACQUISITION SCHEME= undefined
##.AVERAGES= 64
##.DIGITISER RES= 16
##SPECTROMETER/DATA SYSTEM= spect
##.PULSE SEQUENCE= zgpg30
##.SOLVENT NAME= CD3CN
##.SHIFT REFERENCE= (INTERNAL, CD3CN, 0, 248.564)
##AUDIT TRAIL= $$ (NUMBER, WHEN, WHO, WHERE, WHAT)
$$ ##TITLE= Audit trail, XWIN-NMR		Version 3.5
$$ ##JCAMPDX= 5.01
$$ ##ORIGIN= Bruker BioSpin GmbH
$$ ##OWNER= she
$$ F:/spectra/data/she/nmr/P31/1/pdata/1/auditp.txt
$$ ##AUDIT TRAIL=  $$ (NUMBER, WHEN, WHO, WHERE, WHAT)
(   1,<2023-03-14 14:42:26.92 +0400>,<she>,<DPX200>,
      <continue with go, POWCHK disabled, PULCHK disabled
       configuration hash MD5:
       00 E9 B6 7A A2 85 ED C7 34 08 36 98 17 FE 4E 26
       data hash MD5: 32K
       FA 4D 5B EA 1C 3C 9A 8A 0F 83 FD 87 47 3E EF 4E>)
(   2,<2023-03-14 14:42:32.64 +0400>,<she>,<DPX200>,
      <Start of raw data processing
       efp BC_mod = 2 LB = 1 FT_mod = 6 PKNL = 1 PHC0 = -11028.88 PHC1 = 171.4102 SI = 64K 
       data hash MD5: 64K
       68 55 22 2B 81 43 E4 A0 FE 6D E6 02 F9 69 95 28>)
(   3,<2023-03-14 14:44:22.67 +0400>,<she>,<DPX200>,
      <pk PHC0 = -2.806901 PHC1 = 0 
       data hash MD5: 64K
       F0 FC 07 13 06 EB 4B D0 56 24 E8 B4 FB 90 44 8B>)
(   4,<2023-03-14 14:44:25.95 +0400>,<she>,<DPX200>,
      <abs ABSG = 5 
       data hash MD5: 64K
       52 C7 02 4D 9D C2 2A A6 45 D6 E2 25 81 E9 53 8A>)
$$ ##END=
$$ 
$$ hash MD5
$$ 40 67 78 A6 93 02 29 3B 37 5C 22 66 9C 6D B6 0D
##$RELAX= 
##$RELAX= 
##$RELAX= 
##$RELAX= 
##$RELAX= 
##$RELAX= 
##$RELAX= 
##$RELAX= 
##$RELAX= 
$$ Bruker specific parameters
$$ --------------------------
##$DU= <F:/spectra>
##$EXPNO= 1
##$NAME= <P31>
##$PROCNO= 1
##$TYPE= <nmr>
##$USER= <she>
##$AMP= (0..31)
100 100 100 100 100 100 100 100 100 100 100 100 100 100 100 100 100 100 
100 100 100 100 100 100 100 100 100 100 100 100 100 100 
##$AQSEQ= 0
##$AQ_mod= 1
##$AUNM= <au_zg>
##$AUTOPOS= <>
##$BF1= 81.014009
##$BF2= 200.13
##$BF3= 200.13
##$BF4= 200.13
##$BF5= 200.13
##$BF6= 200.13
##$BF7= 200.13
##$BF8= 200.13
##$BYTORDA= 1
##$CFDGTYP= 0
##$CFRGTYP= 5
##$CHEMSTR= <none>
##$CNST= (0..31)
1 1 145 1 1 1 1 1 1 1 1 1 1 1 1 1 1 1 1 1 1 1 1 1 1 1 1 1 1 1 1 1 
##$CPDPRG= <waltz16>
##$CPDPRG1= <>
##$CPDPRG2= <waltz16>
##$CPDPRG3= <>
##$CPDPRG4= <mlev>
##$CPDPRG5= <mlev>
##$CPDPRG6= <mlev>
##$CPDPRG7= <mlev>
##$CPDPRG8= <mlev>
##$CPDPRGB= <>
##$CPDPRGT= <>
##$D= (0..31)
0 1 0 0 0 0 0 0 0 0 0 0.03 2e-05 3e-06 0 0 0 0 0 0 0 0 0 0 0 0 0 0 0 0 
0 0 
##$DATE= 1678790492
##$DBL= (0..7)
120 120 120 11 120 120 24 19 
##$DBP= (0..7)
150 150 150 150 150 150 150 150 
##$DBP07= 0
##$DBPNAM0= <>
##$DBPNAM1= <>
$$ [...]
##$SUBNAM3= <"">
##$SUBNAM4= <"">
##$SUBNAM5= <"">
##$SUBNAM6= <"">
##$SUBNAM7= <"">
##$SUBNAM8= <"">
##$SUBNAM9= <"">
##$SW= 501.771253377433
##$SWIBOX= (0..15)
0 1 3 0 0 0 0 0 0 0 0 0 0 0 0 0 
##$SW_h= 40650.406504065
##$TD= 32768
##$TD0= 1
##$TE= 0
##$TE2= 300
##$TE3= 300
##$TEG= 300
##$TL= (0..7)
0 120 53 12 22 120 120 120 
##$TP= (0..7)
150 150 150 150 150 150 150 150 
##$TP07= 0
##$TPNAME0= <>
##$TPNAME1= <>
##$TPNAME2= <>
##$TPNAME3= <>
##$TPNAME4= <>
##$TPNAME5= <>
##$TPNAME6= <>
##$TPNAME7= <>
##$TPOAL= (0..7)
0.5 0.5 0.5 0.5 0.5 0.5 0.5 0.5 
##$TPOFFS= (0..7)
0 0 0 0 0 0 0 0 
##$TUNHIN= 0
##$TUNHOUT= 0
##$TUNXOUT= 0
##$USERA1= <user>
##$USERA2= <user>
##$USERA3= <user>
##$USERA4= <user>
##$USERA5= <user>
##$V9= 5
##$VALIST= <valist>
##$VCLIST= <CCCCCCCCCCCCCCC>
##$VD= 0
##$VDLIST= <DDDDDDDDDDDDDDD>
##$VPLIST= <PPPPPPPPPPPPPPP>
##$VTLIST= <TTTTTTTTTTTTTTT>
##$WBST= 1024
##$WBSW= 4
##$XGAIN= (0..3)
0 0 0 0 
##$XL= 0
##$YL= 0
##$YMAX_a= 8568
##$YMIN_a= -2719
##$ZGOPTNS= <>
##$ZL1= 120
##$ZL2= 120
##$ZL3= 120
##$ZL4= 120
##$ABSF1= 248.5645
##$ABSF2= -253.2056
##$ABSG= 5
##$ABSL= 3
##$ALPHA= 0
##$AQORDER= 0
##$ASSFAC= 0
##$ASSFACI= 0
##$ASSFACX= 0
##$ASSWID= 0
##$AUNMP= <proc_1d>
##$AZFE= 0.1
##$AZFW= 0.5
##$BCFW= 0
##$BC_mod= 2
##$BYTORDP= 0
##$COROFFS= 0
##$CY= -3
##$DATMOD= 1
##$DC= 0
##$DFILT= <>
##$DTYPP= 0
##$F1P= 0
##$F2P= 0
##$FCOR= 1
##$FTSIZE= 65536
##$FT_mod= 6
##$GAMMA= 0
##$GB= 0
##$INTBC= 1
##$INTSCL= 6.047779e-11
##$ISEN= 30
##$LB= 1
##$LEV0= 0
##$LPBIN= 0
##$MAXI= 10000
##$MC2= 0
##$MEAN= 0
##$ME_mod= 0
##$MI= 50
##$NCOEF= 0
##$NC_proc= -9
##$NLEV= 6
##$NOISF1= 182.463
##$NOISF2= 159.3651
##$NSP= 0
##$NTH_PI= 0
##$NZP= 0
##$OFFSET= 248.5645
##$PC= 4
##$PHC0= -11031.69
##$PHC1= 171.4102
##$PH_mod= 1
##$PKNL= yes
##$PPARMOD= 0
##$PSCAL= 0
##$PSIGN= 0
##$REVERSE= no
##$SF= 81.0140089999694
##$SI= 65536
##$SIGF1= 159.3651
##$SIGF2= -187.1042
##$SINO= 113.3802
##$SIOLD= 16384
##$SREGLST= <1H.CDCl3>
##$SSB= 0
##$STSI= 65536
##$STSR= 0
##$SW_p= 40650.406504065
##$SYMM= 0
##$S_DEV= 0
##$TDeff= 32768
##$TDoff= 0
##$TI= <>
##$TILT= no
##$TM1= 0
##$TM2= 0
##$TOPLEV= 0
##$USERP1= <user>
##$USERP2= <user>
##$USERP3= <user>
##$USERP4= <user>
##$USERP5= <user>
##$WDW= 1
##$XDIM= 65536
##$YMAX_p= 335719919
##$YMIN_p= -202143211
$$ End of Bruker specific parameters
$$ ---------------------------------
##NTUPLES= NMR SPECTRUM
##VAR_NAME=  FREQUENCY,     SPECTRUM/REAL,   SPECTRUM/IMAG
##SYMBOL=    X,             R,               I
##VAR_TYPE=  INDEPENDENT,   DEPENDENT,       DEPENDENT
##VAR_FORM=  AFFN,          ASDF,            ASDF
##VAR_DIM=   65536,         65536,           65536
##UNITS=     HZ,            ARBITRARY UNITS, ARBITRARY UNITS
##FACTOR=    0.620285442955139, 1,           1
##FIRST=     20137.2065510682, 0,            0
##LAST=      -20513.1999529968, 0,           0
##MIN=       -20513.1999529968, -202143211,  0
##MAX=       20137.2065510682, 335719919,    0
$$ Real data points
##PAGE= N=1
##DATA TABLE= (X++(R..R)), XYDATA
$$ [...]
41951c3576972Q942635J6857618J3608827K529169p018460p430440l08833N154562
$$ -33576972 -24634337 -7776719 5832108 8361277 1342817 -6087623 -6396456 -1241894
41943a241894J842935o818461r560745j193000Q789938Q122126o6228k060401
$$ -1241894 601041 -6217420 -15778165 -16971165 -8181227 -59101 -125329 -2185730
41935b185730L710831M076353m733540q239374J457332R836127L248534q180712
$$ -2185730 1525101 5601454 867914 -7371460 -5914128 3921999 7170533 -1010179
41927a010179q530954k384997k854761o276437j695304N585476M914893M497451
$$ -1010179 -9541133 -11926130 -14780891 -21057328 -22752632 -17167156 -12252263 -7754812
41919g754812J6255943K5158793P457660k4013851l0440391o395606J0500090
$$ -7754812 8501131 33659924 41117584 17103733 -13336658 -19732264 -9232174
41912i232174j08218j1374319M34156J3813588J339248j9071705j1612600J6687152
$$ -9232174 -9340392 -20714711 -20280555 -6466967 -5127719 -24199424 -35812024 -19124872
41904a9124872K4795121J968431j6741411n494422J5592771J4110948p951718
$$ -19124872 5670249 7638680 -9102731 -14597153 995618 15106566 7154848
41897G154848k1140683j0155662R999444J7004477P104835n291513p314477j218262
$$ 7154848 -13985835 -24141497 -14142053 2862424 9967259 4675746 -2638731 -3856993
41889c856993K235642l18907j475585M299623J1902140J3321659Q034234M28466
$$ -3856993 -1621351 -1940258 -3415843 883780 12785920 26107579 34141813 34570279
41881C4570279p649031j5260127j7780799j1491427m53802P455065R419572P637255
$$ 34570279 26921248 11661121 -6119678 -17611105 -18064907 -10609842 -1190270 6446985
41873F446985L703766j189928l728065k320310n54199j197044j009310J882642
$$ 6446985 10150751 8960823 5232758 2912448 2358249 1161205 151895 2034537
41865B034537J197143p147375j2934072l316209J4874731J9506239L152673j4981061
$$ 2034537 3231680 -3915695 -16849767 -20165976 -5291245 14214994 17367667 2386606
41857B386606j3983269L005212J6628132J6214363O745608l202835r607072j1130236
$$ 2386606 -11596663 -8591451 8036681 24251044 30996652 27793817 18186745 7056509
41849G056509q264439m724702l996384n057460n494627n884634o265865k882427
$$ 7056509 -1207930 -5932632 -9929016 -14986476 -20481103 -26365737 -32631602 -35514029
41841c5514029M585829P796664J714363k852321P477367K4452957K4214893J468117
$$ -35514029 -30928200 -23131536 -21417173 -24269494 -16792127 7660830 31875723 33343840
41833C3343840j9273293j5815516K881591J2757701P700794N04595j558616m077966
$$ 33343840 14070547 -1744969 1136622 13894323 21595117 22099712 20541096 16463130
41825A6463130j0104986j3497521j0089710l900977K18360J492209L16176j522295
$$ 16463130 6358144 -7139377 -17229087 -21130064 -20911704 -19419495 -19103319 -20625614
41817b0625614J018048R335246J5040201J0541598K233847J323817N352065L167868
$$ -20625614 -19607566 -10272320 4767881 15309479 17543326 18867143 24219208 27387076
41809B7387076m895836q636023p862813j1459695j6450849r616572O539942J2204744
$$ 27387076 22491240 13855217 5992404 -5467291 -21918140 -31534712 -24994770 -12790026
41801a2790026J556143p120811k258313L229759j954532o561692J001416J0391937
$$ -12790026 -11233883 -18354694 -20613007 -17383248 -19337780 -25899472 -24898056 -14506119
41793a4506119Q764888L652393N560679O008833l550872q380051O444882K4008534
$$ -14506119 -5741231 -2088838 3471841 9480674 5929802 -2450249 3994633 28003167
41785B8003167J7179215p873226k1316601j5855891j0474206j1629486n499617
$$ 28003167 45182382 37309156 15992555 136664 -10337542 -21967028 -27466645
41778b7466645R011884J3659982M341498k77503O666598P335914o101179j3071073
$$ -27466645 -18454761 -4794779 -453281 -730784 5935814 13271728 7170549 -5900524
41770e900524J072946J7745555J3959835j796634o365068M10651K67570r348145
$$ -5900524 -4827578 12917977 26877812 25081178 18716110 19126761 19394331 10046186
41762A0046186j0718520M327539J9695775J6145222m150448k0939932j9654936
$$ 10046186 -672334 3655205 23350980 39496202 35345754 14405822 -5249114
41755e249114o643827J044158j465316k050762O839470J3250485M510610q833537
$$ -5249114 -11892941 -10848783 -12314099 -14364861 -7525391 5725094 10235704 1402167
41747A402167o778411P666300J2276224J443713o178926l31934N456625P23423
$$ 1402167 -5376244 2290056 14566280 16009993 9831067 9499133 14955758 15679181
41739A5679181l288578L826859J0757162L604415r881106j3362894p302999l690550
$$ 15679181 12390603 16217462 26974624 30579039 20697933 7335039 32040 -3658510
41731c658510m277150r05275P715245J3643498J1394309K709901o856528j0573752
$$ -3658510 -7935660 -8840935 -1125690 12517808 23912117 26622018 19765490 9191738
41723I191738n804717k07599l713530j1862652r868524L381904J1338791N503762
$$ 9191738 3387021 3179422 -534108 -12396760 -22265284 -18883380 -7544589 -2040827
41715b040827k243089q18284M618682P470848J0707036J2600300K689647j4839179
$$ -2040827 -4283916 -5102200 -483518 6987330 17694366 30294666 32984313 18145134
41707A8145134j6638170L674969J8021365M330155j7350555j5566707M502102
$$ 18145134 1506964 5181933 23203298 27533453 10182898 -5383809 -881707
41700h81707J3603342M816531l893957m078463l262168k963242J430336L526230
$$ -881707 12721635 17538166 13644209 9565746 6303578 3340336 4770672 8296902
41692H296902m770562j2192910l276028J1151415P606376j0100246j5129336n04002
$$ 8296902 3526340 -8666570 -11942598 -791183 6815193 -3285053 -18414389 -18918391
41684a8918391J2732517J1187832L495960k709264r030735r544742M184530J8642804
$$ -18918391 -6185874 5001958 8497918 5788654 -3242081 -12786823 -8602293 10040511
41676A0040511J0406339j3265951j9224907k22207J3539096M936169m834277K535344
$$ 10040511 20446850 7180899 -12044008 -12266215 1272881 6209050 1374773 3910117
41668C910117J1718092N476410n028581n762567o534336j6187519j8203602P3160
$$ 3910117 15628209 21104619 16076038 10313471 3779135 -12408384 -30611986 -30538826
41660c0538826J7911954J1904854m543158m810766O043147M768540o159419n365755
$$ -30538826 -12626872 -722018 -5265176 -10075942 -4032795 735745 -5423674 -10789429
41652a0789429N524154M634386q390503j0028171M998405J3383269K773547q584452
$$ -10789429 -5265275 -630889 -9021392 -19049563 -14051158 -667889 2105658 -6478794
41644f478794l522638P748639P247723l693404j1080199q983336k066726L502347
$$ -6478794 -10001432 -2252793 4994930 1301526 -9778673 -18762009 -20828735 -17326388
41636a7326388L745533j339706n498186k625225L764295N570101K846061J176473
$$ -17326388 -13580855 -14920561 -20418747 -23043972 -19279677 -13709576 -10863515 -9687042
41628i687042n46525o528289j1205897n655219M836461O725682R34798P94715
$$ -9687042 -10233567 -16761856 -27967753 -33622972 -28786511 -22060829 -21126031 -20331316
41620b0331316P027081O175559l029810n115852L543044N808826n285563j0726610
$$ -20331316 -13304235 -7128676 -10158486 -15274338 -11731294 -5922468 -11208031 -21934641
41612b1934641K784322J7110354J0239011p744299j0950120K233679J1517758
$$ -21934641 -19150319 -2039965 8199046 454747 -10495373 -8261694 3256064
41605C256064R805274Q798230J1390930N312965j1172779k0830150j3607183k203339
$$ 3256064 13061338 21859568 33250498 38563463 27390684 6560534 -7046649 -9249988
41597i249988q88203m624701j689680N469252O111917j1065l469912q96881J727482
$$ -9249988 -10138191 -14762892 -16452572 -10983320 -4871403 -4882468 -8352380 -9249261 -7521779
41588g521779K072m061636p415430q287416l822606O676281J5783086J3147775
$$ -7521779 -7519707 -11581343 -18996773 -27284189 -31106795 -24430514 -8647428 4500347
41580D500347q02949j2652811j1071617M18625R318437Q759446J658268o561755
$$ 4500347 3697398 -8955413 -20027030 -19608405 -10289968 -1530522 127746 -6434009
41572f434009j2797752j3879762o359967P259870J6419789J2529101m2156q399187
$$ -6434009 -19231761 -33111523 -39471490 -32211620 -15791831 -3262730 -3304886 -11704073
41564a1704073o399459M93850O283782J1806583J6283650J0821455q497777k6237056
$$ -11704073 -18103532 -17609682 -11325900 480683 16764333 27585788 19088011 -7149045
41556g149045k1388652L214692K0195749J2526895m623529p493523K957536P259097
$$ -7149045 -28537697 -25323005 -5127256 7399639 2776110 -4717413 -1759877 5499220
41548E499220n99271p174184m874158l007459p476227p627244M658873J6541853
$$ 5499220 4899949 -2274235 -7148393 -10155852 -17632079 -25259323 -20600450 -4058597
41540d058597J0852863o505222j2668365M34004J5660414J4713182N88901r451386
$$ -4058597 6794266 289044 -12379321 -11945317 3715097 18428279 19017180 9565794
41532I565794n403579O922969J4713270J1000253K18096p320493p025060m390143
$$ 9565794 4162215 11085184 25798454 36798707 37016803 29696310 22671250 18281107
41524A8281107n648168q186299n955505p23112N79821k054128k108731J091018
$$ 18281107 12632939 4446640 -1508865 -2231977 -1652156 -3706284 -5815015 -4723997
41516d723997J390911j070349J925695J0577146J2039001K47316j0941794o986451
$$ -4723997 -3333086 -4403435 -2477740 8099406 20138407 20385723 9443929 2457478
41508B457478M276368M848510l918042l672177Q621227J1986811n816143k4962071
$$ 2457478 6733846 11582356 7664314 3992137 12613364 24600175 18784032 -6178039
41500f178039j9533566M368375J6948279P684806k060093N411950J6821002J0862690
$$ -6178039 -25711605 -21343230 -4394951 3289855 1229762 6641712 23462714 34325404
41492C4325404o258567r878362L741881J0815467k596588j8339609j4164123K686060
$$ 34325404 28066837 18188475 21930356 32745823 30149235 11809626 -2354497 331563
41484C31563Q390497j009665p413537j692421M805418L037756O19488M859518
$$ 331563 8722060 7712395 298858 -1393563 3411855 6449611 7069099 11928617
41476A1928617Q006817J544679p143096n996305K425802O459120M010503K108506
$$ 11928617 19935434 21480113 14337017 8340712 10766514 17225634 21236137 23344643
41468B3344643J907492j941650q496364j0330422o578042m259408n421108m436636
$$ 23344643 25252135 23310485 14814121 4483699 -2094343 -6353751 -11774859 -16211495
41460a6211495K2854K052939O95367L123474J0588727J2866628M192873n671630
$$ -16211495 -16188641 -14135702 -13440335 -10316861 271866 13138494 17331367 11659737
41452A1659737n632249L25126J677071j200123r97564L45226n566622j5781864
$$ 11659737 6027488 6352614 8029685 6829562 5831998 6177224 610602 -15171262
41444a5171262j6299814l218990J0043284J2272940Q859029Q697368Q143982n5038
$$ -15171262 -31471076 -34690066 -24646782 -12373842 -3514813 5182555 13326537 13271499
41436A3271499r894680q891349J212881N272671k282765q749231k580569R484624
$$ 13271499 3376819 -5514530 -4301649 971022 -1311743 -10060974 -12641543 -3156919
41428c156919J2582357L559986p789466j2833903j1562475q264362o255089n825269
$$ -3156919 9425438 12985424 5195958 -7637945 -19200420 -27464782 -33719871 -39545140
41420c9545140l313661N249248J6017815J7856553O930159m597285l099603P424144
$$ -39545140 -42858801 -37609553 -21591738 -3735185 3194974 -1402311 -4501914 2922230
41412B922230J1441301M559377k522085k912916k316273m785860l478256O016107
$$ 2922230 14363531 18922908 16400823 13487907 11171634 6385774 2907518 8923625
41404H923625J4271030J0742488p3307o486330p469595j0356505j4754973j2411759
$$ 8923625 23194655 33937143 33863836 27377506 19907911 9551406 -5203567 -17615326
41396a7615326k719883M526745M120617J713320J414464j730619j0426343j5892387
$$ -17615326 -20335209 -15808464 -11687847 -9974527 -8560063 -10290682 -20717025 -36609412
41388c6609412r334162L374076Q799189N083784L528421J0256892J6136636J0019277
$$ -36609412 -45943574 -42569498 -33770309 -28686525 -25158104 -14901212 1235424 11254701
41380A1254701m594294j3565038j0381648k796983n2843n44222K668635Q603678
$$ 11254701 6660407 -6904631 -17286279 -20083262 -20136105 -20680327 -18011692 -9408014
41372i408014Q792274R68943o022144m959044q47750j803302m633872M1814R849358
$$ -9408014 -615740 353203 -5668941 -10627985 -11475735 -13279037 -17912909 -17871095 -8021737
41363h021737J0659439j180208q861802K215294K0159363J9802131j920805j9890764
$$ -8021737 2637702 1457494 -7404308 -5189014 14970349 34772480 32851675 12960911
41355A2960911j4492780L139052R340659J16995q889403q217189m104613k923408
$$ 12960911 -1531869 1607183 10947842 11064837 2175434 -6041755 -10146368 -13069776
41347a3069776j885583Q52127M71194l738437l677413L717739Q832790M937880
$$ -13069776 -14955359 -14103232 -13632038 -17370475 -21047888 -17330149 -8497359 -3559479
41339c559479P18916N054306Q975524q58191j6707100j7009339J100514J5381741
$$ -3559479 -2840563 2213743 11189267 10331076 -6376024 -23385363 -22284849 -6903108
41331f903108R552725n574991j0510456l569578K080219n82446n731530n584674
$$ -6903108 2649617 -2925374 -13435830 -17005408 -14925189 -15507635 -21239165 -26823839
41323b6823839L25041O110550O127984J910810K079888J0522576J6806585Q154321
$$ -26823839 -26498798 -20388248 -14260264 -12349454 -10269566 253010 17059595 25213916
41315B5213916r417783j5442406l826912P933504N905199O8467M584392J2144447
$$ 25213916 15796133 353727 -3473185 4460319 10365518 10433985 15018377 27162824
41307B7162824O754182p076249r721852J459605O892453m616742j8478184j5797340
$$ 27162824 33917006 26840757 17118905 18578510 25470963 20854221 2376037 -13421303
41299a3421303J142187J4605028J3905968L276153p014878r534996l071141O483342
$$ -13421303 -12279116 2325912 16231880 19508033 12493155 2958159 -112982 6370360
41291F370360J0102403M455120m489123q720360o683272k553366J67247J479469
$$ 6370360 16472763 20927883 16438760 7718400 1035128 -1518238 -1350991 128478
41283A28478K785013M407732N184060L746573J33658m243399q061446r925417
$$ 128478 2913491 7321223 12505283 16251856 16385514 12142115 4080669 -5844748
41275e844748p076907J888683J1653889J2625348K833437o837197n103607M593904
$$ -5844748 -12921655 -11032972 620917 13246265 16079702 9242505 4138898 8732802
41267H732802P932344j745176j4644778j6097485l587494J0090642J0649500j394594
$$ 8732802 16665146 14919970 275192 -15822293 -19409787 -9319145 1330355 -64239
41259f4239j0947629p494891N13670j417292r917240p011146J0579995K2478461
$$ -64239 -11011868 -18506759 -17993089 -19410381 -29327621 -36338767 -25758772 -3280311
41251c280311J4036198j490616m629585N86036j844705r177789n037996Q904560
$$ -3280311 10755887 9265271 4635686 5221722 3377017 -5800772 -10838768 -1934208
41243a934208J2255861m54813r763480k471563Q939665R110781K699158M95453
$$ -1934208 10321653 9866840 103360 -2368203 6571462 15682243 18381401 18876854
41235A8876854o35513o957616j0202873j73728J3466689J2286937j938289r370266
$$ 18876854 18241341 11283725 1080852 907124 14373813 26660750 24722461 15352195
41227A5352195l218068J377882n413385j1187036l180265P943108L310388j3020588
$$ 15352195 12134127 13512009 8098624 -3088412 -6268677 1674431 4984819 -8035769
41219h035769j7622913k307152J3624676J2176698Q97367l779660l035931p211875
$$ -8035769 -25658682 -27965834 -14341158 -2164460 -1267093 -5046753 -8082684 -15294559
41211a5294559j0784455R2036J7580202J6749516m214996j5615386j095320J5280122
$$ -15294559 -26079014 -25986978 -8406776 8342740 4127744 -11487642 -12582962 2697160
41203B697160P496300j0108777p586146J0509769J3969672k331645j2394478l775123
$$ 2697160 10193460 84683 -7501463 3008306 16977978 14646333 2251855 -1523268
41195a523268O178725M912968L198101P987511O459407p182104j4912354l718975
$$ -1523268 4655457 9568425 12766526 20754037 27213444 20031340 5118986 1400011
41187A400011J0371462P382708n353289q086600l49237L750818J288882Q36389
$$ 1400011 11771473 19154181 13800892 5714292 5365055 9115873 10404755 11241144
41179A1241144M019295M887824K574948j48534m913927j1358951j0853554k31404
$$ 11241144 15260439 20148263 22723211 22574677 17660750 6301799 -4551755 -4783159
41171d783159P625191K178789n738763j192291P821817K314641j3954877j6430405
$$ -4783159 2842032 5020821 -717942 -1910233 5911584 8226225 -5728652 -22159057
41163b2159057L128745K2463670J8131412n778624k5026378k2010189r96893J7282095
$$ -22159057 -19030312 3433358 21564770 15786146 -9240232 -31250421 -32247314 -14965219
41155a4965219J5405783k121490j3603427p756876K504267K224948j989450M137661
$$ -14965219 440564 -1680926 -15284353 -23041229 -20536962 -18312014 -20301464 -16163803
41147a6163803J5419182J4565419J628493n692702q75494L015970l102444j0984038
$$ -16163803 -744621 13820798 15449291 9756589 8881095 11897065 8794621 -2189417
41139b189417j0928395n608768j771590m12404l76279j437685o44295M617237
$$ -2189417 -13117812 -18726580 -20498170 -20910574 -21286853 -22724538 -23368833 -18751596
41131a8751596Q893049M829123l075372l432101L368483N512851m00679m978905
$$ -18751596 -9858547 -5029424 -8104796 -11536897 -8168414 -2655563 -3056242 -8035147
41123h035147l534739k327579l951128k442975K164816M91296q191067j0035018
$$ -8035147 -11569886 -13897465 -17848593 -20291568 -18126752 -17635456 -25826523 -35861541
41115c5861541K261626J5695404J4488470J102680r555832q753932N69670R398648
$$ -35861541 -33599915 -17904511 -3416041 -2313361 -11869193 -20623125 -20053455 -10654807
41107a0654807Q417675l825000j4879738r932573P721471J8880819J3917019K877299
$$ -10654807 -2237132 -6062132 -20941870 -30874443 -23152972 -4272153 9644866 12522165
41099A2522165l413422o661372r171945n204057N633497J1001585L662052n721651
$$ 12522165 9108743 2447371 -6724574 -11928631 -6295134 4706451 8368503 2646852
41091B646852n318734J2974k94326m688608n370363k223698J438878P474925J5083872
$$ 2646852 -2671882 -2658908 -2953234 -7641842 -13012205 -15235903 -13797025 -6322100 8761772
41082H761772J4632148K642733p317217l602941L577287j781195j4078177j4402698
$$ 8761772 23393920 26036653 18719436 15116495 18693782 16912587 2834410 -11568288
41074a1568288j239394P514578K576813n366812m830506J607789N619831M204046
$$ -11568288 -12807682 -5293104 -2716291 -8083103 -12913609 -11305820 -5685989 -1481943
41066a481943j023899o253748n677614K377955R929460Q426669J379950j501610
$$ -1481943 -2505842 -8759590 -14437204 -12059249 -2129789 6296880 7676830 6175220
41058F175220L83546M80463o72822L260603R842860Q724964j598567j0697129
$$ 6175220 6558766 7039229 6366407 9627010 19469870 28194834 26596267 15899138
41050A5899138j1628437p666176k677203K665755M090807k910637j0699523n324054
$$ 15899138 4270701 -3395475 -6072678 -3406923 683884 -2226753 -12926276 -18250330
41042a8250330J1058833J8542353O574526j1397680j8060637j3425815o625556
$$ -18250330 -7191497 11350856 17925382 6527702 -11532935 -24958750 -31584306
41035c1584306L86312Q907750J3546124R152029P72097m240000p126863j0443350
$$ -31584306 -31197994 -22290244 -8744120 407909 1180006 -3059994 -10186857 -20630207
41027b0630207q204603L924157J5742238J4447778M559783P47553M279127L202013
$$ -20630207 -28834810 -24910653 -9168415 5279363 9839146 10586699 14865826 18067839
41019A8067839n149297r674589n874363l047507n576853m082783N703152J0942426
$$ 18067839 12918542 3243953 -2630410 -5677917 -11254770 -15337553 -9634401 1308025
41011A308025J348804j1787464j1362794o300O395555M133884K928420N140763
$$ 1308025 2656829 -9130635 -20493429 -20499729 -14104174 -9970290 -7041870 -1901107
41003a901107K750579l935883l320476O490434J0704943L77216j2589414j3489954
$$ -1901107 849472 -3086411 -6406887 83547 10788490 11165706 -1423708 -14913662
40995a4913662n501402k42015J696709O484075J0988087O691131l787611q462440
$$ -14913662 -20415064 -20657079 -18960370 -12476295 -1488208 5202923 1415312 -7047128
40987g047128l284219M485105R204868J1364611R939754K613509n612266n834976
$$ -7047128 -10331347 -5846242 3358626 14723237 24662991 27276500 21664234 15829258
40979A5829258R45622M190803l53691n798465o685283n442072m239850j639072
$$ 15829258 16774880 20965683 20611992 14813527 8128244 2686172 -1553678 -3192750
40971c192750K20846l223974p772836l032808R743288J5567964P340951l220806
$$ -3192750 -2971904 -6195878 -13968714 -17001522 -7258234 8309730 15650681 12429875
40963A2429875l499505L196195O706609M563616q36317q470904j3692814q609328
$$ 12429875 8930370 12126565 18833174 23396790 22560473 14089569 396755 -8212573
40955h212573L607176P426871j751684p004280M195998J7699650J3673634k262883
$$ -8212573 -4605397 2821474 1069790 -5934490 -1738492 15961158 29634792 27371909
40947B7371909r427015m755536k513600o235916m675847M022490O366503l773112
$$ 27371909 17944894 13189358 10675758 4439842 -236005 3786485 10152988 6379876
40939F379876j4783137j5238405p372378J698701Q374159Q840899J067665o164689
$$ 6379876 -8403261 -23641666 -31014044 -29315343 -20941184 -12100285 -11032620 -17197309
40931a7197309p73127J2513928J4969409J378822j1569936j0760195l544660k15082
$$ -17197309 -17970436 -5456508 9512901 10891723 -678213 -11438408 -14983068 -15198150
40923a5198150L342888J2566466J8511363J1088256k536866q582601p581357r034640
$$ -15198150 -11855262 711204 19222567 30310823 27773957 19191356 11609999 2575359
40915B575359j1809237o548002N972593J4820921J5526320J2055519M242231j0152956
$$ 2575359 -9233878 -15781880 -9809287 5011634 20537954 32593473 36835704 26682748
40907B6682748k1056654j3164495P508035J3558692o276443k6437688j7926896
$$ 26682748 5626094 -7538401 -30366 13528326 7251883 -19185805 -37112701
40900c7112701R928990K2171681P175347j0406762q199931N122633J0362283Q005869
$$ -37112701 -27183711 -5012030 2163317 -8243445 -16443376 -11320743 -958460 7047409
40892G047409R884099J2663104K049812j9126341k8358399j3956741Q373327J7214664
$$ 7047409 16931508 29594612 31644424 12518083 -15840316 -29797057 -21423730 -4209066
40884d209066J0794710J685548l016338n068882n590163l406306r8937J331233
$$ -4209066 6585644 8271192 5254854 185972 -5404191 -8810497 -8909434 -7578201
40876g578201R33973l0133j851058l424593j999321L74892k274069p951199n745083
$$ -7578201 -6644228 -6674361 -8525419 -11950012 -13949333 -13574441 -15848510 -23799709 -29544792
40867b9544792O108010J2765267M197787p290101n392281M428144N478080j502143
$$ -29544792 -23436782 -10671515 -6473728 -13763829 -19156110 -14727966 -9249886 -10752029
40859a0752029j638436N477159M051466q514868j3431139M6J6142407J6161662
$$ -10752029 -12390465 -6913306 -2861840 -11376708 -24807847 -24807801 -8665394 7496268
40851G496268M505893j141320L913513Q477942L248832r002695j8197785j5672905
$$ 7496268 12002161 10860841 14774354 23252296 26501128 17498433 -699352 -16372257
40843a6372257j766872J1430574J0489170k559068j0829892m523575N578033L428888
$$ -16372257 -18139129 -6708555 3780615 1221547 -9608345 -14131920 -8553887 -5124999
40835e124999r663321j6383906n528136J3842764K1880610R860498q998698j3777700
$$ -5124999 -14788320 -31172226 -36700362 -22857598 -976988 8883510 -115188 -13892888
40827a3892888j596919Q207645Q57441j2675865j2846397j058442N528203L561835
$$ -13892888 -15489807 -7282162 -6424721 -19100586 -31946983 -33005425 -27477222 -23915387
40819b3915387O186859J5901116J7809755N755535o495052q852521q869709j1464257
$$ -23915387 -17728528 -1827412 15982343 21737878 15242826 6390305 -2479404 -13943661
40811a3943661o334201R456098J7122905M047599j1734280p841180O105326M429634
$$ -13943661 -20277862 -10821764 6301141 10348740 -1385540 -9226720 -3121394 1308240
40803A308240j2302286j9250498p627818M954771N988187L753476N580887M180102
$$ 1308240 -10994046 -30244544 -37872362 -32917591 -26929404 -23175928 -17595041 -13414939
40795a3414939m088956p139095L334958J5001226J1751035k548862j0736857o594854
$$ -13414939 -17503895 -24642990 -21308032 -6306806 5444229 2895367 -7841490 -14436344
40787a4436344J72884P21672j838907N45920R085454J5912791J2344193o75894
$$ -14436344 -14263460 -13541788 -15380695 -14834775 -5749321 10163470 22507663 21831769
40779B1831769j1144051q204867L972243R284360q32722j5298433j5676732Q30844
$$ 21831769 10687718 2482851 6455094 15739454 14906732 -391701 -16068433 -15237589
40771a5237589J6462114J3855509k174830j0936191l871281M332419k40211o728233
$$ -15237589 1224525 15080034 12905204 1969013 -1902268 2430151 2189940 -4538293
40763d538293L766829K2785706J9724214j2026684l8170821k8085995L043587
$$ -4538293 -771464 22014242 41738456 29711772 -8459049 -36545044 -33501457
40756c3501457J7892999Q520147j528020J306409N737143K748453L48677M065674
$$ -33501457 -15608458 -7088311 -8616331 -7309922 -1572779 1175674 1524351 5590025
40748E590025N652844J317440J286343R324825J1123803j999871j3961770o922962
$$ 5590025 11242869 12560309 13846652 23171477 34295280 32295409 18333639 11410677
40740A1410677Q628262Q028992r790970k0895913j2516064M90186J490922l374444
$$ 11410677 20038939 28067931 18276961 -2618952 -15135016 -14644830 -13153908 -16528352
40732a6528352J507430J4545358J8272695M506906j4011729j9648097r922043
$$ -16528352 -15020922 -475564 17797131 22304037 8292308 -11355789 -21277832
40725b1277832K561884N924095J84793n861626n022575J632187O621819M290704
$$ -21277832 -18715948 -12791853 -12607060 -18468686 -23491261 -21859074 -15237255 -10946551
40717a0946551k148855l479134L758819J1244784R204672N34215k677128L149719
$$ -10946551 -13095406 -16574540 -12815721 -1570937 7633735 8167950 5490822 8640541
40709H640541P753456K832077n571784o949789j511595K569913J794988j184950
$$ 8640541 16393997 19226074 13654290 6704501 5192906 7762819 9557807 8372857
40701H372857m189904m952702J097090J2088978J3885450k970681k3162742k0587154
$$ 8372857 4182953 -769749 327341 12416319 26301769 23331088 168346 -20418808
40693b0418808N467197K5860802K0066538J891781m836649n93747k326769j1607434
$$ -20418808 -14951611 10909191 30975729 32867510 28030861 27437114 25110345 13502911
40685A3502911j2754054j072112Q315614N094358o50232K911083R455703O596264
$$ 13502911 748857 -323255 7992359 13086717 12436485 15347568 24803271 31399535
40677C1399535k135515l375610K822688K921701o346368j0875800j781694R341674
$$ 31399535 29264020 25888410 28711098 31632799 25286431 14410631 12628937 21970611
40669B1970611P864464k316629p317154n106306l752514k955192M807608J4621483
$$ 21970611 29835075 27518446 20201292 15094986 11342472 8387280 13194888 27816371
40661B7816371R669341j1717672k5961546j3449784J3039162K3095374O324853
$$ 27816371 37485712 25768040 -193506 -13643290 -604128 22491246 28816099
40654B8816099j7658222k4848916j1342117Q196330J7582703J2169133Q6349p218520
$$ 28816099 11157877 -13691039 -25033156 -16836826 745877 12915010 13001359 5782839
40646E782839o711716m522889m751605l514692K376803P827271P208532L963511
$$ 5782839 -928877 -5451766 -10203371 -13718063 -11341260 -3513989 3694543 7658054
40638G658054M318122N826563J370000q056220j3800451j1797019o008531j41202
$$ 7658054 11976176 17802739 19172739 11116519 -2683932 -14480951 -20489482 -20630684
40630b0630684N859502J0397744Q912803L56608r757493j4381101j0500537p49249
$$ -20630684 -14771182 -4373438 4539365 4895973 -4861520 -19242621 -29743158 -30492407
40622c0492407P632315P809019R20323m008526r52725O110237J0191359R610373
$$ -30492407 -22860092 -15051073 -14130750 -18139276 -19092001 -12981764 -2790405 6819968
40614F819968N287509k863960j0861475j0206740n45384N548618L2055p073825
$$ 6819968 12107477 9243517 -1617958 -11824698 -12370082 -6821464 -6789409 -13863234
40606a3863234l209156O536295Q923654M030715P12284j854707q618923j0877866
$$ -13863234 -17072390 -10536095 -1612441 2418274 3130558 1275851 -7343072 -18220938
40598a8220938K574201J9252900J4458345q511059j7534523L34728J7729648R327827
$$ -18220938 -15646737 3606163 18064508 9553449 -7981074 -7646346 10083302 19411129
40590A9411129r644509r921664N399107Q751124o527666j7034287o897991R148972
$$ 19411129 9766620 -155044 5244063 13995187 7467521 -9566766 -16464757 -7315785
40582g315785R482959l290794q116176L613306J5676164R042022j1127937k0191279
$$ -7315785 2167174 -1123620 -9239796 -5626490 10049674 19091696 7963759 -12227520
40574a2227520o320260J3194334J5863412M182128k194455K317992M645380j820041
$$ -12227520 -18547780 -5353446 10509966 14692094 12497639 14815631 19461011 17640970
40566A7640970p981397q221527q883589j1381834o385163O684071J3637395R089548
$$ 17640970 9659573 1438046 -7445543 -18827377 -25212540 -18528469 -4891074 4198474
40558D198474O146678J0579743P303965j0600799k1667094p794755J3138069J3978656
$$ 4198474 10345152 20924895 28228860 17628061 -4039033 -11833788 1304281 15282937
40550A5282937J884292L387856J6694771J4616936p887357k4864402k1737086
$$ 15282937 17167229 20555085 37249856 51866792 43979435 19115033 -2622053
40543b622053j3043045r957127k502246J2935942J8725090O638540l161447M902910
$$ -2622053 -15665098 -25622225 -28124471 -15188529 3536561 10175101 7013654 11916564
40535A1916564J3389497J516893j6612891j3351931O387888J3003523K80956p645509
$$ 11916564 25306061 26822954 10210063 -3141868 3246020 16249543 16530499 8884990
40527H884990O43904N913050o121388j8663730j0839275Q749155J5881084O380621
$$ 8884990 9528894 15441944 9320556 -9343174 -20182449 -11433294 4447790 10828411
40519A0828411k162302J201829Q754990R733530L319189n652502j2838918j4401892
$$ 10828411 8666109 9867938 18622928 28356458 31675647 26023145 13184227 -1217665
40511a217665r667974m501829m017500l239306M889960J4114020J1560687M62362
$$ -1217665 -10885639 -15387468 -19404968 -22644274 -17754314 -3640294 7920393 8382755
40503H382755j222844R690706J2723798l798892k0005196j3209802N547968Q793261
$$ 8382755 7159911 16850617 29574415 25775523 5770327 -7439475 -1891507 6901754
40495F901754k768607l076806J2703520J7217845l370353k2782266j3497790J0747350
$$ 6901754 4133147 1056341 13759861 30977706 27607353 4825087 -8672703 2074647
40487B074647J6751136J237315r668701l754675K967460k678144j1055646r938816
$$ 2074647 18825783 20063098 10394397 6639722 9607182 6929038 -4126608 -14065424
40479a4065424m983206o581275r543835j465152J4617847K0597773P292714j1895719
$$ -14065424 -19048630 -25629905 -35173740 -36638892 -22021045 -1423272 5869442 -6026277
40471f026277j5844667Q04J8616720K0520705M976529j0482022j0951796j34574
$$ -6026277 -21870944 -21870140 -3253420 17267285 22243814 11761792 809996 675422
40463F75422P314720N440167K611041P325879J4692316J1907657m251356k0443930
$$ 675422 7990142 13430309 16041350 23367229 38059545 49967202 45715846 25271916
40455B5271916k0562737m991823Q865238P277449l649352p742920o43194O546966
$$ 25271916 4709179 -282644 8582594 15860043 12210691 4467771 3824577 10371543
40447A0371543M395843l744455r776483j0895037p581337L11253J0044721J4906027
$$ 10371543 14767386 11022931 1246448 -9648589 -17229926 -16918673 -6873952 8032075
40439H032075J1750446M450839l341579j1793837j7982652j4853397k927446O305710
$$ 8032075 19782521 24233360 20891781 9097944 -8884708 -23738105 -26665551 -20359841
40431b0359841N916432L082318M922703N288047l083789j2772204j1629892j115598
$$ -20359841 -14443409 -11361091 -6438388 -1150341 -4234130 -17006334 -28636226 -29751824
40423b9751824R070662J7048076K3804209K0099128j350820k4647163k4413163
$$ -29751824 -20681162 -3633086 20171123 40270251 38919431 14272268 -10140895
40416a0140895j870297J4745976R862900j415491k273255J404091j609341o053871
$$ -10140895 -12011192 2734784 12597684 11182193 8908938 10313029 8703688 2649817
40408B649817k894375J623935j436146m105818N006976J6354285J0866333q428005
$$ 2649817 -244558 1379377 -56769 -4162587 844389 17198674 28065007 19637002
40400A9637002j8804508j1807060k243010N05190O533607K0386113K4077731L612466
$$ 19637002 832494 -10974566 -13217576 -12712386 -6178779 14207334 38285065 41897531
40392D1897531k3005859k6958429r642489J554478l653230n639874Q564291K1245429
$$ 41897531 18891672 -8066757 -17709246 -16154768 -19807998 -25447872 -16883581 4361848
40384D361848J2666264n727887r479439n89610k171777j7140916k0719421p78506
$$ 4361848 17028112 11300225 1820786 1231176 -940601 -18081517 -38800938 -39579444
40376c9579444J9973814J6992233l20121n255874O463775J5089462R095029j893864
$$ -39579444 -19605630 -2613397 -2933518 -8189392 -1725617 13363845 22458874 20565010
40368B0565010o468225n743216m615977l047476j137050j685419k975960J040205
$$ 20565010 14096785 8353569 3737592 690116 -446934 -2132353 -5108313 -4068108
40360d068108Q743357R018610k251689j2608129q239676O954770J6282847J1630342
$$ -4068108 4675249 13693859 11442170 -1165959 -9405635 -2450865 13831982 25462324
40352B5462324J769883j273339K343607K641215m568630j0241974m434863P051573
$$ 25462324 27232207 25958868 28302475 30943690 26375060 16133086 11698223 18749796
40344A8749796P282669p872695k0309765j2904357N304022J0245598l719454j6347512
$$ 18749796 26032465 18159770 -2149995 -15054352 -9750330 495268 -3224186 -19571698
40336a9571698r980701Q233609J9195746J6082492O621461j476833o856075r119194
$$ -19571698 -29552399 -21318790 -2123044 13959448 20580909 19104076 12248001 3128807
40328C128807o517738k65197M526006M518355K371330L436078Q244491R573336
$$ 3128807 -3388931 -3654128 871878 5390233 7761563 11197641 19442132 29015468
40320B9015468N4813j5775221k1687038p831478J4303337K3291873J3786437J735143
$$ 29015468 29070281 13295060 -8391978 -16223456 -1920119 21371754 35158191 36893334
40312C6893334J284818O695107M084948o706975j2448553o301270K619690J874038
$$ 36893334 38178152 44873259 48958207 42251232 29802679 23501409 26121099 27995137
40304B7995137q485715j7067740j5399919o468695J454735N418736Q154833R554098
$$ 27995137 19509422 2441682 -12958237 -19426932 -17972197 -12553461 -4398628 5155470
40296E155470M754981o171394j3092066p420925M810278R987400N482706J496787
$$ 5155470 9910451 3739057 -9353009 -16773934 -11963656 -1976256 3506450 5003237
40288E003237L513462L974593l305866j0293593n914930N609138R104093L53308
$$ 5003237 8516699 12491292 9185426 -1108167 -7023097 -1413959 7690134 8043442
40280H043442p372367k479893Q073247Q686112k805979j2348649q990072J800652
$$ 8043442 671075 -1808818 6264429 14950541 12144562 -204087 -9194159 -7393507
40272g393507P750757N467657L38217l732076o175174m630090K334847Q073962
$$ -7393507 357250 5824907 6163124 2431048 -3744126 -8374216 -6039369 2034593
40264B034593L573766q011791j2274782k554198J0646264J3609286N014091o708833
$$ 2034593 5608359 -2403432 -14678214 -17232412 -6586148 7023138 12037229 5328396
40256E328396j3789369j2200949k229050Q806151J1558394O458947K440240J342278
$$ 5328396 -8460973 -20661922 -22890972 -14084821 -2526427 3932520 6372760 7715038
40248G715038m414960j4255906j4862891j832654R748194Q386721M196901Q644093
$$ 7715038 3300078 -10955828 -25818719 -27651373 -17903179 -9516458 -5319557 3324536
40240C324536J2135333J944185j1017832p669979O197023Q533327k466007p632651
$$ 3324536 15459869 17404054 6386222 -1283757 4913266 13446593 10980586 3347935
40232C347935j511617j74890j0314869j6087304n352139J1493487J8063672J1398693
$$ 3347935 1836318 1661428 -8653441 -24740745 -30092884 -18599397 -535725 10862968
40224A0862968j592640j2458158j2104201J500225J4332385J0984004j689738
$$ 10862968 9270328 -3187830 -15292031 -13791806 540579 11524583 9834845
40217I834845m294539L157957K858774o601918o008364Q723432J6259237O182783
$$ 9834845 5540306 8698263 11557037 4955119 -1053245 7670187 23929424 30112207
40209C0112207l218909J928473P714894j49329j1176591j1990015r446377j1352681
$$ 30112207 26893298 28821771 36536665 36387336 25210745 13220730 3774353 -7578328
40201g578328p960256M877357Q582722o131106j4653353L016456K2191639R708109
$$ -7578328 -15538584 -10661227 -2078505 -8209611 -22862964 -19846508 2345131 12053240
40193A2053240j7960266j6820202J3749785K9065355R345541j3494545j0490051
$$ 12053240 -5907026 -22727228 -8977443 20087912 29433453 15938908 5448857
40186E448857L408526K836611n874250j939832J1607933J3562635j198432j4825251
$$ 5448857 8857383 11693994 5819744 3879912 15487845 29050480 27852048 13026797
40178A3026797j1742646L580721J4940615J2588624J627663n424036l594147K8015
$$ 13026797 1284151 4864872 19805487 32394111 34021774 28597738 25003591 25031606
40170B5031606j165208k880163J136577O406838L976383n423253j3354684j4956708
$$ 25031606 23866398 20986235 22122812 28529650 32506033 27082780 13728096 -1228612
40162a228612r111044N023780K0350579K0290125J73224j8729672j4673547K983474
$$ -1228612 -10339656 -5315876 15034703 35324828 35498052 16768380 2094833 5078307
40154E078307Q390785j438578o331299J188619O369976O19968n868490n296335
$$ 5078307 13469092 12030514 5699215 6887834 13257810 13877778 8009288 2712953
40146B712953l377236l029331J807730R675062R695301K524435J907800Q647746
$$ 2712953 -664283 -3693614 -1885884 7789178 17484479 20008914 21916714 30564460
40138C0564460O152505r024546j6490874m649236R284875P775727k66511J08610
$$ 30564460 36716965 27692419 11201545 6552309 15837184 23612911 23346400 23455010
40130B3455010K585786n151767j4641764r294143O455367J3628332P850175J058182
$$ 23455010 26040796 20889029 6247265 -3046878 3408489 17036821 24886996 25945178
40122B5945178j599007o594894j4772766j6675323p472681N138623R856613K412009
$$ 25945178 24346171 17751277 2978511 -13696812 -21169493 -16030870 -6174257 -3762248
40114c762248j0376914j3353280K498767K3523910K3611501o78977k0098296j1234681
$$ -3762248 -14139162 -27492442 -24993675 -1469765 22141736 21462759 1364463 -9870218
40106i870218J0054111J2813967l742975j3044183k867391J0947006J2677139
$$ -9870218 183893 12997860 9254885 -3789298 -6656689 4290317 16967456
40099A6967456N828631n78454n953082j1141680j1429987l984475O228659J1872353
$$ 16967456 22796087 22217633 16264551 5122871 -6307116 -10291591 -4062932 7809421
40091G809421Q782264k466627j3224819j0013876Q124086K1644083J3882471l952263
$$ 7809421 16591685 14125058 900239 -9113637 -989551 20654532 34537003 30584740
40083C0584740q756505n25175J249107o487459n242584R806943J7186899L297733
$$ 30584740 21828235 21303060 22552167 16064708 10822124 20629067 37815966 41113699
40075D1113699j4796798j6090360n182719J292896Q6319m012847j2179264k1314325
$$ 41113699 26316901 10226541 5043822 6336718 6423037 2410190 -9769074 -31083399
40067c1083399j5813898Q677000K7593186J8319304l291462n487939R316083J0214184
$$ -31083399 -46897297 -38220297 -10627111 7692193 4400731 -1087208 8228875 18443059
40059A8443059q734875j7106135J685392K2421160J7268054l713910j2448427
$$ 18443059 9708184 -7397951 -5712559 16708601 33976655 30262745 17814318
40052A7814318l877946N044269M448342r80382n348557n331380K458622J3919929
$$ 17814318 13936372 18980641 23428983 22448601 17100044 11768664 14227286 28147215
40044B8147215J5501836K826227q879493o715580n8562k065754n406304J709614
$$ 28147215 43649051 46475278 37595785 30880205 30821643 28755889 23349585 25059199
40036B5059199Q401502k362928j9092231j5145150O708606J6316064M127992p173958
$$ 25059199 33460701 31097773 12005542 -3139608 3568998 19885062 24013054 16839096
40028A6839096n089858n422667j5481656j5072916N541414K1201879J1264276
$$ 16839096 11749238 6326571 -9155085 -24228001 -18686587 2515292 13779568
40021A3779568m722985p47231J0610375J835152j8872301j9174838M308112K1679145
$$ 13779568 9056583 8309352 18919727 20754879 1882578 -17292260 -12984148 8694997
40013H694997J6216077J891728o297544q986258o578582M754092J6256317J1564483
$$ 8694997 24911074 26802802 20505258 11519000 4940418 9694510 25950827 37515310
40005C7515310n897102j4033545n287316M680528N724717N550018P338070J267581
$$ 37515310 31618208 17584663 12297347 16977875 22702592 28252610 35590680 36858261
39997C6858261j2219349j5830138l900113O032601L026220P59099J0136981J6316997
$$ 36858261 24638912 8808774 4908661 10941262 13967482 14726581 24863562 41180559
39989D1180559L122919j7316419k1011478o312131P858406R538597K829751m040923
$$ 41180559 44303478 26987059 5975581 -336550 7521856 17060453 19890204 15849281
39981A5849281o012440j669396M011346L456016j444235q11745N796025P520598
$$ 15849281 9836841 8167445 12178791 15634807 14190572 13378827 19174852 26695450
39973B6695450K186576L79320L640818j1765j0214000q776943P055615J3143155
$$ 26695450 28882026 29261346 32902164 32890399 22676399 13899456 20955071 34098226
39965C4098226j502409j1748962J817543J6423148N073114j4226075p700897J4265690
$$ 34098226 32595817 20846855 22664398 39087546 44160660 29934585 22233688 36499378
39957C6499378J2835214j2704200k2672233k672029J5031139N987881j2024020
$$ 36499378 49334592 36630392 13958159 11286130 26317269 32305150 20281130
39950B0281130j4958154p344714k295344L099620J1936247J2465537m13121r893123
$$ 20281130 5322976 -2021738 -4317082 -1217462 10718785 23184322 22771201 12878078
39942A2878078k963173P809850O718314K92110O40274J383677p668170j6643833
$$ 12878078 9914905 17724755 24443069 24735179 25375453 26759130 19090960 2447127
39934B447127r889794O488119J3740417R096726M326618K881117k30116j280172
$$ 2447127 -7442667 -954548 12785869 21882595 26209213 29090330 28860214 27580042
39926B7580042P254876J7101065J1486290p125657j7176340r274854J785273J961220
$$ 27580042 34834918 51935983 63422273 56296616 39120276 29845422 31630695 33591915
39918C3591915k932511j938730K342761J448680l319632n233919n082896p919314
$$ 33591915 30659404 28720674 31063435 32512115 29192483 23958564 18875668 10956354
39910A0956354j1117770p341857J885203O593538L695761J511872M681581M513041
$$ 10956354 -161416 -7503273 -5618070 975468 4671229 6183101 10864682 15377723
39902A5377723o402297j6753387p767740J7835601L3058991K0462416l203673
$$ 15377723 8975426 -7777961 -15545701 2289900 35348891 55811307 52607634
39895E2607634r183595M180479J1754920k44130j5450032j3703053j54467N506076
$$ 52607634 43424039 47604518 59359438 59115308 43665276 29962223 29807756 35313832
39887C5313832q40746m957195P82151N753342n93632j0601982q589686N791811
$$ 35313832 34473086 29515891 30298042 36051384 35457752 24855770 16266084 22057895
39879B2057895J5373945Q294994n976081j0074084k608907J980395l038873o088725
$$ 22057895 37431840 45726834 39750753 29676669 27067762 29048157 26009284 19920559
39871A9920559L330521J5672162J4002733n00248j0231363o930201q80683j678446
$$ 19920559 23251080 38923242 52925975 52425727 42194364 35264163 34383480 32705034
39863C2705034m285453j401988K342871p34784o238490l649917N806351R023948
$$ 32705034 28419581 27017593 29360464 28625680 22387190 18737273 24543624 33567572
39855C3567572O1039j0015112p359605N492271J1360826q3952j7775739k1292657
$$ 33567572 33628611 23613499 16253894 21746165 33106991 33023039 15247300 -6045357
39847f045357n842900J2158987J6713065J0758287O185246L732298m353260j5493652
$$ -6045357 -11888257 270730 16983795 27742082 33927328 37659626 33306366 17812714
39839A7812714j6423274m082219P287212O056108j382095k989474Q81727J733315
$$ 17812714 1389440 -2692779 4594433 10650541 9268446 6278972 7160699 8894014
39831H894014j440426j540982M037869R076561P279934J97809m463994r60218
$$ 8894014 7453588 5912606 9950475 19027036 26306970 26504779 22040785 21080567
39823B1080567P055696Q154084l353806j6631875j5043252J313925J3746702R557527
$$ 21080567 28136263 36290347 32936541 16304666 1261414 2575339 16322041 25879568
39815B5879568k067705n744209j249473J474142J014319M622513J2343355J4119683
$$ 25879568 23811863 18067654 16818181 18292323 19306642 23929155 36272510 50392193
39807E0392193M622148q655060j5300619j3282262p473782k326148O04817J437951
$$ 50392193 55014341 46359281 31058662 17776400 10302618 7976470 8581287 10019238
39799A0019238J807131M409497R926452J4432120J2109802K336302p092201p509787
$$ 10019238 11826369 16235866 26162318 40594438 52704240 55040542 47948341 40438554
39791D0438554r66842R18592o838002j3683544q083492M230003P393047j515314
$$ 40438554 39471712 40390304 33552302 19868758 11785266 16015269 23408316 21893002
39783B1893002r100846o280011N29657K661529J662697K237507K582076q67122
$$ 21893002 12792156 6512145 7041802 9703331 11366028 13603535 16185611 15318489
39775A5318489n905639p643753l898165M948788J4595678J5140025J489449j3686927
$$ 15318489 9412850 1769097 -2129068 2819720 17415398 32555423 34044872 20357945
39767B0357945j1357500O430908J6268735N905613j0059260j4720817j0586864
$$ 20357945 9000445 15431353 31700088 37605701 27546441 12825624 2238760
39760B238760n891962J487160J1585028J2262136m65646r081403j425479O354590
$$ 2238760 -3653202 -2166042 9418986 21681122 21215476 12134073 10708594 17063184
39752A7063184k870314j4064328l498428J8156611K0261373K080435p976312j031738
$$ 17063184 14192870 128542 -3369886 14786725 35048098 37128533 29152221 28120483
39744B8120483J768147q081463j0338390N670269J9614291J3473390j184940o668558
$$ 28120483 29888630 21807167 11468777 17139046 36753337 50226727 49041787 42373229
39736D2373229n918584p954438q214671k083168R36834n095847q151076O59733
$$ 42373229 36454645 28500207 20285536 18202368 19139202 14043355 5892279 6552012
39728F552012Q850805M093440l100753J290413Q814663M524038m914950l268961
$$ 6552012 15402817 19496257 16395504 17685917 26500580 31024618 26109668 22840707
39720B2840707O196167Q304437L622617L454835M511533m910171j7711862j4302332
$$ 22840707 29036874 37341311 40963928 44418763 48930296 44020125 26308263 12005931
39712A2005931M035972J4264498O990239j843351J39021M612251K419504p64256
$$ 12005931 16041903 30306401 37296640 35453289 35592310 40204561 42624065 41859809
39704D1859809O93242J17788o669701r438665L08255J2745502J2493952L60548
$$ 41859809 42553051 42670839 36001138 26562473 26870728 39616230 52110182 52470730
39696E2470730r253358p747757M15388O870414Q212050O425051M525371K197381
$$ 52470730 43217372 35469615 35885003 42755417 50967467 57392518 61917889 64115270
39688F4115270l264131r919879r600729O85396J0642666R072537K49631l027074
$$ 64115270 60851139 50931260 41330531 42015927 52658593 61731130 61980761 58953687
39680E8953687R91430L357542J412216N62700Q30761k150968l741036L869219
$$ 58953687 59945117 63302659 64714875 65277575 66108336 63957368 60216332 64085551
39672F4085551J2482793N733431j1600504j6167739l882336J572971j0425903
$$ 64085551 76568344 82301775 70701271 54533532 50651196 52224167 41798264
39665D1798264j6566484Q17362J9624477J1299598j1655906j4458178N444001
$$ 41798264 25231780 26049142 45673619 56973217 45317311 30859133 36303134
39658C6303134J7374614P328133n009456l041180L438331J584557k970103j025441
$$ 36303134 53677748 61005881 55996425 52955245 56393576 57978133 55008030 53982589
39650E3982589L001471K114625j3845J108084P78563l527450l101321O982992
$$ 53982589 56984060 59098685 59084840 60192924 60971487 57444037 54342716 61325708
39642F1325708J4440393N753837j1728414j8410110r266549K197410O007199P669431
$$ 61325708 75766101 81519938 69791524 51381414 42114865 44312275 50319474 57988905
39634E7988905J4021380J8793833J1744573l022757r204225p68098P638890R50144
$$ 57988905 72010285 90804118 102548691 99525934 90321709 89553611 97192501 98142645
39626I8142645j2478585j1315269N489949J3924055O17034j4807479q508923J1094971
$$ 98142645 85664060 74348791 79838740 93762795 94379829 79572350 71063427 82158398
39618H2158398J7251104O104638j423465L845382P919868K401059j321464M385380
$$ 82158398 99409502 105514140 104090675 107936057 115855925 118256984 116935520 121320900
39610A21320900R008750N068995K441537P289410O825640p441617j9267267j1067378
$$ 121320900 130329650 135398645 137840182 145129592 151955232 144513615 125246348 114178970
39602A14178970O663838J1356065K571969k523793N90722J648347j405340l63703
$$ 114178970 120842808 132198873 134770842 132247049 132837771 134486118 133080778 132717075
39594A32717075M464325M714737J728575L380872N310916k271994j0346501M65261
$$ 132717075 137181400 141896137 143624712 147005584 152316500 150044506 139698005 140163266
39586A40163266K4295431L0478192Q402254j4493534j3452264r44151j461223
$$ 140163266 164458697 194936889 203339143 188845609 175393345 174449194 172987971
39579A72987971j1983475j1748196J084139P869317L25383q821353p033184K487357
$$ 172987971 161004496 149256300 150340439 158209756 158535139 149713786 142680602 145167959
39571A45167959Q906502N842827n892540j8359655j9666705n971059J0586699
$$ 145167959 154074461 159917288 154024748 135665093 115998388 110027329 120614028
39564A20614028J4435132N454847l397417m771246k433385L36185M812444P518951
$$ 120614028 135049160 140504007 137106590 132335344 129901959 130238144 135050588 142569539
39556A42569539L10185j4367391k0052501p537790Q967568Q750996o978058j6854854
$$ 142569539 142879724 128512333 108459832 100922042 109889610 118640606 111662548 94807694
39548I4807694r317145L219850N378280R23135K486991Q547215O934061k229621
$$ 94807694 85490549 88710399 94088679 95011814 97498805 106046020 112980081 110750460
39540A10750460n729163j476502l593585j5260248j7047643K043232K0163852
$$ 110750460 105021297 103544795 99951210 84690962 67643319 69686551 89850403
39533H9850403J2034844j0182080j3235193O192079J7275130L190788j6679682
$$ 89850403 101885247 91703167 78467974 84660053 101935183 105125971 88446289
39526H8446289k0532528j2474303m971413J939706Q676078N965314n803915p518051
$$ 88446289 67913761 55439458 50468045 52407751 61083829 67049143 61245228 53727177
39518E3727177R132532K2026874J0080034j2650436j8132947n262009N656337
$$ 53727177 62859709 84886583 94966617 82316181 64183234 58921225 64577562
39511F4577562P195637O725092L471097q041053j7435728r472720P482180J0998044
$$ 64577562 71773199 78498291 81969388 73928335 56492607 47019887 54502067 65500111
39503F5500111L20706m938281k80833o13503p718250n208109P903897J0113083
$$ 65500111 65820817 60882536 60601703 59988200 52269950 47061841 54965738 65078821
39495F5078821n507617j6949002r874779l01908l365695o175086N911354J8441874
$$ 65078821 59571204 42622202 32747423 32445515 29079820 22904734 28816088 47257962
39487D7257962R597060j2490767k0264741n893346J2764005J9844697J5511588
$$ 47257962 56855022 44364255 24099514 18206168 30970173 50814870 66326458
39480F6326458N756144m780928j0868869j0030195o629125m989827l291549m55577
$$ 66326458 72082602 67301674 56432805 46402610 39773485 34783658 31492109 31036532
39472C1036532n60140l430804j597160N403508O466577j870042o466996O578L880671
$$ 31036532 30476392 27045588 25448428 30851936 37318513 35448471 28981475 28988053 32868724
39463C2868724o182828j6456026r070839P568363J2332580N065507J951157M637168
$$ 32868724 26685896 10229870 1159031 8727394 21059974 26125481 28076638 32713806
39455C2713806Q40779p365603l751567J1124731J5378895k55133j6231121j2616642
$$ 32713806 33554585 26188982 22437415 33562146 48941041 48685908 32454787 19838145
39447A9838145L780741J2572196P248045k303433o585154n443677l622450l872275
$$ 19838145 23618886 36191082 43439127 41135694 34550540 29106863 25484413 21612138
39439B1612138m154421o54490N905414J0048595R437750P098187L255516n398242
$$ 21612138 17457717 16803227 22708641 32757236 42194986 49293173 52548689 47150447
39431D7150447j3796166r493106N807045J1695559o67295j1060006j693413J1433943
$$ 47150447 33354281 23861175 29668220 41363779 40696484 29636478 27943065 39377008
39423C9377008M130547j4050453j4983039P04723O573098l368545q061648m92262
$$ 39377008 43507555 29457102 14474063 15178786 21751884 18383339 10321691 9829429
39415I829429J776879o328439o506868N734719Q983332l617514p004139J2012211
$$ 9829429 11606308 5277869 -1228999 4505720 13489052 9871538 2867399 14879610
39407A4879610K6568937J1773442j3312451j6112266p43235M700171m639037q738865
$$ 14879610 41448547 53221989 39909538 23797272 23054037 27754208 23115171 14376306
39399A4376306j2032P363456L163633o738937j3077888j1668587k591952O772570
$$ 14376306 14364274 21727730 24891363 18152426 5074538 -6594049 -9186001 -2413431
39391b413431N640115k503538M67185J7059635K1868773j175441k7985496k6320923
$$ -2413431 3226684 723146 1190331 18249966 40118739 38943298 10957802 -15363121
39383a5363121l109568R616473M347021J269982Q391793J1947673O215087J999256
$$ -15363121 -18472689 -8856216 -4509195 -3239213 5152580 17100253 23315340 25314596
39375B5314596K492020j479668q584124o183466L419448K918167q025206q493550
$$ 25314596 27806616 26326948 17742824 11559358 14978806 17896973 9871767 1378217
39367A378217O814162J4080378j796451k0220096j4761166Q021167J9955086J0301181
$$ 1378217 8192379 22272757 20476306 256210 -14504956 -6483789 13471297 23772478
39359B3772478n144062q750312l93648P112935M016248n373579p328969K717687
$$ 23772478 18628416 9878104 9484456 16597391 20613639 15240060 7911091 10628778
39351A0628778J1187328N061194o822358o621193L201426M295609m756044m908411
$$ 10628778 21816106 26877300 20054942 13433749 16635175 20930784 16174740 11266329
39343A1266329Q650705J4045377k479559k1852803j9771271j685085R168721O210406
$$ 11266329 19917034 33962411 31482852 9630049 -10141222 -11826307 -2657586 3552820
39335C552820J926005L096346K770737m235492j2069632j1921482k096660R858619
$$ 3552820 5478825 8575171 11345908 7110416 -4959216 -16880698 -18977358 -9118739
39327i118739J2274209R27524j2531793j1333851M449418J6199704J0977573l103646
$$ -9118739 3155470 4082994 -8448799 -19782650 -15333232 866472 11844045 8740399
39319H740399j0947581q842439k027951N524447J0915429J0392138M445308k124616
$$ 8740399 -2207182 -11049621 -13077572 -7553125 3362304 13754442 18199750 16075134
39311A6075134q098528j4183798j3192574K567810K1502702K0179274j947766
$$ 16075134 7976606 -6207192 -19399766 -16831956 4670746 24850020 22902254
39304B2902254j6172212m688927J3721386J4008540P95795o299456n584052p119216
$$ 22902254 6730042 2041115 15762501 29771041 30566836 24267380 18683328 11564112
39296A1564112p214871L750350J6110390J0912240p883121j6753302q294470L78484
$$ 11564112 4349241 8099591 24209981 35122221 27239100 10485798 2191328 2569812
39288B569812k298959o459387j426704O954288Q470587L684344j655520o710917
$$ 2569812 270853 -6188534 -7615238 -660950 7809637 11493981 9838461 3127544
39280C127544j2468009j5726741j1862804j24151J4671975K2730944J5636634
$$ 3127544 -9340465 -25067206 -36930010 -37054161 -22382186 348758 15985392
39273A5985392k040428j3300836q713116J222966K975197m07300K09195N12567
$$ 15985392 13944964 644128 -8068988 -6846022 -3870825 -4278125 -4068930 -3556363
39265c556363p605959j4991797o519828J0415250J3171532k2415o288477M971365
$$ -3556363 -11162322 -26154119 -32673947 -22258697 -9087165 -9109580 -15398057 -10426692
39257a0426692J6075974J1155002l31249l092041J0495j371628n447756n083205
$$ -10426692 5649282 16804284 16473035 13380994 13391489 12019861 6572105 1488900
39249A488900k878090m441383n445509L30995O886782L759925o399579j0530907
$$ 1488900 -1389190 -5830573 -11276082 -10945087 -4058305 -298380 -6697959 -17228866
39241a7228866l530016O220034R198332N163942R93228K409005P716688R023958
$$ -17228866 -20758882 -14538848 -5340516 -176574 816654 3225659 10942347 19966305
39233A9966305K299915n363301m889476M22436R9285m599653j364462J0376629
$$ 19966305 22266220 16902919 12013443 12435879 12535164 7935511 6571049 16947678
39225A6947678J3858677P18988j3252401j1132933o04611j67006r065420j0369533
$$ 16947678 30806355 31525343 18272942 7140009 6535398 6368392 -2697028 -13066561
39217a3066561j40585O459194N51147o337172q28481J2079499J6894553Q650945
$$ -13066561 -13207146 -6747952 -6196805 -12533977 -13362458 -1282959 15611594 24262539
39209B4262539l051343p902979n078788M5028L089429K521640j413547n896573
$$ 24262539 21211196 13308217 8229429 8274457 11363886 13885526 12471979 6575406
39201F575406n909965j54220M095321j659463j3232896j4902587J1841J6964971
$$ 6575406 665441 511221 4606542 2947079 -10285817 -25188404 -25176563 -8211592
39193h211592J7807124N361608j679084L818772R252360L802785n722737p516034
$$ -8211592 9595532 14957140 13278056 17096828 26349188 30151973 24429236 16913202
39185A6913202k692740j209514n706550q236163j622700J1050712J8403734J1763205
$$ 16913202 14220462 13010948 7304398 -931765 -2554465 8496247 26899981 38663186
39177C8663186m116102j3869308r546281j334804k015820o312671p708J3158125
$$ 38663186 34547084 20677776 11131495 9796691 7780871 1468200 1460492 14618617
39169A4618617J3017482m964458j9219069j3400876k75519j88205j0277555j2445579
$$ 14618617 27636099 22671641 3452572 -9948304 -10223823 -10412028 -20689583 -33135162
39161c3135162k067271R213831J3496086J2527057O927695m441175j4891384j3664298
$$ -33135162 -35202433 -25988602 -12492516 34541 6962236 2521061 -12370323 -26034621
39153b6034621p11019J2575237J7485629J4112435N600580l527910n536953K683770
$$ -26034621 -26745640 -14170403 3315226 17427661 23028241 19500331 13963378 16647148
39145A6647148J1003968O625104p167934j4339820q406910N41563K543573o21882
$$ 16647148 27651116 34276220 27108286 12768466 4361556 4903119 7446692 6824810
39137F824810l570574n512659n808940j737500M109830L883886k352689l257321
$$ 6824810 3254236 -2258423 -8067363 -9804863 -5695033 -1811147 -4163836 -7421157
39129g421157O597745J5458619J0376847k766955p715946k581635j919775j2519210
$$ -7421157 -823412 14635207 25012054 22245099 14529153 11947518 10027743 -2491467
39121b491467k0844559j2352843O166023J4890401P584221k321883k938250J226388
$$ -2491467 -23336026 -35688869 -29522846 -14632445 -7048224 -9370107 -12308357 -11081969
39113a1081969J398875L59705M859762R381727K537423j1633849j4764109j093535
$$ -11081969 -9683094 -9323389 -4463627 4918100 7455523 -4178326 -18942435 -20035970
39105b0035970J1151322M735565j1422039j5137367k670840P310774J356820j0594657
$$ -20035970 -8884648 -4149083 -15571122 -30708489 -33379329 -26068555 -24711735 -35306392
39097c5306392j0360322L581217J4837657J0809347j902243p170310k01311Q049492
$$ -35306392 -45666714 -42085497 -27247840 -16438493 -18340736 -25511046 -25712357 -17662865
39089a7662865P531680K012457L88350K558665K855455K141133N025721Q059424
$$ -17662865 -10131185 -8118728 -7730378 -5171713 -2316258 -175125 4850596 12910020
39081A2910020L553143n756055r190216n299183k295892j077425N190076J2360116
$$ 12910020 16463163 10707108 1516892 -3782291 -6078183 -7155608 -1965532 10394584
39073A0394584O139470j2074140k0830335j0031256L726078N674962N219402J2871352
$$ 10394584 16534054 4459914 -16370421 -26401677 -22675599 -17000637 -11781235 1090117
39065A090117J6381918K791473j3714858j2557662j293467q60208p499810r56246
$$ 1090117 17472035 20263508 6548650 -6009012 -7302479 -8162687 -15662497 -16618743
39057a6618743J5830978J8598268K796975r260109n874018n61603l143603n032800
$$ -16618743 -787765 17810503 20607478 11347369 5473351 4911748 1768145 -3264655
39049c264655j895429l478593j0089711n605352J2925665K3470108J2309357l112913
$$ -3264655 -5160084 -8638677 -18728388 -24333740 -11408075 12062033 24371390 21258477
39041B1258477j605990J1016052J5811639Q061527n573306k0415440k8409746
$$ 21258477 19652487 30668539 46480178 54541705 48968399 28552959 143213
39034A43213j7276453P462729J7815640N96661j8544367j1277102J0471317J5261625
$$ 143213 -17133240 -9670511 8145129 8741790 -9802577 -21079679 -10608362 4653263
39026D653263J805293m146098N022011J0314340K608760m028724j010313P76997
$$ 4653263 6458556 2312458 7334469 17648809 20257569 16228845 15218532 15995529
39018A5995529n289396q151510r21874M570577j652567r664727o374974L164371
$$ 15995529 10706133 2554623 1632749 6203326 4550759 -5113968 -11488942 -8324571
39010h324571N743827J241972m71558K691888L723121k23664m342219m994501
$$ -8324571 -2580744 -1338772 -1810330 881558 4604679 4381015 38796 -4955705
39002d955705l734435k694688j983272j574442j404542l8292L142265N030007
$$ -4955705 -8690140 -11384828 -13368100 -14942542 -16347084 -16385376 -13243111 -8213104
38994h213104J785507m714172o636891R95289J2301372J5194222N895988n305729
$$ -8213104 -6427597 -11141769 -17778660 -16783371 -4481999 10712223 16608211 11302482
38986A1302482p518251m151851n701681j0845127q210096K422384P415338L066439
$$ 11302482 3784231 -367620 -6069301 -16914428 -25124524 -22702140 -15286802 -12220363
38978a2220363L314293J3124711J4654165k225488j5419676k543291J8588298
$$ -12220363 -8906070 4218641 18872806 16647318 1227642 -1315649 17272649
38971A7272649J4535387q423412j2861102O648195J2436994j2767580l3728796
$$ 17272649 31808036 23384624 10523522 17171717 29608711 16841131 -16887665
38964a6887665j7828909J3340193J9552949K516976n328647M865634J2343808
$$ -16887665 -34716574 -21376381 -1823432 693544 -4635103 230531 12574339
38957A2574339O195589l441054r865190j4889331j1978154N817910K2397841J3945384
$$ 12574339 18769928 15328874 5463684 -9425647 -21403801 -15585891 6811950 20757334
38949B0757334j1036108j8857906k001206J0185010Q82870r247005k582600L948101
$$ 20757334 9721226 -9136680 -11137886 -952876 -70006 -9317011 -11899611 -7951510
38941g951510p679496k0184926q837124J4574813J8789594J980013q880410k133830
$$ -7951510 -15631006 -35815932 -44653056 -30078243 -11288649 -9308636 -18189046 -20322876
38933b0322876N544163Q54972p697286p879174o6349R269714J4823508J0971857
$$ -20322876 -14778713 -13923741 -21621027 -29500201 -29566550 -20296836 -5473328 5498529
38925E498529k705261j4036673j0426528K680330R757331Q338253P416149O719825
$$ 5498529 2793268 -11243405 -21669933 -18989603 -9232272 -894019 6522130 13241955
38917A3241955j605797j2083204r537821M465354J1347934M895809j914461k994472
$$ 13241955 11636158 -447046 -9984867 -5519513 5828421 10724230 8809769 5815297
38909E815297o663261j1372770k311215J7287580K0967738R33890j3978545l058312
$$ 5815297 -847964 -12220734 -14531949 2755631 23723369 24657259 10678714 7620402
38901G620402J1679275K562433j7171738j6891572M91994P668167N76897r13799
$$ 7620402 19299677 21862110 4690372 -12201200 -11709206 -4041039 -3464142 -4377941
38893d377941O144435M015084q567891j1314785M80847O505956k577533r781301
$$ -4377941 1766494 5781578 -2786313 -14101098 -13620251 -7114295 -9691828 -19473129
38885a9473129l306846M138837R15055l132949K828998J0240577P071878k289234
$$ -19473129 -22779975 -18641138 -17726083 -20859032 -18030034 -7789457 -717579 -3006813
38877c006813p038592n712672q70223P367410J3005758N917708q414880r510189
$$ -3006813 -10045405 -15758077 -16628300 -9260890 3744868 9662576 1247696 -8262493
38869h262493O139202J4079833j393870j9513818j2729618J2000535K5107570
$$ -8262493 -2123291 11956542 10562672 -8951146 -21680764 -9680229 15427341
38862A5427341J6589844K619386l543860m690674n745525n857729n132094n321524
$$ 15427341 32017185 34636571 31092711 26402037 20656512 14798783 9666689 4345165
38854D345165m113973Q63751N510182N914172N487211O059133R64686j1313681
$$ 4345165 231192 1094943 6605125 12519297 18006508 24065641 25030327 13716646
38846A3716646j7288351p087016P267979Q918230J389704k114860m083658j3965975
$$ 13716646 -3571705 -10658721 -3390742 5527488 6917192 4802332 718674 -13247301
38838a3247301k2200504j0656470J3369240K1895552P551354o911381n986800
$$ -13247301 -35447805 -46104275 -32735035 -10839483 -3288129 -10199510 -16186310
38831a6186310j429367n093540p502440J238800J0408204O710454k617760l168827
$$ -16186310 -17615677 -22709217 -30211657 -28972857 -18564653 -11854199 -14471959 -17640786
38823a7640786K296818J297441n188234n320767K259735O617909L466623J440028
$$ -17640786 -15343968 -14046527 -19234761 -24555528 -22295793 -15677884 -12211261 -10771233
38815a0771233O505544J1007949M404181j0045244j6145537m402279J2940711
$$ -10771233 -4265689 6742260 11146441 1101197 -15044340 -19446619 -6505908
38808f505908J4133286k921228j4641932m041382J2429774P990303j2129528j6532197
$$ -6505908 7627378 4706150 -9935782 -13977164 -1547390 6442913 -5686615 -22218812
38800b2218812L465954J8821587P080968j4086873j5947763r56644O961169O76907
$$ -22218812 -18752858 68729 7149697 -6937176 -22884939 -23841583 -16880414 -16203507
38792a6203507o057808n553293m025086m777173l413563K47102J895426L510595
$$ -16203507 -22261315 -27814608 -31839694 -36616867 -40030430 -39783328 -37887902 -34377307
38784c4377307R136411J2239515M210616o527749l233263J1017608J4810675J656320
$$ -34377307 -25240896 -13001381 -8790765 -15318514 -18551777 -7534169 7276506 8932826
38776H932826r799601o227401J340150P66262L20609R449036J5593253L194226
$$ 8932826 -866775 -7094176 -5754026 -4987764 -4667155 4781881 20375134 23569360
38768B3569360j5434891j4147354O034168J6032721J955436j5152829j2516600
$$ 23569360 8134469 -6012885 21283 16054004 18009440 2856611 -9659989
38761i659989K087864O617428j509127o605852j612155N083722P414298Q901490
$$ -9659989 -7572125 -954697 -2463824 -9069676 -10681831 -5598109 1816189 10717679
38753A0717679J0382674N781642n026394j1862696q938900l025403o61933J428154
$$ 10717679 21100353 26881995 21855601 9992905 1054005 -1971398 -2633331 -1205177
38745a205177N149120K652086q657181j3974473q37530J6682710J3892330p186178
$$ -1205177 3943943 6596029 -2061152 -16035625 -16873155 -190445 13701885 6515707
38737F515707j8597924p189658Q219518Q684455J954576K776816N729080j442411
$$ 6515707 -12082217 -19271875 -11052357 -2367902 -413326 2363490 8092570 6650159
38729F650159j0878782n405911J0275922J3954484O37447j0838117r382922o600123
$$ 6650159 -4228623 -9634534 641388 14595872 15233319 4395202 -4987720 -11587843
38721a1587843j1676447j2972148J102181J9729830K5143023J8085189J0407456
$$ -11587843 -23264290 -36236438 -35134257 -15404427 9738596 27823785 38231241
38714C8231241K687515j0617104k0885287j3671520L859141P820352n814434j3272518
$$ 38231241 40918756 30301652 9416365 -4255155 -396014 7424338 1609904 -11662614
38706a1662614j206604J0813029L093193r753471k401977J6999330J7213068n563001
$$ -11662614 -12869218 -2056189 1037004 -8716467 -11118444 5880886 23093954 17530953
38698A7530953k0155620r146036N906900K471252p184251r41289J3246916J1026450
$$ 17530953 -2624667 -11770703 -5863803 -3392551 -10576802 -11518091 1728825 12755275
38690A2755275o426755j4193993l877822O283580L804779j544982N8762L226244
$$ 12755275 6328520 -7865473 -11743295 -5459715 -1654936 -3199918 -3141156 85088
38682H5088L168518N281250Q419586r4906j9277584k5551110p287528J1196059
$$ 85088 3253606 8534856 16954442 16859536 -2418048 -27969158 -35256686 -24060627
38674b4060627L918843j4119565q172559K0329997L2130433P734466k3288495
$$ -24060627 -20141784 -34261349 -42433908 -22103911 10026522 17760988 -5527507
38667e527507k3474989L786380K3947164J7237153k392907j0519184j350469R151948
$$ -5527507 -29002496 -25216116 -1268952 15968201 13575294 3056110 1705641 10857589
38659A0857589M429593j1799120j8888954m900518J7237872K5743701J6216285
$$ 10857589 15287182 3488062 -15400892 -20301410 -3063538 22680163 38896448
38652C8896448J793646p685299j2808520j3260578n528418N922924R785874M082373
$$ 38896448 40690094 33004795 20196275 6935697 1407279 7330203 17116077 21198450
38644B1198450j551934k617913m889366r489802q505574j079398K078811k348763
$$ 21198450 19646516 17028603 12139237 2649435 -5856139 -6935537 -4856726 -7205489
38636g205489k928778N824307J1769912N450103l953146n937365n699086q701866
$$ -7205489 -10134267 -4309960 7459952 12910055 8956909 3019544 -2679542 -11381408
38628a1381408n362518R356200J7173116J817787j9289614j6576219O281262J8192475
$$ -11381408 -16743926 -7387726 9785390 11603177 -7686437 -24262656 -17981394 211081
38620B11081Q462036k383966j108642Q53530l855619l107247P803916J1159318
$$ 211081 8673117 6289151 5180509 6034039 2178420 -928827 6875089 18034407
38612A8034407l328044j6728669r701578N880883O985826l584964m910921O587259
$$ 18034407 14706363 -2022306 -11723884 -5843001 1142825 -2442139 -7353060 -765801
38604g65801J4032239Q845264O16297j906714j235037q45587J24049l3892m581138
$$ -765801 13266438 22111702 22727999 20821285 19586248 18740661 18864710 18830818 14249680
38595A4249680r164945o212428O76507j51443q960970j1697332q59276J2488982
$$ 14249680 5084735 -1127693 -451186 -602629 -9563599 -21260931 -22120207 -9631225
38587i631225J3749642K992902p832283r287202j322225Q552402J0255335k83109
$$ -9631225 4118417 7111319 -720964 -10008166 -11330391 -2777989 7477346 7194237
38579G194237j4297825j7171494n162605R896304J5109001J0028871K397317l593496
$$ 7194237 -7103588 -24275082 -29437687 -19541383 -4432382 5596489 7993806 4400310
38571D400310q925286j2816020j0728682o99277J1492742J6483707J1355616L152468
$$ 4400310 -4524976 -17340996 -28069678 -28768955 -17276213 -792506 10563110 13715578
38563A3715578o19471k511232r387360j7204441j3015748L509766J3549849M434410
$$ 13715578 13096107 10584875 1197515 -16006926 -29022674 -25512908 -11963059 -7528649
38555g528649r824741q016314P080123J5320297J1329279Q204138R989775M496176
$$ -7528649 -17353390 -25369704 -18289581 -2969284 8359995 16564133 26553908 31050084
38547C1050084j0856287j9264226j1669678l028515o587025j0136753K880998
$$ 31050084 20193797 929571 -10740107 -13768622 -20355647 -30492400 -27611402
38540b7611402K2597657K5407737R449530m791854n761861j420353J005818M703335
$$ -27611402 -5013745 20393992 29843522 25051668 19289807 17869454 18875272 23578607
38532B3578607Q971652M943078o567788r725617K966966J5249748Q109997j2761514
$$ 23578607 32550259 37493337 30925549 21199932 24166898 39416646 47526643 34765129
38524C4765129k4393877j6969590l744450r23377q475498j3729301p031420R170494
$$ 34765129 10371252 -6598338 -10342788 -11266165 -19741663 -33470964 -40502384 -31331890
38516c1331890K2645594K1428219N656992r967930j0674887J66104L943618q376090
$$ -31331890 -8686296 12741923 18398915 8430985 -2243902 -2077798 1865820 -6510270
38508f510270k1996503j7505746J117879J1182951L911957l756201K677544J1104864
$$ -6510270 -28506773 -46012519 -44894640 -33711689 -29799732 -33555933 -30878389 -19773525
38500a9773525K585815j5444492j7635506J93280J3980474Q449676j546970J637427
$$ -19773525 -17187710 -32632202 -50267708 -50074428 -36093954 -27644278 -29191248 -27553821
38492b7553821J0345590Q817197K079386M601307J0817143L462597j2763668j3964250
$$ -27553821 -17208231 -8391034 -6311648 -1710341 9106802 12569399 -194269 -14158519
38484a4158519L556161J4286582L603502q994286l090519Q847847M169169r976212
$$ -14158519 -10602358 3684224 7287726 -1706560 -4797079 4050768 8219937 -1756275
38476a756275q172686R262751J4650530k391499j7603126j0179690O287218Q335093
$$ -1756275 -9928961 -666210 13984320 11592821 -6010305 -16189995 -9902777 -1567684
38468a567684n44200j53803J0188315J0848225m355773j7002784j2415671j74369
$$ -1567684 -2111884 -2265687 7922628 18770853 14415080 -2587704 -15003375 -15177744
38460a5177744L558454n95942k127450l6157n54268j738547L863455J2355450
$$ -15177744 -11619290 -12215232 -14342682 -14378839 -14933107 -16671654 -12808199 -452749
38452d52749R500127p457265k1227615j5445113L521324J4750801R308316o91347
$$ -452749 9047378 1590113 -19637502 -35082615 -31561291 -16810490 -7502174 -8193521
38444h193521p90831O058604N181192p248576j6761382r988792O169909J4209649
$$ -8193521 -8984352 -2925748 2255444 -4993132 -21754514 -31743306 -25573397 -11363748
38436a1363748J0491624O866852Q092744M106313r015826j7226705j0152811M0563
$$ -11363748 -872124 5994728 14087472 18193785 9177959 -8048746 -18201557 -18160994
38428a8160994j400403n306017N561885K2147464J7979702p768445k4249802j3219491
$$ -18160994 -19561397 -24867414 -19305529 2841935 20821637 13053192 -11196610 -24416101
38420b4416101O493506J1095014M845998L440476M082042n165275j8383207j7722540
$$ -24416101 -17922595 -6827581 -1981583 1458893 5540935 375660 -18007547 -35730087
38412c5730087j747484J1854730J1071213J710547n233657n852691k301527J293687
$$ -35730087 -37477571 -25622841 -14551628 -12841081 -18074738 -23927429 -26228956 -24935269
38404b4935269J785668J158119M222270Q339984L909792q756347j4368622m163343
$$ -24935269 -23149601 -21991482 -17769212 -9429228 -5519436 -14275783 -28644405 -32807748
38396c2807748R313929J1179468N849529M777224M869546k102945r006800l839743
$$ -32807748 -23493819 -12314351 -6464822 -1687598 3181948 1079003 -7927797 -11767540
38388a1767540O797225P117422p26941k038046K846024J229917n289075l844684
$$ -11767540 -4970315 2147107 1420166 -617880 2228144 3458061 -1831014 -5675698
38380e675698J883287l463618j3549690n060716J8441306K3063632j885503k1993015
$$ -5675698 -3792411 -7256029 -20805719 -25866435 -7425129 15638503 13753000 -8240015
38372h240015r960338J2085228R729306j0339471j6214130k222373Q617362M105359
$$ -8240015 -18200353 -6115125 3614181 -6725290 -22939420 -25161793 -16544431 -12439072
38364a2439072m827034o936912j633292Q961146J8567364J3771455p207457k1159643
$$ -12439072 -17266106 -24203018 -25836310 -16875164 1692200 15463655 8256198 -12903445
38356a2903445q154932J5110792J6372108m079605j5763980o393043L747363n1847
$$ -12903445 -21058377 -5947585 10424523 6344918 -9419062 -15812105 -12064742 -12116589
38348a2116589n200396J187833R868585Q089467J99784l783305l427370o61761
$$ -12116589 -17316985 -16129152 -6260567 1828900 2028684 -1754621 -5181991 -5843752
38340e843752O282626J1903543M172059j2993595j6994837K74833J5558107P529253
$$ -5843752 438874 12342417 16514476 3520881 -13473956 -13199123 2358984 9888237
38332I888237j0470020j1621243M309153J5055625J0838625K063285l108647o716266
$$ 9888237 -581783 -12203026 -7893873 7161752 18000377 20063662 16955015 10238749
38324A0238749p654985m77959J0503630J2580679L262452n480824l981589M372536
$$ 10238749 2583764 2105805 12609435 25190114 28452566 22971742 18990153 23362689
38316B3362689R522275L462040j4114791k9883560k4016845L678145K3857854
$$ 23362689 32884964 36347004 22232213 -7651347 -31668192 -27990047 -4132193
38309d132193J2406181j2973139j4943895R242312K4556229J1100511j0481069
$$ -4132193 8273988 -4699151 -19643046 -10400734 14155495 25256006 14774937
38302A4774937j5572554q226166k412556K823685J0251382R275142m448709j3476596
$$ 14774937 -797617 -9023783 -11436339 -8612654 1638728 10913870 6465161 -7011435
38294g011435m960452N437394j84741r831653l801575P297282L83995j5477837
$$ -7011435 -11971887 -6534493 -6719234 -16550887 -20352462 -13055180 -12671185 -28149022
38286b8149022j0298859J4511732K4085110M921182j4917195j1129686M126799
$$ -28149022 -38447881 -23936149 148961 5070143 -9847052 -20976738 -16849939
38279a6849939R428525M976208p06895r261683j8755097j4018021Q797554K7003685
$$ -16849939 -7421414 -2445206 -3152101 -12413784 -31168881 -45186902 -36389348 -9385663
38271i385663K1316492M470699m87969N031688M156393m637316r035146o579901
$$ -9385663 11930829 16401528 15913559 20945247 25101640 20464324 11429178 4849277
38263D849277n029264m759622l4131O694233Q183485N012345P70714p328869j8447105
$$ 4849277 -179987 -4939609 -4973740 1720493 9903978 14916323 15687037 8358168 -10088937
38254a0088937j9333031l209118J3126421J1251781K44676J101926J0882679Q901472
$$ -10088937 -29421968 -32631086 -19504665 -8252884 -8008208 -6906282 3976397 12877869
38246A2877869o130324j3499288n390352K820921J420844L35101O928535J1998141
$$ 12877869 6747545 -6751743 -12142095 -9321174 -7900330 -7565229 -636694 11361447
38238A1361447P250581j412282o735759j0326340j2434282o659558P116268J7357062
$$ 11361447 18612028 17199746 10463987 137647 -12296635 -18956193 -11839925 5517137
38230E517137J5487695N387044n534913j3485618j4370907n484522O399654J0698385
$$ 5517137 21004832 26391876 20856963 7371345 -6999562 -12484084 -6084430 4613955
38222D613955P720182N493032L834821k969170r887507o317378L166464L759192
$$ 4613955 12334137 17827169 21661990 18692820 8805313 2487935 5654399 9413591
38214I413591l227820j320205J1036904J5017435K058941j2683403j5169362r548756
$$ 9413591 6185771 4865566 15902470 30919905 32978846 20295443 5126081 -4422675
38206d422675l076490M483341Q862311J249002j1378835r393400O626318J1357553
$$ -4422675 -7499165 -3015824 5846487 7095489 -4283346 -13676746 -7050428 4307125
38198D307125n050085j8333526p409372J4153824K1885322J3503683K75738j3081680
$$ 4307125 -742960 -19076486 -26485858 -12332034 9553288 23056971 23332709 10251029
38190A0251029k1268867j2709879R156639J9552491P145129o304794j596505O618587
$$ 10251029 -11017838 -23727717 -14571078 4981413 12126542 5821748 4225243 10843830
38182A0843830r26549j1652881m513530J0186282P904209q159089j5608815j1576701
$$ 10843830 9917281 -1735600 -6249130 3937152 11841361 3682272 -11926543 -23503244
38174b3503244r787503q432900N338432K4337293K6634673R764717p611573j4882899
$$ -23503244 -33290747 -41723647 -36385215 -12047922 14586751 24351468 16739895 1856996
38166A856996j5524551j0132893J168427O749621n03837m937993O985343J6911337
$$ 1856996 -13667555 -23800448 -22632021 -15882400 -16386237 -21324230 -14338887 2572450
38158B572450K557996j8408887j2696827J0644221J2960685p132306j0388390
$$ 2572450 5130446 -13278441 -25975268 -15331047 -2370362 -9502668 -19891058
38151a9891058J4263568K8901254R807952j5512967j6609246m720302l544685
$$ -19891058 -5627490 23273764 33081716 17568749 959503 -3760799 -7305484
38144g305484r667846q870383l610525M55838R810423K2581298J8868019n457862
$$ -7305484 -16973330 -25843713 -29454238 -28998400 -19187977 3393321 22261340 16803478
38136A6803478k1646261r949051P007531R55185j5704495j2777641P228999J6252916
$$ 16803478 -4842783 -14791834 -7784303 -6829118 -22533613 -35311254 -28082255 -11829339
38128a1829339O648635l285198l727024l158355n519733l238514N785823J3699928
$$ -11829339 -5180704 -8465902 -12192926 -15351281 -20871014 -24109528 -18323705 -4623777
38120d623777J5377017J1150662Q42632j1492794j4165843l777361M473760j598897
$$ -4623777 10753240 21903902 22746534 11253740 -2912103 -6689464 -2215704 -3814601
38112c814601r760422k454000J2936857J5220814L318044m871965l262852k792506
$$ -3814601 -13575023 -16029023 -3092166 12128648 15446692 10574727 7311875 4519369
38104D519369o697379m773573M446069P743517k78741p233415l084390N069915
$$ 4519369 -2178010 -6951583 -2505514 5238003 4959262 -2274153 -5358543 -288628
38096b88628O502755K692916J022885J680554o66629o701887j0051648m500624
$$ -288628 6214127 8907043 9929928 11610482 10943853 4241966 -5809682 -10310306
38088a0310306P232292J2440889J366507j6448042j7783079M853276K8494621
$$ -10310306 -3078014 9362875 10729382 -5718660 -23501739 -18648463 9846158
38081I846158K5856454m13257k2436575k1485844m713678R298167R065285l707345
$$ 9846158 35702612 35289355 12852780 -8633064 -13346742 -4048575 5016710 1309365
38073A309365j5418032j0716912Q474030J9686003P986798j0181748q448552J0188715
$$ 1309365 -14108667 -24825579 -16351549 3334454 11321252 1139504 -7309048 2879667
38065B879667J7456426K264912j4631284j3462190o59847Q189904J0725203J0165534
$$ 2879667 20336093 22601005 7969721 -5492469 -6152316 2037588 12762791 22928325
38057B2928325K210196j4060588k4179627j4661533N344140J4435893O961636
$$ 22928325 25138521 11077933 -13101694 -27763227 -22419087 -7983194 -1021558
38050a021558l521941o112982l638739j759897l54753J060877P7871k146490N733
$$ -1021558 -4543499 -10656481 -14295220 -16055117 -16409870 -15348993 -15271122 -17417612 -17411879
38041a7411879O424980Q411251J889057m160052o18781O483670M249680o608244
$$ -17411879 -10986899 -2575648 -686591 -4846643 -5465424 1018246 5267926 -1340318
38033a340318j1868436n151418L455216M713776M018197R070203J3799304P062481
$$ -1340318 -13208754 -18360172 -14904956 -10191180 -6172983 2897220 16696524 23759005
38025B3759005q254032j7722477j4467268m275003O051858J3357097J3168403
$$ 23759005 15504973 -2217504 -16684772 -20959775 -14907917 -1550820 11617583
38018A1617583L841553m807490j645677O650641L109064j1286160j6631603o736505
$$ 11617583 15459136 10651646 9005969 15656610 18765674 7479514 -9152089 -15888594
38010a5888594k70871p925799j1585265M523574K2147870J5176498o092976q537434
$$ -15888594 -16159465 -24085264 -35670529 -31146955 -8999085 6177413 84437 -8452997
38002h452997J0594388J7667616m267291k7366538j9784070Q817439K4046677
$$ -8452997 2141391 19809007 15541716 -11824822 -31608892 -22791453 1255224
37995A255224J4666393L20595k681057j55935j709987l090527K626354Q467729
$$ 1255224 15921617 16242212 13561155 13405220 11695233 8604706 11231060 19698789
37987A9698789K290900j2286470j7560729o234837P415530O917447m854822j2270402
$$ 19698789 21989689 9703219 -7857510 -14092347 -6676817 240630 -4614192 -16884594
37979a6884594q523199J49842P519349J2000841R955959j620363j4361502j4620886
$$ -16884594 -25407793 -25257951 -17738602 -5737761 4218198 2597835 -11763667 -26384553
37971b6384553l662138K828988J08970J971678J3873501J7627801J98715j8017547
$$ -26384553 -30046691 -27217703 -27108733 -25137055 -11263554 6364247 6562962 -11454585
37963a1454585q200186K1396555L2384939J0148265j5437210j3218410P065555
$$ -11454585 -19654771 1741784 34126723 44274988 28837778 15619368 22684923
37956B2684923J3045989l724159k0418178j7890233l066399P521018J0495288
$$ 22684923 35730912 32006753 11588575 -6301658 -9368057 -1847039 8648249
37949H648249J1920705J1391616L818835o483567p893310L09091M660082k240758
$$ 8648249 20568954 31960570 35779405 29295838 21402528 21711619 26371701 24130943
37941B4130943j0029259p249232J203241M096726J504043m77374l330156q943166
$$ 24130943 14101684 6852452 8055693 12152419 13656462 13179088 9848932 905766
37933I05766p779700O541356J8189091P856883j3690721j7146155O76818J2368067
$$ 905766 -6873934 -332578 17856513 25713396 12022675 -5123480 -4446662 7921405
37925G921405L990843o664060m682400k20390k429413r50861Q836018J0481848
$$ 7921405 11912248 5248188 565788 345398 -2084015 -3034876 5801142 16282990
37917A6282990k896486j0319103J030690R440962l293990j5113716r2759K2699381
$$ 16282990 13386504 3067401 4098091 13539053 10245063 -4868653 -4961412 17737969
37909A7737969J8270782m575443q588753P568947Q819824j4158239k9631376j8338967
$$ 17737969 36008751 31433308 22844555 30413502 39233326 25075087 -4556289 -22895256
37901b2895256J13830N421979L659038L623046K61183n033121M98484J2606673
$$ -22895256 -22781426 -17359447 -13700409 -10077363 -9816180 -14849301 -14350817 -1744144
37893a744144Q796753j0565831j3769870J1058346K9844290J2727167j8718132
$$ -1744144 7052609 -3513222 -17283092 -6224746 23619544 36346711 17628579
37886A7628579k4241908k900312J2978009P123494p158343j4586984j3248578
$$ 17628579 -6613329 -9513641 3464368 10587862 3429519 -11157465 -24406043
37879b4406043n959234L951710J0341115J0730970J0166637J0025459L604620
$$ -24406043 -30365277 -26413567 -16072452 -5341482 4825155 14850614 18455234
37872A8455234q063222j0790018L16318Q990188K743056o995160o089960j461170
$$ 18455234 10392012 -398006 -81688 8908500 11651556 4656396 -1433564 -2894734
37864b894734l934576n001337N147966J1971690k501247k4011198k2138286K999785
$$ -2894734 -6829310 -11830647 -6682681 5289009 2787762 -21223436 -43361722 -40361937
37856d0361937K0170447J2674497l453578r472152o080930j93273P049156J1790425
$$ -40361937 -20191490 -7516993 -10970571 -20442723 -26523653 -26716926 -19667770 -7877345
37848g877345O906111l120701m441427L719372O991171J249555K7095Q908086
$$ -7877345 -971234 -4091935 -8533362 -4813990 2177181 3426736 3453831 12361917
37840A2361917J3113212K456838r680981p279749L084733M232293n198909j2474560
$$ 12361917 25475129 27931967 18250986 10971237 14055970 18288263 13089354 614794
37832F14794j1150940m507668N249835J5861709J7492704K898649j5527652j5295098
$$ 614794 -10536146 -15043814 -9793979 6067730 23560434 26459083 10931431 -4363667
37824d363667N650688K2175249J3583282r028799j8414447p733483K956056k391720
$$ -4363667 1287021 23462270 37045552 28016753 9602306 1868823 4824879 2433159
37816B433159j2899993q472770Q656058J5728271K652471j2710211j0284317M074948
$$ 2433159 -10466834 -18939604 -10283546 5444725 8097196 -4613015 -14897332 -10822384
37808a0822384R561292J514263n261269k173173J877629j109456m473925k35444
$$ -10822384 -1261092 253171 -5008098 -7181271 -5303642 -6413098 -10887023 -11122467
37800a1122467O216961N951925J864668J654810J973429n962942j7556718j6941594
$$ -11122467 -4905506 1046419 2911087 4565897 6539326 576384 -16980334 -33921928
37792c3921928l09278J6225605J7723374Q494247J623961j52636k746023o241397
$$ -33921928 -34231206 -18005601 -282227 8212020 9835981 9683345 6937322 695925
37784F95925m819613L14612K22097o801412r844044p76984J2301932J4539907
$$ 695925 -4123688 -3809076 -3586979 -10388391 -20232435 -21009419 -8707487 5832420
37776E832420L419901q978753j1637593n906535l3593K235942L848730P223368
$$ 5832420 9252321 273568 -11364025 -17270560 -17304153 -15068211 -11219481 -3996113
37768c996113R202430N440318j943977n198560p45767N789106P508686N183171
$$ -3996113 5206317 10646635 8702658 3504098 2758331 8547437 16056123 21239294
37760B1239294L107920L0295p630373j5529801j4313923l546080O756800R930025
$$ 21239294 24347214 24377509 16747136 1217335 -13096588 -16642668 -9885868 44157
37752D4157Q139543K942292o780580j3940489n651448J5201021K5759995J2862714
$$ 44157 8183700 11125992 4345412 -9595077 -15246525 -45504 25714491 38577205
37744C8577205o351373q664453K175570N322125l166735q281532m426018k990210
$$ 38577205 32225832 23561379 25736949 31059074 27892339 19610807 15184789 12194579
37736A2194579r400974j3085257o357708L362319P254854P037913O056863R91637
$$ 12194579 2793605 -10291652 -16649360 -13287041 -6032187 1005726 7062589 8054226
37728H054226r250045j6254085j2217748r93530P073699O460779q09263q525074
$$ 8054226 -1195819 -17449904 -29667652 -30661182 -23587483 -17126704 -17935967 -26461041
37720b6461041j0132552m172924L385212O706064P770131J0523162J1884111P628184
$$ -26461041 -36593593 -40766517 -37381305 -30675241 -22905110 -12381948 -497837 7130347
37712G130347K437818K727262M072834q90231o574068k261530P590641Q708459
$$ 7130347 9568165 12295427 16368261 15478030 8903962 6642432 14233073 22941532
37704B2941532R05931k554331O92738r91434r863914j3243530n725358K945572
$$ 22941532 23847463 21293132 21985870 20994436 11130522 -2113008 -7838366 -4892794
37696d892794O915843J1184780J4844512Q587455n223247j1712405q764080r951945
$$ -4892794 2023049 13207829 28052341 36639796 31416549 19704144 10940064 988119
37688I88119j6161543j1367719M113604O597824r913514j6808533L917219K6900015
$$ 988119 -15173424 -26541143 -22427539 -15829715 -25743229 -42551762 -38634543 -11734528
37680a1734528K2456371K562717k953628N204124N135724m260517n707493J514932
$$ -11734528 10721843 13284560 10330932 15535056 20670780 16410263 10702770 12217702
37672A2217702K305509l773442l102486L861195L003215o309371r962640m186750
$$ 12217702 14523211 10749769 7647283 11508478 14511693 8202322 -1760318 -5947068
37664e947068J094965K584712N652704Q308999L947609k910097l352561j398690
$$ -5947068 -4852103 -2267391 3385313 11694312 15641921 12731824 9379263 7980573
37656G980573m752979o574809R65903N411578o470064j8395812o405795J7157073
$$ 7980573 3227594 -3347215 -2381312 3030266 -3439798 -21835610 -28241405 -11084332
37648a1084332J9152220J229735k242306J5417617J9929377m777551k7694914
$$ -11084332 8067888 9297623 7055317 22472934 42402311 37624760 9929846
37641I929846k1667611m533719k872783p801139J559847J6394849J4427716O82477
$$ 9929846 -11737765 -16271484 -19144267 -26945406 -25385559 -8990710 5437006 6119483
37633F119483j675069Q373759R507000n129395j7398401j2185227L793119J4237601
$$ 6119483 4444414 12818173 22325173 17195778 -202623 -12387850 -8594731 5642870
37625E642870J0807529l017294j5745412j5771560k608081J1606922J5976955
$$ 5642870 16450399 13433105 -2312307 -18083867 -20691948 -9085026 6891929
37618F891929J1037528K307598o794761j1160809n226169N000665M001516j0223043
$$ 6891929 17929457 20237055 13442294 2281485 -2944684 2055981 6057497 -4165546
37610d165546j8697883q416103O861047P407156k814329n029190M147203J0609054
$$ -4165546 -22863429 -31279532 -24418485 -17011329 -19825658 -24854848 -20707645 -10098591
37602a0098591P296327K605410L490071N250298J783258m592112p583567n028885
$$ -10098591 -2802264 -196854 3293217 8543515 10326773 5734661 -1848906 -6877791
37594f877791m19060N52394l952738p294514n80372J3057404J7678327M804376
$$ -6877791 -7296851 -6744457 -10697195 -17991709 -18572081 -5514677 12163650 16968026
37586A6968026j2227253j3524081J855614J5455465J3125458L73758p282061l114828
$$ 16968026 4740773 -8783308 -6927694 8527771 21653229 22026987 14744926 11630098
37578A1630098M966793N843910l43221k992687K357004N367599l298038j3971779
$$ 11630098 16596891 22440801 22097580 19104893 21461897 26829496 23531458 9559679
37570I559679r511202P663089J6679919Q168663m346392q253674q955464j3547124
$$ 9559679 48477 7711566 24391485 32560148 28213756 19960082 11004618 -2542506
37562b542506j4442560l636681R291921R157888k778896j2369628j1917266m268605
$$ -2542506 -16985066 -20621747 -11329826 -2171938 -4950834 -17320462 -29237728 -33506333
37554c3506333N945429J3675075J2068976R62828q363551o764610K29724K763419
$$ -33506333 -27560904 -13885829 -1816853 -854025 -9217576 -15982186 -15752462 -12989043
37546a2989043K201713N270925R454606O841785j678562p453189o319338q23130
$$ -12989043 -10787330 -5516405 3938201 10779986 9101424 1648235 -4671103 -5494233
37538e494233N775252R700542O278950k676640p357568l356997J347873L63493
$$ -5494233 281019 9981561 16260511 13583871 6226303 2869306 4217179 4580672
37530D580672p82810K282420K148528n130792p761226K023888R029668k737831
$$ 4580672 3797862 6080282 8228810 3098018 -4663208 -2639320 6390348 3652517
37522C652517j9571296j5146669P692220J9533883Q380908n958459n825680J359596
$$ 3652517 -15918779 -31065448 -23373228 -3839345 4541563 -1416896 -7242576 -5882980
37514e882980K684061k89923k582045p566386j4578298j1197100P138938K2534458
$$ -5882980 -3198919 -3488842 -6070887 -13637273 -28215571 -39412671 -32273733 -9739275
37506i739275J5643103o670506j9299405j0173131Q622264J8598824J3398115
$$ -9739275 5903828 -766678 -20066083 -30239214 -21616950 -3018126 10379989
37499A0379989m2992j0787715j2583107p157803n01543L768373N880166O388532
$$ 10379989 10336997 -450718 -13033825 -20191628 -20693171 -16924798 -11044632 -4656100
37491d656100N343963M069509L147573R5922n576032p684293j416961O417280
$$ -4656100 687863 4757372 7904945 8000867 2424835 -5259458 -6676419 -259139
37483b59139N116997l014838m878353L490972J1119468Q965400R65405n758630
$$ -259139 4857858 1843020 -3035333 455639 11575107 20540507 21505912 15747282
37475A5747282j0232032j1911297p015613K468696O582859K204800Q3053P573155
$$ 15747282 5515250 -6396047 -13411660 -10942964 -4360105 -2155305 -2072252 5500903
37467E500903J3940375N474521j1471479j7246151o594112M670496K777397o606113
$$ 5500903 19441278 24915799 13444320 -3801831 -10395943 -5725447 -2948050 -9554163
37459i554163r729933l978116K881153P140551J2185173J7364510J4837170L183158
$$ -9554163 -19284096 -23262212 -20381059 -13240508 -1055335 16309175 31146345 34329503
37451C4329503m804883J138359R596176Q22852k0431425k5068073j727999K0840425
$$ 34329503 29524620 30662979 40259155 41082007 20650582 -4417491 -6145490 14694935
37443A4694935J2175169j4100031j9193190L293347J9720984R125251q067658
$$ 14694935 26870104 12770073 -6423117 -3129770 16591214 25716465 17648807
37436A7648807p087377L452393K456764o297083m885418L573026K5334j4336889
$$ 17648807 10561430 14013823 16470587 10173504 5288086 8861112 8886446 -5450443
37428e450443j5982003K620541J7856093R070023j1319848j6284542n12604J6445914
$$ -5450443 -21432446 -18811905 -955812 8114211 -3205637 -19490179 -20002783 -3556869
37420c556869J6834154J697273j5715486k2964414j5751901o89194Q977400O448032
$$ -3556869 13277285 14974558 -740928 -23705342 -39457243 -40146437 -31169037 -24721005
37412b4721005l82954O35875Q940932J2539986O239080q86055J04584M924361
$$ -24721005 -25103959 -24468084 -15527152 -2987166 3251914 2365859 2470443 7394804
37404G394804M401267p11505k703147r23169j958521o356748o427613J77175N376041
$$ 7394804 11796071 11084566 8381419 7458250 5499729 -857019 -7284632 -7107457 -1731416
37395a731416L944413J736864L690536L413335n334314j4903574j3865231n232085
$$ -1731416 2212997 3949861 7640397 11053732 5719418 -9184156 -23049387 -28281472
37387b8281472r81919k008460J344576R787401J2518096O595576K574220N181375
$$ -28281472 -29263391 -31271851 -29927275 -20139874 -7621778 -1026202 1548018 6729393
37379F729393M186502o430921j4626052q091732N345635R345288K881965k394434
$$ 6729393 10915895 4484974 -10141078 -18232810 -12887175 -3541887 -659922 -3054356
37371c054356k663621l792503n642575j140690Q074125J0526698L221700k505317
$$ -3054356 -5717977 -9510480 -15153055 -16293745 -8219620 2307078 5528778 3023461
37363C023461J047626O448056M912433N32056J113768L745515J137760l761689
$$ 3023461 4071087 10519143 15431576 15963632 17077400 20822915 21960675 18198986
37355A8198986k645619J541527k658088j4193158j5787571J144797J9319745J5707796
$$ 18198986 15553367 17094894 14436806 243648 -15543923 -14399126 4920619 20628415
37347B0628415o913725k2574962j6048584j78390N832795K733751M470139J2807779
$$ 20628415 13714690 -8860272 -24908856 -25087246 -19254451 -16520700 -12050561 757218
37339G57218J4085828J761387j1605304j1447206j225518L602829k597702r107059
$$ 757218 14843046 16604433 4999129 -6448077 -7673595 -4070766 -6668468 -15775527
37331a5775527m679276P067405J2229153M310620p205322q488449N37010N647973
$$ -15775527 -20454803 -13387398 -1158245 3152375 -4052947 -12541396 -12004386 -6356413
37323f356413j747743j1252736q022751M475806Q981442J050916m190295L115604
$$ -6356413 -8104156 -19356892 -27379643 -22903837 -13922395 -12871479 -17061774 -13946170
37315a3946170J1556393P942920p86928m83262N680934M406704k366579r03322
$$ -13946170 -2389777 5553143 4766215 4282953 9963887 14370591 12004012 11100690
37307A1100690P090571M125964j1879145j9510507p275461O382328K080124r735802
$$ 11100690 18191261 22317225 10438080 -9072427 -16347888 -9965560 -7885436 -17621238
37299a7621238p196771P231004J2553180L337416n362391m553644p67092J362585
$$ -17621238 -24818009 -17587005 -5033825 -1696409 -7058800 -11612444 -12379536 -11016951
37291a1016951N097027P891948K118060o629213k856494J1103875J2788426m928054
$$ -11016951 -5919924 1972024 4090084 -2539129 -5395623 5708252 18496678 13568624
37283A3568624j8308788p968251J0516322J1237055k911585r117244j757334M185561
$$ 13568624 -4740164 -12708415 -2192093 9044962 6133377 -2983867 -4741201 -555640
37275e55640J605375m26664L812762Q925562J0714724R381979J789067j2317899
$$ -555640 1049735 623071 4435833 13361395 24076119 33458098 35247165 22929266
37267B2929266j9525964q506661O072331k10483k0713676k1251167Q360868L4760910
$$ 22929266 3403302 -5103359 968972 758489 -19955187 -41206354 -32845486 1915424
37259A915424K7613800Q33805j2333245n551830J962289o79002o644853q745420
$$ 1915424 29529224 30363029 18029784 12477954 14440243 13761241 7116388 -1629032
37251a629032o943222k666425M38954l804370j2078065r329477Q115766J9925536
$$ -1629032 -8572254 -11238679 -10799725 -14604095 -26682160 -36011637 -27895871 -7970335
37243g970335R637083p782002q240186L005528K491467q644663m808052J9294640
$$ -7970335 1666748 -6115254 -14355440 -11349912 -8858445 -17503108 -22311160 -3016520
37235c016520L5222309K2103609m472484j8348240j6364288j0892141o551070
$$ -3016520 32205789 54309398 49836914 31488674 15124386 4232245 -2318825
37228b318825j535350O75201k296655k707431N082920J1380171M953649o796057
$$ -2318825 -3854175 -3178974 -5475629 -8183060 -3100140 8280031 13233680 6437623
37220F437623p611967J687652M158011o103075j4398137q535315K362618K316444
$$ 6437623 -1174344 513308 4671319 -1431756 -15829893 -24365208 -22002590 -19686146
37212a9686146p070550r711623j08794Q402318M849930j790633L035526J4936473
$$ -19686146 -26756696 -36468319 -36577113 -28174795 -23324865 -25115498 -22079972 -7143499
$$ [...]
##END NTUPLES=NMR SPECTRUM
##END=
