##TITLE=31Pdec_LR-0139-C1-EtOAc-B-M
 CD3CN, 64 sc
 15.3.2023
##JCAMPDX= 6.0         $$ Bruker NMR JCAMP-DX V2.0
##DATA TYPE= NMR SPECTRUM
##DATA CLASS= NTUPLES
##ORIGIN= UXNMR, Bruker Analytische Messtechnik GmbH
##OWNER= root
$$ XWIN-NMR		Version 3.5
$$ Wed Mar 15 14:25:01 2023 Russian Standard Time (UT+4h)  she@DPX200
##.OBSERVE FREQUENCY= 81.013821
##.OBSERVE NUCLEUS= ^31P
##.ACQUISITION MODE= SIMULTANEOUS
##.ACQUISITION SCHEME= undefined
##.AVERAGES= 64
##.DIGITISER RES= 16
##SPECTROMETER/DATA SYSTEM= spect
##.PULSE SEQUENCE= zgpg30
##.SOLVENT NAME= CD3CN
##.SHIFT REFERENCE= (INTERNAL, CD3CN, 0, 248.564)
##AUDIT TRAIL= $$ (NUMBER, WHEN, WHO, WHERE, WHAT)
$$ ##TITLE= Audit trail, XWIN-NMR		Version 3.5
$$ ##JCAMPDX= 5.01
$$ ##ORIGIN= Bruker BioSpin GmbH
$$ ##OWNER= she
$$ F:/spectra/data/she/nmr/P31/1/pdata/1/auditp.txt
$$ ##AUDIT TRAIL=  $$ (NUMBER, WHEN, WHO, WHERE, WHAT)
(   1,<2023-03-15 14:24:03.39 +0400>,<she>,<DPX200>,
      <continue with go, POWCHK disabled, PULCHK disabled
       configuration hash MD5:
       00 E9 B6 7A A2 85 ED C7 34 08 36 98 17 FE 4E 26
       data hash MD5: 32K
       A7 DD B3 CD EF E5 C8 F7 43 75 DD CB 12 41 01 87>)
(   2,<2023-03-15 14:24:07.28 +0400>,<she>,<DPX200>,
      <Start of raw data processing
       efp BC_mod = 2 LB = 1 FT_mod = 6 PKNL = 1 PHC0 = -11032.22 PHC1 = 96.61019 SI = 64K 
       data hash MD5: 64K
       51 FC 7B DC 24 84 1D EC F9 4E 69 4B C1 B5 50 0E>)
(   3,<2023-03-15 14:24:24.59 +0400>,<she>,<DPX200>,
      <pk PHC0 = 64.05842 PHC1 = -75.60001 
       data hash MD5: 64K
       0F 84 3D 03 F5 CF C3 62 FD 50 54 3D 98 3A 02 18>)
$$ ##END=
$$ 
$$ hash MD5
$$ 2C 6F 45 AD CC 09 01 AB BD 7A F9 45 C7 74 6B 22
##$RELAX= 
##$RELAX= 
##$RELAX= 
##$RELAX= 
##$RELAX= 
##$RELAX= 
##$RELAX= 
##$RELAX= 
##$RELAX= 
$$ Bruker specific parameters
$$ --------------------------
##$DU= <F:/spectra>
##$EXPNO= 1
##$NAME= <P31>
##$PROCNO= 1
##$TYPE= <nmr>
##$USER= <she>
##$AMP= (0..31)
100 100 100 100 100 100 100 100 100 100 100 100 100 100 100 100 100 100 
100 100 100 100 100 100 100 100 100 100 100 100 100 100 
##$AQSEQ= 0
##$AQ_mod= 1
##$AUNM= <au_zg>
##$AUTOPOS= <>
##$BF1= 81.014009
##$BF2= 200.13
##$BF3= 200.13
##$BF4= 200.13
##$BF5= 200.13
##$BF6= 200.13
##$BF7= 200.13
##$BF8= 200.13
##$BYTORDA= 1
##$CFDGTYP= 0
##$CFRGTYP= 5
##$CHEMSTR= <none>
##$CNST= (0..31)
1 1 145 1 1 1 1 1 1 1 1 1 1 1 1 1 1 1 1 1 1 1 1 1 1 1 1 1 1 1 1 1 
##$CPDPRG= <waltz16>
##$CPDPRG1= <>
##$CPDPRG2= <waltz16>
##$CPDPRG3= <>
##$CPDPRG4= <mlev>
##$CPDPRG5= <mlev>
##$CPDPRG6= <mlev>
##$CPDPRG7= <mlev>
##$CPDPRG8= <mlev>
##$CPDPRGB= <>
##$CPDPRGT= <>
##$D= (0..31)
0 1 0 0 0 0 0 0 0 0 0 0.03 2e-05 3e-06 0 0 0 0 0 0 0 0 0 0 0 0 0 0 0 0 
0 0 
##$DATE= 1678875759
##$DBL= (0..7)
120 120 120 11 120 120 24 19 
##$DBP= (0..7)
150 150 150 150 150 150 150 150 
##$DBP07= 0
##$DBPNAM0= <>
##$DBPNAM1= <>
##$DBPNAM2= <>
##$DBPNAM3= <>
##$DBPNAM4= <>
##$DBPNAM5= <>
##$DBPNAM6= <>
##$DBPNAM7= <>
##$DBPOAL= (0..7)
0.5 0.5 0.5 0.5 0.5 0.5 0.5 0.5 
$$ [...]
##$SUBNAM2= <"">
##$SUBNAM3= <"">
##$SUBNAM4= <"">
##$SUBNAM5= <"">
##$SUBNAM6= <"">
##$SUBNAM7= <"">
##$SUBNAM8= <"">
##$SUBNAM9= <"">
##$SW= 501.771253377433
##$SWIBOX= (0..15)
0 1 3 0 0 0 0 0 0 0 0 0 0 0 0 0 
##$SW_h= 40650.406504065
##$TD= 32768
##$TD0= 1
##$TE= 0
##$TE2= 300
##$TE3= 300
##$TEG= 300
##$TL= (0..7)
0 120 53 12 22 120 120 120 
##$TP= (0..7)
150 150 150 150 150 150 150 150 
##$TP07= 0
##$TPNAME0= <>
##$TPNAME1= <>
##$TPNAME2= <>
##$TPNAME3= <>
##$TPNAME4= <>
##$TPNAME5= <>
##$TPNAME6= <>
##$TPNAME7= <>
##$TPOAL= (0..7)
0.5 0.5 0.5 0.5 0.5 0.5 0.5 0.5 
##$TPOFFS= (0..7)
0 0 0 0 0 0 0 0 
##$TUNHIN= 0
##$TUNHOUT= 0
##$TUNXOUT= 0
##$USERA1= <user>
##$USERA2= <user>
##$USERA3= <user>
##$USERA4= <user>
##$USERA5= <user>
##$V9= 5
##$VALIST= <valist>
##$VCLIST= <CCCCCCCCCCCCCCC>
##$VD= 0
##$VDLIST= <DDDDDDDDDDDDDDD>
##$VPLIST= <PPPPPPPPPPPPPPP>
##$VTLIST= <TTTTTTTTTTTTTTT>
##$WBST= 1024
##$WBSW= 4
##$XGAIN= (0..3)
0 0 0 0 
##$XL= 0
##$YL= 0
##$YMAX_a= 3708
##$YMIN_a= -3658
##$ZGOPTNS= <>
##$ZL1= 120
##$ZL2= 120
##$ZL3= 120
##$ZL4= 120
##$ABSF1= 0
##$ABSF2= 0
##$ABSG= 0
##$ABSL= 0
##$ALPHA= 0
##$AQORDER= 0
##$ASSFAC= 0
##$ASSFACI= 0
##$ASSFACX= 0
##$ASSWID= 0
##$AUNMP= <proc_1d>
##$AZFE= 0.1
##$AZFW= 0.5
##$BCFW= 0
##$BC_mod= 2
##$BYTORDP= 0
##$COROFFS= 0
##$CY= -3
##$DATMOD= 1
##$DC= 0
##$DFILT= <>
##$DTYPP= 0
##$F1P= 0
##$F2P= 0
##$FCOR= 1
##$FTSIZE= 65536
##$FT_mod= 6
##$GAMMA= 0
##$GB= 0
##$INTBC= 1
##$INTSCL= 6.047779e-11
##$ISEN= 30
##$LB= 1
##$LEV0= 0
##$LPBIN= 0
##$MAXI= 10000
##$MC2= 0
##$MEAN= 0
##$ME_mod= 0
##$MI= 50
##$NCOEF= 0
##$NC_proc= -9
##$NLEV= 6
##$NOISF1= 182.463
##$NOISF2= 159.3651
##$NSP= 0
##$NTH_PI= 0
##$NZP= 0
##$OFFSET= 248.5645
##$PC= 4
##$PHC0= -10968.16
##$PHC1= 21.01018
##$PH_mod= 1
##$PKNL= yes
##$PPARMOD= 0
##$PSCAL= 0
##$PSIGN= 0
##$REVERSE= no
##$SF= 81.0140089999694
##$SI= 65536
##$SIGF1= 159.3651
##$SIGF2= -187.1042
##$SINO= 113.3802
##$SIOLD= 16384
##$SREGLST= <1H.CDCl3>
##$SSB= 0
##$STSI= 65536
##$STSR= 0
##$SW_p= 40650.406504065
##$SYMM= 0
##$S_DEV= 0
##$TDeff= 32768
##$TDoff= 0
##$TI= <>
##$TILT= no
##$TM1= 0
##$TM2= 0
##$TOPLEV= 0
##$USERP1= <user>
##$USERP2= <user>
##$USERP3= <user>
##$USERP4= <user>
##$USERP5= <user>
##$WDW= 1
##$XDIM= 65536
##$YMAX_p= 435924531
##$YMIN_p= -63854668
$$ End of Bruker specific parameters
$$ ---------------------------------
##NTUPLES= NMR SPECTRUM
##VAR_NAME=  FREQUENCY,     SPECTRUM/REAL,   SPECTRUM/IMAG
##SYMBOL=    X,             R,               I
##VAR_TYPE=  INDEPENDENT,   DEPENDENT,       DEPENDENT
##VAR_FORM=  AFFN,          ASDF,            ASDF
##VAR_DIM=   65536,         65536,           65536
##UNITS=     HZ,            ARBITRARY UNITS, ARBITRARY UNITS
##FACTOR=    0.620285442955139, 1,           1
##FIRST=     20137.2065510682, 0,            0
##LAST=      -20513.1999529968, 0,           0
##MIN=       -20513.1999529968, -63854668,   0
##MAX=       20137.2065510682, 435924531,    0
$$ Real data points
##PAGE= N=1
##DATA TABLE= (X++(R..R)), XYDATA
$$ [...]
12847a8357099n902665Q250320J4137784L026848j1039234q324751R069882J8397897
12839I258982P481480q641017j0584256j617485J962675j925956j596872M888783
12831g73666O279671n94015m682758o85393J751762l871934q750501l956018M945849
12822a0337003Q087476N138344J47864o382526j1463950p413340M596556J0900672
12814f725907N702101J592248P254536R869951k937531j7697808j3800033K606216
12806a4136227Q265508L97363j894032P397000J1844234K801700n821830j926716
12798F927000O284943O741292J493337k131901l961831n141747l039102j03086
12790G068905m253477j2775693j0989757L873087J3734753O581084l746675k3923
$$ y = [-18357099, -24259764, -16009444, -1871660, 1155188, -9884046, -18208797, -9138915, 9258982, 16740462, 8099445, -2484811, -4102296, -2139621, -4065577, -5662449, -773666, 5506005, 4911990, 229232, -456161, 1295601, -2576333, -11326834, -15282852, -10337003, -2249527, 2888817, 3036681, -3345845, -14809795, -22223135, -17626579, -6725907, -1023806, 568442, 7822978, 17692929, 14755398, -2942410, -16742443, -14136227, -5870719, -5473356, -7367388, 29612, 11873846, 14675546, 8853716, 6927000, 13211943, 19953235, 21446572, 19314671, 15352840, 10211093, 7171991, 7068905, 2815428, -9960265, -20950022, -17076935, -3342182, 3238902, -507773, -531696]
12782e31696J0497794R523923j782843o744073j726816K76606o291801j0842021
12774g620927n070458M719312Q369638M511699j226765l357433n16530K108791
12766A917327l432319j5099490j7349783r77811J8914946J9409796J470505j1855867
12758g002696r280753m001522p088536q137421M442189J9321724J6562168j934151
12750B881002j4439690r659009J334925M934867K080309K66626N09170N96483
12742a1495317L111217J0353293J5502722Q842531p436047j8734154j4435816
12735a4291571M63126J1868300J0508991j673359j4330068j6452448o097482O064401
12727b3940110P843016Q46313k425487K207274N177568J353286J09890P120676
$$ y = [-531696, 9966098, 19490021, 17707178, 10963105, 9236289, 9512895, 3221094, -7620927, -12691385, -7972073, 397565, 4909264, 3682499, 325066, -191464, 1917327, -1514992, -16614482, -33964265, -34942076, -16027130, 3382666, 4853171, -7002696, -16283449, -20284971, -27373507, -35510928, -31068739, -11747015, 4815153, 2881002, -11558688, -21217697, -19882772, -14947905, -12867596, -12600970, -12091800, -11495317, -8384100, 1969193, 17471915, 26314446, 18878399, 144245, -14291571, -13828445, -1960145, 8548846, 6875487, -7454581, -23907029, -30004511, -23940110, -16097094, -15250781, -17676268, -15468994, -10291426, -8938140, -8828250, -1707574]
12719a707574R611235l774567j8911479j3388312P904566J8428220J0124719J817043
12711A0103851L840699K485325r606690j5067260j553088J3626871J0368215k179305
12703A2018618m173488J295751m11649m775756J679423J0819301M069536j2017294
12695H504442j3735805q16041M460768j521978L55618J0567154M982378j7641708
12687d845172k2288258O701919L3222451K2064509p026531j3857807j808176m490438
12679G672497k2206697j8758498J6301296M3994017K8843405j3955770m1585491
12672C04759l4250630o824099J6356547K2539778J2974182k890909j4764425j7146644
12664b3701441r437189M889676J5754320J1271570n648500j3568115R37867J9955743
$$ y = [-1707574, 7903661, 4129094, -14782385, -28170697, -20266131, -1837911, 8286808, 10103851, 13944550, 16429875, 6823185, -8244075, -9797163, 3829708, 14197923, 12018618, 7845130, 9140881, 8729232, 3953476, 5632899, 16452200, 20521736, 8504442, -5231363, -6047404, -1586636, -3108614, -2752996, 7814158, 12796536, -4845172, -27133430, -20431511, 12790940, 34855449, 27828918, 13971111, 12162935, 7672497, -14534200, -33292698, -16991402, 27002615, 55846020, 41890250, 304759, -33945871, -40769970, -24413423, -1873645, 11100537, 8209628, -6554797, -23701441, -33138630, -28248954, -12494634, -1223064, -6871564, -20439679, -19501812, 453931]
12656D53931J5603184q975772k1784469p232172J3193718J3881707j093014j0389921
12648f342808o689791K02488K541820J854694R25558L71218J554303M627681N459652
12639D504815R24380m973221n800761j248570L779709O223642O547515N236157
12631A5193666J488069n124192j2908106j6764715j0266334O230237K0567136
12624a584239J9016031K879318j1796926j2979659m553636K505439L543340J210084
12616a760248q11881p69438P30669R78658j176519k694695j894582l475455j0146139
12607b1019630j3059004k595878J3270263J6300558M668359l902020N90115P029558
12599A282321L831060l896857p370861q411213r327323l837514Q583777J3923004
$$ y = [453931, 16057115, 7081343, -14703126, -21935298, -8741580, 5140127, 4047113, -6342808, -13032599, -12830111, -10288291, -8433597, -7508039, -7136821, -5582518, -954837, 4504815, 5429195, 455974, -5344787, -6593357, -2813648, 3409994, 9957509, 15193666, 16681735, 11557543, -1350563, -18115278, -28381612, -22151375, -1584239, 17431792, 20311110, 8514184, -4465475, -9019111, -6513672, -2970332, -1760248, -2572129, -3341567, -2610898, -1632240, -2808759, -5503454, -7398036, -10873491, -21019630, -34078634, -36674512, -23404249, -7103691, -2435332, -6337352, -5747237, 1282321, 5113381, 1216524, -6154337, -14565550, -23892873, -27730387, -19146610, -5223606]
12591e223606M601361m442371J859539J2867394R037471n770787j1361937l708086
12583b141022K962245K793799L470325N689503R94483p676559n841836P143754
12575G394692J3346986L767189q170024q478500j014844M097746M746835J523176
12567A7213256o770971j4528930j1484028j036964J78303j0452811j3785352n24716
12559d1192213R907484L57784j2701140l402662K0510974K7215967Q539827j0215413
12551i79392j0473523l800193o017999j0575745l164180J2254239J9497628J4296111
12543A1036946O136270l58417r682406j9526841j6207852N065927K5661052K2561551
12535B4686230j257730j9004057j4244650N93305O070150K545603K686839P412884
$$ y = [-5223606, -622245, -5064616, -3205077, 9662317, 18699788, 12929001, 1567064, -2141022, 821223, 3615022, 7085347, 12774850, 13769333, 6092774, 250938, 7394692, 20741678, 24508867, 16338843, 7860343, 6845499, 10943245, 15690080, 17213256, 10442285, -4086645, -15570673, -16607637, -16429334, -26882145, -40667497, -41192213, -31284729, -30926945, -43628085, -47030747, -26519773, 696194, 9236021, -979392, -11452915, -15253108, -21271107, -31846852, -35011032, -22756793, -3259165, 11036946, 17173216, 16814799, 7132393, -12394448, -28602300, -23536373, 2124679, 24686230, 23428500, 4424443, -9820207, -9226902, -3156752, -611149, 2075690, 9488574]
12527I488574O619194n37218m292948k900373m705619r586234o853363L574987
12519i193000P152215j93844k565232Q355162J5377776K319370j7500874j9488776
12511a5737203l085666J1758926J4703608J0575570J742057j2179083k0035886
12504a2257677p881966J6116010K5984108J1579077q982482j4844575n346715
12497D365780O473340R286116j416874k0462764l1489856k0354912O384391K6321010
12489b0893769K5561115R014439j0315026j9742785r921075J3392455K5030128
12482A2125482Q076731j7995787k0447836j168936P794951l287572q996986L785198
12474b0114755J3089691L476887n022197O089952J8848742R979391q965379j3818453
$$ y = [9488574, 16107768, 15570550, 11277602, 8377229, 3671610, -5914624, -12767987, -9193000, -2040785, -2234629, -4799861, 3555301, 18933077, 21252447, 3751573, -15737203, -18822869, -7063943, 7639665, 18215235, 19957292, 7778209, -12257677, -20139643, -4023633, 21960475, 33539552, 24557070, 9712495, 4365780, 10839120, 20125236, 18708362, -1754402, -33244258, -53599170, -47214779, -20893769, 4667346, 13681785, 3366759, -16376026, -26297101, -12904646, 12125482, 20202213, 2206426, -18241410, -19410346, -11615395, -14902967, -23899953, -20114755, -7025064, -3548177, -8570374, -2480422, 16368320, 26347711, 17382332, 3563879]
12466C563879p956832p884902q850367N17030P299616m556187j7746794o574818
12458d2189375J4651849J2386919o581094n560391J5581819J8212755n343963
12451A158519j5794473L361145J4972315n702543k4607383o350125K3972887K1899684
12443A2910026m381365j2075433N765812J6569955N872988o452391o335966k539394
12435I334232p50866M773103Q808381l741626k6615318l0916197o148917K1460894
12427b3796314K3973507N650533j0042044j0996577j854068Q623733J3848976
12420E407746J0667439K393453m103758o838350q303421p789522l148531J558630
12412a0156314J023547q12352K707947P045909L523634l194247k311347J178440
$$ y = [3563879, -4392953, -12277855, -21128222, -20611192, -13311576, -17867763, -35614557, -42189375, -27537526, -15150607, -21731701, -27292092, -11710273, 6502482, 1158519, -14635954, -11274809, 3697506, -2005037, -26612420, -32962545, -8989658, 12910026, 8528661, -3546772, 2219040, 18788995, 24661983, 18209592, 11873626, 9334232, 8583366, 13356469, 22164850, 18423224, -8192094, -39108291, -45257208, -23796314, 177193, 5827726, -4214318, -15210895, -17064963, -8441230, 5407746, 16075185, 18468638, 14364880, 7526530, -776891, -8566413, -11714944, -10156314, -9132767, -9945119, -7237172, -191263, 3332371, 138124, -2173223, -994783]
12404i94783o552416j9236450j4121497R615057K2736994Q682410j0394941q160684
12396a8426310P091610J0983150L282723K389695R475006P076019p653756j4746583
12388e28446k560991J3565134J3665364k30065j0517277q000252O43378N029175
12380A1066020K721874q13721j01932L218510J879804o797676j4676760j1591879
12372a5095760P75420R827615P639347j62545l369389P1987M124848L916032J02126
12363G829681m478314p452248n948878J627430J0188449R519681k938118j4368800
12355f021117j0152327N583638J3292757M434303o808721m780584N664691Q925374
12347A0138014J523054p589129j2652610j2757345l960785J3093657K1668044
$$ y = [-994783, -7547199, -26783649, -40905146, -31290089, -8553095, 129315, -10265626, -18426310, -11334700, -351550, 2931173, 5320868, 14795874, 21871893, 14218137, -528446, -3089437, 10475697, 24141061, 23910996, 13393719, 5393467, 6036845, 11066020, 13787894, 12974173, 12872241, 16090751, 17970555, 11172879, -3503881, -15095760, -14320340, -4492725, 3146622, 2984077, -385312, -313325, 3811523, 7727555, 7829681, 3351367, -4100881, -10049759, -8422329, 1766120, 11285801, 8347683, -6021117, -16173444, -10589806, 2702951, 7137254, 328533, -4452051, 1212640, 10138014, 11661068, 4071939, -8580671, -21338016, -25298801, -12205144, 9462900]
12340I462900N433586k2960084l0923776q351877J9003293K5647574J5662687
12333A2974303N818298j88203n525647n824942P67310K745319o869018j3736201
12325i838781l250007J2452527J1535936j365787k190381J1982473J7082804R61338
12317C7370122j7881580k0574848j4335022j3907918j4711526l599301J4590188
12310c3049885K1407039J2166895J492027L71877K346350k371755j0215843j0288742
12302a8142037j283110O817224O909093K550302m68325k924475o941950p579714
12294b1062992J229885J3976620J6971531O621881m812375n827482L40988L852445
12286A1290501K366632l87504l349241o561887n792932J880228R992493Q982108
$$ y = [9462900, 14896486, -8063598, -38987374, -47339251, -28335958, -2688384, 12974303, 18792601, 18604398, 13078751, 7253809, 8021119, 10766438, 3897420, -9838781, -13088788, -636261, 10899675, 9533888, 7343507, 19325980, 36408784, 37370122, 19488542, -1086306, -15421328, -29329246, -44040772, -47640073, -33049885, -11642846, 524049, 2016076, 2387953, 4734303, 2362548, -7853295, -18142037, -19425147, -12607923, -5698830, -3148528, -3616853, -6541328, -13483278, -21062992, -19833107, -5856487, 11115044, 17736925, 12924550, 7097068, 7438056, 11290501, 13657133, 13269629, 9920388, 3358501, -2434431, -554203, 9438290, 18420398]
12278A8420398q47205r844294j1072896n882658K49586J836030l321069r318672
12270a9780780n426780R226582K0251398J5674850K422022n379345p336577j1654731
12262b003361j4771136n072228J3011321J8195072J804297j7866544j9377402
12255b6079981m061797J0940407J5381498J1748236N831529J306338k67330j093448
12247A3705452n389866j1401336j0462336O36113J1971932J1983258K605275m001261
12239I647231j409035M892786O530155K057777l263007m446374j838076O47562
12231A2819019J301428K110094L650046K883154n92441j486386J755442J82559
12223B2622915j3027597k7091840k3646044k029683J8020009K0569583Q730668
$$ y = [18420398, 17573193, 7728899, -3343997, -9226655, -8977069, -7141039, -10462108, -19780780, -25207560, -15980978, 4270420, 19945270, 22367292, 16987947, 9651370, -2003361, -16774497, -21846725, -8835404, 9359668, 11163965, -6702579, -26079981, -30141778, -19201371, -3819873, 7928363, 13759892, 15066230, 14798900, 13705452, 8315586, -3085750, -13548086, -12911973, -940041, 11043217, 13648492, 9647231, 8238196, 13130982, 19661137, 21718914, 18455907, 14009533, 12171457, 12819019, 14120447, 16230541, 19880587, 22763741, 22171300, 20684914, 22440356, 22622915, 9595318, -17496522, -41142566, -43172249, -25152240, -4582657, 4148011]
12216D148011n392247j2765273p791499P726933J7340803M589603j8617203j9023635
12208b9784507J0610940L3394640J7560791j5917289k2991400l26895J4723589
12201G269869L730226j0314389p203618q16710p927083j4398551Q87411K6454286
12193b318559L1664980J1783421p298871q197111j796870l576995j0579499j1374424
12185a693928n204761p10466k706907p496618p493386K097958J6807377K3813053
12177A7412322J6228525L996486J89417m8502j0568694k5098015j9849628P262709
12169a0475380K4342282R378824j4517853j1943191J2071772K1856213N926697
12162C6639364j0638218r808026m152341o783704o791647P249830K0918200J3361186
$$ y = [4148011, -1244236, -14009509, -21801008, -14074075, 3266728, 7856331, -10760872, -29784507, -19173567, 14221073, 31781864, 15864575, -7126825, -7453720, 7269869, 11000095, 685706, -6517912, -7334622, -15261705, -29660256, -28772845, -2318559, 29346421, 41129842, 33830971, 25633860, 23836990, 20259995, 9680496, -1693928, -6898689, -7609155, -10316062, -17812680, -25306066, -23208108, -6400731, 17412322, 33640847, 37637333, 37826750, 37778248, 27209554, 2111539, -17738089, -10475380, 13866902, 23245726, 8727873, -3215318, 8856454, 30712667, 36639364, 26001146, 16193120, 12040779, 5257075, -1534572, 5715258, 26633458, 39994644]
12154C9994644r461123k2020785j3675663J757472Q265864M632418j337400m522534
12146C632893n465792o587129p127422k631185P061506J1926297K906144j2093104
12138h377792j5714708n501053L920772N236565P072907J2708173J0639859k755792
12130G228931j0958840k526812R110570P707897n22089j915020L84564k553925
12122E955276n265676p57990R07057r263452j6940273p074929N590589j06713
12114b6956111j0719895K000827K7899061K7548544m083095k6092055j3731889
12107b4134613P974791R425187m11076J279295J1560402J2260656R53746j0447382
12099H461006j4225303q269668O566341J8084429Q819260j6938173l0561778j6678727
$$ y = [39994644, 30533521, 8512736, -5162927, -3405455, 4860409, 9492827, 8155427, 3632893, -1832899, -8420028, -15547450, -18178635, -11117129, 809168, 3715312, -8377792, -24092500, -29593553, -25672781, -20436216, -13363309, -655136, 9984723, 7228931, -3729909, -6256721, 2853849, 10561746, 10039657, 8124637, 8509201, 5955276, 689600, -68390, 838667, -8424785, -25365058, -32439987, -26849398, -26956111, -37676006, -35675179, -7776118, 19772426, 15689331, -10402724, -24134613, -16159822, -6734635, -7145711, -5866416, 5693986, 17954642, 18908388, 8461006, -5764297, -14033965, -7467624, 10616805, 19436065, 2497892, -28063886, -44742613]
12091d4742613N991030J5029534J3775586J3367896Q259706p224774j7065575
12084a2609210n141463J4468260J5359807j558640j1324970k788643R693987J0795114
12076A6894242J539590p771996q131757K748347J5144169J2977398n459339k1011543
12068F929111j8349950o074903k5606L65638L549517O472771K079421m024158
12060i078159k643185K380024L677724N849385J3333194J4872906J217528j3146544
12052A6462873r663960K993405L153705o923920o973495L952984O861786j437317
12044H426061k942384P453695J1866889J070945j0139091r238201m383861n266576
12036c152523o026797J66913O288284L747870l173004n500732k194273K474908
$$ y = [-44742613, -38751583, -23722049, -9946463, 3421433, 11681139, 4456365, -12609210, -17750673, -3282413, 12077394, 10518754, -806216, -3594859, 6099128, 16894242, 18433832, 10661836, 2530079, 5278426, 20422595, 33399993, 27940654, 6929111, -11420839, -17495742, -17521348, -17155710, -13606193, -7133422, -5054001, -9078159, -11721344, -9341320, -5663596, 185789, 13518983, 28391889, 29609417, 16462873, 6798913, 9792318, 12946023, 6022103, -951392, 3001592, 9863378, 8426061, 5483677, 12937372, 24804261, 25875206, 15736115, 6497914, 2114053, -3152523, -9179320, -9012407, -2724123, 1023747, -2149257, -7649989, -9844262, -7369354]
12028g369354N130609L025433l181399n740646K66893N610240k82665q877587
12020a1418476l641164J0954358J4074201K268519o480613n444085q334351j8462215
12012b6483826j7631054P93172J4845038Q013517l579379Q53944J2323685R647591
12004a217312m514773j0476654l642746L949806O709935Q143071O090492l723892
11996A317927j3027408r346155L229488R417393O649745N675049Q512971M833673
11988A7262683p171266j3798800n771076Q089167J3795086R147588J824370k214198
11980B1163554k944373l124614m460281n331517k826616J135013k49508q133749
11972d772091j2757396o187466M341899N620635j885195m853719K558287J0625647
$$ y = [-7369354, -2238745, 786688, -2394711, -8135357, -7868464, -2258224, -2540889, -11418476, -15059640, -4105282, 9968919, 12237438, 5756825, 312740, -8021611, -26483826, -44114880, -43321708, -28476670, -20463153, -24042532, -23188588, -10864903, -1217312, -5732085, -16208739, -19851485, -15901679, -9191744, -1048673, 5041819, 1317927, -11709481, -21055636, -17826148, -8408755, -1759010, 3916039, 12429010, 17262683, 10091417, -3707383, -9478459, -1389292, 12405794, 21553382, 23377752, 21163554, 18219181, 15094567, 10634286, 5302769, 2476153, 3611166, 3361658, -4772091, -17529487, -23716953, -19375054, -13754419, -15639614, -20493333, -17935046, -7309399]
11964g309399R311546J932852j587708J776678P121384R611380P954492K333873
11956C1145098n673699j0996657p380434N087887J6205597J3802898j978666j5821817
11948B4390207j3383039J109921R281671J116649j3052993j5555518j759240J5370750
11940G518408J8299100J718062k0474893k6158743q305335J4441473J8311471
11933E349543L796278o748610j020583Q555383P175490q09931l484892j877207
11925A0935471m501197r460315p158280K795097J0563603J0144225L558463o527569
11917A0349498j7231736k0588433j0231395O923439J6180557J2867241N398217
11910C667388Q59799k201207n694746o914507m161595O24906O482036J2932000
$$ y = [-7309399, 2002147, 3934999, 2347291, 4123969, 11245353, 20856733, 28811225, 31145098, 25471399, 14474742, 7094308, 12182195, 28387792, 42190690, 40212024, 24390207, 11007168, 12117089, 21398760, 22515409, 9462416, -6093102, -7852342, 7518408, 25817508, 27535570, 7060677, -19098066, -27403401, -12961928, 5349543, 9145821, 2397211, 1376628, 9932011, 17107501, 16297570, 12812678, 10935471, 6434274, -3026041, -10184321, -7389224, 3174379, 13318604, 16877067, 10349498, -6882238, -27470671, -37702066, -30778627, -14598070, -1730829, 3667388, 4527187, 2325980, -3368766, -10283273, -14444868, -13819962, -7337926, 5594074]
11902E594074J4436393M752188j1398346k0394845j6039273m940562O233788J7645661
11894d110922K6285799K1973391K983244j3911873j1709152K966786O847798r166654
11886B2158417k7177917k4552510k133961J6443284J2584958n585991j3417039
11879b1680759k20990J7271862J6533135j680153j5684653j2095467Q7064P321397
11871a0148564R848902J3767562J6017732R954787n39900n757390n774765q616464
11863A8751900j4274941j3717455m792360L515514N357989M451559K851001l325016
11855a181809j0834551o303362J2563534K4948701J1855626j4305388k3013665
11848f270914o560192J0536587O522525j0037020j6722512q187533K774489P871919
$$ y = [5594074, 20030467, 24782655, 13384309, -7010536, -23049809, -27990371, -21756583, -4110922, 22174877, 44148268, 47131512, 33219639, 21510487, 24477273, 31325071, 22158417, -5019500, -29572010, -31705971, -15262687, -2677729, -8263720, -21680759, -21901749, -4629887, 11903248, 10223095, -5461558, -17557025, -17469961, -10148564, -299662, 13467900, 29485632, 39440419, 38900519, 33143129, 27368364, 18751900, 4476959, -9240496, -14032856, -10517342, -5159353, -707794, 2143207, -1181809, -12016360, -18319722, -5756188, 19192513, 31048139, 16742751, -6270914, -12831106, -2294519, 4228006, -5809014, -22531526, -30719059, -27944570, -20072651]
11840b0072651J1508793J6251619J4347628R63357j3116797j2940012n67606O847024
11832C221355J775290l498893J349544N460898n485880k0904533j6599690O318656
11824b8363253J8643299O579948p153629j054029J0337234L407383j2060997r154782
11816a8818826Q495116J0984640p586110j8677858n765877J1212353J0262962
11809i893600j715378p600279n755298j133257P705614J6422080J0458773j0062869
11801a574214k1149133q870157P705181P380681m92160J995180P225324r08864
11793h688162j2561380p048261R071640J2192524K169759r27513M299291q8475
11785a580577j3669913j4740302J12514P248493l943148j3053284l392828J2417905
$$ y = [-20072651, -8563858, 7687761, 22035389, 22998746, 9881949, -3058063, -3625669, 3221355, 4996645, 1497752, 2847296, 8308194, 2822314, -18082219, -34681909, -28363253, -9719954, -3140006, -10293635, -11347664, -1010430, 2396953, -9664044, -18818826, -10323710, 660930, -6925180, -25603038, -31368915, -20156562, -9893600, -11608978, -19209257, -24964555, -26097812, -18392198, -1970118, 8488655, -1574214, -22723347, -31593504, -23888323, -16507642, -16999802, -15004622, -7779298, -8688162, -21249542, -28297803, -19226163, -7033639, -4863880, -5791393, -1492102, -1580577, -15250490, -29990792, -29878278, -22629785, -26572933, -39626217, -43019045, -30601140]
11777c0601140J6218429J0457686N582751J419661l943708m081159K750894N577205
11769C380619j678699q523804n107978K569254N093479L773053K663711J39519
11761B309154k441900K042720J1502179J1952299n06204j0697983p936723k243074
11753C980468m632935p658215r85847P977305O510489j089910j106895O700389
11745I694849R595905J368688j0860305j6585320j0754002L146597J3777038J2070437
11737A1453887L594571J523204N958887M303671n194713q577792j163060K730787
11729A4629442m503667q460589K389872J4713809J0567411n016473j4162643j1906862
11721a749700n824151q68900J055376k660998p223920j512887J1588753J2807577
$$ y = [-30601140, -14382711, -3925025, 1657726, 3077387, -866321, -4947480, -2196586, 3380619, 1701920, -6821884, -11929862, -9360608, -4267129, -494076, 2169635, 2309154, -132746, 1909974, 13412153, 25364452, 24858248, 14160265, 6223542, 3980468, -652467, -8310682, -9296529, -1319224, 5191265, 4101355, 2994460, 9694849, 19290754, 20659442, 9799137, -6786183, -17540185, -14393588, -616550, 11453887, 15048458, 16571662, 22530549, 26834220, 21639507, 13061715, 11898655, 14629442, 10125775, 1665186, 4055058, 18768867, 29336278, 24319805, 10157162, -1749700, -7573851, -8442751, -7387375, -10048373, -17272293, -18785180, -7196427, 5611150]
11713E611150k612526j1833225O26965J6306322J2992399N89121K71282O442993
11705B8394481J83256j3725199j5549816n995145j062249n32458N868930R096959
11697F678759o682634k7001963k0538527R890219K7294009J5815509o67865k768810
11689B018697j554858p762897r970422j011370M127429l830174r311844m44331
11681b7739770Q040782J843112n901327J257970J1501143L829851j5397434k1541212
11673d4106885q328672Q612796J8285905K1707408J7501356K824172j2265638
11666D230442j2142754P63557P758747K202165j593794O248259J3501339M943192
11658B5911153j2310989j7307876m916492P587027N929105k009847j085339O254444
$$ y = [5611150, 2998624, -8834601, -8207636, 8098686, 21091085, 21680206, 21951488, 28394481, 28577737, 14852538, -697278, -6692423, -7754672, -8287130, -2418200, 6678759, -3875, -27005838, -47544365, -37654146, -10360137, 5455372, 4787507, 2018697, 463839, -7299058, -17269480, -18280850, -14153421, -17983595, -27295439, -27739770, -19698988, -17855876, -23757203, -22499233, -10998090, -7168239, -22565673, -44106885, -52435557, -43822761, -25536856, -3829448, 13671908, 16496080, 4230442, -7912312, -7148755, 609992, 2812157, 1218363, 7466622, 20967961, 25911153, 13600164, -3707712, -8624204, -1037177, 4891928, 2882081, 1796742, 8051186]
11650H051186M540384p681811j2770255j563284J0238251N405459p980111r618153
11642a1378334J391528O968033r62030j0241933q286340L183000J4947060J9040019
11634A4661003J0798859m924842j1552697L15552J4703587R242297j0044823j5635948
11626G562988j068250R667159J812456q579880n988720k398941j2960852k5448477
11618c7402517j8192140M880411K0716674K0279130J3712960Q221404J559251
11611A3775173m654360l660299L647630Q633787P637819L483680l413853j3587706
11603A1861871k0592332j6785276n736713J891969K895628J931410R95623k98130
11595b3835950J988023R787991J3716053M316453j0182385j2908777l472165K855946
$$ y = [8051186, 12591570, 4909759, -7860496, -9423780, 814471, 6219930, -1760181, -11378334, -9986806, -3018773, -3980803, -14222736, -22509076, -19326076, -4379016, 14661003, 25459862, 20535020, 8982323, 9297875, 24001462, 33243759, 23198936, 7562988, 6494738, 16161897, 17974353, 9394473, 3405753, 1006812, -11954040, -37402517, -55594657, -50714246, -29997572, -9718442, 3994518, 12215922, 13775173, 9120813, 5460514, 9108144, 17741931, 25379750, 28863430, 25449577, 11861871, -8730461, -25515737, -31252450, -29360481, -26464853, -24533443, -23537820, -23835950, -21847927, -12059936, 1656117, 5972570, -4209815, -17118592, -20590757, -17734811]
11587a7734811O29164k81299L078500N07734q223863o058654J2329759K4101256
11579H347786R570520j5591628k1845094q526899K43300l328635k032002J1825147
11571b1337505K1382929J4806761N155948N029904K681490j5101039l2340394
11564a9721906k2878412P251334K3968608J2568890m034445j506388J2853502
11557H501183J5586332O78447j6388021k0359190j0674535K143092P617284M907725
11549g987683K948206P219415R415646k39371j3779398j3541672R48868J1607548
11541c408441R467020M287967K117670m440428j4868242j3303962L776741J4940889
11533a430786N855804p476175o723190m62535k427365k728181J0558390K0898185
$$ y = [-17734811, -17105647, -17386946, -14308446, -13800712, -22024575, -28083229, -15753470, 8347786, 17918306, 2326678, -19518416, -28045315, -27802015, -31130650, -33162652, -21337505, 45424, 14852185, 20008133, 25038037, 27719527, 12618488, -19721906, -42600318, -35348984, -11380376, 1188514, -2845931, -4352319, 8501183, 24087515, 24765962, 8377941, -11981249, -22655784, -20512692, -12895408, -7987683, -5039477, 2179938, 11595584, 11356213, -2423185, -15964857, -15015989, -3408441, 6058579, 10346546, 12464216, 8023788, -6844454, -20148416, -16371675, -1430786, 4425018, -3051157, -9774347, -10236882, -12664247, -15392428, -4834038, 16064147]
11525A6064147P971236j3091091j3847897j116120k908768j5038261p555049J7572951
11517a1948852K4300051M909908m733824J1763949K0767783l044955l0167791
11510A1846269k2859354M649869J2004500l691720j0795624K257081J3471312
11503F882333O296839r248175j7753371j7121136j1245143j289275J0518721J9170976
11495a3788231K1712025J7981823Q786310j547729o055515m013334k510832m810568
11487A5753949o017733m587194o365973j1244212r091364K906755J2101417Q870559
11479B326204N95313k220511j014787r16095m96840R65222m85381k022627N416806
11470B147304J6908404J3674892n481567j5425854k869452J0239480J995227j3735776
$$ y = [16064147, 24035383, 10944292, -2903605, -4019725, -6928493, -21966754, -29521803, -11948852, 12351199, 17261107, 12527283, 24291232, 45059015, 42014060, 11846269, -11013085, -6363216, 5641284, 1949564, -8846060, -6588979, 6882333, 13179172, 3930997, -13822374, -30943510, -42188653, -43477928, -32959207, -13788231, 7923794, 25905617, 34691927, 33144198, 27088683, 23075349, 20564517, 15753949, 9736216, 5149022, -1216951, -12461163, -21552527, -18645772, -6544355, 2326204, 2921517, 701006, -313781, -1229876, -1726716, -761494, -1246875, -3269502, 2147304, 19055708, 32730600, 27249033, 11823179, 8953727, 19193207, 21188434, 7452658]
11462G452658j2586886l72773J665812l776135J387701J3429220J2070977k417574
11454A6853000r629568m327768j002993l869460k078916M028092J368809p926171
11446f584975n865190Q535914J3709899R27898j1149016p536289J788021L542917
11438b630821J929606M357378N622495K62880n257623n175759m706525o910712
11430a2509081m416736M673604Q157846k59844o991594Q74921J3671861J3716205
11422A6917182K196284m716708o29270N186878L950125k700951q099847p525758
11414D577935r41489N848236N545820j341252o135900l898713R44233L812523
11406H411393N663415N081249l892929j8079334k0995513m703243J3275387J0318779
$$ y = [7452658, -5134228, -5507001, -3841189, -7617324, -6229623, 7199597, 19270574, 16853000, 7223432, 2895664, 1892671, -1976789, -4055705, -27613, 1341196, -6584975, -12450165, -3914251, 9795648, 10723546, -425470, -7961759, -6173738, -2630821, -701215, 3656163, 9278658, 9541538, 4283915, -891844, -5598369, -12509081, -16925817, -12252213, -4094367, -4354211, -11345805, -10470884, 3200977, 16917182, 19113466, 14396758, 13767488, 18954366, 22904491, 20203540, 12103693, 4577935, 3636446, 9484682, 15030502, 13689250, 7553350, 3654637, 4598870, 8411393, 14074808, 19156057, 15263128, -2816206, -23811719, -28514962, -15239575, -4920796]
11398d920796q935004j7456008l185693J4962291J4322316j566022j0765853l310949
11390b0855718Q593475J0113554K790173j094557K980646O641611J487576r183689
11382A473071j4223797p098285P748149J9070903J8209734O462868o178629j1577006
11374A3887008j1395347j0698540p057314M629550J7403153J6084879P38823p955689
11366A5636523K808609J6597739J0082010j1840917k1858506q589839R395412
11359A2231031J0900606k114986j2599505j1004442k094721M299405L161345k018386
11351G60347k987604L141531Q412549L594712q286379j4768177r776728L52719
11343a9557030O627041O236005J518378k894130j438323O898274J3631771Q373404
$$ y = [-4920796, -13855800, -31311808, -34497501, -19535210, -5212894, -6778916, -17544769, -20855718, -12262243, -2148689, 641484, -453073, 2527573, 9169184, 10656760, 1473071, -12750726, -19849011, -12100862, 6970041, 25179775, 31642643, 25464014, 13887008, 2491661, -8206879, -15264193, -10634643, 6768510, 22853389, 23592212, 15636523, 18445132, 35042871, 45124881, 33283964, 11425458, 2835619, 12231031, 23131637, 21016651, 8417146, -2587296, -4682017, -382612, 2778733, 760347, -2227257, 914274, 9326823, 12921535, 4635156, -10133021, -19909749, -19557030, -12929989, -6693984, -5175606, -8069736, -9508059, -2609785, 11021986, 19395390]
11335A9395390o748120j6529012r686494P467491J7181126Q887776r216316j7973318
11327g221477q694214N272098M926667p796182j1730419K210525J6368614J2466783
11319E802395j579057n687287K091149O860548K149387m031628n660046m884606
11311d939145k839386J246490K957197j804566o373375k124467N312805L705699
11303d858748n005411q209068m421532l377756n610933j684339P351592R208419
11295a6607776L219090L487843J3691370J8555751Q451757n439539r903931q008655
11287G445910q869315j2191405j2048046n790241O247873J9365842K1204826M365574
11279A9731018j6354404j7418870l5450J0426622K866291n647616k515940L33403
$$ y = [19395390, 12647270, -3881742, -13568236, -6100745, 11080381, 19968157, 10751841, -7221477, -15915691, -10643593, -5716926, -13513108, -25243527, -23033002, -6664388, 5802395, 4223338, -1463949, 627200, 7487748, 9637135, 5605507, -54539, -4939145, -7778531, -6532041, -3574844, -5379410, -11752785, -13877252, -8564447, -4858748, -9864159, -18073227, -22494759, -25872515, -31483448, -33167787, -25816195, -16607776, -13388686, -9900843, 3790527, 22346278, 30798035, 25358496, 15454565, 7445910, -1423405, -13614810, -25662856, -31453097, -25205224, -5839382, 15365444, 19731018, 3376614, -14042256, -14077706, -3651084, -784793, -6432409, -8948349, -8614946]
11271h614946o638584r333252L877522J6677242R726720n995059o837770M999143
11263b138984P567893l498748r965555j515401J0986301J4011340O356123m789997
11255A7012972r843982j691252J3497368J6508337k90004j7091436j2573079L091217
11247H620141L074332j3760574k0767650m595162J6147170J9557642P445382m491010
11239A1230271p035483k22706J0211330J2716030k38336j6982682j6196346K488657
11231d029265J4192861L908502j1587829j0380188J911609M649522l712405n961758
11223a1008951L340735R309520J736898r231558r523204l554R299154J3557746
11215G476786J2843808N913839n254977j0610375l256768P554807O649201m676372
$$ y = [-8614946, -15253530, -24586782, -20709260, -4032018, 5694702, -300357, -7138127, -2138984, 5428909, 1930161, -8035394, -9550795, 1435506, 15446846, 21802969, 17012972, 7168990, 5477738, 18975106, 35483443, 35193439, 18102003, 5528924, 8620141, 11694473, -2066101, -22833751, -27428913, -11281743, 8275899, 15721281, 11230271, 4194788, 3972082, 14183412, 26899442, 26661106, 9678424, -6517922, -4029265, 10163596, 14072098, 2484269, -7895919, -5984310, -1334788, -5047193, -11008951, -7668216, 1641304, 3378202, -5853356, -15376560, -15380114, -6080960, 7476786, 20320594, 26234433, 20979456, 10369081, 7112313, 14667120, 21316321, 16639949]
11207A6639949r409116k53468R289128N892553l986649o267724j448777q33175
11199I622721o074557p504601j575284M233593N419488O410341R191077P907126
11191B7629904R8195o709250n877904j249047O760k612901n579077p937307r871994
11182a2102621r522623n827441o67061M594452J0251674J4298551J2887614O372524
11174B0285069n52784n024551o210389j520746P820337J0116511l787705k1309683
11166a83941j9543586R34020J3534620M547151o827278r31605J0733801P186387
11158I449569n152173l687584J0873099J4213479k944294k1136285k2106258j1380426
11150c1870873l002698Q12237M514918O891935N149959L044342N304480R147829
$$ y = [16639949, 7230833, 6977365, 16266493, 22159046, 18172397, 11904673, 10455896, 9622721, 3548164, -3956437, -5531721, -1298128, 4121360, 10531701, 19722778, 27629904, 27728099, 21018849, 15140945, 13891898, 13898658, 11285757, 5706680, -2230627, -12102621, -21625244, -27452685, -28119746, -23525294, -13273620, 1024931, 13912545, 20285069, 19732285, 14707734, 8497345, 6976599, 14796936, 24913447, 21125742, -183941, -19727527, -18793507, -5258887, -711736, -7539014, -8470619, 2263182, 9449569, 4297396, 609812, 11482911, 25696390, 22752096, 1615811, -20490447, -31870873, -34873571, -34061334, -29546416, -22654481, -17504522, -14460180, -9155700, -7871]
11142g871Q602000L343484k232363n396677o411281o384783o502155o502037l065771
11133b4557454N621118J3048777R060701n596724j6245957j1063630M272573J4573499
11125a0887097J3394192O296147p07911o629956r516388n105620M232309P580417
11117a343907k33945q511844m233789Q051436J1402366J029029q944943o413358
11109i198955L177158Q050420N546265j046189r697566j4423501m988226J5589043
11101f991551K4933383R021094j3812605j5693970J603058J1987117M574971o175214
11093I446283q608081p245464n799263j280430R33854q762691j9524456p139407
11085d7979655K4494418L8009638J4656532j5394139j6030195N083611J5000589
$$ y = [-7871, 8594129, 11937613, 9705250, 4308573, -2102708, -8487491, -14989646, -21491683, -24557454, -18936336, -5887559, 3173142, -2423582, -18669539, -29733169, -25460596, -10887097, 2507095, 8803242, 8095331, 1465375, -8051013, -13156633, -8924324, -1343907, -1577852, -10089696, -14323485, -6272049, 5130317, 6159346, -2785597, -9198955, -6021797, 2028623, 7574888, 6528699, -3168867, -17592368, -22580594, -6991551, 17941832, 26962926, 13150321, -2543649, -940591, 11046526, 15621497, 9446283, 838202, -6407262, -12206525, -13486955, -12553101, -21315792, -40840248, -47979655, -23485237, 14524401, 29180933, 13786794, -2243401, 2840210, 17840799]
11078A7840799N075509n764826n380451N88558N608333P791955L354282p260840
11070B1853319j2808692o778151n59702m700751q755056M45156J2554032R605038
11062A0855193j664685l24480J1598932J0892446q037157k2879887j6730239L89078
11054a5900799R863059P278386R40659o6475O532891J1919857K955341j7318709
11046F204210k5470685q510502J2876757J2145587l520111p049325M071019P722071
11038a530979j980804n986751M812809J5735666J4975490P700469j312237j2949732
11030A9463931j7720577k908680J8653097J7132735q888516k6665898j9171728
11023b0105636p384339q229933n603698J4131874L0077022J9410552l401914j0937429
$$ y = [17840799, 22916308, 17151482, 11771031, 12359589, 17967922, 25759877, 29114159, 21853319, 9044627, 2266476, 1706774, -2993977, -11749033, -11303877, 1250155, 10855193, 9190508, 8866028, 20464960, 31357406, 23320249, 440362, -16289877, -15900799, -6037740, 1240646, 2181305, 2114830, 8647721, 20567578, 23522919, 6204210, -19266475, -27776977, -14900220, -2754633, -6274744, -13324069, -9253050, -1530979, -3511783, -9498534, -4685725, 11049941, 26025431, 33725900, 32413663, 19463931, 1743354, -1165326, 17487771, 34620506, 25731990, -933908, -20105636, -27489975, -35719908, -41323606, -27191732, 2885290, 22295842, 18893928, 7956499]
11015G956499n943727q509074j6628581j2655353J731852Q774020O042460N322571
11007a3909333N599896l497643j4310414p247529J4078139K2211848O271386j2198250
10999c001900j2498273j683111L428364K659027N986564J2511155J1239169j100836
10991A7540159j3865482j4584898k493786J0810705J3436357N565723k143399
10984A4265379k201336K734358P128689Q867169O021170k477182r057075l244692
10976B2036480Q630200N542475j5587526k7365764r402289J8499067K3899387
10969B6252030Q613565l47173L105184P78277r785008q554347P444264J2985559
10961D0492351l437266j8213863j1453078J372532o92166q020944j673662J0112917
$$ y = [7956499, 2012772, -6496302, -23124883, -35780236, -34048384, -25274364, -19231904, -13909333, -8309437, -11807080, -26117494, -33365023, -19286884, 2924964, 9196350, -3001900, -15500173, -17183284, -13754920, -11095893, -5109329, 7401826, 18640995, 17540159, 3674677, -10910221, -13404007, -2593302, 10843055, 16408778, 14265379, 12064043, 14798401, 21927090, 30794259, 36815429, 34338247, 25281172, 22036480, 30666680, 36209155, 20621629, -6744135, -16146424, 2352643, 26252030, 34865595, 34518422, 37623606, 38401883, 28616875, 20062528, 27506792, 40492351, 37055085, 18841222, 7388144, 8760676, 8068510, 47566, -1626096, 8486821]
10953H486821P948586j529102J836092J2041655N641055j3802521j7394934j78330
10945C049322Q722474m351745j4248493j575912J2821477M802307r207908J81168
10937A92690K1983147J8351408j4426700l6685899k2330923P434228J9309763
10930f172286J0909068K225767K619632M572189Q07176o886603j1916600q479305
10922a2320962K519139J0472435N941010m724483p232673k038623k843849j0348542
10914b0576548q765724M237433Q126041n906156j4748290J067120K2458137J9678903
10906E570916o13981p772656K724260N979318o923804j4670980m057914P743317
10898a2021524K827584r036605p854228O965711J9463430J8905443P350995o179855
$$ y = [8486821, 16435407, 14906305, 16742397, 28784052, 34425107, 20622586, 3227652, 3049322, 11771796, 7420051, -6828442, -8404354, 4417123, 9219430, 11522, 192690, 22175837, 40527245, 26100545, -10585354, -32916277, -25482049, -6172286, 4736782, 6962549, 9582181, 14154370, 14961546, 8074943, -3841657, -12320962, -9801823, 670612, 6611622, 1887139, -5345534, -7384157, -10228006, -20576548, -29342272, -25104839, -16978798, -22884954, -37633244, -36566124, -14107987, 5570916, 4956935, -2815721, -91461, 5887857, -1035947, -15706927, -19764841, -12021524, -9193940, -18230545, -26084773, -19119062, 344368, 19249811, 26600806, 20420951]
10890B0420951j1369813m548995M275780J660302r443582j2386705k276117O258083
10882g410096K398511n083250l853533L771823Q370107P831376M949809N35443
10874A1510190k985576r15800L605285m43286j4411073k3592312j6846698j935469
10866d6014739P388350R115937Q791210P768207N340262M006416M262324K407413
10858C065380m41799K056225P210060K917430j0369813j3927368O17856J3660122
10850D788093N803530j0663023r892327P418245J5705146L523223j1454081j0043158
10842d814352L070040Q998165o5033j2287085j0673648N909622J8280774R015262
10834A7433745j2690686k0214901n465928J0392027Q768687j904696n367703k868012
$$ y = [20420951, 9051138, 4502143, 8777923, 10438225, 994643, -11392062, -13668179, -7410096, -5011585, -10094835, -13948368, -10176545, -1806438, 6024938, 10974747, 11510190, 8524614, 7608814, 11214099, 10770813, -3640260, -27232572, -44079270, -46014739, -38626389, -29510452, -20719242, -12951035, -7610773, -3604357, 657967, 3065380, 2623581, 4679806, 11889866, 14807296, 4437483, -9489885, -8872029, 4788093, 10591623, -71400, -9963727, -2545482, 13159664, 16682887, 5228806, -4814352, -1744312, 7253853, 7188820, -5098265, -15771913, -9862291, 8418483, 17433745, 4743059, -15471842, -20937770, -10545743, -1777056, -3681752, -9049455, -11917467]
10826a1917467k209256K109900J6259495K7198136J8954659k85126j0834387j2854776
10818B6421178j9200973k3915461q719694J9314556K8542942Q718956j2190942
10811A8970562r324317N366564O450858p463843j7680686j4012799k696684O553396
10803a3836949Q497539L132767k389855J036743J0634254J1840531m09509j0878661
10795G626860m734498J0169552J4434315M279775o237958p564322n426810p431084
10787E115830j0438591p188533J295376O812394N071131j80447m106126o393988
10779a0012954p369261l581419O625538J5729413J3374903P10993r560841r472935
10771c556563m112450j063524n97958l53345k15021K210445J0328097J7399205
$$ y = [-11917467, -14126723, -12016823, 4242672, 31440808, 50395467, 50110341, 39275954, 26421178, 7220205, -16695256, -25414950, -6100394, 22442548, 31161504, 18970562, 9646245, 15012809, 21463667, 13999824, -3680862, -17693661, -20390345, -13836949, -5339410, -2206643, -4596498, -3559755, 7074499, 18915030, 18505521, 7626860, 2892362, 13061914, 27496229, 31776004, 25538046, 17973724, 12546914, 5115830, -5322761, -12511294, -11215918, -4403524, 667607, 487160, -3618966, -10012954, -17382215, -20963634, -14338096, 1391317, 14766220, 15477213, 5916372, -3556563, -7669013, -8732537, -9330495, -9683840, -9898861, -7688416, 2639681, 20038886]
10763B0038886R946263r587791j8861052o626129P947400L672608r983263j0411257
10755a3864335M83634K750763m981964m511576P839256J4834774R049274L102519
10747A4702345L763848J682487n580274n729533L123221M217654q485440j6351026
10739h656718o522072N926200L992441l223276J291142J3112241J6536990J0558508
10731C3015456M049618k836826j1799081j2753632M83100J1258681J466822j6143244
10723F740894j4206271N012344J1566053l754192j3664406J859089K2917578J9801277
10715C6272366k956845j5677533p293111L582210J204930n020416M2763J0528837
10707B0683201Q174951p658789j6373778o567557N943143K171145j0271366r343841
$$ y = [20038886, 29985149, 20397358, 1536306, -5089823, 2857577, 6530185, -3453078, -13864335, -13380701, -10629938, -15611902, -20123478, -12284222, 2550552, 11599826, 14702345, 18466193, 20148680, 14568406, 8838873, 11962094, 16179748, 7694308, -8656718, -15178790, -9252590, -5260149, -8483425, -7192283, 5919958, 22456948, 33015456, 37065074, 34228248, 22429167, 9675535, 10158635, 21417316, 22884138, 6740894, -7465377, -2453033, 9113020, 5358828, -8305578, -6446489, 16471089, 36272366, 33315521, 17637988, 10344877, 13927087, 15132017, 10111601, 10154364, 20683201, 28858152, 21199363, 4825585, -1741972, 4201171, 6372316, -3899050, -13242891]
10699a3242891O008956J4448195O564611k430383j083568j53780r476226j6164242
10691a5529328m688576J5171822K0608992P334687r330531j7724197j6902096
10684b1059227p447379O644926J2691451M223057m297629L159020J5857130R953375
10676A9724724j2528129k3639134j0445574Q702835J4662654J0789908O696832
10669A3964116P07799q454901j0519891O89000J3183202J2059913k79256r641227
10661A1708755p781641K709489J2655485J0864498m690551j7729455j0641290
10654b904710P118798Q163828j0080333j7967350j174502J3451246J483889j6984726
10646a8893860j0198661J1625564J3977661l236507p174936J0051135J7844185
$$ y = [-13242891, -7233935, 7214260, 13778871, 11348488, 10264920, 10111140, 634914, -15529328, -20217904, -5046082, 15562910, 22897597, 13567066, -4157131, -21059227, -28506606, -21861680, -9170229, -4947172, -9244801, -6085781, 9771349, 19724724, 7196595, -16442539, -26888113, -18185278, -3522624, 7267284, 13964116, 14671915, 6217014, -4302877, -3613877, 9569325, 21629238, 21349982, 11708755, 3927114, 6636603, 19292088, 30156586, 25466035, 7736580, -2904710, 4214088, 12377916, 2297583, -15669767, -16844269, -3393023, -1909134, -18893860, -29092521, -17466957, -3489296, -6725803, -13900739, -3849604, 13994581]
10639A3994581j70823j8678231j2499496O002771J2394983P999771Q875053J4984290
10631C2902899J3756339L485637o280901j0228819q703360k059287M439084P19266
10623B8030858j1212143j3390255J503622J4437575Q163994m234247j401322R038876
10615C0936958L714991j3607154j4787870N897348J9626155P116859j2842640
10608B6054647j4048372J03854Q715819O085898J980884n76619p329965j6039879
10600D946267j5063213l93706J7070708K3304092J3749421m811091j8865459j7073633
10592B863386j604927J1252105Q541652l383205p672369K95532Q362103O284746
10584B4939023j027919l495590j191667k053731p897776j0915619n022195N210776
$$ y = [13994581, 13823758, -4854473, -17353969, -11351198, 1043785, 9043556, 17918609, 32902899, 46659238, 50144875, 43863974, 33635155, 24931795, 22872508, 27311592, 28030858, 16818715, 3428460, 4932082, 19369657, 27533651, 23299404, 21898082, 30936958, 34651949, 21044795, 6256925, 12154273, 31780428, 38897287, 26054647, 12006275, 12110129, 20825948, 26911846, 28892730, 28316111, 20986146, 4946267, -10116946, -10510652, 6560056, 29864148, 43613569, 38802478, 19937019, 2863386, 1258459, 12510564, 21052216, 17669011, 9996642, 10292174, 18654277, 24939023, 23911104, 20415514, 19223847, 17170116, 9272340, -1643279, -6665474, -1454698]
10576a454698J0128730O490219J02796j881082J367913M255124Q16998q697978
10568A1128022j6605287j4966285n125279L049786L482676O14643j56244j805742
10560b0383710o853993n966947J0168950L0149579L0794682R731040r083757r471216
10552B9084628m108121r464063j7503364j0934691N924932J3138132N760249k119287
10544I778415j820404J67168k198985n040644l593818R16992N324172P181049
10536A0713945M610548M16833J478192O885985N550837n082194j0322724j433957
10528A2817465O840877k32667j1362750r248564j814626n590397j1134365J204137
10520a8520890K0024892J5560720r161837j9198059k601971J3722426R671592
$$ y = [-1454698, 8674032, 15164251, 15267047, 13385965, 14753878, 19009002, 19826000, 11128022, -5477265, -20443550, -25568829, -22519043, -19036367, -18421724, -18577968, -20383710, -27237703, -33204650, -23035700, 7113879, 37908561, 47639601, 38555844, 29084628, 24976507, 15512444, -1990920, -12925611, -7000679, 6137453, 11897702, 9778415, 7958011, 8125179, 5926194, 885550, -2708268, -1791276, 3532896, 10713945, 15324493, 15741326, 17219518, 24105503, 29656340, 24574146, 14251422, 12817465, 19658342, 19425675, 8062925, -1185639, -3000265, -8590662, -19725027, -18520890, 1504002, 17064722, 7902885, -11295174, -13897145, -174719, 9496873]
10513I496873k884917r069679j0593191p692380N024886J7361491J2090269r94751
10505A2738601K693160J4863886M860238j9686937j8269254Q537635J4266541
10498B0003870r116565j3605418J3822130K2175855n201849j1198707K3720270
10491D0599586K8204502k3609252k5040549R4932732K02676907J18160605j01697041
10484C34227490k13101211j19840530J5343922L2087124k1737203k5945095J3126760
10477A4161257J6408266j3140975j4412608J0117573R286050j3905105j3443659
10470d929201P224553L682853k0966416j9124657J3433971K8591421Q742986r412414
10462G243096l357233L929901m463330r867855J373735J1930690P432138M18454
$$ y = [9496873, 6611956, -2457723, -13050914, -20743294, -15718408, 1643083, 13733352, 12738601, 15431761, 30295647, 35155885, 15468948, -2800306, 5737329, 20003870, 10887305, -2718113, 11104017, 33279872, 28078023, 16879316, 40599586, 68804088, 45194836, 20154287, 115087019, 317763926, 435924531, 334227490, 121126279, 1285749, 16629671, 48716795, 26979592, 1034497, 14161257, 30569523, 17428548, 3015940, 13133513, 22419563, 8514458, -4929201, 2295352, 5978205, -14988211, -34112868, -20678897, 7912524, 16655510, 7243096, 3885863, 7815764, 3352434, -6515421, -5141686, 6789004, 14221142, 14639596]
10454A4639596K738423M652470k143084o902298q36710N826412J923492o473523
10446A3424778p688226j292262N190263O699845L056384j718798k234400K44103
10438A5681687k250340r804195j0208865J321045J1129570Q208532J211933k03835
10430A5085532k985796j1142068r208285J0006918K1481834K975135k3341420
10423B871850k0374045N868993J7655609O678922L91977Q443542P792524j0670967
10415A8658405k2185069r851813Q322378J1249942M477527J145058p46938m784095
10407F285395k959995O636497R302110k365922j2554391o857822M064430K653944
10399D204246p960217j1785783m648387M561384R512127J0502504Q859638O416506
$$ y = [14639596, 17378019, 22030489, 19887405, 12985107, 12148397, 17974809, 19898301, 13424778, 5736552, 4444290, 9634553, 16334398, 19390782, 17671984, 15437584, 15681687, 13431347, 3627152, -6581713, -5260668, 5868902, 14077434, 15289367, 15085532, 12099736, 957668, -8250617, 1756301, 23238135, 26213270, 2871850, -17502195, -11633202, 6022407, 12701329, 13093306, 21536848, 29329372, 18658405, -3526664, -13378477, -5056099, 6193843, 10671370, 11816428, 11069490, 6285395, 3325400, 9961897, 19264007, 16898085, 4343694, -2514128, 1550302, 4204246, -3755971, -15541754, -20190141, -15628757, -6116630, 4385874, 13245512, 19662018]
10391A9662018N036137J914874o438656j3303635p478021O768093J1040569K0829
10383A7222208r375195m509268M479463M342828L69273K997914O742942J042174
10375B3312339p317585k704573J2287362J7453428M177110j2209447j4861573
10368B0137061p641394n503545j0149675q149898N714138J5644438N391563j5142528
10360C00160j9544824j882187J3665183Q039228n652930n477535M452015M455371
10352a645519n372317o634784L350403O264099m364514j0561166j40903J2248783
10344f855918Q559958m675849q042833J775437J0672824R472075L658284J327580
10336A5891558J657996j335006q078567j1081506n168896K858078J799669o455952
$$ y = [19662018, 24698155, 26613029, 20174373, 6870738, -607283, 6160810, 17201379, 17222208, 7847013, 3337745, 7817208, 12160036, 12529309, 15527223, 22270165, 23312339, 15994754, 13290181, 25577543, 43030971, 47208081, 34998634, 20137061, 12495667, 6992122, -3157553, -11307451, -5593313, 10051125, 15442688, 300160, -19244664, -21126851, -7461668, 577560, -5075370, -10552905, -6100890, -1645519, -7017836, -13652620, -10302217, -4038118, -8402632, -18963798, -19104701, -6855918, 1704040, -2971809, -11014642, -9239205, 1433619, 10905694, 14563978, 15891558, 17549554, 16214548, 8135981, -2945525, -8114421, -5256343, -3456674, -9912626]
10328i912626p789410J632642P309101k5267p754458k826062M827030K18877q000187
10319b2320360j612354J3035011J2801023l883801j4216614o444936Q296535J9737961
10311E392465K6702777K1138679n102328l3187679k9826080L462940K5177444
10304A3758218J0974931j4540377j9288052p091173J196716L273552P423384R509593
10296E216792K284839p455986j0861179j1209750j0022083J778055K1168309K3988410
10288A4887407J236021j7887927o906699J4192157R229175j5696441k2132868
10281b3079175r36138J5101255M032848j4172832j1359961R193799K2116467J4036014
10273A4932277m517537j4155074o169468R804801J6009904O091040r259746j7811796
$$ y = [-9912626, -17702036, -16069394, -8760293, -8785560, -16540018, -19366080, -14539050, -14320173, -22320360, -23932714, -10897703, 1903320, -1980481, -16197095, -22642031, -14345496, 5392465, 32095242, 53233921, 48131593, 14943914, -14882166, -11419226, 13758218, 24733149, 10192772, -9095280, -16186453, -14989737, -11716185, -4292801, 5216792, 7501631, 45645, -10815534, -22025284, -32047367, -30269312, -9101003, 14887407, 16123428, -1764499, -8671198, 5520959, 14750134, -946307, -23079175, -24015313, -8914058, -4881210, -19054042, -30414003, -21220204, 896263, 14932277, 10414740, -3740334, -9909802, -105001, 15904903, 21995943, 12736197, -5075599]
10265e075599j7893101j1265227K341386J5181233J1484958r154237k2575890
10258c6956477j0185040J4340109K5172027J8265049O659919m687849j6963778
10251d356040k1365934r712790N861643P537778J15927J236686R565494Q457073
10243b660163k513102o401095J339034P121826L931957j724748p418117j5512061
10235b3836469j7197258j832337J7620011J6636617j219912o740124P819230J6113197
10227G362955K244546j3931624j1629925n43810J556005k406410l050502n388322
10219b5787087j3461506j3540851M052656K2386832K0473182M969043l405563
10212d313294k843895n896088j1768896q355569L269617R476151O548528K538119
$$ y = [-5075599, -22968700, -34233927, -31892541, -16711308, -5226350, -14380587, -36956477, -47141517, -32801408, -7629381, 10635668, 17295587, 12607738, -4356040, -25721974, -35434764, -29573121, -22035343, -21919416, -20682730, -11117236, -2660163, -5173265, -11574360, -10235326, -3113500, 818457, -906291, -8324408, -23836469, -41033727, -42866064, -25246053, -8609436, -9829348, -16569472, -8750242, 7362955, 9607501, -4324123, -15954048, -16497858, -14941853, -17348263, -20398765, -25787087, -39248593, -52789444, -48736788, -26349956, -5876774, -907731, -4313294, -7157189, -13053277, -24822173, -33177742, -29908125, -20431974, -13883446, -11345327]
10204a1345327k30851n178376p484432j99151Q492134N196053l469240J185654
10196a3033536J6169776J6656984m332086k1430849j4211885L148904O062040
10189a0970652m384768r370901l920630J185463K632898P907268J5695734J2842416
10181A1616828l647236j6986889j1802614N079792J4261740Q219531k554995n150081
10173i63924J589653Q764948Q285336L31552q008051j0286623o665929k043496
10165h996534L33387P39833l94101k928604l671252J330990Q694700Q667481p75563
10156C000337p499355j108925R778198P475933q883565j9888010j1484776O884118
10148b1726045J6166997J1351492L052191Q05060L596722N343820K773560k472734
$$ y = [-11345327, -11576178, -16754554, -24238986, -24438137, -15946003, -10749950, -14219190, -13033536, 3136240, 19793224, 15461138, -5969711, -20181596, -17032692, -10970652, -15355420, -24726321, -28646951, -27461488, -24828590, -16921322, -1225588, 11616828, 7969592, -9017297, -20819911, -15740119, -1478379, 6741152, 4186157, -963924, 625729, 9390677, 17676013, 18007565, 9999514, -287109, -6953038, -8996534, -8663147, -7923314, -8317415, -11246019, -14917271, -13586281, -4891581, 3775900, 3000337, -4499018, -5607943, 4170255, 11646188, 2762623, -17125387, -28610163, -21726045, -5559048, 5792444, 8844635, 9649695, 13246417, 18590237, 21363797, 18891063]
10140A8891063n571575k901985K618734K949477m628831j1254763o241925P835195
10132A695390J5893423Q068684p702169j4611106o938562L368115K056895r044070
10124g213400j4793027p587683K695321M125869R1219J830706Q698424Q560525
10116c592046k219000j1460987p623825N441992J4308768J0211420m275020j6494205
10108a5702903j2619410N829699J6776125K128356k3691572k7509560k364541
10101e7153806K1883693K0835291O681818K737774P295647M266931m942706n451032
10093c846390K562685L781943n641947j2859817j0348507m207645J170386Q866479
10085b0522813J6864753J6434277P698006K036541L857784L708386m501806j2276450
$$ y = [18891063, 13319488, 10417503, 13036237, 15985714, 11356883, 102120, -6139805, 1695390, 17588813, 25657497, 17955328, 3344222, -3594340, -226225, 1830670, -7213400, -22006427, -29594110, -26898789, -22772920, -22681701, -20850995, -12152571, -3592046, -5811046, -17272033, -24895858, -19453866, -5145098, 5066322, 791302, -15702903, -28322313, -22492614, -5716489, -3588133, -27279705, -54789265, -57153806, -35270113, -14434822, -7753004, -5015230, 2280417, 6547348, 1604642, -3846390, -1283705, 2498238, -3143709, -16003526, -26352033, -30559678, -29389292, -20522813, -3658060, 12776217, 20474223, 22510764, 26368548, 30076934, 25575128, 13298678]
10077A3298678j0188188k241002J929164J557554K960516P682881R815873M387842
10069B9203318n270623r420845k245861R205348J0822665n86988j1176186q047982
10061A2482846L076441P139729J005679n853253p889970p815372n984276J234131
10053b604045J1058348J3842259O207795l724385o461839l51497Q999809J2451635
10045C9418080L011318j4927856k5486808j8501385k387818Q655133J3094930
10038B875594J5858652J2170097m608571k3379537k3632651m230414J3921923
10031a1024907J6225401Q982945L299672J153723J577957N101537P105201N99951
10023C3021480j0408119j3761223p936636l446948l504887j66931O756676N389107
$$ y = [13298678, 3110490, 869488, 2798652, 4356206, 7316722, 14999603, 24815476, 29203318, 23932695, 14511850, 12265989, 21471337, 32294002, 31707014, 20530828, 12482846, 15559287, 22699016, 23704695, 17851442, 9961472, 2146100, -3838176, -2604045, 8454303, 22296562, 28504357, 24779972, 18318133, 17966636, 26966445, 39418080, 42429398, 27501542, 2014734, -16486651, -18874469, -10219336, 2875594, 18734246, 30904343, 26295772, 2916235, -20716416, -24946830, -11024907, 5200494, 14183439, 17483111, 18636834, 20214791, 25316328, 32421529, 33021480, 22613361, 8852138, 915502, -2531446, -6036333, -6203264, 553412, 5942519]
10015E942519p062107j6111970j1118523N92290Q182283J1089565J1597710Q849627
10007A1961394O529471J0269728J2011292l349304k8376965l3153211p287192
10000c1394787K0888902K3483646R603595K813348L118739k853937j0340460m894442
9992A0424604P239169O850281m445367o440345M250494Q687035o29693o743997
9984A9192181J893952J1130341M169736j1859531j7795975j0176735k004294j284022
9976f734347k532722P09212N557648N538273P90472k460610j314068m88759m784377
9967e719278j0089923o996624O236998J9133088J9711994O870600r373427j7333681
9959B439747j2789595j789271N264535M636970K614145M842147P068394L203096
$$ y = [5942519, -1119588, -17231558, -28350081, -27757791, -19575508, -8485943, 3111767, 11961394, 18490865, 28760593, 40771885, 37422581, 9045616, -24107595, -31394787, -10505885, 12977761, 22581356, 25394704, 28513443, 25659506, 15319046, 10424604, 17663773, 24514054, 20068687, 13628342, 17878836, 26565871, 25936178, 19192181, 21086133, 32216474, 36386210, 24526679, 6730704, -3446031, -5450325, -6734347, -9267069, -8557857, -3000209, 2538064, 3328536, 867926, -446142, -934901, -5719278, -15809201, -22805825, -16568827, 2564261, 22276255, 29146855, 19773428, 2439747, -10349848, -12139119, -6874584, -2237614, 376531, 5218678, 12287072, 15490168]
9951A5490168k553783k055193J951191J26665o014379n534172K258308M876264
9943H545069l048817j0957272r031215q85805N473766P408676M171378m003172
9935b327392r724874m414599O452509Q140062r22751p478276o177792m961136
9927b1414249m752356L821689J7444161J8014378K934687o692327N04853R154360
9919A9015196O304175J361678J673512l826072j7588779j8960165m8547J2530112
9911D61110p28627j6792602q099113J0869818J1730106K230567O230720J4455614
9903B0357593J880113k0428857j9451591K726131J3899068P575670N288256P753877
9895A9600260m372416k1991220j5344739N874361J05314k7261619j7817743M1994366
$$ y = [15490168, 12936385, 10881192, 12832383, 12959048, 6944669, 1410497, 3668805, 8545069, 5496252, -5461020, -14492235, -15378040, -9904274, -2495598, 1675780, -2327392, -12052266, -16466865, -10014356, -1874294, -2797045, -10275321, -16453113, -21414249, -26166605, -22344916, -4900755, 13113623, 16048310, 9355983, 9860836, 19015196, 25319371, 26681049, 28354561, 24528489, 6939710, -12020455, -12069002, 461110, -267517, -17060119, -25159232, -14289414, -2559308, -328741, 5901979, 20357593, 22237706, 1808849, -17642742, -14916611, -1017543, 6558127, 11846383, 19600260, 15227844, -6763376, -22108115, -16233754, -16128440, -43390059, -61207802, -19213436]
9887a9213436Q0926154M2043684l1290343n8566752l0317837P98750O886646N352529
9879c380605Q379681O164156j776701j814504N426932N141962l497208p651084
9871F992629n956140o166808l435800J0173622K0511538P597736j6191015j7964467
9863d438705M645174J8480495O648515q442173n573495K914410k373386j3590916
9855a730081j0205745P510064K0407962J7559331N066053o804893j2336352r985235
9847I481104l483518o88894m333045p518241m123325J403630J431045k445710
9839a0276954k683673J167590J805794k783147m271079L188977J1144253O560673
9831C852434p704684j2765922O83846J6247838J2541162o042775j4840502m269793
$$ y = [-19213436, 61712718, 103756402, 72466059, 13899307, -16418530, -15619780, -8733134, -3380605, 4999076, 11163232, 9386531, 7572027, 12998959, 18140921, 14643713, 6992629, 1036489, -5130319, -8566119, 1607503, 22119041, 29716777, 13525762, -4438705, 206469, 18686964, 25335479, 16893306, 11319811, 14234221, 11860835, -1730081, -11935826, -4425762, 15982200, 33541531, 38607584, 31802691, 19466339, 9481104, 5997586, 5308692, 975647, -6542594, -10665919, -9262289, -7831244, -10276954, -12960627, -11793037, -9987243, -12770390, -17041469, -13852492, -2708239, 3852434, -3852250, -16618172, -15934326, 313512, 12854674, 6811899, -8028603, -12298396]
9823a2298396P962889M762006p435003j3026383r264149j580824R429688K1218880
9815b31292K1026169K176684j9340801k2456182r118376K681293P279919J2060140
9807e922446J4795444N129426j0661595j1963958L057875J0968855j52006j0833919
9799e582324k486068J1330063P161083r697376j3656179R64512J2787405O937349
9791G758465n629072q249932j438811L415246K176163J9787J086336L895669M837891
9782G871742J885403l382009n709164j357737N465026O100530n66840n078032
9774E228919j72384Q417934R525529J577921o381424p550790m937968m948977
9766G58760q252658r750020n670085J273228M021280q99217p671809o305367M928930
$$ y = [-12298396, -4335507, 426499, -7008504, -20034887, -29299036, -30879860, -21450172, -231292, 20794877, 22971561, 3630760, -18825422, -27943798, -25262505, -17982586, -5922446, 8872998, 14002424, 3340829, -8623129, -5565254, 5403601, 5251595, -5582324, -8068392, 3261671, 10422754, 725378, -12930801, -11966289, 821116, 7758465, 2129393, -6120539, -7559350, -4144104, -1967941, -1948154, -861818, 3033851, 7871742, 9757145, 6375136, 665972, -691765, 4773261, 10873791, 10306951, 5228919, 5056535, 13474469, 22999998, 24577919, 18196495, 10645705, 5707737, 758760, -7493898, -17243918, -22914003, -21640775, -17619495, -18518712, -26190521, -32495888, -27566958]
9757b7566958J5832294J6248707P924299J36790k164223Q6019N477008J0518899
9749B6492835P030483p379694j8945137j1870206P357950J5544556N135435o438066
9741A6928156n479947j031137m452814q656315l619853L073476K10910n112952
9733h140476j36388R179410Q316898N50877n6702M612910J954265m366458j41905
9724A1772431Q828024K136822j6981840k0481762k89736J6876991J1974667J127625
9716A4963222L630754J0104175M375564o190759o758661k833069o884084j2078679
9708a671537m715758Q576433J0812226L094931l93139J408099j701050q673008
9700F737197r104217m005928l575747o978393m333341L534317O575192M356866
$$ y = [-27566958, -11734664, 4514043, 12438342, 12575132, 10410909, 10496928, 15973936, 26492835, 33523318, 26143624, 7198487, -4671719, 2686231, 18230787, 23366222, 16928156, 11448209, 10417072, 5964258, -2692057, -6311910, -3238434, -3027524, -8140476, -8276864, 902546, 9219444, 9770321, 9713619, 14326529, 16280794, 11914336, 11772431, 20600455, 22737277, 5755437, -14726325, -15016061, 1860930, 13835597, 14963222, 18593976, 28698151, 33073715, 26882956, 20124295, 17291226, 10407142, -1671537, -6387295, 2189138, 13001364, 16096295, 15703156, 17111255, 15410205, 6737197, -2367020, -6372948, -9948695, -16927088, -21260429, -17726112, -11150920, -6794054]
9692f794054M670451O223832K068482k836814J649937Q993652L595151j0077544
9684G493093j0244804O929617J8598878Q810808j0166612j8636754j3230917j390618
9676a1837309J0778807J6240327Q346550o558800j2012576m629700K67091o094027
9668e499637j1219219k397034J2351707J6978258R459829q38000p978420j0457551
9660C99933o223659K637356P532099M409907j67741p53538j199539l861540k109598
9651F63680O578813J1157471K703867r504517j0301294P7119R142989J0376653
9643B0894781O472457J09055o429301p063090P74145Q301238N944312k018828
9635B6984769m601389k012700l550278r531459r143135J755894J2354151J0932661
$$ y = [-6794054, -2123603, 4100229, 6168711, 3331897, 4981834, 13975486, 17570637, 7493093, -2751711, 4177906, 22776784, 31587592, 21420980, 2784226, -10446691, -11837309, -1058502, 15181825, 23528375, 16969575, 4956999, 327299, 594390, -5499637, -16718856, -19115890, -6764183, 10214075, 19673904, 18835904, 10857484, 399933, -5823726, -3186370, 4345729, 8755636, 8587895, 7834357, 6634818, 2773278, 663680, 7242493, 18399964, 21103831, 11599314, 1298020, 1375139, 10518128, 20894781, 27367238, 27476293, 21046992, 13983902, 14758047, 23059285, 29003597, 26984769, 22383380, 20370680, 16820402, 7288943, -1854192, -98298, 12255853, 23188514]
9627B3188514l59357r069593o779605K417807O182148k350460j4209121j3022301
9619a4001968L061342J5439569Q098489j0527070j8812778r833689L756994R664262
9611a3154849Q034545L930869L0836j009406K795258P061955M751338k484762
9603I955784n490108j846613P44759k129577n061386l600658j213157k11593L621575
9594e230974J0019483Q465316n873208j8881174j3433503O075697J8666052J4328555
9586A4136244L295316k353510k382468m41444L853819P866083K866490j1797533
9578A5042997k0491978r759990J0229146J6060544J672875j4061400j2484929
9571a3792735K901322J4229592J1048415j202479r801390p574781M72663K505213
$$ y = [23188514, 22829157, 13759564, 6979959, 9397766, 15579914, 13229454, -979667, -14001968, -10940626, 4498943, 12597432, 2070362, -16742416, -26576105, -22819111, -13154849, -5120304, -1189435, -1158599, -2168005, 627253, 7689208, 12440546, 9955784, 4465676, 2619063, 3363822, 1234245, -3827141, -7427799, -8640956, -8852549, -5230974, 4788509, 13253825, 7380617, -11500557, -24934060, -18858363, -192311, 14136244, 17431560, 15078050, 12695582, 12254138, 16107957, 23974040, 26840530, 15042997, -5448981, -15208971, -4979825, 11080719, 12753594, -1307806, -13792735, -10891413, 3338179, 14386594, 13184115, 3382725, -4192056, -3719393, -1214180]
9563a214180m978640r869861k09617J4819959J2869997r280024k5999127j5184499
9555c9045992J1314821K3670565J3346203J24630J253725R755941R052394k282845
9547B7189442j0191079n666209L642040N434855Q94785K192804J0678804R447709
9539D3623151j1272269l0989355k1534349R381081K2524014J992254k0861920
9532g137393j4267412Q346988J4418279L552378L36540Q089059O254605q478399
9524A1114645j4156916k084205Q526131M321792j991080K099602P519788L336574
9516A8686331l427121k907675R21106K410418N255912Q349375k28703k0205862
9508H853781k9324193j3916792Q322656J4461984Q169650N528670N707701j048609
$$ y = [-1214180, -6192820, -16062681, -16272298, -1452339, 11417658, 2137634, -23861493, -39045992, -27731171, -4060606, 9285597, 9410227, 10663952, 20419893, 29472287, 27189442, 16998363, 11332154, 14974194, 20409049, 21303834, 23496638, 34175442, 43623151, 32350882, 1361527, -20172822, -10791741, 11732273, 13724527, -7137393, -21404805, -13057817, 1360462, 4912840, 5249380, 13338439, 19593044, 11114645, -3042271, -5126476, 3399655, 7721447, 5730367, 7829969, 15349757, 18686331, 15259210, 12351535, 13272641, 15683059, 20938971, 29288346, 29059643, 8853781, -20470412, -34387204, -26064548, -11602564, -3432914, 2095756, 7803457, 6754848]
9500F754848r730690r115210l462102k513439m00185J1016979J8215667L605181
9492A4371049j9831156k1669723J51120J6295374J0517957j575485l553139n05717
9484e799720q61175L68516Q011210J4809771J4041790R200489L495198n064241
9476C8201838j2201077q255437K713324L142291j0184042j7447553o000270R238760
9468g92166R485108n55271n331025m300869o879612j1792740j0023015k272960
9460c2462550K987467M794781Q416335J2130382R187099J371536j703912L400124
9452H121262J0341794J2539320Q188499k017383j3775143j8190282j0648888J053596
9444d387225N476068K306490J73404K146545L130828R76371K1867J741892Q30935
$$ y = [6754848, -2975842, -12091052, -15553154, -18066593, -18466778, -7449799, 10765868, 14371049, -5460107, -27129830, -26978710, -10683336, -165379, -1740864, -5294003, -5799720, -6660895, -6292379, 1718831, 16528602, 30570392, 39770881, 43266079, 38201838, 26000761, 17745324, 20458648, 23600939, 13416897, -4030656, -10030926, -792166, 8692942, 8137671, 2806646, -1494223, -8373835, -20166575, -30189590, -32462550, -29475083, -24680302, -16263967, -4133585, 5053514, 6425050, 4721138, 8121262, 18463056, 31002376, 39190875, 37173492, 23398349, 5208067, -5440821, -4387225, 1088843, 3395333, 3568737, 5715282, 8846110, 9822481, 9844348, 11586240, 12417175]
9435A2417175n402244j0361778o231332M576513J1167810P313397q08981k611268
9427A0059292K696341N070090j040995o976974k885873M870960J707603j1070172
9419B430272j5387742l690014Q509587O587844q68668K156052J1682639J0200055
9411B1620025m065836j3129883o075048O285528R092271K870903k896904o204368
9403G496688j1812970j8122403j5862285k518126R565928O773984o045385q445553
9395c8970122Q903333K8595523K7201866O327731j0546191j0704451n131223n592212
9387H4254p203066l395382j016382n669852o344333O818421K0440974J4852961
9379A8567595m157222j3426326q318539n812127j1505124j0009690N158120J7089651
$$ y = [12417175, 7014931, -3346847, -9578179, -5001666, 6166144, 13479541, 12670560, 10059292, 12755633, 17825723, 16784728, 9807754, 6921881, 11792841, 13500444, 2430272, -12957470, -16647484, -8137897, -1550053, -2418721, -262669, 11419970, 21620025, 17554189, 4424306, -1650742, 4634786, 13727057, 16597960, 13701056, 7496688, -4316282, -22438685, -38300970, -40819096, -31253168, -24479184, -30524569, -38970122, -30066789, -1471266, 25730600, 32058331, 21512140, 10807689, 5676466, 84254, -7118812, -10514194, -11530576, -17200428, -23544761, -16726340, 3714634, 18567595, 14410373, 984047, -7334492, -13146619, -24651743, -34661433, -29503313, -12413662]
9371a2413662J2700817K902347J020011M21308q338121j4532247l500778J4861274
9363f879051J7146891J186908j2027580j0116533k467857P14726L198411R909941
9355F65856J5065183J2278561N457636R53385k528350p999841j1415658p502035
9347D974737L65342L977414J108567l761926o862471p243128l630084M392654
9339f678895J2212470J2574641L777782p207520j1126096n291467L759216O375686
9331H395817k73575q747633r886620l648502K603733N367590P678924R981939
9323A1471673P437454J67886l551244j270539l376903j5021036k0622792l647236
9315b8412737K2941105K7321129K645184k0937164j7248548K070108R340538N32145
$$ y = [-12413662, 287155, 3189502, 4209513, 4630821, -3707300, -18239547, -21740325, -6879051, 10267840, 11454748, -572832, -10689365, -13157222, -12442496, -9244085, 665856, 15731039, 28009600, 33467236, 34420621, 31892271, 23892430, 12476772, 4974737, 5340079, 9317493, 10426060, 6664134, -198337, -7441465, -11071549, -6678895, 5533575, 18108216, 21885998, 14678478, 3552382, -1739085, 2020131, 8395817, 8122242, -625391, -10512011, -14160513, -11556780, -6189190, 1489734, 11471673, 18909127, 19077013, 15525769, 14255230, 10878327, -4142709, -24765501, -28412737, -5471632, 21849497, 24494681, 3557517, -13691031, -11620923, -2280385, -1748240]
9307a748240o697291m332604o88608L89767M356534Q642473K162415j2135177
9299a0050731j4460078K148562J7179942J1139224o107200j1665508k779881M980555
9291i615115N152625N348644P128488K005806q828913r948538M436125J7375108
9283A3054230J2007262l503979q090757J379765O997509k423743j4796859j2395933
9275g772505L246498J3765960Q188249m822140j0749611p247550k338725L47307
9267g382517N044013J2344479J4038663N032202o196009p183654J186884N269981
9259B2154042k749999j3861190j3439315K23294J3054080J1219059k578239j1957741
9251B063991o702455M793453P894278K536210J834481J0222408J5612538Q236274
$$ y = [-1748240, -8445531, -12778135, -13466743, -13076976, -8720442, -77969, 2084446, -10050731, -24510809, -22362247, -5182305, 5956919, -150281, -11815789, -14595670, -9615115, -4462490, 886154, 8014642, 10020448, 1191535, -8757003, -4320878, 13054230, 25061492, 21557513, 13466756, 14846521, 21844030, 19420287, 4623428, -7772505, -4526007, 9239953, 17428202, 12606062, 1856451, -5391099, -7729824, -7382517, -2338504, 10005975, 24044638, 29076840, 22880831, 15697177, 16884061, 22154042, 19404043, 5542853, -7896462, -7673168, 5380912, 16599971, 14021732, 2063991, -4638464, 154989, 8049267, 10585477, 12419958, 22642366, 38254904, 46491178]
9243D6491178m812473j2078878j3575414j3570033q810032J797028N779798o191170
9235d969996j8899422r198854J8072627L2768812K0037048k750897j3965062j1904181
9227I190075m521854M336082R012362J625222j1577841j1692177L957408J3731912
9219A4061189M935225o379319m995740k610431j1935151j7287199p98111K0057499
9211d952038J6348149k891056m014087J3708773J5776883q516541k6238995j3339369
9203a4118281R703048J4424180N705110K904409M559525j669417j1377029j1322198
9195a190653l342772J288315J394731R01066m499645j6001993j8194309Q86629
9187c8758631K4650420K6242771O914176o971729l121353L376362k218779j3748644
$$ y = [46491178, 41678705, 29599827, 16024413, 2454380, -6355652, -4558624, 1221174, -4969996, -23869418, -33068272, -14995645, 17773167, 37810215, 35059318, 21094256, 9190075, 4668221, 9004303, 18016665, 19641887, 8064046, -3628131, 329277, 14061189, 18996414, 12617095, 7621355, 5010924, -6924227, -24211426, -25009537, -4952038, 11396111, 8505055, 4490968, 18199741, 33976624, 25460083, -778912, -14118281, -4415233, 10008947, 15714057, 18618466, 23177991, 21508574, 10131545, -1190653, -4533425, -3245110, -1850379, -949313, -5448958, -21450951, -39645260, -38758631, -14108211, 12134560, 19048736, 12077007, 8955654, 12332016, 10113237, -3635407]
9179c635407j6707028o329848J1037109K3219209J8492580j401665j6366883j0088282
9171a780215N661125N798650j1010973k0716134j0948959K777553M783326J476184
9163b3959443M253318Q816097O643380K831846O138880J1258016O980727m504750
9155A8458071j0810435p418545l20984N256047P305762K409224r263674j7188775
9147a1573309j0824515M554032J3483340J0705086M542893O30697m366932j0388251
9139c236959r117091J693575J0264768O634534j700332j013114P092695Q090194
9131A8708270k622712j2222593r276403R56630O619626N944081M959924M703571
9123A7770394J380167l675361n048122l507298m659954p112619l485808M815967
$$ y = [-3635407, -20342435, -26672283, -15635174, 7584035, 26076615, 24674950, 8308067, -1780215, 3880910, 9679560, -1331413, -22047547, -32996506, -30218953, -25435627, -23959443, -19706125, -10890028, -4246648, -1414802, 4724078, 15982094, 22962821, 18458071, 7647636, 229091, -91893, 5164154, 12469916, 14879140, 5615466, -11573309, -22397824, -17843792, -4360452, 6344634, 10887527, 11518224, 7151292, -3236959, -12354050, -10660475, -395707, 6238827, 4538495, 3525381, 10618076, 18708270, 16085558, 3862965, -5413438, -4456808, 2162818, 8106899, 13066823, 17770394, 19150561, 15475200, 10427078, 6919780, 2259826, -4852793, -8338601, -3522634]
9115c522634O509157j191969n917919N54678Q577882O634002J42023J011764O659457
9106A9456441M501641p015451j5993485j3672430j936580J2734530K1612371J4574256
9098C4261293p852912k6570279k2409638q98556J4909622J3840364M423800l437030
9090F266664p458784n209249M093304R791462Q49310j2473692q933098R379419
9082c694664J6534719K522138j1295591p035933L611062L185729l566703m050126
9074c789369j651916m813471p220375K44593R850811R611078M700428N847524
9066A2779303O630781m959405j9848703j7182580K316513J5279923R239130k707000
9058A547962m150927M373602J1844105J0598402K47278j2265571j5296334m211115
$$ y = [-3522634, 2986523, 1794554, -4123365, -3568687, 5009195, 11643197, 11785220, 12796984, 19456441, 23958082, 16942631, 949146, -12723284, -14659864, -1925334, 19687037, 34261293, 26408381, -161898, -22571536, -23470092, -8560470, 5279894, 9703694, 6266664, -1192120, -6401369, -2308065, 7483397, 8332707, -4140985, -13074083, -3694664, 12840055, 15362193, 4066602, -2969331, 641731, 3827460, 260757, -3789369, -5441285, -10254756, -17475131, -17230538, -7379727, 2231351, 6931779, 12779303, 19410084, 14450679, -5398024, -22580604, -20264091, -4984168, 4254962, 1547962, -2602965, 1770637, 13614742, 24213144, 24460422, 12194851, -3101483, -7312598]
9050g312598J0092766J2946994L849356o149454j0707783j1123366p256850K041434
9042a3619501J1423334J2938896O253772k681364q942832p979906L610765J7564270
9034A8567434J5740586m641768j9856827j0257565J0064155J4089673J061234
9027B4766922q670113q623835q903535r623720q89104J1662977J0149540m418478
9019E450654j1643532n722963k307141o729804m571811P760258J2173117R67637
9011d623585p241685J317548J3062385J2131698N185642L163347n56853j3362275
9003I076222k2616421j3431211N708133J4768618R372908l40981p488087r559640
8995a4510459k537156J0673837J5819681N719324o619674o486417J682598N060317
$$ y = [-7312598, 2780168, 15727162, 19576518, 13427064, 2719281, -8404085, -15660935, -13619501, -2196167, 10742729, 16996501, 14315137, 5372305, -2607601, 1003164, 18567434, 34308020, 29666252, 9809425, -448140, 9616015, 23705688, 24766922, 16096809, 7472974, -1430561, -11054281, -11943385, -280408, 9869132, 5450654, -6192878, -11915841, -14222982, -20952786, -25524597, -17764339, -5591222, -4623585, -11865270, -10547722, 2514663, 14646361, 19832003, 22995350, 22438497, 9076222, -13540199, -26971410, -21263277, -6494659, 2878249, 2537268, -4950819, -14510459, -17047615, -6373778, 9445903, 15165227, 8545553, 2059136, 3741734, 8802051]
8987H802051K352205r87471n680524j2052852j1813261j172040Q729213Q394906
8979c427773M793121N776786M525113m006047p233033M077764J4294438O256066
8971B5056435p348690l228567J2180033J1970766o674425j8247094r851726K956797
8963F813529O239542O633836J1127123J0915265j808556j7275278k0748340j1591763
8955i694642j145478J336951m026563q743709l583365Q995579J3764879K468875
8947f27473j1604437j0880048J175321P195783K869341r53103L49147N70332j568798
8938a3473935m88039K384905N59415j936128M542272J4754463J3097005K39088
8930A9679046n832707Q61996N391972j337750p913036l723378L957801N236565
$$ y = [8802051, 11154256, 10166785, 4486261, -7566591, -19379852, -20551892, -11822679, -3427773, 1365348, 7142134, 11667247, 7661200, 428167, 4505931, 18800369, 25056435, 17707745, 14479178, 26659211, 38629977, 31955552, 13708458, 3856732, 6813529, 13053071, 19686907, 30814030, 41729295, 39920739, 22645461, 1897121, -9694642, -10840120, -9503169, -13529732, -22273441, -25856806, -16861227, -3096348, -627473, -12231910, -23111958, -21936637, -14740854, -11871513, -12824616, -12475469, -11905137, -13473935, -13961974, -11577069, -11017654, -12953782, -8411510, 6342953, 19439958, 19679046, 13846339, 14708335, 20100307, 18762557, 10849521, 7126143, 11083944, 16320509]
8922A6320509L626467N062028M740189k924356j1855118j2781658o438938m19603
8914d670480M84089l738600q658968o059747O545068J7285741J2561481k811539
8906A0937045j2107690j1222557r219058o651450M237643J7062708J4837219O07142
8898H481002k791168Q463562J0156491p304224j8124318l017485J6818362J3634492
8890B6316714l192351p267833N58465P23579o392994m439176M672306L925286
8882A4903996n385803n594184K966497J611898r997673r194575R400121J9706802
8874A8417079M838600j4487868j1642463O166577J2432931K224977n734300k496792
8866I718741p37563r501509j6317611o133609J2620831J6242906j100143j7180759
$$ y = [16320509, 19946976, 25009004, 29749193, 26824837, 14969719, 2188061, -4250877, -4670480, -4186391, -7924991, -16583959, -22643706, -16098638, 1187103, 13748584, 10937045, -1170645, -12393202, -21612260, -28263710, -24026067, -6963359, 7873860, 8481002, 5689834, 14153396, 24309887, 17005663, -1118655, -4136140, 12682222, 26316714, 23124363, 15856530, 16414995, 17138574, 10745580, 6306404, 10978710, 14903996, 9518193, 3924009, 6890506, 8502404, -1495269, -10689844, -1289723, 18417079, 23255679, 8767811, -2874652, 3291925, 15724856, 17949833, 12215533, 9718741, 8981178, -520331, -16837942, -22971551, -10350720, 5892186, 4792043, -12388716]
8858a2388716j1672013N609567J0316508P9525m540343M409263R083889k529832
8850a632152j3882329o198977R768260J0768377j840525o939786P72367O175108
8842c009657L465058M172080J1349835J0900220k095908j0784799l592298N035192
8834A5439723k229849j6166596j4551203K861567J3224563L511668j2930144j6812436
8826b7652707o500022N934351J2684521J4430450J1414850J898277r109397j0006087
8818f905764K080058J3530514J0798344o71183n407502j588833n02619l624982
8810G708033L79586J1488657J2494800k018162j1863188k875797P247855k660523
8802A9901261j9246029j3576400J1436148K3602100R258967j1078780j7209494
$$ y = [-12388716, -24060729, -18451162, -8134654, -8055129, -12595472, -8186209, 897680, -1632152, -15514481, -21713458, -11945198, -1176821, -3017346, -9957132, -9184765, -3009657, 455401, 4627481, 15977316, 26877536, 24781628, 13996829, 10404531, 15439723, 13209874, -2956722, -17507925, -14646358, -1421795, 2089873, -10840271, -27652707, -34152729, -28218378, -15533857, -1103407, 10311443, 12209720, 3100323, -6905764, -4825706, 8704808, 19503152, 18831969, 13424467, 11835634, 11333015, 7708033, 8087619, 19576276, 32071076, 30052914, 18189726, 15313929, 22561784, 19901261, 655232, -12921168, -1485020, 22117080, 31376047, 20297267, 3087773]
8795C087773j1826843l801282M613044O812875o143627k3373789j9228437Q073483
8787d1786803K7534199J8712816n21022n936495j916827l214251m386852N929634
8779e585601J7208982J1891290l563603r894750p899114j1769876j6685890m361350
8771c0659912J9833255K6548062N747622j6408492j4523367L645410J3781571
8764G964149P256350n473693j1769270o916510M167209R239512J079554j0079196
8756d531895p734620N732834J0029821l070315j7394864j7136789p368748J29875
8748d1344701N622799J2978507J6377657J0742037M491825O183354P972599p16157
8740B2307920j1456674q332209M051570N695739o137773j1572734m88055J0559421
$$ y = [3087773, -8739070, -12540352, -7927308, -1114433, -7258060, -30631849, -49860286, -41786803, -14252604, 4460212, 3939190, -1997305, -3914132, -7128383, -11515235, -5585601, 11623381, 23514671, 19951068, 10056318, 2157204, -9612672, -26298562, -30659912, -10826657, 15721405, 21469027, 5060535, -9462832, -5817422, 7964149, 15220499, 9746806, -2022464, -8938974, -4771765, 4467747, 5547301, -4531895, -12266515, -6533681, 3496140, 425825, -16969039, -34105828, -41474576, -41344701, -35721902, -22743395, -6365738, 4376299, 8868124, 15051478, 23024077, 22307920, 10851246, 2519037, 6570607, 12266346, 6128573, -5444161, -5932216, 4627205]
8732D627205M699271q701563r248789L288036J0242062K705391p499742p905668
8724g793797l004911m142586j0111838q735999L584219J4576127J3161368N819585
8716C352168O208332J2337338P894698j0804723k3959145j4893879L956824P785459
8708h122928m115764q278580N899163J9421873J2477622o598106j4615990n225393
8700i158103P147677R423113K656535n036358p548989l602283J819859J202137
8692c096412m154004k714980Q498983J2648972l960899k4367822j8174288J3282005
8684b2038445L2709386J6251640j4502670k4401569j0417223M364744R134536
8677h899601J2939773J8661329J4956403j193743j4354604j2313487l212112r53142
$$ y = [4627205, 9326476, 624913, -8623876, -5335840, 4906222, 7611613, 111871, -7793797, -10798708, -14941294, -25053132, -33789131, -30204912, -15628785, -2467417, 3352168, 9560500, 21897838, 29792536, 18987813, -4971332, -19865211, -15908387, -8122928, -12238692, -20517272, -14618109, 4803764, 17281386, 10683280, -3932710, -9158103, -2010426, 7412687, 10069222, 5032864, -2516125, -6118408, -4298549, -3096412, -7250416, -9965396, -1466413, 11182559, 7221660, -17146162, -35320450, -22038445, 10670941, 26922581, 12419911, -11981658, -22398881, -18034137, -8899601, 4040172, 22701501, 37657904, 36464161, 22109557, 9796070, 6583958, 5630816]
8669E630816m842286m891176N81669M347002L197160J143044R93854R48439l20285
8660F788237j259417o24203R08208J967029O61807m193727q906195o072741M477271
8651f253731J0142877n6555j7101588j9021512O57253K1605169K0808192J006050
8643A1786155j3989577r079664O461951J3573042N634031p318886j1804014m323836
8635i060798O701318J0141053L713662l915094m014353J233474K894649j032440
8627F661471l231091J96874K835496j007094n547928k276193N071039M789420
8619G491994m393053j0041073m047627N544998O734863O39241j730405L398429
8611C597367P197076J350383r454637j2380829k292566J1058650J3771210M139692
$$ y = [5630816, 788530, -4102646, -3520977, 826025, 4023185, 5166229, 6160083, 7108522, 6788237, 5528820, 4904617, 5812825, 7779854, 8441661, 4247934, -4658261, -10731002, -6253731, 3889146, 3832591, -13268997, -32290509, -31633256, -10028087, 10780105, 11786155, -2203422, -11283086, -4821135, 8751907, 14385938, 7067052, -4736962, -9060798, -2359480, 7781573, 11495235, 7580141, 3565788, 4799262, 7693911, 6661471, 3430380, 3627254, 6462750, 5455656, -92272, -2368465, 2702574, 7491994, 3098941, -6942132, -10989759, -5444761, 1290102, 1929343, 198938, 3597367, 10794443, 12144826, 2690189, -9690640, -11983206, -924556, 12846654, 16986346]
8603A6986346n707067n582645K63515Q96225n046532q341478l502827L936826
8595f097637O357619L586120N83579P95759M340208Q325560P612810M43298o262378
8586A9684938m302502K532451K020082p584058j3673399q953652k173790j380137
8578a3830067l1375Q018416J2478034K575195j0402171o853920R741438J6782093
8570A8477643P079517k738305j638886K46127o487082j3558034j1937248q111141
8562a8667409r070814o496733P058527J8958750J3234039k124962n719111M036559
8554A208846Q065125j355546r814320o859824k293701o428137j1281372n528211
8546c4287140M192614L363601n865935p024047N137168J6582333J4612584M496753
$$ y = [16986346, 11279279, 5696634, 5960149, 6856374, 1809842, -6531636, -10034463, -6097637, 259982, 3846102, 4429681, 5225440, 9565648, 17891208, 25504018, 25947316, 19684938, 15382436, 17914887, 19934969, 12350911, -1322488, -10276140, -12449930, -13830067, -13861442, -5843026, 6635008, 9210203, -1191968, -8045888, 1695550, 18477643, 25557160, 22818855, 21179969, 21426096, 14939014, 1380980, -10556268, -18667409, -27738223, -34234956, -27176429, -8217679, 5016360, 2891398, -2827713, 1208846, 9273971, 7918425, -1895895, -8755719, -11049420, -17477557, -28758929, -34287140, -30094526, -26730925, -32596860, -39620907, -34483739, -17901406, -3288822, 1207931]
8538A207931n73620K166575M301925k32919p675409r887378l390348P018012J2108613
8529E043382O949580l236075q373352n579399j710351j832998j440227M018009
8521f161431P809784M65774j2555848j4249333J04000J4130790J1884854j415576
8513A3014q854024m330053M836222J1996615J5481788J1744534k180344j8211329
8505A0496423k1585942r621079L747567O248919P54879m079527o583756q197949
8497b8820465n713073K642263R095451M980811n200167q248324M9057J0645021
8489b0569426J4681426J2204917N921012m197299j4989138j6578672l415313J4011644
8481a2930849J7382241K453055j3580644j1402514O843444J9381702J0691359
$$ y = [1207931, 634311, 2800886, 7102811, 6869892, -805517, -10692895, -14083243, -7065231, 5043382, 11992962, 8756887, 383535, -5195864, -6906215, -8739213, -10179440, -6161431, 1648353, 2114127, -10441721, -24691054, -24587054, -10456264, 1428590, 13014, -8841010, -13171063, -8334841, 3661774, 19143562, 30888096, 28707752, 10496423, -11089519, -20710598, -16963031, -10714112, -9959233, -14038760, -20622516, -28820465, -34533538, -31891275, -22795824, -17815013, -23015180, -31263504, -31214447, -20569426, -5888000, 6316917, 12237929, 8040630, -6948508, -23527180, -26942493, -12930849, 4451392, 6904447, -6676197, -18078711, -11235267, 8146435, 18837794]
8474A8837794j0321313k1911430j5089011j112533N479470L496836J569203M166781
8466a4884203P566643P623182N151557K493618n27267m311429n920367j985685
8458d793951M809674O298554j177571r893118q865697J287829P772504K784561
8450a777215m757872r57019J3291400K2510005J6385217J586802q312769q472697
8442B9495852m657368l555910n306081m632491K086235J0485716J0700430p36747
8434C3879636j3669370j4693000m165660L862715k8982r055747j0098120L8532
8426a3929996J2114570J5230772P414845k888212n424755J08662L252078k638119
8418A3239845r566838o344533L480894O910647K648796J994849O968065M587053
$$ y = [18837794, 8516481, -13394949, -28483960, -29596493, -24117023, -20620187, -19050984, -14884203, -7317560, 305622, 5457179, 7950797, 7423530, 3112101, -2808266, -4793951, 15723, 6314277, 5136706, -4756412, -13622109, -12334280, -4561776, -1777215, -6535087, -7492106, 5799294, 28309299, 44694516, 46281318, 37968549, 29495852, 24838484, 21282574, 15976493, 11344002, 13430237, 23915953, 34616383, 33879636, 20210266, 5517266, 1351606, 5214321, 5185339, -3870408, -13968528, -13929996, -1815426, 13415346, 20830191, 17941979, 12517224, 12625886, 15877964, 13239845, 3673007, -2671526, 809368, 7720015, 10368811, 12363660, 19331725, 23918778]
8410B3918778j0105279k1635714j6273079l168809P46837l698270l426163L617641
8402c0024058Q073059P957272J0291535J4249900R217645o793526k0248900j9242687
8394b6519760q073808O84858J949854J033213M414522J0909305J1980471K483368
8386a137977r085540p997402O031658J5479585R485944L87282L884394J3640293
8378C0688237J2652243J733408l998772k538096n965567j4661497j5059463o862524
8370d012031p006686j7660390j5893116R268935L2158050K4357257l098123j5644412
8362B469484l587609R978662O372421o323386j0996870l975391O122965J0645148
8354A0705424P045722n08416m902380m803844o740015j2804581j2875613N55717
$$ y = [23918778, 13813499, -7822215, -24095294, -27264103, -26517266, -30215536, -33641699, -30024058, -21950999, -13993727, -3702192, 10547708, 19765353, 12971827, -7277073, -26519760, -34593568, -33908710, -31958856, -30925643, -26511121, -15601816, -3621345, -1137977, -10223517, -18220919, -12189261, 3290324, 12776268, 13163550, 17047944, 30688237, 43340480, 45073888, 41075116, 38537020, 32571453, 17909956, 2850493, -4012031, -11018717, -28679107, -44572223, -35303288, -3145238, 21212019, 18113896, 2469484, -1118125, 8860537, 15232958, 8909572, -2087298, -6062689, 60276, 10705424, 17751146, 17242730, 12340350, 7536506, 796491, -12008090, -24883703, -24327986]
8346b4327986J5910078J5293940R33527p185518p50371O433933K170163n713572
8338B764194m085856M307390O546971k07686o070906l979531J851523M107092
8330E233191K277976J433898M162504O872326M579803k210693p931881r400499
8322E016625q917024q040903l741632M270502P944988J078941q500223p515805
8314a8404531L125934R047320M225052m50140M571383J2468635J1697461L450593
8306B9731707k839590n091163q437548j2843460j2076325n005251J459410K418387
8298a2683833O74810K96733O81138j94335j460516j522933j231326j750586j284372
8289a8475220K948167R659131J2785262P746229j614575n144342J623691R808806
$$ y = [-24327986, -8417908, 6876032, 7809559, 624041, -126330, 6307603, 8477766, 2764194, -1321662, 2985728, 9532699, 9325013, 3254107, -725424, 1126099, 5233191, 7511167, 8945065, 13107569, 19979895, 24559698, 22349005, 14417124, 5016625, -3900399, -11941302, -15682934, -11412432, -3467444, -2388503, -10888726, -18404531, -15278597, -6231277, -2006225, -2456365, 2115018, 14583653, 26281114, 29731707, 26892117, 21800954, 13363406, 519946, -11556379, -16561630, -15102220, -12683833, -12009023, -11712290, -11031152, -11225487, -12686003, -14208936, -15440262, -17190848, -18475220, -15527053, -5867922, 6917340, 14663569, 13048994, 7904652, 9528343, 19337149]
8281A9337149P269204m099555r404085j935652O172919J726966r577532j2310139
8273b820725m870465J04649k755827m698072J50623N457109N821319N573728O568347
8264H530686P38214j3455581j9358374l373946K0006114K3691318N958036p211567
8256A5524900m78340J0365289N601316q024999r844459K139825R278796M55920
8248B5018248j3681176j7516809r329436K133203J0861103J5523952J3462490
8241B6471575K321721j1810997j5764879l875967J2367873J5665821L685239q156811
8233B0903575p072126J298840L706542p60568k514477k99228m098099j6092862
8225d928403k2059330j0280449J0160901K0182273J4250720L301477k345205k929942
$$ y = [19337149, 26606353, 22506798, 13102713, 11167061, 17339980, 19066946, 9489414, -2820725, -7691190, -7586541, -10342368, -15040440, -14889817, -9432708, -3611389, 1962339, 8530686, 9268900, -4186681, -23545055, -26919001, -6912887, 16778431, 22736467, 15524900, 15046560, 25411849, 31013165, 22988166, 13143707, 15283532, 24562328, 25018248, 11337072, -6179737, -15509173, -13375970, -2514867, 13009085, 26471575, 28793296, 16982299, 1217420, -2658547, 9709326, 25375147, 29060386, 20903575, 13831449, 15130289, 18836831, 18076263, 15561786, 15262558, 11164459, -4928403, -26987733, -37268182, -27107281, -6925008, 7325712, 10627189, 8281984, 5352042]
8217E352042k702725k164921N75498M852714N886173j295900j3702831j7702433
8209b0902383k817349K0245929K6858689R614935j0237600j2110167l403778k578202
8201D670074p434071k115791J1108184J2583050j451564j0793715k880183R019888
8193A2705872Q757097l3438n563363o449328o312894k847809N370290J1445222
8185A7071649R879794M172441k742419j3118442k1913860j5877706L753665J4880828
8177c894050N638292n351396J719360J5178641J2127684k624168o082695L069191
8169A9780859M420133p107025j4137049q856719l595386l857761J767484J5485149
8161C899685J9776779O162360p643732m535517O605478Q174771M09545n924024
$$ y = [5352042, 2649317, 484396, 1059894, 5912608, 11798781, 10502881, -3199950, -20902383, -23719732, -3473803, 23384886, 32999821, 22762221, 10652054, 7248276, 4670074, -2763997, -4879788, 6228396, 18811446, 17359882, 6566167, 3685984, 12705872, 21462969, 21429531, 15866168, 9416840, 3103946, 256137, 5626427, 17071649, 26951443, 31123884, 28381465, 15263023, -6650837, -22528543, -18774878, -3894050, 1744242, -3607154, -1887794, 13290847, 25418531, 22794363, 16711668, 19780859, 24200992, 17093967, 2956918, -5899801, -9495187, -13352948, -11585464, 3899685, 23676464, 29838824, 22195092, 17659575, 24265053, 32439824, 32849369, 26925345]
8153B6925345r756055j5050653j6273851o108011Q740972J4649864R475372J496799
8145A4099782m948963j0692947j2780572o048385P770064K0194367K3182020J2784655
8137D3560021p336512k2304139j7030163K404811J0988651k074230j6211450q960140
8129a6963151J0648260J6352855K922504j0190376q994908N22017O963815O051368
8121G312384j291318r412436q030099M771140J3377573M037650j1042389q538901
8113h816396R132142J4849892j988775j9008283j5356410j493321J046440o021634
8105b7656345l390429J2632890K1905284Q559654j5063780k1346043j756363K0361871
8097e753261J7750067n103181j7984826p743661M583906J43237o236100O212528
$$ y = [26925345, 17169290, 2118637, -14155214, -20263225, -11522253, 3127611, 12602983, 14099782, 9150819, -1542128, -14322700, -20371085, -12601021, 7593346, 30775366, 43560021, 36223509, 13919370, -3110793, -705982, 10282669, 8208439, -8003011, -16963151, -6314891, 10037964, 12960468, 2770092, -6224816, -5702799, 1261016, 7312384, 6021066, -3391370, -11421469, -6650329, 6727244, 10764894, -277495, -8816396, 315746, 15165638, 13176863, -5831420, -21187830, -22681151, -21634711, -27656345, -31046774, -18413884, 3491400, 12051054, -3012726, -24358769, -26115132, -5753261, 11996806, 6893625, -11091201, -18834862, -14250956, -14107719, -20343819, -14131291]
8089a4131291K3010266J4393501j2445633j9787844R60610J6260899O782944l840091
8081A1203361M250318J0334213p445467k7857515j8740938R082675J9332295P129625
$$ y = [-14131291, 8878975, 23272476, 10826843, -8961001, -8000391, 8260508, 15043452, 11203361, 15453679, 25787892, 18342425, -9515090, -28256028, -19173353, 158942, 7288567]
$$ [...]
##END NTUPLES=NMR SPECTRUM
##END=
