##TITLE=31Pdec_LR-0139-B-IPS
 D2O, 24 sc
 3.7.2023
##JCAMPDX= 6.0         $$ Bruker NMR JCAMP-DX V2.0
##DATA TYPE= NMR SPECTRUM
##DATA CLASS= NTUPLES
##ORIGIN= UXNMR, Bruker Analytische Messtechnik GmbH
##OWNER= root
$$ XWIN-NMR		Version 3.5
$$ Mon Jul  3 15:30:36 2023 Russian Standard Time (UT+4h)  she@DPX200
##.OBSERVE FREQUENCY= 81.013821
##.OBSERVE NUCLEUS= ^31P
##.ACQUISITION MODE= SIMULTANEOUS
##.ACQUISITION SCHEME= undefined
##.AVERAGES= 24
##.DIGITISER RES= 16
##SPECTROMETER/DATA SYSTEM= spect
##.PULSE SEQUENCE= zgpg30
##.SOLVENT NAME= CDCl3
##.SHIFT REFERENCE= (INTERNAL, CDCl3, 0, 248.564)
##AUDIT TRAIL= $$ (NUMBER, WHEN, WHO, WHERE, WHAT)
$$ ##TITLE= Audit trail, XWIN-NMR		Version 3.5
$$ ##JCAMPDX= 5.01
$$ ##ORIGIN= Bruker BioSpin GmbH
$$ ##OWNER= she
$$ F:/spectra/data/she/nmr/P31/1/pdata/1/auditp.txt
$$ ##AUDIT TRAIL=  $$ (NUMBER, WHEN, WHO, WHERE, WHAT)
(   1,<2023-07-03 15:28:38.42 +0400>,<she>,<DPX200>,
      <created by zg, POWCHK disabled, PULCHK disabled
       configuration hash MD5:
       00 E9 B6 7A A2 85 ED C7 34 08 36 98 17 FE 4E 26
       data hash MD5: 32K
       06 B3 04 28 D5 AE 8C E0 1E 19 71 55 BB BB FE 5C>)
(   2,<2023-07-03 15:28:52.25 +0400>,<she>,<DPX200>,
      <Start of raw data processing
       efp BC_mod = 2 LB = 1 FT_mod = 6 PKNL = 1 PHC0 = -10705.51 PHC1 = 136.2848 SI = 64K 
       data hash MD5: 64K
       66 98 82 EB 4D AA AC C7 A9 67 33 45 EA DE A1 33>)
(   3,<2023-07-03 15:29:20.65 +0400>,<she>,<DPX200>,
      <pk PHC0 = -33.99353 PHC1 = -4.2 
       data hash MD5: 64K
       4E F7 9F DC 37 F3 84 67 67 B7 47 54 59 7F 87 FE>)
(   4,<2023-07-03 15:29:58.14 +0400>,<she>,<DPX200>,
      <pk PHC0 = 36.05722 PHC1 = -89.59997 
       data hash MD5: 64K
       72 0A 5B 58 F4 D0 76 CF 63 88 E8 4B BD AE 3A 66>)
(   5,<2023-07-03 15:30:02.00 +0400>,<she>,<DPX200>,
      <abs ABSG = 5 
       data hash MD5: 64K
       5F A0 B4 39 62 16 21 C3 4F BC 88 98 0A D9 74 C1>)
$$ ##END=
$$ 
$$ hash MD5
$$ E3 E0 F3 2F EB 51 E7 84 3A 2E 72 9B 46 4A E6 06
##$RELAX= 
##$RELAX= 
##$RELAX= 
##$RELAX= 
##$RELAX= 
##$RELAX= 
##$RELAX= 
##$RELAX= 
##$RELAX= 
$$ Bruker specific parameters
$$ --------------------------
##$DU= <F:/spectra>
##$EXPNO= 1
##$NAME= <P31>
##$PROCNO= 1
##$TYPE= <nmr>
##$USER= <she>
##$AMP= (0..31)
100 100 100 100 100 100 100 100 100 100 100 100 100 100 100 100 100 100 
100 100 100 100 100 100 100 100 100 100 100 100 100 100 
##$AQSEQ= 0
##$AQ_mod= 1
##$AUNM= <au_zg>
##$AUTOPOS= <>
##$BF1= 81.014009
##$BF2= 200.13
##$BF3= 200.13
##$BF4= 200.13
##$BF5= 200.13
##$BF6= 200.13
##$BF7= 200.13
##$BF8= 200.13
##$BYTORDA= 1
##$CFDGTYP= 0
##$CFRGTYP= 5
##$CHEMSTR= <none>
##$CNST= (0..31)
1 1 145 1 1 1 1 1 1 1 1 1 1 1 1 1 1 1 1 1 1 1 1 1 1 1 1 1 1 1 1 1 
##$CPDPRG= <waltz16>
##$CPDPRG1= <>
##$CPDPRG2= <waltz16>
##$CPDPRG3= <>
##$CPDPRG4= <mlev>
##$CPDPRG5= <mlev>
##$CPDPRG6= <mlev>
##$CPDPRG7= <mlev>
##$CPDPRG8= <mlev>
##$CPDPRGB= <>
##$CPDPRGT= <>
##$D= (0..31)
$$ [...]
##$SUBNAM3= <"">
##$SUBNAM4= <"">
##$SUBNAM5= <"">
##$SUBNAM6= <"">
##$SUBNAM7= <"">
##$SUBNAM8= <"">
##$SUBNAM9= <"">
##$SW= 501.771253377433
##$SWIBOX= (0..15)
0 1 3 0 0 0 0 0 0 0 0 0 0 0 0 0 
##$SW_h= 40650.406504065
##$TD= 32768
##$TD0= 1
##$TE= 0
##$TE2= 300
##$TE3= 300
##$TEG= 300
##$TL= (0..7)
0 120 53 12 22 120 120 120 
##$TP= (0..7)
150 150 150 150 150 150 150 150 
##$TP07= 0
##$TPNAME0= <>
##$TPNAME1= <>
##$TPNAME2= <>
##$TPNAME3= <>
##$TPNAME4= <>
##$TPNAME5= <>
##$TPNAME6= <>
##$TPNAME7= <>
##$TPOAL= (0..7)
0.5 0.5 0.5 0.5 0.5 0.5 0.5 0.5 
##$TPOFFS= (0..7)
0 0 0 0 0 0 0 0 
##$TUNHIN= 0
##$TUNHOUT= 0
##$TUNXOUT= 0
##$USERA1= <user>
##$USERA2= <user>
##$USERA3= <user>
##$USERA4= <user>
##$USERA5= <user>
##$V9= 5
##$VALIST= <valist>
##$VCLIST= <CCCCCCCCCCCCCCC>
##$VD= 0
##$VDLIST= <DDDDDDDDDDDDDDD>
##$VPLIST= <PPPPPPPPPPPPPPP>
##$VTLIST= <TTTTTTTTTTTTTTT>
##$WBST= 1024
##$WBSW= 4
##$XGAIN= (0..3)
0 0 0 0 
##$XL= 0
##$YL= 0
##$YMAX_a= 2438
##$YMIN_a= -2880
##$ZGOPTNS= <>
##$ZL1= 120
##$ZL2= 120
##$ZL3= 120
##$ZL4= 120
##$ABSF1= 248.5645
##$ABSF2= -253.2056
##$ABSG= 5
##$ABSL= 3
##$ALPHA= 0
##$AQORDER= 0
##$ASSFAC= 0
##$ASSFACI= 0
##$ASSFACX= 0
##$ASSWID= 0
##$AUNMP= <proc_1d>
##$AZFE= 0.1
##$AZFW= 0.5
##$BCFW= 0
##$BC_mod= 2
##$BYTORDP= 0
##$COROFFS= 0
##$CY= -3
##$DATMOD= 1
##$DC= 0
##$DFILT= <>
##$DTYPP= 0
##$F1P= 0
##$F2P= 0
##$FCOR= 1
##$FTSIZE= 65536
##$FT_mod= 6
##$GAMMA= 0
##$GB= 0
##$INTBC= 1
##$INTSCL= 6.047779e-11
##$ISEN= 30
##$LB= 1
##$LEV0= 0
##$LPBIN= 0
##$MAXI= 10000
##$MC2= 0
##$MEAN= 0
##$ME_mod= 0
##$MI= 50
##$NCOEF= 0
##$NC_proc= -5
##$NLEV= 6
##$NOISF1= 182.463
##$NOISF2= 159.3651
##$NSP= 0
##$NTH_PI= 0
##$NZP= 0
##$OFFSET= 248.5645
##$PC= 4
##$PHC0= -10703.44
##$PHC1= 42.48483
##$PH_mod= 1
##$PKNL= yes
##$PPARMOD= 0
##$PSCAL= 0
##$PSIGN= 0
##$REVERSE= no
##$SF= 81.0140089999694
##$SI= 65536
##$SIGF1= 159.3651
##$SIGF2= -187.1042
##$SINO= 113.3802
##$SIOLD= 16384
##$SREGLST= <1H.CDCl3>
##$SSB= 0
##$STSI= 65536
##$STSR= 0
##$SW_p= 40650.406504065
##$SYMM= 0
##$S_DEV= 0
##$TDeff= 32768
##$TDoff= 0
##$TI= <>
##$TILT= no
##$TM1= 0
##$TM2= 0
##$TOPLEV= 0
##$USERP1= <user>
##$USERP2= <user>
##$USERP3= <user>
##$USERP4= <user>
##$USERP5= <user>
##$WDW= 1
##$XDIM= 65536
##$YMAX_p= 110833022
##$YMIN_p= -333945579
$$ End of Bruker specific parameters
$$ ---------------------------------
##NTUPLES= NMR SPECTRUM
##VAR_NAME=  FREQUENCY,     SPECTRUM/REAL,   SPECTRUM/IMAG
##SYMBOL=    X,             R,               I
##VAR_TYPE=  INDEPENDENT,   DEPENDENT,       DEPENDENT
##VAR_FORM=  AFFN,          ASDF,            ASDF
##VAR_DIM=   65536,         65536,           65536
##UNITS=     HZ,            ARBITRARY UNITS, ARBITRARY UNITS
##FACTOR=    0.620285442955139, 1,           1
##FIRST=     20137.2065510682, 0,            0
##LAST=      -20513.1999529968, 0,           0
##MIN=       -20513.1999529968, -333945579,  0
##MAX=       20137.2065510682, 110833022,    0
$$ Real data points
##PAGE= N=1
##DATA TABLE= (X++(R..R)), XYDATA
$$ [...]
15784 800691 1057187 1379431 1491482 1161824 547759 122104 147740 337668 253593 -39163
15774 -39163 -48455 376736 740728 571778 86059 -134683 66610 317676 335161 280978
15764 280978 414072 657078 690821 363936 -143308 -527339 -623572 -463093 -171309 115686
15754 115686 266553 190371 -75222 -342443 -413074 -265982 -84511 -76112 -249911 -376189
15744 -376189 -221237 132218 277912 -75632 -705480 -1082454 -968847 -616357 -367502 -309074
15734 -309074 -374852 -508014 -592481 -479251 -220050 -26880 98223 361345 699775 765533
15724 765533 580645 636520 991281 931986 119649 -605135 -424078 30289 -400689 -1398860
15714 -1398860 -1486590 -383547 417363 -100561 -975024 -819733 176109 820684 742280 523141
15704 523141 426040 84590 -594426 -1095365 -1003473 -496885 -21981 166585 122001 98680
15694 98680 266452 428983 277407 -5279 132116 700820 1006792 733476 486953 732851
15684 732851 933216 511752 -3348 196807 755671 701399 142615 131201 855983 1270870
15674 1270870 793068 179098 203632 486023 314145 -154603 -288178 -43932 108010 8538
15664 8538 -93039 -93844 -157701 -355386 -573890 -727139 -775750 -626252 -264826 72970 70233
15653 70233 -356486 -995823 -1513378 -1643065 -1342618 -817278 -299551 158091 550743 731063
15643 731063 620909 488455 656129 998337 1110695 924540 731135 644962 536047 473611
15633 473611 648370 793925 367473 -470297 -758584 -51438 765239 562975 -515752
15624 -515752 -1267089 -960201 -73251 492538 446876 198650 179298 315964 235406 -88003
15614 -88003 -166493 293268 801914 702036 201763 102044 482744 500613 -227008 -900580
15604 -900580 -748749 -197122 -69857 -242049 -35257 428683 327136 -485199 -1183245 -1202087
15594 -1202087 -912266 -801365 -723909 -354630 189365 604207 847362 948769 755320 262856
15584 262856 -113323 -23177 289390 351400 180954 212400 580721 907030 846538 514649
15574 514649 261050 255997 404523 505148 424797 243496 218288 423982 480759 -33708
15564 -33708 -843936 -1065704 -301631 704827 924194 311741 -275139 -290375 -21616 135947
15554 135947 266760 524645 705413 651920 653831 968505 1283183 1161255 747073 480430
15544 480430 332370 -64836 -653156 -958861 -860819 -738946 -794724 -810034 -697797 -714733
15534 -714733 -931822 -1018921 -799176 -561916 -583073 -749408 -880613 -1014508 -1158344 -1177323
15524 -1177323 -1147810 -1378283 -1837618 -2027034 -1705028 -1268036 -1080479 -911722 -457338 23362
15514 23362 92273 -165927 -299784 -106091 294547 726660 954736 733382 228942 24390
15504 24390 303580 456464 -5684 -591706 -539736 -21274 133456 -285222 -650877 -525789
15494 -525789 -164464 98981 330865 672232 988361 1027115 669464 18874 -536686 -533002
15484 -533002 -17382 342707 154938 -50806 340258 919671 819308 161438 -52142 462058
15474 462058 794178 266042 -542723 -667803 -12175 763621 1141960 1115004 961343 928635
15464 928635 914036 463216 -521195 -1231181 -826734 198751 464184 -335662 -975303 -616940
15454 -616940 -72996 -412229 -1285058 -1637576 -1354679 -1069375 -853776 -306797 320712 305324
15444 305324 -250498 -410551 141842 649030 567422 383876 689258 1212276 1362923 1172261
15434 1172261 1060713 1041163 785146 313587 49362 163800 304312 100966 -332101 -567209
15424 -567209 -392140 -2776 291467 383647 319675 92990 -292837 -614576 -585907 -299030
15414 -299030 -202418 -472361 -718254 -577729 -309108 -402536 -797935 -942899 -567500 17711
15404 17711 401531 463964 249721 -159232 -515568 -484505 -55469 334313 275821 -144241
15394 -144241 -505753 -593204 -608108 -834505 -1219323 -1432369 -1360752 -1322138 -1566241 -1764758
15384 -1764758 -1426526 -738430 -402704 -543188 -474096 126365 565891 250005 -249013 -90024
15374 -90024 391891 202616 -600073 -871160 -127431 735041 772828 160178 -358549 -444780
15364 -444780 -194855 193981 426007 295482 111552 379321 918997 1017920 624418 499241
15354 499241 863097 900635 163682 -538304 -436807 -79991 -332231 -872196 -839400 -422457
15344 -422457 -561849 -1367566 -2026654 -2155793 -2114308 -1986963 -1361442 -286085 493375 495085
15334 495085 -7748 -527838 -708472 -233809 735363 1149990 172139 -1299894 -1434119
15325 -1434119 -12055 1145080 773286 -164199 -217749 386287 503242 69672 -29724
15316 -29724 404945 721492 690645 742097 914957 656591 -146285 -855070 -1064155 -1101524
15306 -1101524 -1224835 -1072468 -417079 116761 -247525 -1267975 -1824899 -1266202 -184996
15297 -184996 325240 -58243 -638934 -675168 -271991 -75956 -302152 -502703 -333153 -93861
15287 -93861 -260250 -795356 -1239062 -1277453 -951555 -484310 -171116 -272626 -728039 -1095862
15277 -1095862 -1030990 -697582 -479859 -443119 -353346 -99129 190954 367980 363195 159918
15267 159918 -131147 -282481 -215513 -103867 -52623 89147 389231 600888 562908 525504
15257 525504 704700 816302 535096 170868 302624 849020 1097199 677843 -9898 -407679
15247 -407679 -356837 23925 539573 852679 643708 39715 -429517 -450110 -215423 -14651
15237 -14651 118723 196449 52304 -425943 -1036076 -1417055 -1345808 -821393 -48576 592356
15227 592356 774079 542431 282131 310952 617039 967880 1115536 944694 617723 513416
15217 513416 798511 1140900 1110273 763344 502180 437220 294968 -59142 -436721 -713575
15207 -713575 -976020 -1182113 -1092632 -690870 -290332 -59045 179702 469232 449359 -101459
15197 -101459 -755686 -880745 -474907 -195093 -521548 -1141004 -1282050 -579271 529820
15188 529820 1328455 1609364 1684037 1641446 1088658 -77011 -1107318 -1195258 -568986 -133523
15178 -133523 -141973 31067 722838 1352097 1270859 671513 253076 350975 695530 747478
15168 747478 105224 -1089549 -2046784 -2040120 -1323339 -851854 -990861 -1115416 -700135 -100689
15158 -100689 142988 115593 117056 48885 -159522 -36682 767785 1669183 1772551 1093871
15148 1093871 427403 159178 -23835 -297969 -373705 -152462 -40235 -326787 -727984 -814235
15138 -814235 -549492 -191546 63723 165226 162107 207248 424630 707993 823500 720244
15128 720244 551423 429594 393886 550567 936241 1276325 1239068 952983 887054 1128539
15118 1128539 1193770 766296 244062 204234 571058 739835 457406 156527 297146 704568
15108 704568 828528 503029 135749 125649 359455 417679 102283 -403539 -789691 -894076
15098 -894076 -821980 -881408 -1229509 -1500047 -1103113 -113287 552162 269509 -375388 -433126
15088 -433126 -232 95417 -171845 58340 915253 1298141 556361 -393760 -456211 29466
15078 29466 86347 -188937 47143 738778 941884 444349 106373 331279 352057 -424309
15068 -424309 -1296530 -1241187 -409109 131475 -146128 -730255 -961669 -810017 -604595 -420038
15058 -420038 -72957 397147 603284 324722 -82110 -100425 215879 347543 167539 151012
15048 151012 505771 680517 212051 -421997 -423587 189644 739673 917886 914770 696170
15038 696170 8718 -859807 -1161776 -739478 -282409 -289269 -437659 -282056 65184 331798
15028 331798 585623 889858 956528 641890 383740 612381 1018482 944489 330277 -237414
15018 -237414 -357990 -258843 -349791 -638664 -711642 -207946 701447 1328330 1100505 193919
15008 193919 -653544 -955615 -846241 -649668 -473210 -330229 -258538 -126759 292604 839394
14998 839394 957483 447523 -170820 -382085 -359147 -510916 -734892 -665623 -400693 -377702
14988 -377702 -642589 -793072 -615880 -289194 33109 361098 573393 442396 25856 -350231
14978 -350231 -523913 -534828 -295580 246955 630201 233424 -689822 -1031562 -282986 649979
14968 649979 654097 -67784 -404420 40574 551672 476646 17750 -316744 -397150 -319422
14958 -319422 -79591 260195 459061 457177 520966 764779 896179 749546 670826 941545
14948 941545 1187413 908710 318399 12525 -12526 -275038 -772485 -857312 -369121 -102864
14938 -102864 -661652 -1443247 -1415493 -558766 130339 -34614 -684913 -1037032 -816582 -354307
14928 -354307 -37349 92745 232412 444974 528445 335668 92640 129800 330968 224883
14918 224883 -277825 -658765 -545121 -292699 -436359 -861617 -992208 -636901 -179480 13033
14908 13033 -66495 -314004 -675066 -951791 -818348 -242005 325071 380567 -90767 -648563
14898 -648563 -907104 -875648 -763154 -589595 -211082 248442 318136 -186833 -707149 -568868
14888 -568868 57237 375060 115923 -174653 -113235 -15975 -154792 -193440 138756 430245
14878 430245 249961 -81297 -24698 315359 531908 686650 986677 1073846 508443 -279758
14868 -279758 -423156 117947 586361 643346 637144 644905 228349 -626158 -1200072 -1027130
14858 -1027130 -481161 -65813 209417 406229 267116 -315058 -940636 -1209392 -1169667 -977903
14848 -977903 -582071 -55884 227723 126197 26312 255471 554021 480812 27224 -492869
14838 -492869 -869681 -1007587 -781868 -209208 401293 690036 525248 -15223 -710274 -1203806
14828 -1203806 -1228433 -877031 -424469 32416 435846 472892 -38745 -611703 -605514 -222711
14818 -222711 -226756 -654056 -704955 -112308 322614 -28408 -683192 -865090 -519673 22954
14808 22954 695602 1386042 1612798 1191869 729986 811823 1141232 1098296 708650 425382
14798 425382 331833 192703 1184 -67393 21296 276652 734959 1071888 752434 -21818
14788 -21818 -251701 404155 938220 535499 -53381 259383 1042508 1032147 193052 -317944
14778 -317944 -35878 350420 401643 465462 673930 640733 390804 439405 683837 367986
14768 367986 -515423 -952016 -486599 60213 18151 -113078 209000 491786 175885 -231484
14758 -231484 -52701 249540 -183708 -1042735 -1222903 -528633 118629 125100 -144940 -252040
14748 -252040 -243407 -138249 278443 822934 822852 87440 -629276 -605506 -125929 11004 -397127
14737 -397127 -860372 -986690 -843632 -595970 -246015 190408 564629 744974 695673 404546
14727 404546 -56001 -420710 -456960 -315147 -348839 -527991 -403335 171926 683724 660819
14717 660819 408200 556227 1075560 1312365 970078 460145 157119 -102304 -487731 -669220
14707 -669220 -303435 310779 549890 264130 -149038 -326698 -210293 131402 525290 606614
14697 606614 143595 -520753 -728180 -278667 368472 719610 743522 647297 491044 232262
14687 232262 -63936 -275033 -373132 -378703 -247196 68826 479352 764317 735549 405121
14677 405121 17183 -142219 -35216 79611 -45348 -376964 -722233 -980760 -1115853 -1012085
14667 -1012085 -616415 -159529 51467 79870 307776 834643 1205967 977645 394574 198672
14657 198672 718647 1387268 1346286 442743 -588055 -949542 -565810 83720 654606 1135649
14647 1135649 1470229 1420611 947918 406020 137842 82566 -15008 -179615 -222838 -88463
14637 -88463 40797 -15956 -210000 -299598 -110440 211680 288092 -25269 -365396 -291668
14627 -291668 100654 322832 210308 96722 222872 398321 382511 198551 -92361 -526046
14617 -526046 -965707 -1109985 -964345 -875250 -914023 -752054 -388913 -361220 -806180 -968076
14607 -968076 -249637 796256 1241708 1087970 987274 1033548 766089 206083 -70627 73572
14597 73572 150905 -5037 69643 561594 896073 560668 -130971 -509540 -396873 -124742
14587 -124742 2204 -53124 -175094 -228931 -182478 -165780 -286762 -430375 -430907 -338013 -251593
14576 -251593 -43837 398793 798328 773012 398426 55752 -136860 -255262 -129718 373570
14566 373570 760582 383440 -491874 -946139 -851095 -1083112 -1943689 -2380169 -1494869 -38114
14556 -38114 526533 -40700 -705651 -784225 -627991 -651239 -584325 -59621 665602 1028083
14546 1028083 869025 433209 -113826 -734041 -1156726 -957481 -191961 431185 401702 190529
14536 190529 620569 1521640 1766198 912282 17068 175080 910275 974213 318333 69742
14526 69742 598433 899179 267238 -571757 -684388 -344798 -355717 -640810 -511703 40978
14516 40978 308418 5730 -399348 -548261 -664420 -995645 -1320424 -1218642 -521683 553379
14506 553379 1429344 1430764 464553 -596994 -710201 110310 837493 780366 325840 127080
14496 127080 161600 73962 3307 387454 1080214 1346017 883352 315089 343803 799452
14486 799452 949949 542626 45233 -115760 -46820 40736 282396 824570 1355490 1446142
14476 1446142 1229568 1249658 1604927 1707700 1081197 43062 -666723 -714151 -375224 -75238
14466 -75238 1564 -98172 -251731 -355250 -383242 -391498 -423052 -438682 -382613 -270840 -166563
14455 -166563 -112091 -115001 -134087 -55452 194712 435084 284159 -364282 -1006131 -981296 -347552
14444 -347552 25865 -486590 -1369059 -1573458 -926345 -327416 -404407 -643147 -315876 313460
14434 313460 458573 120974 24562 348525 490650 229198 157912 587924 890341 503529
14424 503529 -108038 -148191 403375 998809 1346692 1407964 1040224 317841 -192630 -130395
14414 -130395 75345 -46869 -148686 297406 950109 1076653 722935 474253 345128 -80066
14404 -80066 -598951 -562910 -51420 166205 -118982 -341941 -262066 -252921 -363187 -129089
14394 -129089 435508 659794 338039 90968 260235 347506 -50852 -590745 -854615 -895496
14384 -895496 -780897 -415052 -115573 -452728 -1159045 -1181486 -267667 516889 398441 -29089
14374 -29089 -19449 82357 -311867 -852435 -897987 -615213 -494755 -431807 -204003 -201439 -708621
14363 -708621 -1080224 -660484 31594 92849 -310291 -404119 -253339 -493726 -929611 -721000
14353 -721000 101220 560578 271346 -83578 4031 191211 126893 33240 87795 22231
14343 22231 -275790 -425023 -202408 5031 -229519 -744157 -1026514 -811508 -279297 131005
14333 131005 86680 -248713 -308786 141515 620556 641864 463628 585683 827934 617559
14323 617559 -3463 -406952 -324637 -52262 219278 538780 695075 364083 -173472 -202499
14313 -202499 396640 937812 864757 285365 -481153 -1208563 -1528524 -1126247 -371409 -91434
14303 -91434 -490401 -887087 -711514 -158407 329791 604269 614376 266135 -277999 -656718
14293 -656718 -804321 -883691 -746421 -160853 431117 281812 -414458 -645544 -211857 -102974
14283 -102974 -750652 -1103734 -303756 764156 743637 -118710 -448890 137397 683388 525919
14273 525919 86821 -81669 -25155 84489 305595 506466 295238 -287495 -595042 -260689
14263 -260689 228652 236608 -129319 -259670 51272 358842 180915 -431474 -983729 -1058548
14253 -1058548 -688904 -238988 28707 160020 259676 234152 -30279 -367047 -455353 -200711
14243 -200711 216388 604323 836090 735082 212278 -442303 -716263 -460194 -96339 -99620
14233 -99620 -444087 -712860 -617982 -249151 103637 212522 27178 -337781 -696215 -909336
14223 -909336 -922513 -721367 -348561 21601 162323 41848 -109898 -101637 -59709 -243149
14213 -243149 -631151 -902482 -848193 -597525 -360746 -167804 -11718 -36773 -326238 -635408
14203 -635408 -645873 -441331 -404581 -612851 -679302 -323614 213900 532628 581203 543273
14193 543273 421628 68610 -450028 -833030 -906629 -789055 -659688 -537635 -338119 -34268
14183 -34268 276896 423317 304280 36456 -123998 -76134 10593 -30806 -104631 -19911 168842
14172 168842 164577 -237819 -910809 -1448031 -1421244 -725649 215831 724831 501887 -83159
14162 -83159 -434409 -347636 -79387 42771 -91911 -364394 -525798 -379599 11693 375078
14152 375078 547512 611526 652861 584090 306325 -160268 -775425 -1423596 -1690874 -1134155
14142 -1134155 -8008 726437 502411 -117311 -240994 179498 514953 484246 340288
14133 340288 182467 -199715 -747743 -1021779 -825052 -466264 -270732 -252431 -358437 -578670
14123 -578670 -678804 -297004 451431 846629 338075 -777577 -1668182 -1788122 -1253218
14114 -1253218 -577408 -190173 -132802 -166308 -182874 -361387 -783344 -1128120 -1043622 -633036
14104 -633036 -229196 121946 533858 830933 759361 524399 526997 626025 317585 -333124
14094 -333124 -662708 -461372 -317695 -623274 -940717 -801537 -516913 -631752 -1025997 -1153521
14084 -1153521 -877348 -515026 -249578 2468 246897 364849 368015 393475 488081 586868
14074 586868 584751 314141 -284466 -819439 -669498 157608 795592 572767 -70033 -238872
14064 -238872 149488 413188 223839 -74427 -277769 -678582 -1339573 -1663414 -1160893 -254812
14054 -254812 176103 -129790 -613247 -677075 -310856 77833 170894 -8284 -189504 -137112
14044 -137112 79347 108461 -272161 -791832 -905130 -416225 272778 615336 473560 103062
14034 103062 -261746 -593075 -890050 -1035801 -895075 -445993 190231 743366 868420 428854
14024 428854 -261926 -658644 -500012 11629 507099 716304 484755 -136032 -738185 -838161
14014 -838161 -460075 -131517 -147952 -208429 -7595 226038 159212 -35629 11996 196011
14004 196011 112725 -199148 -252960 115472 450684 296355 -213389 -522252 -225652 556819
13994 556819 1233995 1241682 668123 237036 437354 885736 900491 483665 225434 330243
13984 330243 324419 -154966 -771353 -933475 -542447 -89691 -145713 -816758 -1599873 -1823251
13974 -1823251 -1354386 -730036 -430800 -299677 27850 434899 530743 316275 109321 -41210
13964 -41210 -316034 -622345 -718407 -758549 -1081230 -1476397 -1333830 -589975 119158 359515
13954 359515 317550 190931 -151731 -657957 -885171 -654745 -393470 -491289 -766327 -855989
13944 -855989 -709512 -430709 -57334 262767 306587 201248 354439 759817 894966 552916
13934 552916 203831 209951 269580 65205 -93718 185765 633907 695397 356286 63737
13924 63737 31677 97513 123385 144418 210840 347014 540983 623480 397466 16997 -104429
13913 -104429 83453 154216 -93137 -311603 -257817 -216489 -370668 -289900 397950 1251866
13903 1251866 1564274 1380480 1347864 1701614 1977106 1705456 956181 177432 -223004 -195778
13893 -195778 -128866 -431302 -902075 -864872 -164412 426923 215725 -403460 -492547 151557
13883 151557 845358 1002233 713313 374417 211859 253701 448774 716218 991886 1181069
13873 1181069 1056919 476607 -212473 -366791 147507 731902 870821 716533 563076
13864 563076 275065 -289603 -780748 -867246 -843268 -1083975 -1250009 -775100 73945 406235
13854 406235 -70182 -736373 -1007969 -943666 -793499 -535592 -114257 271005 383665 254626
13844 254626 124566 187063 394892 447797 96379 -453704 -681179 -434236 -141927 -120194
13834 -120194 -88744 248344 561760 363801 -190415 -532551 -492199 -324205 -113118 261455
13824 261455 659011 725524 383380 -147520 -712455 -1193388 -1303112 -903207 -377391 -190305
13814 -190305 -229550 -87889 209503 353064 430541 771773 1216296 1259924 921214 749666
13804 749666 925047 1057808 979770 1000093 1182272 1085367 541021 61746 84803 313356
13794 313356 219710 -178979 -424572 -210279 426777 1237405 1821520 1803596 1206572 493142
13784 493142 85859 19498 130885 314072 463650 435459 231252 34892 -38773 -49844
13774 -49844 -35189 87382 364580 742379 1152753 1458391 1369108 716603 -180768 -727139
13764 -727139 -674485 -311715 -45791 -51596 -305586 -666756 -901793 -866331 -649716 -365328
13754 -365328 51588 582671 888182 714900 347167 205561 192544 -25885 -271499 -73557
13744 -73557 412216 459009 -124930 -652961 -574077 -197939 -75078 -201065 -235440 -88336
13734 -88336 111087 324428 543195 648297 567828 360426 27386 -441458 -745829 -442826
13724 -442826 373482 1011412 1046943 796670 643843 409638 -151210 -671715 -592953 -31430
13714 -31430 349408 240721 -42718 -166072 -170506 -183654 -117005 175633 636583 1008324
13704 1008324 1004616 510135 -239655 -739184 -685005 -350173 -277478 -604755 -927905 -860643
13694 -860643 -458381 20244 477058 850640 872021 362237 -274170 -316648 352580 994561
13684 994561 954324 507039 372827 681525 959215 984423 1021845 1179567 1158661 807615
13674 807615 378708 42019 -313636 -591277 -417128 118466 289420 -236626 -786912 -660463
13664 -660463 -170627 -40001 -226542 -159765 150924 108223 -432661 -864660 -662434 15558
13654 15558 621810 735441 325843 -186251 -287561 -55985 -136175 -695557 -956092 -361088
13644 -361088 363663 177042 -669150 -992407 -422008 253862 410943 243469 40989 -232077
13634 -232077 -486335 -487640 -421334 -675847 -1001454 -771310 -169920 -126379 -824893 -1281033
13624 -1281033 -805071 5725 224429 -206370 -710307 -870912 -575474 45350 487721
13615 487721 272910 -277936 -328063 219589 557040 322378 181830 618572 1080773 973178
13605 973178 667827 776767 1099119 1082449 797160 673945 673280 439090 1073 -276093
13595 -276093 -230691 35054 364446 512843 286915 -23895 145446 741197 1030168 739109
13585 739109 496926 698945 768228 204644 -407644 -267993 377132 702155 555619 397150
13575 397150 366465 245077 75252 82159 196614 241386 293275 345498 55266 -605034 -988816
13564 -988816 -734084 -479374 -823237 -1202068 -808412 -75039 -41312 -588281 -607876 159720
13554 159720 739820 516793 48461 -28987 95597 41416 -26468 206197 596231 729537
13544 729537 388039 -328798 -1024936 -1163748 -617144 23769 164879 69274 381195 966467
13534 966467 1052098 522128 176496 467055 790180 440874 -363748 -872501 -766393 -329843
13524 -329843 17836 12357 -403731 -1023641 -1470420 -1498948 -1171453 -774694 -645097 -907658
13514 -907658 -1237933 -1138714 -644950 -363080 -513516 -472969 205245 887414 761461 179662
13504 179662 124685 616662 724645 79087 -701433 -1137298 -1372131 -1384039 -809988 118967
13494 118967 491679 14576 -501454 -403960 -67695 7922 78753 461536 725074 351153
13484 351153 -354343 -731787 -696964 -556564 -337955 35796 272442 61662 -376206 -638278
13474 -638278 -731098 -794456 -593773 96879 878492 1120723 802915 420477 230643 129877
13464 129877 120445 330517 628209 706559 535784 344950 214213 32645 -233273 -549115
13454 -549115 -943077 -1300213 -1226178 -517408 384232 803557 578837 58231 -453478 -842452
13444 -842452 -976921 -823674 -657120 -711743 -740899 -367717 238765 517816 276762 -172069
13434 -172069 -571931 -926755 -1164419 -1095954 -779613 -524915 -491018 -603655 -787288 -898020
13424 -898020 -594105 205337 882857 776604 169028 -110328 -4530 -231457 -857198 -951864
13414 -951864 -131348 586808 240356 -593911 -729827 -170542 116720 -133162 -209802 225058
13404 225058 610289 514588 276145 282533 366170 295000 229403 298282 273688 53347 -53059
13393 -53059 91142 114729 -156503 -207944 351039 942552 705004 -277736 -1155210 -1493295
13383 -1493295 -1504513 -1250000 -533304 305275 408629 -393036 -1129545 -952336 -276390 -80253
13373 -80253 -510124 -862466 -715788 -367688 -147485 71463 462995 801070 746876 377008
13363 377008 129149 238344 416431 193190 -461751 -990069 -834839 -112031 509772 610865
13353 610865 444098 443958 588723 520044 138142 -247332 -351798 -241370 -164629 -246744 -442106
13342 -442106 -666934 -854916 -904094 -678616 -161642 391426 579299 240003 -374908 -920885
13332 -920885 -1310352 -1545398 -1402730 -698342 191280 572190 309929 834 93482 322058
13322 322058 274679 17666 -230940 -553609 -938622 -882022 -62657 893817 1090407 642572
13312 642572 490147 951969 1312019 1018827 489634 341999 473898 384485 -51466 -571944
13302 -571944 -925735 -908472 -372994 406615 740985 320285 -314121 -511120 -380320 -433129
13292 -433129 -691420 -766320 -596663 -446162 -297880 48230 318064 -31463 -833880 -1200850
13282 -1200850 -770093 -266789 -403873 -848725 -849587 -404256 -131037 -259360 -429292 -402884
13272 -402884 -376854 -550149 -831406 -1021840 -955482 -513447 142005 459724 83428 -526036
13262 -526036 -571702 -19277 357307 121480 -242824 -139136 302706 574329 562643 548096
13252 548096 673714 787580 713929 483792 378887 723139 1375957 1570743 803818 -162055
13242 -162055 25122 1418904 2445375 1942683 679309 118925 434563 708900 546595
13233 546595 370370 382511 318645 179871 256168 419578 277060 35997 328634 1113279
13223 1113279 1625338 1520650 1201219 898510 364056 -330208 -630239 -442588 -349806 -562858
13213 -562858 -572928 -234860 -237673 -947766 -1668785 -1696674 -1317978 -1076300 -801178 -147989
13203 -147989 532272 685571 439344 266332 211677 116655 117283 227747 -56654 -967118
13193 -967118 -1735087 -1482237 -473313 297121 410174 145849 -300343 -860074 -1177751
13184 -1177751 -1038958 -939668 -1351874 -1727019 -1220329 -160329 319886 25416 -96382
13175 -96382 418089 890667 768089 465749 469468 513330 235510 -79480 -25930 221069
13165 221069 311700 371730 660121 900101 540590 -416882 -1284760 -1411978 -845957 -275821
13155 -275821 -347287 -945535 -1224646 -544389 723006 1604079 1629219 1149415 637295 170534
13145 170534 -310115 -679133 -769645 -591552 -302112 -122245 -226560 -500140 -545398 -211368
13135 -211368 93224 -18982 -289612 -273501 -146198 -378667 -784707 -692429 -54057 433862
13125 433862 437554 408002 667655 860517 676621 429016 458035 535476 331824 150
13115 150 -161137 -220875 -363843 -489124 -456797 -404495 -459034 -466706 -348330 -355509 -606631
13104 -606631 -748610 -505139 -205875 -291936 -599792 -652128 -415802 -231630 -180585 -94464
13094 -94464 -82126 -426315 -939240 -1026392 -546438 -71388 -46121 -177427 -21207 243824
13084 243824 155987 -160666 -100509 448828 860822 714852 414221 449065 535347 118208
13074 118208 -581400 -805643 -465004 -274333 -553347 -726101 -355260 108996 131411 -42844
13064 -42844 27177 99532 -295977 -941539 -1224921 -1039233 -686845 -210144 434196 854256
13054 854256 711987 469438 753054 1202711 957309 143143 -251348 -13974 -25952 -693717
13044 -693717 -1235241 -998290 -439841 -188424 -58157 294113 523418 210227 -278147 -323832
13034 -323832 -7579 184901 200471 264303 243276 -105748 -487311 -371667 169485 545813
13024 545813 494587 293221 175120 64374 -82740 -136451 -70090 -9496 55434 266670
13014 266670 517377 401701 -260116 -1034651 -1229430 -603472 408015 1189428 1534108
13005 1534108 1637589 1635836 1439115 1061785 777283 748411 789373 720024 632887 535020 152862
12994 152862 -465641 -620230 100012 917165 759152 -154362 -581131 -82281 451813 295283
12984 295283 -117069 -126908 99139 66872 -162156 -220999 -105730 -35849 -9408 37652 -39886
12973 -39886 -303076 -479680 -361030 -133011 -12391 90068 250791 273689 78127 -44422
12963 -44422 78746 119541 -254822 -810812 -1053585 -860313 -479507 -116773 171697 325109
12953 325109 256644 -71770 -578253 -941738 -729292 14608 515748 137869 -669543 -952943
12943 -952943 -628627 -428720 -531430 -284707 507772 1082401 918701 514219 466728 630401
12933 630401 680877 685473 609990 134746 -493726 -384751 542489 1004372 111378 -1220841
12923 -1220841 -1606653 -1121394 -782637 -794417 -564112 -24806 307709 378955 588544 875697
12913 875697 812364 507089 482950 718847 667251 171600 -407808 -875399 -1247802 -1275264
12903 -1275264 -729422 -56342 73046 -209454 -179896 319729 748358 847208 908530 1009495
12893 1009495 795306 202775 -281450 -294403 -16567 195857 160518 -163925 -639365 -922594
12883 -922594 -853368 -711997 -729012 -666383 -361882 -253693 -702559 -1212320 -1119218 -682144
12873 -682144 -590898 -725114 -434405 169341 329566 -8530 -115982 177864 199327 -299652
12863 -299652 -687380 -614874 -597889 -964894 -1156566 -672256 34146 231526 -77731 -385752
12853 -385752 -459716 -378063 -141310 282811 731109 977041 954394 735729 485161 426658
12843 426658 583474 626134 315666 -62358 -133429 -70786 -234804 -430972 -240389 127191
12833 127191 151172 13699 335987 964303 1082091 598634 288461 342452 -1043 -954988
12823 -954988 -1524688 -1020328 -170304 71947 -87578 30303 316861 287267 125642 288361
12813 288361 495098 121546 -655889 -1028835 -737001 -271642 13471 239537 462325 477404
12803 477404 247672 684 -157873 -304508 -390625 -297024 -164833 -247081 -436410 -350270
12793 -350270 77556 453372 442524 152611 -66467 -5733 244429 382838 189663 -165070
12783 -165070 -246156 68908 339842 127565 -372164 -560881 -202085 338639 570458 333411
12773 333411 -195855 -695507 -857624 -573201 -77018 181586 -72472 -640884 -972141 -678026
12763 -678026 19298 468958 313279 -123309 -311806 -164717 64590 290818 564152 666200
12753 666200 284987 -383441 -740670 -612695 -476372 -692889 -1003999 -1036936 -866994 -766575
12743 -766575 -744292 -639811 -407131 -65288 370012 728423 769239 583878 546233 691694
12733 691694 596463 124032 -217166 -59772 145185 -224346 -959459 -1253477 -783929 -34431
12723 -34431 410228 444564 317609 289966 454115 664381 671408 488311 475311 840665 1247157
12712 1247157 1216818 772318 331192 64850 -256915 -773894 -1215801 -1186401 -614054 131212
12702 131212 518346 326345 -106875 -247082 -22837 128636 -25725 -125907 188313 653154
12692 653154 763769 516705 290659 178394 -14932 -203322 -63643 288623 267156 -314493
12682 -314493 -839868 -685878 -57324 322163 93076 -490073 -979309 -1084330 -776140 -357030
12672 -357030 -284659 -618143 -796352 -325647 470984 854893 719766 645050 851068 796935
12662 796935 144351 -513247 -449881 107902 359594 115256 -120485 -115052 -172472 -356267
12652 -356267 -207040 471298 1130136 1138640 515639 -265878 -798517 -834868 -324203 343414
12642 343414 541737 150660 -290724 -385124 -327404 -313000 -140396 198798 218729 -213702
12632 -213702 -402625 104919 620063 355380 -219623 -136995 389071 291332 -511276 -925220
12622 -925220 -462296 54392 -54863 -296449 -11431 521495 698987 598351 625341 666726
12612 666726 340607 -199979 -382183 -35736 387797 405112 -46 -465079 -664911 -632596
12602 -632596 -643069 -709325 -433644 302567 775494 194590 -1026105 -1547470 -829533 172594
12592 172594 372300 -94545 -387778 -249670 -108228 -224096 -380230 -323741 -44967 344999
12582 344999 680336 744447 493882 239767 380889 962179 1617153 1909172 1679592 1145896
12572 1145896 687625 465359 306797 58191 -139626 -145073 -159214 -427740 -790452 -923518
12562 -923518 -825997 -617549 -134575 651737 1089266 553396 -417444 -635855 46168 555357
12552 555357 271429 -191150 -247477 -282364 -672530 -851258 -240946 597678 700812 113968
12542 113968 -311017 -185626 165148 448816 611686 483662 -36499 -528219 -422532 234909
12532 234909 919013 1355317 1545817 1289837 426378 -499649 -603133 133498 672683 228049
12522 228049 -752898 -1251314 -930083 -319577 21084 76995 90194 67162 -159645 -491775
12512 -491775 -518846 -44491 594028 967576 1089172 1159327 994803 259481 -772099 -1296757
12502 -1296757 -991440 -408052 -136788 -84507 109362 406140 518553 402341 235857 155997
12492 155997 280025 699162 1183244 1203433 561623 -253113 -615947 -456233 -182883 -163494
12482 -163494 -464043 -853662 -928176 -517321 -55088 -172309 -847658 -1425283 -1547879 -1477026
12472 -1477026 -1345659 -834291 62068 678434 608856 363678 526467 829249 700828 211737
12462 211737 -226309 -638158 -1188900 -1483553 -1015372 -124483 299365 23234 -310413 -158646
12452 -158646 345839 801089 954790 694385 142916 -190463 151972 892318 1187532 615895
12442 615895 -307469 -704119 -217645 707490 1272546 1056462 400297 11780 202380 719049
12432 719049 1265220 1745885 1930203 1455514 460583 -308797 -408089 -242092 -317344 -463059
12422 -463059 -310005 -73536 -224705 -691800 -987216 -909209 -620103 -281693 -89148 -364287
12412 -364287 -1086544 -1602772 -1337464 -559517 30077 184742 114711 -28983 -116601 144178
12402 144178 725760 955547 355274 -491885 -625986 -7736 590206 747124 685493 601684
12392 601684 509478 619415 1076369 1412014 1050771 280441 -94273 14619 -12457 -282504
12382 -282504 -194567 354962 579543 21707 -681875 -765950 -394524 -220729 -421782 -701768
12372 -701768 -856310 -842379 -572582 -65430 402125 627298 793128 1171608 1665386 1891504
12362 1891504 1638689 1078106 564980 293944 115492 -249750 -743981 -912573 -528372
12353 -528372 -49054 -65161 -430437 -428563 177413 745930 594886 -97185 -484802 -23792
12343 -23792 927805 1493618 1238119 650240 511722 885332 1108840 801016 324356 48114
12333 48114 -221946 -661049 -882587 -596104 -304996 -600768 -1140116 -1152714 -706119 -556662
12323 -556662 -835180 -819812 -140870 625766 836809 581649 303093 161801 88926 57724
12313 57724 32027 -53884 -101863 72997 371656 426243 94279 -322655 -439586 -177998
12303 -177998 206106 324389 -14242 -505601 -575201 -107684 337482 319095 147741 312624
12293 312624 669923 773429 699423 871695 1240837 1301870 873528 302590 -63334 -155676
12283 -155676 -66354 -57700 -443615 -1029647 -1056005 -253401 504139 324422 -379403 -572082
12273 -572082 -199362 -59026 -335535 -421173 -131254 47536 -9809 121167 429078 354242
12263 354242 -137215 -393481 -227773 -211543 -544474 -668486 -363793 -202210 -462139 -572525
12253 -572525 -149333 335784 461715 541834 832598 941423 660959 539506 905207 1127678
12243 1127678 648613 16926 25548 445514 539695 311839 275759 380545 175252 -183138
12233 -183138 -82406 424577 562253 24275 -532611 -419193 235549 819935 998399 879579
12223 879579 721757 711362 878432 1058979 1007367 645258 180232 -75676 -27718 92345
12213 92345 21864 -151833 -110991 145847 213813 -52847 -177722 238720 815844 926197
12203 926197 628169 412105 267446 -186734 -742559 -675552 108689 821713 890593 569044
12193 569044 263458 32712 6234 459122 1077251 963695 -68573 -904863 -483240 770536
12183 770536 1508979 1098692 94648 -669092 -917193 -946174 -1155101 -1555538 -1697885 -1276841
12173 -1276841 -728197 -777346 -1398832 -1784913 -1430630 -655315 60432 582996 802652 541191
12163 541191 60496 -59512 131841 -112787 -976358 -1555587 -1142320 -278421 114296 -2181
12153 -2181 -91503 -28612 309 121711 500011 759011 425203 -274396 -721806 -811255 -898725
12142 -898725 -1010237 -760497 -54858 655592 892048 597457 74229 -302773 -384599 -397278
12132 -397278 -629136 -918340 -801829 -285857 3760 -314818 -833820 -992623 -816928 -653766
12122 -653766 -575104 -452938 -298345 -148281 97825 409556 490794 207510 -133662 -177783
12112 -177783 86008 470396 775063 735803 247869 -266955 -254010 124601 169495 -227002
12102 -227002 -409235 -118450 48688 -294399 -662117 -576299 -302196 -195699 -105403 47871
12092 47871 -81704 -462901 -399000 293212 701171 189017 -518626 -509753 -99772 -63232
12082 -63232 -225996 24032 436615 325229 -131738 -183559 196137 390332 290488 362872
12072 362872 731629 1068376 1196725 1063790 482289 -325315 -462135 413429 1151234 525260
12062 525260 -902516 -1571403 -1160727 -681664 -629484 -528628 -252486 -313946 -688029 -697444
12052 -697444 -307906 -279937 -761547 -960815 -570427 -338975 -773086 -1329497 -1381390 -1050237
12042 -1050237 -632077 -91936 429053 454986 -19927 -321325 -76500 305415 421440 377221
12032 377221 250980 -103758 -438291 -173506 585496 978665 667252 263672 147128 -122649
12022 -122649 -741987 -1080881 -801197 -563168 -883080 -1215690 -986296 -655522 -829996 -1089221
12012 -1089221 -720246 -6092 256174 51136 -44440 33267 -95408 -355610 -330964 -94329
12002 -94329 -76991 -267274 -325339 -313903 -521152 -737359 -542526 -178467 -263413 -698187
11992 -698187 -743331 -211096 307169 509688 767334 1181122 1139079 283853 -756556 -1136697
11982 -1136697 -818157 -366754 -132742 -90180 -172772 -312847 -338592 -198544 -141992 -393659
11972 -393659 -804614 -1071072 -1133399 -1130996 -1137530 -1159513 -1209674 -1174705 -847130 -333071 -136856
11961 -136856 -481870 -825455 -542591 99267 258526 -231433 -624748 -446607 -212033 -520104
11951 -520104 -997972 -819560 14183 644678 579312 274640 323329 626492 718281 518113
11941 518113 325732 254152 85672 -303958 -676177 -689479 -302038 155153 274492 -54014
11931 -54014 -538027 -779143 -679288 -486161 -426462 -410419 -190482 241999 535899 325888
11921 325888 -305441 -811564 -753695 -330120 -109956 -244415 -299623 -12607 233758 60249
11911 60249 -188254 52617 605130 795696 562376 528981 875932 952931 359065 -300800
11901 -300800 -255584 356423 810864 820305 666982 568191 477493 413310 486349 586403 421185
11890 421185 -54954 -488247 -490394 -75722 298116 180313 -305615 -508186 -108129 290108
11880 290108 -83754 -960207 -1287236 -749623 -214187 -349892 -621251 -238983 538375 794242
11870 794242 245504 -560014 -1083780 -1200690 -941631 -421569 46249 209471 174164 143114
11860 143114 76614 -69017 -76401 158964 300588 61369 -276371 -300800 -131844 -126525 -197110
11849 -197110 1037 380313 482081 150744 -301053 -532892 -456838 -222751 -171540 -535301
11839 -535301 -965373 -798330 -87863 206163 -486862 -1476139 -1808582 -1498176 -1048280 -432994
11829 -432994 485946 1083610 648220 -378556 -924319 -812559 -687529 -651912 -209073 498991
11819 498991 677525 252505 58164 392001 531358 64165 -387859 -274891 17378 -23437
11809 -23437 -192395 -110965 95589 217431 431236 841866 1123108 1075608 997860 1096656
11799 1096656 1104545 885550 810180 1081617 1296068 1157971 1030365 1233090 1375563 1008850
11789 1008850 431366 172124 102231 -208658 -562411 -341572 443578 1004639 762303 12943
11779 12943 -510858 -447398 -72643 91109 -134852 -434666 -521724 -615047 -1015624 -1359354
11769 -1359354 -939668 135555 822217 482448 -306299 -703222 -722202 -814413 -892231 -535595
11759 -535595 143059 603620 720540 843275 1049572 972848 474638 -25145 -75666 283391
11749 283391 678619 848902 817127 747669 697938 512814 77904 -334600 -277077 210120
11739 210120 554926 527097 674083 1402796 2070181 1736175 605695 -148469 -38721 159670
11729 159670 -219079 -651300 -331265 508756 1012462 1032716 1125418 1369152 1205839 618474
11719 618474 469777 1175025 1876080 1653534 890480 526123 461774 -135705 -1130707 -1329549
11709 -1329549 -368712 507066 195066 -684332 -807812 -75879 456654 225723 -217810
11700 -217810 -173408 385224 1033389 1385779 1277760 857189 516555 444273 376513 117381
11690 117381 43181 583738 1390759 1625310 1042676 250249 -132925 -71487 175286 440036
11680 440036 603761 555783 366682 256363 307579 397458 397659 243184 -135548 -730236 -1350016
11669 -1350016 -1738951 -1694763 -1048370 132914 1205173 1319068 462200 -342540 -280791
11660 -280791 303339 658264 731332 852360 864881 463462 42439 254723 889942 1099418
11650 1099418 679339 276723 306138 454622 334714 -57680 -580494 -1030015 -1039004 -510759
11640 -510759 -31307 -177548 -596263 -538137 -99120 -11206 -326155 -334105 187232 672062
11630 672062 837658 1048583 1399900 1404501 894501 379181 230156 306175 569908 1191305
11620 1191305 1829089 1773400 1120113 855874 1384693 1880248 1543791 639441 -192537 -820444
11610 -820444 -1309261 -1484383 -1320647 -1122309 -942761 -513987 -16327 -55848 -561668 -689580
11600 -689580 -235964 -61833 -533590 -687149 224292 1385226 1620770 1086479 690580
11591 690580 545925 137371 -476256 -738700 -566518 -310111 -41963 280044 294827 -240288
11581 -240288 -728616 -427583 387553 814010 637210 375201 217161 -115372 -492756 -318495
11571 -318495 484687 1186781 1170063 584924 -27798 -255143 104170 917508 1549406 1322456
11561 1322456 354998 -434233 -345930 354541 853251 703925 164495 -226164 -220569 3192
11551 3192 167346 173262 -9018 -462507 -1049866 -1258752 -781924 -98078 85918 -135978
11541 -135978 -79423 342436 500543 248984 277610 874196 1249446 702321 -297526 -865667
11531 -865667 -899682 -825287 -727170 -489121 -334841 -471283 -554434 -203733 296603 478149
11521 478149 507518 809107 1184519 1074138 509666 101029 180177 533350 833792 823762
11511 823762 303828 -501923 -828632 -212288 797984 1349919 1390938 1390813 1328712 849266
11501 849266 234775 226602 817142 1134751 738885 206313 115747 201096 -20208 -364475
11491 -364475 -299644 191144 599736 612332 410543 265556 165569 -40818 -319235 -450928
11481 -450928 -349240 -220161 -301204 -548633 -762522 -935938 -1199551 -1426933 -1246457 -580994
11471 -580994 116988 361073 156892 -114560 -133264 182165 723602 1244079 1489822 1401743
11461 1401743 1108230 725710 307162 -69710 -357457 -607536 -798231 -761645 -512362 -372566
11451 -372566 -444838 -347769 44166 95795 -595200 -1174669 -570710 722703 1169085 466212
11441 466212 -79792 307944 802951 600385 257918 536616 1011241 874972 319968 89009
11431 89009 239327 289012 140054 22011 -114722 -430693 -742157 -800807 -680393 -472396
11421 -472396 -93706 238858 25458 -586807 -698157 -40071 422060 -10646 -583739 -326505
11411 -326505 359625 443240 -69417 -365799 -238681 -132493 -138829 -22504 28129 -311514
11401 -311514 -695521 -521779 78840 536931 826768 1245986 1538723 1241989 669960 531846
11391 531846 717906 464216 -349908 -1016814 -1086475 -779722 -367421 40793 172889 -106186
11381 -106186 -260747 298736 1142334 1243781 449962 -346274 -517711 -321696 -145170 4595
11371 4595 84784 -136627 -579792 -793222 -566752 -128670 291436 609679 673170 441492
11361 441492 273846 463044 641214 286116 -368654 -668175 -620233 -798047 -1215477 -1218899
11351 -1218899 -633477 -150086 -273351 -601632 -532877 -149556 -2615 -329873 -781176 -784118
11341 -784118 -114341 784960 1174906 880149 508804 550013 646518 232038 -472218 -726626
11331 -726626 -338161 154338 264103 5778 -360281 -593505 -569194 -435553 -498778 -720594
11321 -720594 -703587 -442387 -515169 -1083885 -1358465 -711385 276043 665012 529951 602310
11311 602310 970293 1066049 673089 91507 -460520 -838011 -676583 86733 730447 615280
11301 615280 182657 228565 588034 521216 27670 -311243 -481290 -845598 -1038895 -340645
11291 -340645 889624 1434488 1001824 576260 767557 995973 721130 399537 614427
11282 614427 1048428 977543 341491 -178085 21920 746745 1042479 171595 -1256571 -1652502
11272 -1652502 -433353 984312 958750 -226195 -1026237 -918092 -695529 -768554 -643063
11263 -643063 -176893 29204 -195134 -238066 78034 36708 -717247 -1431838 -1342386 -749849
11253 -749849 -441472 -620668 -902866 -933688 -642286 -222271 -63629 -379189 -850264 -1008051
11243 -1008051 -883304 -811868 -754780 -423188 39484 187811 43023 47359 249406 202814
11233 202814 -266543 -782741 -962723 -746400 -214388 461895 971445 1167052 1235035 1232528
11223 1232528 867780 177628 -144673 274691 766059 602187 113589 -4699 129583
11214 129583 54246 -8032 348721 750857 694774 581824 917947 1097776 343467 -698735
11204 -698735 -784358 -34157 470687 622646 1130797 1767513 1614189 933626 928965 1593939
11194 1593939 1671125 927366 580611 1097537 1410235 874729 294840 335736 486570 307917
11184 307917 266111 603225 712209 346747 202841 617416 890912 568784 229188 321383
11174 321383 337907 -149467 -624154 -470655 143800 731228 1043295 877666 191742 -408994
11164 -408994 -234485 378454 558566 404457 698151 1222822 938848 -109372 -752821
11155 -752821 -720326 -909344 -1406792 -1214082 -360937 -183645 -840583 -739539 623587 1468921
11145 1468921 645586 -365074 51453 1021638 904311 69814 -38601 538439 634610
11136 634610 95152 -224618 -78761 42922 -18940 -104109 -325708 -666817 -637581 -234054
11126 -234054 -374967 -1402023 -2136444 -1575964 -529750 -255348 -413662 128722 1215536
11117 1215536 1691280 1282213 716367 313120 -175035 -553531 -304551 378979 751204
11108 751204 615405 368445 124579 -323929 -815302 -890355 -486351 24396 330981 294154
11098 294154 -112653 -578135 -589087 -139590 198437 166987 105368 119979 -122479 -460740
11088 -460740 -189853 572001 658325 -327219 -1169653 -866094 -120485 -16534 -291587 -87452
11078 -87452 484876 711235 504356 241285 13521 -123095 102156 443434 99113 -845396
11068 -845396 -1085736 -103316 802635 610807 315301 1115127 2168073 1918071 643669
11059 643669 -192912 -353539 -666097 -1060437 -739546 12502 97442 -439543 -489491 90741
11049 90741 229701 -425865 -898478 -497296 296359 868463 1221170 1401120 1224726 826597
11039 826597 593847 442457 11684 -453731 -374227 42705 -10852 -573247 -763475 -160936
11029 -160936 628400 994592 1016805 893483 537200 74035 8726 487274 944040 846923
11019 846923 375963 50596 12785 -2103 -145554 -186954 167312 783288 1148558 1043419
11009 1043419 870095 964743 947239 405753 -100771 299074 1251855 1472064 691446 53692
10999 53692 226242 439064 -9137 -572033 -582792 -399494 -508836 -524955 -58546 354006
10989 354006 199174 15214 454734 1077472 1068601 477200 -159371 -708293 -1097652 -870280
10979 -870280 4526 644478 479311 166537 407032 755136 598503 388719 765153 1299297
10969 1299297 1282091 991387 1029647 1166931 987927 895884 1283086 1507141 943860 264915
10959 264915 358948 767091 579722 122901 240946 572236 159873 -704295 -859209 -184332
10949 -184332 379216 479885 600386 835890 786570 556233 628420 865233 739780 371218
10939 371218 265634 294719 -8233 -450548 -536228 -450279 -609287 -652344 -40964 730332
10929 730332 739293 137211 -138465 127271 353537 337326 381140 458908 275079 -52662
10919 -52662 -233322 -378286 -557415 -349502 306062 533938 -190193 -950445 -713790 68336
10909 68336 420783 540822 1085606 1562469 1075487 96942 -164752 259380 338434 -128288
10899 -128288 -466625 -538799 -662613 -504035 370650 1199505 917009 34715 -42712 670614
10889 670614 852024 155288 -388168 -288030 -200113 -429924 -425840 -54751 41358 -320897
10879 -320897 -519216 -256662 85478 356196 790679 1184655 1009832 415635 77302 46094
10869 46094 -223964 -746551 -927219 -582977 -95179 357384 837896 1123617 989965 726208
10859 726208 575774 169994 -614416 -951137 -314433 322523 -160703 -1180731 -1374774
10850 -1374774 -734799 -285789 -199203 125400 509206 204435 -567665 -836379 -468191 -138108
10840 -138108 17590 336096 544094 151890 -402941 -400128 -232807 -740693 -1593126 -1816384
10830 -1816384 -1474237 -1300030 -1144499 -398174 503846 653864 318600 380586 621824 266858
10820 266858 -275992 -22605 702632 804745 335732 10790 -561850 -2035061 -3257622
10811 -3257622 -2451442 -207943 1077028 678905 94130 136800 -13895 -594661 -547458
10802 -547458 371737 925774 498351 -30595 -75182 -199831 -650568 -759963 -344215 -87843
10792 -87843 -112592 256445 955403 1030047 364570 -36163 169728 172437 -362282 -728390
10782 -728390 -586762 -466442 -570452 -501642 -381896 -806273 -1514096 -1543450 -852011 -378873
10772 -378873 -418437 -335373 94795 468336 798496 1350834 1609502 910991 -111044 -271594
10762 -271594 251780 363130 40610 129761 509011 340085 -150910 -63784 295015 -98333
10752 -98333 -886956 -770428 173997 653643 433072 394947 588942 343901 60022 680317
10742 680317 1612153 1428337 397419 8 197977 -347784 -1536507 -1875975 -1202358
10733 -1202358 -804887 -885823 -483526 110627 -438655 -1798829 -2166286 -1341709 -953241
10724 -953241 -1452093 -1586044 -1059808 -969871 -1324215 -875507 269914 595954 -6942 -113953
10714 -113953 352711 5656 -1020115 -1008184 59635 290343 -585764 -669197 500483
10705 500483 1036737 217965 -295677 283688 535996 -169419 -389934 495158 1028003 521700
10695 521700 332633 1057022 1236755 161184 -695333 -346553 102608 -229610 -483788
10686 -483788 -16045 415411 421051 695060 1165835 745912 -416640 -832783 -317844 -206579
10676 -206579 -580042 -94958 1049306 1026085 -236607 -723047 76377 467355 -1081
10667 -1081 200837 1220373 1258986 149016 -117213 726756 561645 -932975 -1345752 40827
10657 40827 868343 120645 -98816 1183000 1793021 525436 -578822 -82013 405144
10648 405144 -315051 -705596 257031 970556 430699 195228 1105889 1429944 290595
10639 290595 -429994 377693 1009812 418097 250539 1387727 1940680 835699 -50408
10630 -50408 529977 911869 -67369 -800142 -157714 411428 44252 219210 1402443 1602911
10620 1602911 247695 -313463 811283 1174530 -364745 -1274356 -9382 1131390 367093
10611 367093 -470542 153834 591300 -263320 -502033 744906 979007 -1022476 -2422118
10602 -2422118 -1222665 211556 -337370 -1072613 -85703 954168 369881 -205541 603826
10593 603826 917919 -567503 -1623265 -572735 525914 -120290 -797349 -41563 441689
10584 441689 -433128 -641816 768110 1413135 293547 60052 1732612 2231598 195917
10575 195917 -1090265 192183 973423 -544059 -1155939 1052975 2596299 936521 -891691
10566 -891691 -284287 218883 -1382959 -2200506 -356869 876565 -513377 -1062942 1231384
10557 1231384 2411040 38147 -1719432 126428 1615514 -388907 -1949393 217727
10549 217727 2114373 176159 -1726249 72828 1773142 -279240 -2148962 -24410
10541 -24410 2082406 141691 -1925324 -99665 1628057 -688133 -2703415 -246201
10533 -246201 2067667 -324220 -2790374 -530071 1878499 -330760 -2366491 472481
10525 472481 2816910 -300622 -2830502 917623 4508456 1275894 -2630835 -177723
10517 -177723 2679069 -916078 -4357687 -455899 3385333 -831830 -5132161 -594502
10509 -594502 4369926 -52872 -4961124 346523 6220896 798169 -5479705 431265
10501 431265 6776730 -1104362 -9409361 -534068 9770675 -80927 -12500326 -1314146
10493 -1314146 12370493 -5381875 -28474737 -10232119 9051820 -68361795 -233491654
10486 -233491654 -333945579 -261745944 -100126266 -7442576 -16153890 -36332582 -16236860
10479 -16236860 4665049 -5908176 -18962295 -8494017 3934298 -2647479 -10909192
10472 -10909192 -3537925 4546182 -1545227 -8359270 -2293627 4627186 -377214 -6843236
10464 -6843236 -2824437 2809108 -651889 -5374513 -1880183 2439262 -1123456 -5504694
10456 -5504694 -2412304 1664507 -898247 -3817357 28017 4175904 1236527 -2758985
10448 -2758985 -194549 3800769 1934775 -1429410 249619 2757186 83783 -3259005
10440 -3259005 -963453 2817150 1530935 -1613735 -671530 1544605 -232371 -3088105
10432 -3088105 -1977029 283795 -1018205 -2959400 -1008622 1618201 54837 -2653291
10424 -2653291 -1339448 1469096 603785 -2031122 -1651065 277714 -334352 -1907971 -800806
10415 -800806 1012814 -145994 -2101915 -921960 1326465 499077 -1684570 -1108666 851038
10406 851038 292901 -1589738 -1075161 831400 678283 -604631 130268 1791518 1231164
10397 1231164 -481452 -176296 1287431 963364 -334602 83642 1216661 350173 -1439238
10388 -1439238 -1242223 166240 37589 -1051498 -735444 222654 -403732 -1552396 -718706
10379 -718706 1160626 1399713 440393 484193 1012922 182801 -1053315 -678262 225535
10370 225535 -588671 -2100482 -1825091 -410197 -199429 -824560 -436212 254083 -613590
10361 -613590 -2050525 -1782877 -479905 -426472 -1288836 -1118956 -282170 -494423 -1164690
10352 -1164690 -524009 734112 660929 -211649 8236 796996 207389 -1303071 -1603917
10343 -1603917 -703298 -478309 -1238126 -1626035 -1308361 -983499 -494005 492632 908160
10334 908160 -122665 -1273729 -1013451 -216587 -343150 -651869 101599 884570 203399
10325 203399 -885891 -571711 369444 25837 -1217429 -1682400 -1538361 -1974452 -2458859
10316 -2458859 -1760076 -583711 -382822 -665291 -183138 436309 -18865 -705983 -170126
10307 -170126 820939 678851 -10989 279730 1028294 781547 99166 437169 1147911 555310
10297 555310 -863073 -1233612 -444295 153263 388289 985272 1458451 893682 57633
10288 57633 241632 830742 446479 -418616 -375929 205993 33166 -557614 -394466 82278
10278 82278 -303389 -1012324 -750271 -48166 -336990 -1188007 -994653 210773 998117 1008348
10268 1008348 979678 958338 555389 243279 468307 429486 -394236 -793512 67951 660185
10258 660185 -430858 -1655961 -890277 832534 1022984 -102105 -411082 200703 68622
10249 68622 -704536 -418643 783210 948445 -182544 -786179 -263308 -47329 -749172
10240 -749172 -1162285 -625289 -41930 -49724 -206458 -337827 -801951 -1209339 -704536 356894
10230 356894 755745 425491 383589 747986 637469 2530 -251494 960 -49720 -530325
10220 -530325 -711285 -483555 -517243 -917064 -1049244 -666793 -71504 580154 1060996 696259
10210 696259 -604245 -1571898 -1116847 38171 545920 433305 502166 633796 294485
10201 294485 -80463 134178 349609 -205046 -828610 -460321 299592 91835 -922927
10192 -922927 -1491002 -1400292 -1403939 -1507883 -1078998 -275379 206469 401566 693184 746170
10182 746170 200315 -304637 -210572 -275430 -1202363 -1989954 -1355600 75195 759916 583539
10172 583539 455968 440389 124717 1237 548095 755688 -412994 -1838654 -1618664
10163 -1618664 -3871 1135278 1234810 1282649 1547200 1252754 396285 -111916 -137646 -424298
10153 -424298 -1037582 -1274441 -1039833 -892438 -887355 -670702 -424736 -489372 -485748 -17876
10143 -17876 345625 16363 -407187 -154423 316516 272917 142756 548619 882559 416728
10133 416728 -142431 119280 520885 -2255 -800280 -501104 684802 1486841 1642970
10124 1642970 1651676 1277303 187579 -688725 -360782 386094 241986 -312923 46442 952938
10114 952938 909536 -95052 -623341 -146898 515019 832447 926275 648986 -78584 -455361
10104 -455361 128249 783163 431794 -298522 -151828 560004 637724 173653 200384 754456
10094 754456 1082958 1218642 1621905 1838711 1207688 309817 105504 310548 178957 39424
10084 39424 425903 668044 117005 -259386 588403 1701339 1589129 784109 749763 1180736
10074 1180736 713143 -426096 -837439 -464509 -437735 -848934 -815541 -368988 -273135 -357921
10064 -357921 98365 797536 979326 915796 1144951 1064033 104185 -678568 -177625 623465
10054 623465 232051 -659041 -395644 646756 781192 -16601 -345644 -1356 84056 9242
10044 9242 594885 1337002 1041187 159672 205623 1120474 1423281 744379 129605 40774
10034 40774 -8688 -60677 275806 709765 687608 436717 292863 -119999 -742513 -431006
10024 -431006 1028169 1838925 901780 -167696 241892 956382 373135 -408561 318382
10015 318382 1482327 1127239 108750 514171 1703673 1427557 -105147 -726017 -95464
10006 -95464 314207 314687 862809 1497311 1050967 254339 590093 1338358 832935 -247528
9996 -247528 -60461 866916 656068 -265894 -41621 894707 620803 -413276 -71674 1384345
9986 1384345 1647968 540284 172714 1042710 1472495 928550 594965 667658 186586 -580260
9976 -580260 -529100 -116327 -490281 -924970 -118541 889514 344094 -747461 -269245 974405
9966 974405 673632 -573598 -306940 1172018 1389755 304132 162425 1199460 1520375
9957 1520375 904823 845855 1239327 790106 90374 587625 1378826 802972 26209 1044678
9947 1044678 2557334 2142542 953031 1558083 2758875 1647405 -701118 -948883 501260
9938 501260 684910 -174241 274788 1196609 175290 -1404547 -626193 1003634 184051
9929 184051 -1525868 -464953 1802198 1263414 -570433 576322 3117728 2293578 -513150
9920 -513150 -214598 2226168 2087779 728250 2668033 5233100 2733582 -1407030 385471
9911 385471 5153441 4218776 273402 2847181 8698807 6551762 529967 5231478 16081450
9902 16081450 13569298 4063088 22264085 74318188 110833022 86877137 25674027
9895 25674027 -12260198 -8041672 4905310 894127 -7903566 -5440255 485440 -1663762
9887 -1663762 -5816963 -2944151 1669013 149758 -3296867 -2005983 605825 -808111
9879 -808111 -2894031 -1076918 1133739 -674080 -3194951 -2131361 -274837 -1322776
9871 -1322776 -2469566 -373851 1854651 539644 -1590857 -868140 460866 -828038
9863 -828038 -2423038 -1156204 641459 -434400 -2445085 -1937981 -194136 -131690 -709686
9854 -709686 288734 1382490 371159 -1059013 -481270 644211 26416 -883738 125561
9845 125561 1441909 504401 -1425023 -1672039 -842990 -1008153 -1574700 -950326 -103270
9836 -103270 -636304 -1374903 -496196 916206 861973 20741 116185 632759 287993 -163653
9826 -163653 374151 786844 -163374 -1141278 -516210 590342 354169 -572739 -684328 -479478
9816 -479478 -967345 -1256708 -367951 444342 -155778 -1023561 -717106 -211324 -771893 -1238654
9806 -1238654 -270913 773432 202250 -742364 -114253 1068995 664939 -678748 -789684
9797 -789684 154793 313199 -319061 -289550 276919 82829 -570276 -297724 626416 737005
9787 737005 84929 -81500 140370 -409544 -1488609 -1658619 -749759 17165 160683 253902
9777 253902 378331 83209 -372822 -373006 -191945 -429400 -720381 -450518 -106047 -434364
9767 -434364 -966602 -881810 -607102 -1016166 -1753291 -1900209 -1622092 -1639753 -1760952 -1443773
9757 -1443773 -1139865 -1567443 -2257070 -2249707 -1659524 -1229154 -970300 -510776 -114229 -134729
9747 -134729 -166495 123511 132693 -577365 -1232862 -1074888 -679568 -845090 -1148060 -865565
9737 -865565 -360628 -281773 -337043 -83590 57975 -250214 -396689 -55561 -44981 -727975
9727 -727975 -959199 -40013 751177 226590 -565234 -139010 815425 704058 -201183 -450550
9717 -450550 -15979 -21499 -506174 -546947 -144823 -30622 -303 665465 1464308 1197252
9707 1197252 11553 -770268 -675992 -392160 -276479 -53378 204595 163752 80982 359419
9697 359419 618126 360590 34645 214913 387005 -128823 -756390 -622454 -231999 -611983
9687 -611983 -1426145 -1602305 -1275301 -1386950 -1822184 -1693138 -1098175 -842006 -725589 83647
9677 83647 1195044 1346803 560669 156729 534260 660909 8449 -601748 -461246 78059
9667 78059 485289 722575 764162 476728 144557 169676 238338 -249142 -1015528 -1225239
9657 -1225239 -869452 -750326 -1152715 -1594752 -1822258 -1994850 -1968530 -1438599 -707198 -315190
9647 -315190 -89680 413896 785075 242702 -942183 -1697236 -1687151 -1450650 -1198273 -724052
9637 -724052 -362347 -693923 -1322912 -1253286 -508157 -85122 -264782 -309209 36430 125376
9627 125376 -245768 -403768 -90954 38247 -340726 -615215 -364607 -77652 -228629 -537934
9617 -537934 -637870 -658997 -710780 -538424 -105581 179734 160805 175975 344237 330002 75576
9606 75576 11994 257971 366097 165593 95206 372949 603740 574199 653362 967245 956100
9595 956100 313762 -321792 -262292 196364 293539 -76203 -421667 -504177 -467581 -323703
9585 -323703 56077 501931 655163 544195 581263 902381 1136563 1004866 781542 864585
9575 864585 1135305 1143440 859629 800947 1264718 1816193 1830696 1273747 593453 67941
9565 67941 -298229 -386796 -16856 607125 981701 921946 718197 668222 828619 1153188
9555 1153188 1417563 1133567 141241 -803134 -743741 183144 935862 1038899 961655 950749
9545 950749 587390 -126519 -343858 318712 960625 638554 -311728 -948352 -1059542 -1031305
9535 -1031305 -935970 -600109 -218369 -140074 -281570 -346663 -379520 -582318 -847737 -930138
9525 -930138 -827438 -649115 -427800 -321858 -551916 -871717 -662150 133265 785881 840443
9515 840443 696008 710059 512365 -181992 -805079 -723717 -230517 -26382 -184937 -306158
9505 -306158 -276769 -243016 -193940 -105288 -114631 -126381 254091 958354 1222724 624320 -247176
9494 -247176 -671537 -722472 -763915 -695643 -339976 28998 166227 268827 349943 -78250
9484 -78250 -1044504 -1615659 -1148577 -331841 -117456 -292884 -76117 468111 677941 548895
9474 548895 671172 1110317 1283910 904352 336269 50716 207025 634055 885705 598692
9464 598692 45930 -111653 178271 260607 -102950 -362218 -276898 -378369 -789772 -654360
9454 -654360 475586 1645110 1785092 1165155 698243 610373 670708 921664 1266930 1113966
9444 1113966 309303 -360911 -407146 -420335 -765084 -639706 448145 1423720 1199787 428991
9434 428991 240187 246003 -514336 -1515271 -1489944 -651184 -312270 -663144 -724734 -288790
9424 -288790 -138597 -408819 -398354 -61342 -128054 -639378 -829557 -619478 -834662 -1716912
9414 -1716912 -2486784 -2624827 -2447584 -2213844 -1738405 -1092574 -710086 -630252 -492303 -326515
9404 -326515 -517387 -1011934 -1369866 -1488827 -1515205 -1296293 -745516 -390783 -653626 -1005935
9394 -1005935 -811591 -481417 -677805 -949789 -483807 292661 338833 -139442 -24995 720945
9384 720945 983272 371192 -309230 -492699 -395452 -122133 426789 784950 389582 -249011
9374 -249011 -194123 250170 -5287 -840393 -1013627 -268040 302564 147988 -94342 -80257
9364 -80257 -290062 -760116 -805118 -366864 -207359 -445834 -339979 185676 267911 -333749
9354 -333749 -880276 -1121322 -1549674 -1919593 -1258862 188140 826261 153821 -426882 -10976
9344 -10976 375647 -259840 -1146863 -1193438 -746235 -657070 -783893 -633202 -460229 -598627
9334 -598627 -640595 -323379 -292981 -969574 -1583134 -1371755 -846788 -809395 -953116 -553201
9324 -553201 173730 492992 358251 225879 198834 213129 505670 1061386 1176909 423215
9314 423215 -484243 -577766 91360 781990 1117177 1106306 688261 -4337 -433446 -384017
9304 -384017 -383112 -782505 -1047612 -635390 66336 418667 517235 698038 674274 84762 -572181
9293 -572181 -506050 152059 549104 327580 -86487 -253101 -138630 111408 304839 230460
9283 230460 -69919 -249650 -157381 -89926 -297673 -619246 -834508 -912996 -703328 15771
9273 15771 877032 997865 149126 -766140 -867434 -352217 51191 80683 -99751 -343176
9263 -343176 -396051 112862 1028560 1536969 1187975 540813 309552 421132 441819 373317
9253 373317 428206 490379 374054 208961 81468 -253942 -826207 -1090040 -630988 191676
9243 191676 766213 972417 994819 849068 514415 131764 -246041 -664172 -862788 -502071
9233 -502071 48894 -14475 -614036 -739963 -118781 220891 -297098 -696661 -101171 629001
9223 629001 232042 -815504 -1005992 -176936 358320 -66265 -661390 -680706 -466130 -553270
9213 -553270 -700928 -406760 209958 599879 552616 344328 222973 55046 -411681 -1028938
9203 -1028938 -1226958 -703074 60459 326524 4970 -449550 -875646 -1440533 -1881799 -1590957
9193 -1590957 -650707 59784 91668 -74352 -69507 -231386 -686350 -819786 -327635 111415
9183 111415 -16259 -115297 406027 895824 439700 -524367 -773326 -139933 364000 132348
9173 132348 -360389 -490999 -233063 129659 367484 293463 -108276 -521524 -639295 -562999
9163 -562999 -542277 -556217 -506312 -521564 -687357 -802353 -774805 -857633 -1108573 -1114485 -701585
9152 -701585 -354122 -382387 -288478 353795 983022 849794 252309 66976 389376 547372
9142 547372 235188 -218371 -534886 -655462 -428679 87587 248129 -394889 -1130103 -868093
9132 -868093 201434 760089 267938 -305779 568 793200 1058673 619650 178521 181097
9122 181097 254200 -148168 -900948 -1282959 -867858 -66997 436200 558877 679536 781016
9112 781016 438221 -242135 -478368 19814 495543 290549 -149832 -97424 255836 257415
9102 257415 -1878 110184 569307 600528 -185645 -1239863 -1738770 -1346357 -340840 620530
9092 620530 934499 564941 3498 -426920 -837744 -1151205 -868660 62432 807769 737794
9082 737794 376736 505540 884180 775837 271959 63302 209072 209624 115779 451254
9072 451254 1062394 1157676 637948 358044 796307 1388612 1521858 1331631 1086275 566510
9062 566510 -365038 -1166102 -1218074 -684495 -239715 -174090 -234708 -204236 -176864 -249276 -316590
9051 -316590 -330564 -506784 -994277 -1427641 -1197557 -325922 311483 17088 -775050 -1110559
9041 -1110559 -839411 -618939 -719703 -711060 -411003 -194453 -108341 321257 995681 1015898
9031 1015898 172145 -375551 244947 1205163 1219616 390523 -311762 -703871 -1238496 -1693812
9021 -1693812 -1384714 -478866 148126 291633 513194 916361 966802 579354 300156 281399
9011 281399 86501 -325642 -407110 -39251 182005 -24188 -157384 136549 410937 121323
9001 121323 -562387 -1031734 -966768 -555876 -260072 -418676 -849296 -969141 -596092 -299916
8991 -299916 -516248 -763378 -414181 187335 246777 -174205 -341914 -120646 -35324 -184030
8981 -184030 -127443 179355 374733 575801 1190242 1842893 1673793 827738 430263 854130
8971 854130 1250334 1119952 1035002 1289231 1162368 292040 -406190 -114560 578589 713587
8961 713587 438699 425550 547170 266962 -173513 -81042 471875 760132 550336 237530
8951 237530 -15201 -408458 -832222 -872392 -555200 -405676 -661607 -986402 -1040892 -839687
8941 -839687 -482920 -29773 270985 106148 -375070 -556506 -97792 602575 904793 691751
8931 691751 422162 525706 946923 1301166 1344777 1187292 1074689 1105860 1220078 1305453
8921 1305453 1175230 603037 -354697 -1159580 -1227558 -580068 188256 579307 571698 388219
8911 388219 244794 356622 811245 1319194 1416950 1045028 630776 495015 503242 433312
8901 433312 326018 258603 109680 -149937 -188674 301064 1054281 1391982 953802 76292
8891 76292 -603881 -793425 -708068 -654380 -607979 -357455 10628 78669 -328411 -829547 -987256
8880 -987256 -868786 -797904 -778432 -578111 -250349 -125381 -313281 -608283 -865525 -1094015
8870 -1094015 -1207201 -1092445 -921328 -954536 -1018192 -662415 49956 414353 -12014 -781935
8860 -781935 -1139822 -934292 -613716 -488211 -346037 171713 1012996 1652201 1612695 1011615
8850 1011615 447894 305668 374904 286713 44080 -149295 -314616 -544034 -620864 -309080
8840 -309080 48522 -205586 -1068728 -1681699 -1366517 -484413 55688 -112840 -574531 -863763
8830 -863763 -1020308 -1250178 -1320603 -730934 435767 1276888 1085783 316581 -34619 157384
8820 157384 118935 -409068 -673300 -203873 306609 110121 -356664 -226507 333004 395460
8810 395460 -268162 -966140 -1203570 -1142253 -958808 -568027 -93486 70863 -178579 -524025
8800 -524025 -683938 -580627 -177511 382785 692830 646175 757218 1285774 1489629 641779
8790 641779 -596442 -940976 -405452 -195002 -702989 -983180 -468317 158980 333355 562017
8780 562017 1244344 1642703 1016260 -19575 -296145 260136 715256 515787 -51760 -568333
8770 -568333 -897526 -990433 -878659 -815235 -974724 -1109636 -895022 -479634 -297752 -430430
8760 -430430 -523267 -302531 118310 443164 512974 424391 412590 576564 737851 684572 466845
8749 466845 247118 -964 -319697 -437111 -64859 528345 732041 397193 -42376 -249007
8739 -249007 -280306 -218812 -70264 -60070 -424356 -845147 -742113 -216270 10621 -252646
8729 -252646 -361634 51178 471196 425602 244881 354076 476326 187213 -274634 -424153
8719 -424153 -337931 -379013 -445632 -183212 242908 243047 -344997 -994777 -1128184 -696950 -134619
8708 -134619 40810 -371621 -1065535 -1493848 -1416135 -1060349 -720464 -441514 -181319 -14034
8698 -14034 -41154 -282261 -677875 -994809 -822055 -6935 978375 1502256 1509765 1335309
8688 1335309 946160 46573 -1088144 -1636105 -1253049 -451420 154227 348625 32530
8679 32530 -757194 -1402478 -1147535 -248518 178715 -243654 -643839 -387852 -60978 -330516
8669 -330516 -774328 -676202 -243288 -150908 -440574 -686926 -768277 -722887 -350623 280096
8659 280096 453692 -234888 -1025600 -975374 -358566 -136403 -388600 -326803 296544 838992
8649 838992 860571 651264 529156 384901 113262 -131238 -291612 -519521 -807136 -932033
8639 -932033 -821840 -589587 -229029 320586 840047 958912 605981 34283 -485577 -721045
8629 -721045 -488323 7453 128184 -444641 -1197631 -1503884 -1490832 -1586517 -1598696 -1082678
8619 -1082678 -384801 -347565 -966286 -1275289 -763173 -59842 98261 -144526 -208998 76410
8609 76410 498519 864541 1006935 777694 371394 273641 565528 676415 202268 -420797
8599 -420797 -531358 -209758 -59225 -211780 -214073 71227 127335 -354073 -813952 -550593
8589 -550593 195163 499031 54775 -406735 -196167 383148 559801 181217 -224529 -256103
8579 -256103 -1266 306978 515547 458113 77994 -333707 -392936 -112036 184191 319382
8569 319382 266774 -105549 -760679 -1152679 -817765 -175984 -5037 -230406 -133786 273740
8559 273740 186709 -496739 -802217 -275573 200885 -99497 -491896 -43080 878500 1269742
8549 1269742 1044186 820269 665685 196663 -372313 -391971 115241 483210 488496 520463
8539 520463 678532 560157 49877 -405395 -436429 -104417 398108 855282 899784 361014
8529 361014 -315473 -558737 -472100 -553315 -798622 -813218 -680066 -864515 -1241156 -1111151
8519 -1111151 -376702 145814 -88842 -600823 -727827 -566831 -557632 -635001 -396977 152820
8509 152820 570387 585739 346112 58274 -295943 -802340 -1350758 -1667248 -1608922 -1343343
8499 -1343343 -1142370 -1033613 -813855 -412522 -24473 182942 265446 318433 337184 338383
8489 338383 356592 280195 32231 -86158 264048 727213 534207 -282378 -723485 -249640
8479 -249640 441859 609433 570681 816456 850851 33778 -988303 -972334 39886 755268
8469 755268 504608 -70764 -307116 -374679 -543596 -558082 -193640 257820 458292 463583
8459 463583 439931 409106 418455 503348 453232 136749 -10118 505771 1288358 1425158 850120
8448 850120 442919 608908 726624 358977 50547 336039 767382 654731 179526 20718
8438 20718 286226 527836 543720 505894 438875 155365 -314044 -658711 -663845 -371198 76744
8427 76744 519964 792283 852208 826860 804033 720125 552425 413378 322153 115495 -244750
8416 -244750 -509311 -499603 -420639 -553408 -769957 -651588 -93294 449550 459620 25873
8406 25873 -182204 263117 898966 867340 60889 -665531 -621484 -143935 48985 -98033
8396 -98033 -179448 -214144 -526823 -875947 -588232 289192 794338 371644 -290086 -245797
8386 -245797 386353 701189 328331 -140613 -38047 542247 954663 787721 249931 -134429
8376 -134429 -53519 371409 746010 694482 137184 -532005 -678258 -140690 388481 138782
8366 138782 -624426 -857041 -210278 472039 439878 43570 -101257 -201578 -703458 -1196771
8356 -1196771 -936962 -176899 65362 -478595 -995285 -863374 -411250 -204273 -289780 -401719
8346 -401719 -366647 -103765 343266 672690 613398 349070 272161 415664 545216 628154
8336 628154 733946 723060 572987 666434 1101192 1151393 286228 -692502 -617811 239782
8326 239782 584970 154719 -45306 364664 513064 -45005 -432955 78437 858808 944127
8316 944127 377227 -159132 -271602 135631 987972 1672380 1372969 268445 -455933 -236632
8306 -236632 193437 217077 262019 651485 740921 125083 -407081 -185191 110564 -284588
8296 -284588 -702146 -170669 755656 845343 288678 324177 1080897 1423692 911254 355775
8286 355775 224790 -96888 -1006610 -1812051 -1744914 -1029495 -427691 -292769 -435183 -489158
8276 -489158 -208674 260819 430481 152792 75 409623 827474 525676 -47095 201942
8266 201942 1221528 1705315 926047 -368299 -1157975 -1279902 -1032318 -590621 -233279
8257 -233279 -315718 -604463 -419108 204418 360757 -299712 -946405 -932276 -790665 -1097080
8247 -1097080 -1291403 -668826 228256 419241 142011 381048 1037532 982885 -17759 -795916
8237 -795916 -548625 67737 158671 -128101 -270771 -454619 -1052849 -1598105 -1282277 -244126
8227 -244126 535471 541568 129043 -345399 -931238 -1463926 -1391639 -644914 -10932 -108544
8217 -108544 -506484 -450849 -39004 56826 -207002 -132364 589610 1358086 1517835 1184587
8207 1184587 896188 856416 891691 873830 800902 595641 158288 -394622 -757935 -725381
8197 -725381 -360675 84332 370286 451501 481079 557167 503551 84272 -561370 -942830
8187 -942830 -786381 -387806 -242429 -429487 -511120 -43417 850724 1453412 1110842 -33172
8177 -33172 -1151678 -1682637 -1843314 -1944337 -1639842 -489778 979849 1614894 1106172
8168 1106172 345730 90099 47789 -295850 -691029 -608763 -182116 64330 96847 275969
8158 275969 578107 610695 345737 208313 395293 645804 763115 866370 987037 851046
8148 851046 277309 -492023 -1032379 -1124030 -834631 -418199 -168892 -170196 -174540 60916 344785
8137 344785 223494 -411939 -1173861 -1666931 -1839231 -1791232 -1565464 -1274921 -1147660 -1222927
8127 -1222927 -1210364 -873871 -393554 -121989 -120373 -192738 -276842 -476356 -692712 -569897
8117 -569897 7229 587556 596536 27541 -557482 -719018 -589170 -540802 -622876 -534743 -96418
8106 -96418 452404 685874 458731 87218 39181 425949 846589 804849 235346 -475428
8096 -475428 -906306 -879055 -433337 181034 518351 296123 -202727 -424836 -288597 -214583
8086 -214583 -345555 -299030 74185 306455 105276 -63959 236806 579199 340499 -191961
8076 -191961 -214381 345962 813900 849480 708652 498117 39783 -487447 -621222 -445545
8066 -445545 -538841 -954867 -1083186 -728826 -483830 -708995 -945376 -734247 -304620 -34504
8056 -34504 98917 122970 -200324 -792812 -1047844 -679476 -189133 -27747 71731 412915
8046 412915 650984 430704 132554 270352 604872 577944 264258 176892 385463 492065
8036 492065 321617 88303 10260 160833 484768 643564 216577 -582334 -873166 -272327
8026 -272327 424342 314411 -348445 -675400 -502352 -400810 -579396 -607938 -187253 473331
8016 473331 1030428 1247617 972273 349185 -104562 -75927 142782 243235 452471 908632
8006 908632 997185 162095 -988260 -1367166 -1000371 -886439 -1299685 -1342878 -460647 577241
7996 577241 716138 -15972 -696866 -679561 -179737 109298 -199584 -687785 -522627 427677
7986 427677 1173580 777700 -343300 -956757 -645621 -104523 99019 137875 187707 10250
7976 10250 -381325 -434193 108863 710401 822673 622434 511983 408259 66425 -293863
7966 -293863 -276220 7384 84678 -123944 -154625 349026 1128479 1554603 1267775 526891
7956 526891 -73506 -233379 -198203 -304997 -476677 -410642 -93262 235068 522056 887111
7946 887111 1191252 1079757 532844 -24719 -265923 -258580 -150344 44634 223465 157646
7936 157646 -136507 -331468 -278619 -241131 -433331 -641894 -567833 -299056 -153343 -205531
7926 -205531 -242479 -117685 76201 188726 201543 174172 76029 -211955 -671755 -1031276
7916 -1031276 -1058304 -926257 -1009976 -1291009 -1327123 -943770 -544636 -485945 -563763 -481069 -404996
7905 -404996 -573980 -715484 -449918 -13994 59170 -183802 -207945 141553 511419 729998
7895 729998 958372 1141929 993964 624429 525688 764510 811341 394649 -62070 -129683
7885 -129683 35556 103456 94972 144791 136606 -54327 -242131 -175510 107199 391499 539471
7874 539471 469070 147940 -216085 -249400 122506 513530 554156 311622 83978 14116
7864 14116 89320 309518 634399 880469 846738 500598 -31052 -587028 -1034384 -1245589
7854 -1245589 -1062510 -393291 496343 902252 302696 -854507 -1460171 -1064628 -380724
7845 -380724 -145715 -110657 254223 644736 368151 -464178 -1097812 -1269514 -1267969 -1027623
7835 -1027623 -191219 899747 1313371 846456 328741 348890 536291 415702 133570 -49469
7825 -49469 -205928 -267479 134486 879039 1134319 495018 -280179 -270738 386239 884887
7815 884887 921722 843552 904138 948304 738890 254810 -238946 -307692 187753 696548 506572
7804 506572 -245416 -669700 -385174 -7435 -101304 -375172 -358838 -205433 -254850 -353306
7794 -353306 -193997 114743 358708 671851 1173540 1561055 1537338 1229330 770697 9818
7784 9818 -882402 -1145109 -433530 461055 635350 316575 282026 521653 436149 35547
7774 35547 -106924 18978 -200235 -865155 -1282130 -1022767 -500038 -243770 -254020 -326780
7764 -326780 -439534 -530468 -387949 -54124 56874 -284287 -758285 -915062 -701833 -406990
7754 -406990 -316052 -561519 -1081740 -1578987 -1700710 -1402670 -1025336 -938597 -1190303 -1510984
7744 -1510984 -1578452 -1303513 -928805 -782379 -884877 -939838 -776311 -582291 -562804 -598808
7734 -598808 -443508 -70573 342889 582048 425384 -178780 -787250 -697982 177511 1012480
7724 1012480 989013 226282 -556443 -949185 -989208 -742627 -311498 -31708 -102354 -184483
7714 -184483 82755 337671 -96279 -1118436 -1817675 -1610690 -855479 -216107 60955 61037
7704 61037 -143318 -492091 -878822 -1259227 -1601260 -1692004 -1302712 -614887 -167639 -264615
7694 -264615 -672007 -966732 -940013 -623391 -202389 11396 -220869 -770354 -1198025 -1164707
7684 -1164707 -684258 -31359 444112 516894 315049 239420 433882 511446 111924 -469123
7674 -469123 -635028 -331140 -38047 6047 23225 121903 103560 -19946 88268 430220
7664 430220 462732 -69478 -577115 -394189 268734 698187 740970 846619 1137816 1143314
7654 1143314 632260 101086 38367 140373 -210421 -898755 -1099897 -398186 620635 1106700
7644 1106700 899221 474653 262130 362962 715843 1121037 1220561 864812 430576 368698
7634 368698 505804 279987 -336889 -719979 -526495 -183931 -178519 -362328 -328681 -60725
7624 -60725 190679 332537 332608 6206 -661712 -1208051 -1128235 -476454 282332 801891 926106
7613 926106 546857 -152130 -549216 -202937 506841 826385 601811 319905 272926 242869
7603 242869 56697 -77272 39978 273958 420846 497003 578733 585072 417608 191102
7593 191102 159077 415478 728644 731199 351176 -10157 67499 424677 500958 152314 -142943
7582 -142943 -59457 92765 -12930 -114489 133280 459681 392173 82021 63090 363279
7572 363279 526937 450258 528010 931168 1346380 1527365 1549480 1403569 900922 187541
7562 187541 -160555 133503 585198 527070 -77688 -649906 -679783 -214349 268701 369905
7552 369905 143268 -73727 -164895 -332194 -633880 -810837 -789881 -907488 -1248758 -1254678
7542 -1254678 -591992 16806 -342442 -1322789 -1663890 -975051 -221854 -240170 -655359 -660509
7532 -660509 -117431 597022 1228736 1595236 1366732 468914 -547374 -979827 -677773 -45855
7522 -45855 409814 360567 -176861 -715653 -674319 -107618 284312 92156 -284191 -346157
7512 -346157 -253704 -420231 -735973 -762551 -494865 -369077 -562690 -761503 -667111 -373343
7502 -373343 -158175 -161148 -346354 -607872 -836523 -955961 -911819 -645326 -200800 132287
7492 132287 5762 -549002 -1073612 -1218611 -1130998 -1127276 -1165162 -894317 -170256 681613
7482 681613 1135268 945577 405879 117030 382944 863494 997980 702334 356984 156881
7472 156881 -80087 -370572 -359647 43911 299145 -30407 -518575 -441670 83091 195588
7462 195588 -419090 -990049 -716047 120448 563875 256609 -222277 -257055 74195 357636
7452 357636 517192 743921 967825 864628 390776 -91108 -318205 -407607 -500468 -488041
7442 -488041 -293965 -80439 78835 370127 763110 755003 66884 -717302 -795265 -253515
7432 -253515 79958 -184071 -583798 -608307 -314424 2719 246592 427284 516720 552558
7422 552558 591797 532662 310670 194972 432987 682109 376838 -355112 -795644 -693989
7412 -693989 -499700 -442736 -221540 140496 36126 -656657 -1097034 -709425 -135585 -206886
7402 -206886 -630250 -580118 -75902 197981 82870 -34983 -151268 -552677 -897873 -472189
7392 -472189 523556 973123 432159 -223999 -171251 214125 185125 -137869 -161739 35954
7382 35954 -133499 -633951 -697900 540 748986 709299 -14096 -612629 -627826 -342149
7372 -342149 -178211 -130047 30806 253862 226016 -156689 -598438 -752883 -576105 -243984
7362 -243984 100501 366057 421680 211041 -59829 -40534 381370 904694 1106682 898865
7352 898865 611788 559023 589715 282745 -369685 -786927 -579521 -232938 -529055 -1380747
7342 -1380747 -1823264 -1276946 -258868 412496 591746 601813 526192 249345 -72986 -125531
7332 -125531 114150 456114 854522 1244764 1244077 592147 -217990 -383865 100947 403398
7322 403398 48910 -436001 -342391 279188 856321 1079328 1056293 959239 889493 924146 1005265
7311 1005265 938375 722361 657254 869883 996805 688990 205197 73007 305477 432866
7301 432866 262847 106158 187029 324041 359967 439182 593869 492515 -4429 -382243
7291 -382243 -67859 702332 1139121 955634 620847 507783 356640 -171797 -877542 -1307643
7281 -1307643 -1322536 -1023772 -434598 314412 745297 520635 47587 31069 451362 591323
7271 591323 169167 -223996 -114136 65321 -290541 -897040 -951112 -353138 155515 84507
7261 84507 -230189 -313129 -238093 -311173 -494148 -536454 -416404 -288079 -176225 -55910 -70064
7250 -70064 -318960 -565268 -523102 -345029 -404256 -633964 -561687 -70800 365586 400824 296756
7239 296756 387327 476123 191312 -350104 -699573 -735017 -726401 -833940 -930689 -876220 -648455
7228 -648455 -288819 622 -107696 -581012 -825626 -446313 61179 2122 -371863 -228804
7218 -228804 433083 715911 293817 -66944 171444 456241 180352 -284068 -312610 -73865
7208 -73865 -62228 -185197 -131017 -125483 -471293 -779000 -536584 -72660 -68418 -448096 -659041
7197 -659041 -716122 -966171 -1097131 -502714 495864 929450 662781 466307 570785 365243
7187 365243 -259526 -504507 -20816 449055 327211 83242 239598 410682 59747 -521041
7177 -521041 -716898 -523267 -357044 -409204 -664227 -1070516 -1307945 -957122 -247887 18668
7167 18668 -363371 -678168 -495086 -295750 -397307 -259240 418203 893054 583317 166854
7157 166854 446422 934652 733152 110571 -82267 -4003 -442301 -1213469 -1356295 -756976
7147 -756976 -232489 -52644 300208 852371 929329 415888 11625 -31587 -276308 -898372
7137 -898372 -1246623 -997222 -683730 -626728 -361144 346334 885176 807710 555556 547901
7127 547901 406370 -192272 -696682 -559171 -278480 -650608 -1428940 -1617991 -851188 252496
7117 252496 908732 768709 -16326 -757255 -575628 581173 1558890 1271656 84711
7108 84711 -752679 -772508 -573537 -610842 -639346 -468016 -393419 -553031 -541465 -103384 310571
7097 310571 160609 -348082 -512903 -42361 661641 1044557 922549 500850 112364 -31834
7087 -31834 37560 154657 262353 444244 655853 612890 150015 -424951 -610952 -346218
7077 -346218 -83872 -149818 -309229 -184563 138110 279165 235518 437353 1039602 1557813
7067 1557813 1461714 853927 266197 -15643 -97334 -85178 75787 361718 557497 466111
7057 466111 89067 -400230 -757496 -827181 -729204 -749779 -897532 -785934 -198161 480841
7047 480841 751885 695642 726427 835612 656097 227741 67651 366026 690896 694798
7037 694798 586179 630718 671953 498296 289198 302823 402678 266457 -126297 -518229
7027 -518229 -725837 -724865 -534206 -205922 198674 696372 1227021 1418682 925626 92989
7017 92989 -244435 125739 426537 14246 -669733 -806185 -402769 -118891 -178788 -184144
7007 -184144 92349 391881 466447 340680 44269 -421196 -807395 -777410 -402210 -94158
6997 -94158 -21293 4630 57577 -30108 -276250 -458318 -470051 -386097 -200984 43305 -47543
6986 -47543 -776139 -1597546 -1548131 -604552 148797 25568 -372140 -265608 57253 -144055
6976 -144055 -772503 -1105115 -985222 -918984 -1087610 -1086390 -702737 -249777 -1998 101049
6966 101049 77724 -169457 -397004 -100084 688547 1226532 1026009 521299 391817 627291
6956 627291 724026 517561 321770 370450 554355 682716 668319 458168 67813 -285255
6946 -285255 -312413 19374 436745 683681 799030 1012557 1380327 1580520 1208014 357683
6936 357683 -279347 -168876 356150 529768 227346 80518 444890 870714 897669 787822
6926 787822 965340 1179679 855489 23627 -705508 -964366 -870295 -542739 47637 724281
6916 724281 1092163 973467 527936 -33382 -521206 -666954 -368301 45094 201899 217982
6906 217982 384468 528107 290578 -104211 -97768 219592 166369 -400264 -821560 -694945
6896 -694945 -381440 -175996 195604 834378 1214104 1001170 629463 495516 263976 -383472
6886 -383472 -967963 -947162 -666148 -727887 -862065 -344536 718717 1417544 1244322 537851
6876 537851 -162290 -524829 -348703 211152 462397 -86009 -928158 -1189586 -869137 -667341
6866 -667341 -734888 -516371 153441 726445 864041 852754 923511 935040 893242 994066 1000940
6855 1000940 441597 -380838 -516709 191986 788164 722518 650082 1106106 1443322 951154
6845 951154 130621 -164863 -124328 -397790 -705603 -264289 741200 1342301 1287445 1175649
6835 1175649 1149692 688391 -159328 -556668 -259545 -100822 -575515 -962278 -547806 152317
6825 152317 243348 -160220 -335941 -267847 -551807 -1201951 -1525625 -1221641 -781631 -652123
6815 -652123 -692986 -660618 -594692 -474422 -87006 422732 419356 -341824 -1120830 -1024374 -172278
6804 -172278 513122 537866 290393 262117 369752 272276 -17376 -153044 46424 338414
6794 338414 303985 -178652 -697112 -652324 19117 607742 378894 -520006 -1220232 -1179078
6784 -1179078 -700556 -360264 -320408 -399855 -469190 -499361 -449568 -358289 -377780 -529067 -601509
6773 -601509 -456938 -226278 -51005 119437 299673 337700 244178 336541 752621 1121086
6763 1121086 1073691 807561 732789 821989 784380 672668 772095 1000022 970489 632663 328617
6752 328617 206330 78928 -102849 -167261 -195985 -528248 -1090395 -1228994 -532767 533995
6742 533995 1128192 914887 232308 -380257 -577350 -324316 130729 461966 545779 481975
6732 481975 389124 359031 523856 858793 962548 432914 -477861 -978017 -646813 98744
6722 98744 575616 549548 247981 -8092 -13063 207647 357369 194814 -63183 -17951 214195
6711 214195 88399 -443803 -677928 -163155 547172 628288 96783 -331314 -260769 26459
6701 26459 143766 70387 4073 32724 26577 -225054 -707670 -1025774 -817452 -367139 -392231
6690 -392231 -1031632 -1510474 -1159999 -344566 96299 -26802 -251133 -323426 -405101 -501892
6680 -501892 -345320 59049 307686 204262 64270 214348 533349 713547 711568 701742
6670 701742 747401 731600 543583 195909 -212306 -571828 -807657 -859714 -633914 -63228
6660 -63228 718872 1364090 1588128 1421488 1101187 770305 366205 -226360 -937366 -1394084
6650 -1394084 -1150681 -244270 563077 463051 -418942 -1096499 -896677 -159717 410091 613568
6640 613568 644962 564085 359219 216300 233016 120085 -331339 -746710 -665471 -295803
6630 -295803 -170759 -258069 -98436 296379 437620 235838 112911 171747 62508 -152836
6620 -152836 130368 966127 1462518 1025395 298114 215894 707703 1058090 1076430 1093583
6610 1093583 1121359 863943 414938 155064 32354 -292480 -627244 -403748 271252 586418
6600 586418 291667 141369 641638 1141926 817526 -49937 -537481 -428935 -295469 -424278
6590 -424278 -462378 -155839 218925 301790 34353 -495130 -1131354 -1498265 -1256462 -657632
6580 -657632 -375387 -598796 -752960 -365235 241046 463563 262559 69875 92907 121545
6570 121545 -69399 -438083 -748681 -737700 -309319 283072 585634 397629 -80627 -594177
6560 -594177 -1030928 -1205262 -885907 -257841 95872 -17247 -88333 237011 513898 266879
6550 266879 -78686 214311 982289 1357568 1034808 525491 177346 -231711 -794556 -1134642
6540 -1134642 -1023764 -736922 -545338 -369888 -130084 64414 230557 504240 678160 320206
6530 320206 -459470 -949393 -793353 -448427 -427854 -651007 -840120 -988752 -1075182 -850149
6520 -850149 -321839 13658 -177785 -607436 -882312 -1011666 -1056000 -807922 -263714 83133
6510 83133 -89058 -394433 -341352 -52370 80253 30635 -54279 -261172 -616487 -789918
6500 -789918 -593895 -371517 -398021 -362226 18563 378344 320457 138627 211108 187741 -391151
6489 -391151 -1113380 -1245291 -902890 -727287 -713210 -387059 103909 205197 109097 482024
6479 482024 1040819 713218 -522073 -1244266 -571782 583167 933203 541438 300252
6470 300252 419901 382090 8237 -283479 -177071 190525 547469 761932 834428 846288
6460 846288 841800 689143 256691 -271323 -580188 -702726 -866468 -895501 -392149 397467
6450 397467 641668 124710 -335924 -80744 473998 619047 389587 185684 -44228 -468659
6440 -468659 -691627 -274027 355400 391534 -91706 -252518 171989 512913 315747 -478
6430 -478 28871 148770 -51531 -346741 -244892 163312 316218 19336 -359886 -541575
6420 -541575 -686791 -944732 -1056724 -732104 -193040 34985 -158582 -303941 -4188 515803
6410 515803 698253 309161 -397083 -1024890 -1301443 -1087480 -438434 286086 604824 337410
6400 337410 -233279 -650357 -665841 -376500 -98285 -74204 -195354 -76513 458363 1060807
6390 1060807 1213620 827561 281866 -58644 -141108 -101703 -105405 -305944 -749610 -1311562
6380 -1311562 -1858738 -2363113 -2682591 -2458211 -1572991 -534197 41859 224640 563030
6371 563030 1130934 1347781 863994 99152 -329720 -307707 -128790 -60394 -215914 -543367
6361 -543367 -740742 -474275 143408 573980 492117 105001 -270711 -571860 -767318 -684530
6351 -684530 -319048 15026 102321 104164 203392 294691 269945 280050 423642 466736 173569
6340 173569 -323641 -744760 -1008439 -1133028 -1078414 -933097 -950200 -1125497 -1078154 -681024
6330 -681024 -447647 -831333 -1409522 -1319378 -428480 423779 421169 -338592 -1050061 -1080066
6320 -1080066 -539627 -62408 -77695 -374497 -467694 -245198 26573 226019 468122 676635
6310 676635 573319 197456 -88679 -263690 -730523 -1501638 -1941631 -1691694 -1228525 -1049597
6300 -1049597 -931732 -564526 -294229 -508617 -805748 -608226 -211115 -334869 -898766 -1129492
6290 -1129492 -746679 -201327 157854 318046 87896 -745411 -1692493 -1857993 -1109640 -198043
6280 -198043 381919 830053 1204849 1071521 354433 -255375 -225004 102788 157842 -35080
6270 -35080 -113022 13877 207579 368702 356440 41756 -334999 -323037 30938 183011
6260 183011 -7345 -48772 231686 281288 -187174 -565346 -313878 142509 182091 204
6250 204 60288 123180 -251546 -704322 -580062 -101902 -6312 -238616 -107649 362137 392043
6239 392043 -155496 -496105 -297579 -217539 -631849 -879649 -406030 256810 413599 350647
6229 350647 692084 1203533 1184292 674105 326926 292608 144423 -149373 -104071 304956
6219 304956 389944 -205811 -886994 -942138 -492099 -153683 -129249 -122062 36819 141068 -22658
6208 -22658 -370389 -626012 -555891 -105310 547373 1069163 1215229 1005614 629550 255318
6198 255318 8452 13271 263443 472072 263727 -373897 -958640 -1001284 -580281 -225569
6188 -225569 -191674 -126317 300464 689571 335474 -643397 -1190117 -634167 361012 676510
6178 676510 198152 -258458 -276331 -283174 -596619 -830875 -607372 -207845 -37768 52082
6168 52082 354905 616868 383476 -211071 -630668 -769660 -964100 -1226526 -1143308 -646671
6158 -646671 -264372 -337661 -485699 -174340 549980 1213476 1505559 1408005 997372 463260
6148 463260 139399 170539 259571 69052 -203996 -10777 756157 1472529 1449214 714983
6138 714983 -35738 -198277 191924 650851 822359 737835 563331 292170 -188247 -823719
6128 -823719 -1355125 -1564598 -1470611 -1275180 -1163126 -1117365 -918444 -448949 -24142 -160996
6118 -160996 -846554 -1340926 -1068210 -456206 -361845 -776615 -778445 86609 1042954 1106121
6108 1106121 376467 -203253 -90172 387372 671426 602296 383152 259086 296310 311933
6098 311933 77782 -279213 -291326 196350 655963 563872 237246 424174 1126900 1488613
6088 1488613 1019141 316825 187488 521823 590253 189313 -124574 50671 367832 287648
6078 287648 -134014 -375019 -221900 -46072 -231274 -601451 -651166 -247290 162376 102187
6068 102187 -369632 -790228 -846225 -618419 -352167 -195734 -168009 -195030 -131499 96912
6058 96912 321990 268241 -55941 -264326 -25984 528283 984513 1126311 1042079 816981
6048 816981 387159 -208039 -631731 -514711 96771 678427 670648 -4492 -846349 -1212275
6038 -1212275 -922530 -447073 -418501 -941111 -1483019 -1495717 -1006842 -489020 -270031 -268687
6028 -268687 -257386 -141459 79870 415525 789317 960159 724275 210734 -147632 -24623
6018 -24623 430728 714367 524710 146005 116325 498166 724721 339940 -338350 -598859
6008 -598859 -239938 280195 541629 584595 573640 471900 233938 -22479 -233457 -465595
5998 -465595 -602629 -330275 307910 712282 438439 -187862 -524005 -399569 -82877 231528
5988 231528 440210 312229 -192428 -569768 -320229 268917 495486 304536 267388 474532
5978 474532 280676 -535812 -1126557 -681787 319249 676754 70013 -617482 -611653 -233574
5968 -233574 -224331 -524222 -339787 590018 1421545 1289651 537175 212832 515550 570856
5958 570856 -93936 -747075 -625904 -119774 -10827 -162388 54570 437383 191975 -606137
5948 -606137 -921708 -301733 475995 590320 158396 -306898 -634115 -793611 -665411 -429713
5938 -429713 -568657 -1073931 -1239630 -638215 273138 901993 1261708 1521660 1439829 820823
5928 820823 71411 -264425 -197882 -109323 -215260 -533072 -955604 -1101519 -621441 98567
5918 98567 212945 -297197 -438251 236281 809304 436320 -325279 -549324 -463452 -785181
5908 -785181 -1196274 -821206 122928 498113 -20494 -596439 -651536 -511321 -508210 -482203
5898 -482203 -384926 -452945 -557243 -237524 402016 662260 326778 -57671 -195505 -455757
5888 -455757 -961234 -1164406 -801229 -460766 -636303 -905365 -690287 -252355 -221887 -549492
5878 -549492 -635312 -271112 179708 424704 506989 452394 149066 -312395 -541119 -291298
5868 -291298 163808 298891 -43460 -462153 -519232 -299673 -196898 -229163 -8287 522992
5858 522992 857867 721706 558352 750912 878394 412165 -265589 -346900 157690 508104
5848 508104 418880 270013 185792 -149938 -630255 -586299 187103 1002575 1181600 773322
5838 773322 168584 -362462 -556121 -247656 210535 266948 44403 154688 523343 333926
5828 333926 -568858 -1229605 -1016613 -510861 -319547 275 923302 1704453 1299208 57395
5818 57395 -629377 -171040 701048 1160362 1137789 912193 622304 352530 169209 -43049
5808 -43049 -401151 -710396 -719300 -602347 -764865 -1219086 -1543555 -1427250 -940132 -344244
5798 -344244 95292 248915 291805 488947 618140 71686 -1088156 -1740335 -1041599 281988
5788 281988 807742 301180 -208216 -133718 -65466 -575149 -1242503 -1385853 -1083797 -875230
5778 -875230 -875721 -764477 -407447 -1623 282655 412782 314248 -84360 -622260 -970839
5768 -970839 -961992 -693733 -317906 96477 456715 595655 464614 264554 196974 129620
5758 129620 -232084 -779125 -934633 -422756 175313 85116 -570812 -898446 -486293 67276
5748 67276 115406 -124489 -62734 291117 427575 197573 755 131440 400898 492666
5738 492666 352381 115891 -98231 -201564 -112856 135186 319597 175780 -298563 -710131
5728 -710131 -608990 -68262 285849 67357 -274837 -68607 556523 841128 542964 215624
5718 215624 224105 236555 9824 -52138 379436 897618 999627 858672 836578 718263 163053
5707 163053 -456661 -471693 26948 305691 80902 -192796 -118426 168387 372584 396142
5697 396142 265039 53441 -148789 -437962 -1037985 -1750940 -1872877 -1129120 -255511 -28132
5687 -28132 -149172 131404 685761 751560 256035 -131810 -171103 -232277 -333939 -95126
5677 -95126 263192 38537 -574705 -428074 782815 1799395 1551806 626490 183959 292081
5667 292081 286047 110043 253723 723124 1001098 846453 425646 -129617 -672095 -836068
5657 -836068 -532680 -353579 -801679 -1413179 -1394347 -874593 -669285 -924455 -925412 -342963
5647 -342963 198678 82307 -459346 -803639 -719848 -369332 48386 332810 289650 -21816
5637 -21816 -274603 -272080 -128576 30320 228950 386001 257295 -157273 -451321 -301372
5627 -301372 105713 358659 343740 261874 280793 392068 518887 574970 464129 167415
5617 167415 -173110 -327203 -146290 296200 677291 637497 178177 -236281 -181828 186729
5607 186729 348186 100428 -277392 -505690 -558634 -416350 -22093 374686 303565 -238146
5597 -238146 -605673 -351478 131262 207166 -115877 -394833 -547228 -814650 -1065088 -813396
5587 -813396 -40594 568581 432126 -263276 -885210 -1038587 -793692 -524385 -632815 -1167956
5577 -1167956 -1659708 -1621523 -1202029 -927923 -814908 -326140 629991 1314655 1134666 439985
5567 439985 -94172 -342114 -448602 -217284 484845 1097830 978911 435525 321044 726631
5557 726631 956259 769987 661349 729152 321756 -723862 -1420247 -923376 192758 740250
5547 740250 490832 114346 -87562 -438642 -965468 -1143690 -789519 -491104 -770759 -1293156
5537 -1293156 -1332704 -764595 -181946 -95908 -348332 -414080 -95623 291395 424053 424931 591175
5526 591175 811218 629043 -47116 -671271 -701887 -238763 212710 360981 240614 -70450
5516 -70450 -505420 -879478 -981870 -754682 -241258 482699 1171756 1452296 1255382 994256
5506 994256 1048868 1300275 1443722 1462199 1420555 1111413 420709 -194857 -200386 169036 174024
5495 174024 -355605 -847267 -905173 -719867 -436642 143396 908090 1164882 550559 -273251
5485 -273251 -396155 201505 816132 1035558 984330 740895 205876 -388466 -464840 131115
5475 131115 771632 771026 198277 -327630 -442424 -301711 -157189 -45087 49942 30133 -147493
5464 -147493 -321149 -317423 -184943 -86069 -57828 -41076 -44608 -80475 -22799 219961 437397
5453 437397 307615 -129936 -476719 -491167 -306850 -88124 166691 354709 208711 -246000
5443 -246000 -541684 -390469 -126149 -154460 -282160 -76111 346883 469439 231355 146080
5433 146080 479072 838339 793560 487894 345219 441713 479725 269293 -28629 -157254
5423 -157254 -107205 -100799 -240131 -297879 -20134 420635 558645 288693 64563 261501
5413 261501 654637 800373 644270 410439 149268 -192054 -439754 -370055 -97611 101239
5403 101239 216484 361163 379739 83090 -261478 -215740 117181 212355 -64154 -315039
5393 -315039 -299953 -196015 -116745 40638 165245 -36304 -406157 -358751 197789 575841
5383 575841 306824 -151892 -194810 -63928 -437866 -1290492 -1801992 -1404752 -443711 319309
5373 319309 558173 565378 690025 781198 365130 -604527 -1469242 -1620023 -1295561 -1185619
5363 -1185619 -1381189 -1287774 -599012 228508 616662 470329 1365 -517849 -664774 -129832
5353 -129832 670581 840692 199047 -369206 -159496 374114 444959 167215 225964 691408
5343 691408 961644 739422 348255 95541 -58606 -144666 -34626 225062 343520 186610
5333 186610 -41093 -108177 -32784 6522 -108667 -302155 -328298 -66902 158304 -145433
5323 -145433 -891334 -1323978 -984717 -390137 -317064 -732616 -965961 -720982 -335915 -139574
5313 -139574 -112073 -160267 -209268 -20462 556895 1106156 954928 113268 -587268 -515524
5303 -515524 7434 248279 22810 -216413 -84548 247518 276302 -250371 -1002909 -1355585
5293 -1355585 -1053957 -501685 -253701 -352585 -403396 -230300 -154033 -552963 -1351941 -2033188
5283 -2033188 -2075724 -1407737 -507627 15193 8869 -186584 -319344 -502440 -729162 -564404
5273 -564404 212895 987919 953242 229779 -297445 -224869 -24277 -97338 -165883 74102
5263 74102 317065 156682 -201200 -267570 -49098 22297 -188943 -362975 -302924 -261316 -543491
5252 -543491 -1036676 -1318770 -1153419 -746048 -478074 -439099 -343740 7955 339844 222557
5242 222557 -267965 -571662 -426480 -266553 -584298 -1188087 -1470221 -1251394 -930410 -813130
5232 -813130 -726759 -442848 -118367 -39895 -154938 -181859 -87901 -127239 -385265 -583837 -448926
5221 -448926 -41436 397944 698977 702990 241354 -527415 -990850 -714365 -92696 83669
5211 83669 -321766 -684139 -607624 -427136 -502755 -631630 -584148 -666551 -1132638 -1456142 -962263
5200 -962263 21029 466640 100843 -267237 -50393 286797 119403 -299480 -318091 37274
5190 37274 163223 -142551 -467000 -524681 -525648 -689558 -883690 -932021 -876988 -709639 -218512
5179 -218512 580510 1175910 1122029 678428 474129 647983 759353 504374 51033 -350890
5169 -350890 -570919 -335377 588195 1678543 1835731 796632 -247256 -168956 497427
$$ [...]
##END NTUPLES=NMR SPECTRUM
##END=
