##TITLE=31Pdec_LR-0138-C1-EtOAc
 CD3CN, 24 sc
 14.3.2023
##JCAMPDX= 6.0         $$ Bruker NMR JCAMP-DX V2.0
##DATA TYPE= NMR SPECTRUM
##DATA CLASS= NTUPLES
##ORIGIN= UXNMR, Bruker Analytische Messtechnik GmbH
##OWNER= root
$$ XWIN-NMR		Version 3.5
$$ Tue Mar 14 14:58:18 2023 Russian Standard Time (UT+4h)  she@DPX200
##.OBSERVE FREQUENCY= 81.013821
##.OBSERVE NUCLEUS= ^31P
##.ACQUISITION MODE= SIMULTANEOUS
##.ACQUISITION SCHEME= undefined
##.AVERAGES= 24
##.DIGITISER RES= 16
##SPECTROMETER/DATA SYSTEM= spect
##.PULSE SEQUENCE= zgpg30
##.SOLVENT NAME= CD3CN
##.SHIFT REFERENCE= (INTERNAL, CD3CN, 0, 248.564)
##AUDIT TRAIL= $$ (NUMBER, WHEN, WHO, WHERE, WHAT)
$$ ##TITLE= Audit trail, XWIN-NMR		Version 3.5
$$ ##JCAMPDX= 5.01
$$ ##ORIGIN= Bruker BioSpin GmbH
$$ ##OWNER= she
$$ F:/spectra/data/she/nmr/P31/1/pdata/1/auditp.txt
$$ ##AUDIT TRAIL=  $$ (NUMBER, WHEN, WHO, WHERE, WHAT)
(   1,<2023-03-14 14:51:11.54 +0400>,<she>,<DPX200>,
      <created by zg, POWCHK disabled, PULCHK disabled
       configuration hash MD5:
       00 E9 B6 7A A2 85 ED C7 34 08 36 98 17 FE 4E 26
       data hash MD5: 32K
       1E F6 99 3C 24 45 91 BB C9 4A C9 15 98 B3 51 DD>)
(   2,<2023-03-14 14:57:25.84 +0400>,<she>,<DPX200>,
      <Start of raw data processing
       efp BC_mod = 2 LB = 1 FT_mod = 6 PKNL = 1 PHC0 = -11031.69 PHC1 = 171.4102 SI = 64K 
       data hash MD5: 64K
       B0 8F AE D1 4B 65 46 72 42 2D 91 4E AD 09 28 CE>)
(   3,<2023-03-14 14:57:40.56 +0400>,<she>,<DPX200>,
      <pk PHC0 = 6.446249 PHC1 = 0 
       data hash MD5: 64K
       C8 1B 40 8D C1 FF 23 53 01 5F 38 FE 31 62 99 EF>)
(   4,<2023-03-14 14:57:45.15 +0400>,<she>,<DPX200>,
      <abs ABSG = 5 
       data hash MD5: 64K
       25 7C EE DE B4 61 7C C8 23 7C 68 14 6F 61 96 3C>)
$$ ##END=
$$ 
$$ hash MD5
$$ 01 65 78 A1 4E 13 CB F5 F3 47 E1 DB 61 F2 FB 2C
##$RELAX= 
##$RELAX= 
##$RELAX= 
##$RELAX= 
##$RELAX= 
##$RELAX= 
##$RELAX= 
##$RELAX= 
##$RELAX= 
$$ Bruker specific parameters
$$ --------------------------
##$DU= <F:/spectra>
##$EXPNO= 1
##$NAME= <P31>
##$PROCNO= 1
##$TYPE= <nmr>
##$USER= <she>
##$AMP= (0..31)
100 100 100 100 100 100 100 100 100 100 100 100 100 100 100 100 100 100 
100 100 100 100 100 100 100 100 100 100 100 100 100 100 
##$AQSEQ= 0
##$AQ_mod= 1
##$AUNM= <au_zg>
##$AUTOPOS= <>
##$BF1= 81.014009
##$BF2= 200.13
##$BF3= 200.13
##$BF4= 200.13
##$BF5= 200.13
##$BF6= 200.13
##$BF7= 200.13
##$BF8= 200.13
##$BYTORDA= 1
##$CFDGTYP= 0
##$CFRGTYP= 5
##$CHEMSTR= <none>
##$CNST= (0..31)
1 1 145 1 1 1 1 1 1 1 1 1 1 1 1 1 1 1 1 1 1 1 1 1 1 1 1 1 1 1 1 1 
##$CPDPRG= <waltz16>
##$CPDPRG1= <>
##$CPDPRG2= <waltz16>
##$CPDPRG3= <>
##$CPDPRG4= <mlev>
##$CPDPRG5= <mlev>
##$CPDPRG6= <mlev>
##$CPDPRG7= <mlev>
##$CPDPRG8= <mlev>
##$CPDPRGB= <>
##$CPDPRGT= <>
##$D= (0..31)
0 1 0 0 0 0 0 0 0 0 0 0.03 2e-05 3e-06 0 0 0 0 0 0 0 0 0 0 0 0 0 0 0 0 
0 0 
##$DATE= 1678791071
##$DBL= (0..7)
120 120 120 11 120 120 24 19 
##$DBP= (0..7)
150 150 150 150 150 150 150 150 
##$DBP07= 0
##$DBPNAM0= <>
##$DBPNAM1= <>
$$ [...]
##$SUBNAM3= <"">
##$SUBNAM4= <"">
##$SUBNAM5= <"">
##$SUBNAM6= <"">
##$SUBNAM7= <"">
##$SUBNAM8= <"">
##$SUBNAM9= <"">
##$SW= 501.771253377433
##$SWIBOX= (0..15)
0 1 3 0 0 0 0 0 0 0 0 0 0 0 0 0 
##$SW_h= 40650.406504065
##$TD= 32768
##$TD0= 1
##$TE= 0
##$TE2= 300
##$TE3= 300
##$TEG= 300
##$TL= (0..7)
0 120 53 12 22 120 120 120 
##$TP= (0..7)
150 150 150 150 150 150 150 150 
##$TP07= 0
##$TPNAME0= <>
##$TPNAME1= <>
##$TPNAME2= <>
##$TPNAME3= <>
##$TPNAME4= <>
##$TPNAME5= <>
##$TPNAME6= <>
##$TPNAME7= <>
##$TPOAL= (0..7)
0.5 0.5 0.5 0.5 0.5 0.5 0.5 0.5 
##$TPOFFS= (0..7)
0 0 0 0 0 0 0 0 
##$TUNHIN= 0
##$TUNHOUT= 0
##$TUNXOUT= 0
##$USERA1= <user>
##$USERA2= <user>
##$USERA3= <user>
##$USERA4= <user>
##$USERA5= <user>
##$V9= 5
##$VALIST= <valist>
##$VCLIST= <CCCCCCCCCCCCCCC>
##$VD= 0
##$VDLIST= <DDDDDDDDDDDDDDD>
##$VPLIST= <PPPPPPPPPPPPPPP>
##$VTLIST= <TTTTTTTTTTTTTTT>
##$WBST= 1024
##$WBSW= 4
##$XGAIN= (0..3)
0 0 0 0 
##$XL= 0
##$YL= 0
##$YMAX_a= 3087
##$YMIN_a= -2662
##$ZGOPTNS= <>
##$ZL1= 120
##$ZL2= 120
##$ZL3= 120
##$ZL4= 120
##$ABSF1= 248.5645
##$ABSF2= -253.2056
##$ABSG= 5
##$ABSL= 3
##$ALPHA= 0
##$AQORDER= 0
##$ASSFAC= 0
##$ASSFACI= 0
##$ASSFACX= 0
##$ASSWID= 0
##$AUNMP= <proc_1d>
##$AZFE= 0.1
##$AZFW= 0.5
##$BCFW= 0
##$BC_mod= 2
##$BYTORDP= 0
##$COROFFS= 0
##$CY= -3
##$DATMOD= 1
##$DC= 0
##$DFILT= <>
##$DTYPP= 0
##$F1P= 0
##$F2P= 0
##$FCOR= 1
##$FTSIZE= 65536
##$FT_mod= 6
##$GAMMA= 0
##$GB= 0
##$INTBC= 1
##$INTSCL= 6.047779e-11
##$ISEN= 30
##$LB= 1
##$LEV0= 0
##$LPBIN= 0
##$MAXI= 10000
##$MC2= 0
##$MEAN= 0
##$ME_mod= 0
##$MI= 50
##$NCOEF= 0
##$NC_proc= -8
##$NLEV= 6
##$NOISF1= 182.463
##$NOISF2= 159.3651
##$NSP= 0
##$NTH_PI= 0
##$NZP= 0
##$OFFSET= 248.5645
##$PC= 4
##$PHC0= -11025.24
##$PHC1= 171.4102
##$PH_mod= 1
##$PKNL= yes
##$PPARMOD= 0
##$PSCAL= 0
##$PSIGN= 0
##$REVERSE= no
##$SF= 81.0140089999694
##$SI= 65536
##$SIGF1= 159.3651
##$SIGF2= -187.1042
##$SINO= 113.3802
##$SIOLD= 16384
##$SREGLST= <1H.CDCl3>
##$SSB= 0
##$STSI= 65536
##$STSR= 0
##$SW_p= 40650.406504065
##$SYMM= 0
##$S_DEV= 0
##$TDeff= 32768
##$TDoff= 0
##$TI= <>
##$TILT= no
##$TM1= 0
##$TM2= 0
##$TOPLEV= 0
##$USERP1= <user>
##$USERP2= <user>
##$USERP3= <user>
##$USERP4= <user>
##$USERP5= <user>
##$WDW= 1
##$XDIM= 65536
##$YMAX_p= 309137629
##$YMIN_p= -29741800
$$ End of Bruker specific parameters
$$ ---------------------------------
##NTUPLES= NMR SPECTRUM
##VAR_NAME=  FREQUENCY,     SPECTRUM/REAL,   SPECTRUM/IMAG
##SYMBOL=    X,             R,               I
##VAR_TYPE=  INDEPENDENT,   DEPENDENT,       DEPENDENT
##VAR_FORM=  AFFN,          ASDF,            ASDF
##VAR_DIM=   65536,         65536,           65536
##UNITS=     HZ,            ARBITRARY UNITS, ARBITRARY UNITS
##FACTOR=    0.620285442955139, 1,           1
##FIRST=     20137.2065510682, 0,            0
##LAST=      -20513.1999529968, 0,           0
##MIN=       -20513.1999529968, -29741800,   0
##MAX=       20137.2065510682, 309137629,    0
$$ Real data points
##PAGE= N=1
##DATA TABLE= (X++(R..R)), XYDATA
$$ [...]
42272A979852j894606j032621K169287L821887J711394k000503m600762n506797
42264e352869m340648l51435M731175O728658L830242r96506l688044l038199
42256b477626k96513K663442L936805K695035M85671m88406l99535q69628j612567
42247C636678j097463j5963l10553j041089M08091K899330K285538j575873l753104
42238A435592j820537O07456J88346j285511j277442j120363k579911l592943
42230i445313j378303K796416N228485M232883R34378k189286k471293K91242
42222b000791K019131o73078l914644j210217N005891M877244l380196r013687
42214h290347m695646K563023L583746J009965J767056L559650M29954m120916
$$ plain form
42272 1979852 85246 -947375 1221912 5043799 6755193 4754690 153928 -5352869
42264 -5352869 -9693517 -10044952 -5313777 1414881 5245123 4248617 560573 -2477626
42256 -2477626 -2774139 -110697 3826108 6521143 7006814 6518408 6118873 5249245 3636678
42247 3636678 2539215 2523252 2212699 1171610 1579701 4479031 6764569 5188696 1435592
42238 1435592 -384945 222511 410857 -874654 -2152096 -3272459 -5852370 -9445313
42230 -9445313 -10823616 -8027200 -2798715 1434168 2368546 179260 -2292033 -2000791
42222 -2000791 18340 -654738 -4569382 -5779599 -773708 4103536 723340 -8290347
42214 -8290347 -12985993 -10422970 -6839224 -5829259 -4062203 -502553 -72599 -4193515
42206d193515k268554L512504L865298j238499k626789J860305M041363J9790
42198B971903l733483k119669J196623J859009J109024M32144j561752l599627
42190c445828j424913L817801N226713J184712j949467j145578j042302l313803
42182b092665k265731L687684O704439K279967k827554k831946k659169o597188
42174f602163p821621n81293O656794L712220l316399j653773O049385N836488
42166B279638l644517q404971j625086O826650P292381K921551l3424k320642
42158C291580n391790n301548l31221L536298J876955o21112J252159L903893
42150B215214J758273k451436k428093R60583J910432k83984j295671r2628K08953
$$ plain form
42206 -4193515 -6462069 -2949565 915733 -322766 -2949555 -1089250 2952113 2971903
42198 2971903 -761580 -2881249 -1684626 174383 1283407 1715551 153799 -3445828
42190 -3445828 -4870741 -1052940 4173773 5358485 3409018 2263440 1221138 -2092665
42182 -2092665 -4358396 -670712 6033727 8313694 5486140 2654194 -4975 -6602163
42174 -6602163 -14423784 -15005077 -8348283 -4636063 -7952462 -9606235 -3556850 2279638
42166 2279638 -1364879 -9769850 -11394936 -4568286 2724095 5645646 5612222 3291580
42158 3291580 -2100210 -7401758 -7732979 -4196681 -2319726 -2940838 -1688679 2215214
42150 2215214 3973487 1522051 -906042 54541 1964973 1680989 385318 292690 501643
42141E01643r18647n63324J617474K341191K36693k311256l222617k492563j25083
42132d936489L353254M736030J432162l128495k798243J996613M156837P03148
42124E514817k594084o26403K945313K128757j474347j795352J181124J290117
42116F569942l450308p064320m336524J826927M917210L166953m0525j725685
42108a36330j674919l92529J867052L857382L676679J171439j443478k093877
42100D831419j132452n19539j153507j687887l91782K036523K639601J3268l198446
42091A437198l358852n66658K023451K992394L525358L495528Q79321l539296
42083F888444n242658k477859K70972j025578l329248j365498L580061N304835
$$ plain form
42141 501643 -417004 -980328 637146 2978337 3215030 903774 -2318843 -4811406 -4936489
42132 -4936489 -1583235 3152795 4584957 1456462 -1341781 654832 4811669 5514817
42124 5514817 2920733 2294330 5239643 7368400 5894053 4098701 5279825 6569942
42116 6569942 3119634 -3944686 -8281210 -6454283 -1537073 1629880 1589355 -136330
42108 -136330 -1811249 -2203778 -336726 3520656 7197335 8368774 6925296 4831419
42100 4831419 3698967 3179428 2025921 338034 -53748 1982775 4622376 4635644 1437198
42091 1437198 -1921654 -2488312 -464861 2527533 6052891 9548419 10427740 6888444
42083 6888444 1645786 -832073 -561101 -1586679 -4915927 -6281425 -2701364 2603471
42075B603471K001948j552487j236255J680472L642677K798429o49218m748662
42067D540375o242154l732541j49346Q58879p9424j06692N35713k27092j315596
42058e917878j89877J709488J166325l29164R20380K898166N77435l751674k390806
42049e307605M258631O475984P20343m229246j775545K213019P43418k326379
42041G72620p65786J804296j094776n734747l685523L424976O050524J734991
42033B506575k623660k814087j709749j358522J24049K513439K396789j90383
42025a155549r23532J526772L486465K701242J076424J33289q93559j830111j467984
42016B653457p54448j248907j286744R69768K387291n98138m125767j714890M189053
$$ plain form
42075 2603471 4605419 3052932 1816677 3497149 7139826 9938255 9289037 4540375
42067 4540375 -1701779 -5434320 -5583666 -4724787 -4804211 -4910903 -4375190 -4602282 -5917878
42058 -5917878 -6107755 -4398267 -3231942 -3561106 -2640726 257440 834875 -2916799 -5307605
42049 -5307605 -1048974 5427010 6147353 1918107 142562 2355581 3098999 772620
42041 772620 6834 1811130 716354 -5018393 -8703916 -5278940 771584 2506575
42033 2506575 -117085 -2931172 -4640921 -5999443 -5875394 -3361955 -965166 -1155549
42025 -1155549 -2079081 -552309 2934156 5635398 6711822 6845111 5951552 4121441 2653457
42016 2653457 1899009 650102 -636642 333126 2720417 2122279 -2003488 -3718378 470675
42007D70675M821477n67027l112096J031929M709053K156306k202425k610934
41999D696958j187489j956552k710372J53024L910325L514235k74032k637338
41991C508759j827246K48836J948201K377049O19472k128661k599601n15809K2810
41982A653810k749390m342800o33776N369383P549793M496177l06476l268354
41974G768367k697586Q13331L400140J051598l932972m365714J180638M944103
41966H161905J251687m842961n703563k258807k85143k89284J218142L636363
41958H88339L276849N47567r35345r67252j962828l058537j591615Q37573M65600
41949b499649j522291p94862K018542K196601l72232q61490J579669K228765l72776
$$ plain form
42007 470675 5292152 4725125 1613029 2644958 7354011 9510317 7307892 4696958
41999 4696958 3509469 1552917 -1157455 -1004431 2905894 6420129 6146097 3508759
41991 3508759 1681513 1930349 3878550 6255599 6875071 4746410 2146809 1631000 1653810
41982 1653810 -1095580 -5438380 -6072156 -702773 6847020 11343197 11036721 7768367
41974 7768367 5070781 5884112 9284252 10335850 6402878 2037164 3217802 8161905
41966 8161905 9413592 4570631 -1132932 -3391739 -3676882 -3966166 -2748024 888339
41958 888339 4165188 4712755 3777410 2810158 847330 -2211207 -3802822 -2965249 -2499649
41949 -2499649 -4021940 -4816802 -2798260 -601659 -973891 -1835381 -255712 1973053 1600277
41940A600277j540426R41901K440533m77920l782806k469519J541358L040931
41932A294329J505695M25558J039847J431751N90577n57933j490499k316200k249564
41923c26439n90679J196891Q53206j397976l023222k590749j184133l07388k5629
41914g396118L77724J134635J998912K728396K929481J911623n17288l130846
41906C6519l967823k444694j83637J050835J581982K618771L385040J769875j822818
41897B024050l995930l099609j790089k577173l343994q51510K957266K826027
41889g850962j546733l909369j25380N493517N927459R87162l088380k586058
41881f698744k63357M20521M17152J576911J718589j943172o112205m020386M413063
$$ plain form
41940 1600277 59851 1001752 3442285 2964365 -818441 -3287960 -1746602 1294329
41932 1294329 2800024 3225582 4265429 5697180 6287757 5729824 4239325 1923125 -326439
41923 -326439 -917118 279773 1132979 -264997 -3288219 -5878968 -7063101 -7370489 -7396118
41914 -7396118 -7018394 -5883759 -3884847 -1156451 1773030 3684653 3167365 36519
41906 36519 -3931304 -6375998 -6559635 -5508800 -3926818 -1308047 2076993 3846868 2024050
41897 2024050 -1971880 -5071489 -6861578 -9438751 -12782745 -13634255 -10676989 -7850962
41889 -7850962 -9397695 -13307064 -13432444 -7938927 -2011468 -1024306 -4112686 -6698744
41881 -6698744 -6962101 -6541580 -6124428 -4547517 -2828928 -4772100 -10884305 -14904691 -10491628
41872a0491628J0507294P667814j04895m279002k727944j0692N42274l18438j418089
41863f33306k428663j973647Q42763L384903K448190l44841r24350K55898o61746
41854c4799l181182k378957K532434O037283M444948L27088k807925m391561l881435
41845c334106m10261K961971J569057k506591k260386J987582J769426m432941
41837d656249o296091J538847Q732546M920182l467594l983430J803926K745784
41829A337921k323497m033729L25844L116534N63887j959185r80314n2693j017109
41820e022341k70941K958840L842809R07317q88533M04818j53390m487535o120832
41811h829788m89558O307509N638766j648102p340545o497940r69161M836375
$$ plain form
41872 -10491628 15666 7683480 7578585 3299583 571639 560947 1103221 784783 -633306
41863 -633306 -3061969 -5035616 -4192853 -807950 1640240 1295399 371049 626947 -34799
41854 -34799 -3215981 -5594938 -3062504 2974779 7419727 7746815 4938890 547329 -3334106
41845 -3334106 -3744367 -782396 786661 -1719930 -3980316 -1992734 -223308 -4656249
41837 -4656249 -10952340 -9413493 -680947 4239235 771641 -3211789 -1407863 1337921
41829 1337921 -985576 -5019305 -4693461 -1576927 -1013040 -2972225 -3952539 -4005232 -5022341
41820 -5022341 -5293282 -2334442 1508367 2415684 1527151 1931969 1778579 -2708956 -8829788
41811 -8829788 -9319346 -3011837 2626929 978827 -6361718 -12859658 -13828819 -8992444
41803h992444P347466N246286R58973j035713M65769J985456O74086j978639l179033
41794A492207k403254o07142J018259P18290j944102l694353j283935K576001
41786d128029K547128r1944J259879O622677P201659j026714r288764p672414
41778d576522J038662O061476L236105j862543l310181j218966Q31467M81536
41770F81034j440629j724904J390070M581506K771639k934232n313455j305194
41762c294165L039588J689696k313522k226869J819434L732507Q79369l105693
41754B20345m217262k226866P96856K629336J854831o95843k068053o00340J977707
41745b329289L202905K571723L66974l132834n574589l419176K529706O236662
$$ plain form
41803 -8992444 -1644978 3601308 4560281 3524568 3990337 5975793 6649879 4671240 1492207
41794 1492207 -911047 -1518189 -499930 218360 -1725742 -5420095 -6704030 -4128029
41786 -4128029 -1580901 -1672845 -412966 6209711 13411370 12384656 3095892 -4576522
41778 -4576522 -3537860 2523616 5759721 3897178 586997 -631969 199498 681034
41770 681034 -759595 -2484499 -1094429 3487077 6258716 3324484 -1988971 -3294165
41762 -3294165 -254577 1435119 -878403 -3105272 -1285838 2446669 3326038 220345
41754 220345 -3996917 -6223783 -5426927 -2797591 -942760 -1638603 -3706656 -4306996 -2329289
41745 -2329289 873616 3445339 3812313 679479 -4895110 -8314286 -5784580 452082
41737D52082M106734j62854j625204q54533o90165m31421J611052L207888J395705
41728G009284k036168l505288l476359l917918k829514K111267O654635M379171
41720D389110k613126n154622j60123M926910L223700k346449m485025j501406
41712c721031K187939K677724J56497k606270k945726n15482J902674J202695
41704a660980j672863k320932R57958M104332K741376j253569k081087J402502
41696B16737L407864m20863n562254m067759L439973P174161J823526n142780
41688H68605m116920K401448M108017j046325m738944k521775J23029q61140p65190
41679f549195L940630P161211K791482m050361m544188J16453K103070L17500
$$ plain form
41737 452082 4558816 4395962 2770758 1916225 1226060 794639 2405691 5613579 7009284
41728 7009284 4973116 1467828 -2008531 -5926449 -8755963 -6644696 9939 4389110
41720 4389110 1775984 -3378638 -3538761 1388149 4611849 2265400 -2219625 -3721031
41712 -3721031 -1533092 1144632 1301129 -1305141 -4250867 -4766349 -2863675 -1660980
41704 -1660980 -3333843 -5654775 -4696817 -592485 2148891 895322 -1185765 216737
41696 216737 3624601 3203738 -2358516 -6426275 -2986302 4187859 6011385 868605
41688 868605 -3248315 -846867 3261150 2214825 -2524119 -5045894 -4922865 -5784005 -6549195
41679 -6549195 -2608565 4552646 7344128 3293767 -1250421 -1133968 969102 1286602
41671A286602K13689K426073K088786q25350p05454K958697L630403j068629n034050
41662D970767l833162r67951L2688J798101N953222O982680M97721p519211p808943
41653A05912j351522K240792r03812l924672l87580N976193O790017P07785n183148
41644D069965m875054l21002K414831J047560j454767j989817p78366N26238J280832
41635g9580J238628l1290j543117j000102J647031L032041R87448j986953k566089
41626c01983j542614j443862j294194J721188O251911P247246K996491k312821
41618A1321362m305746l451202k796118l198311k915248q44420J582160K069611
41610b537912N95078n1233K059689M596211L690637j37760k322613j278929p92689
$$ plain form
41671 1286602 1500291 3926364 6015150 5189800 4484346 7443043 11073446 10004817 4970767
41662 4970767 1137605 169654 202342 2000443 7953665 14936345 15434066 7914855 105912
41653 105912 -1245610 995182 91370 -3833302 -4220882 1755311 8545328 9253113 4069965
41644 4069965 -805089 -1126091 1288740 2336300 881533 -1108284 -1886650 -1360412 -79580
41635 -79580 1159048 1127758 -415359 -1415461 231570 3263611 4251059 2264106 -301983
41626 -301983 -1844597 -3288459 -4582653 -2861465 3390446 10637692 13634183 11321362
41618 11321362 7015616 3564414 768296 -2430015 -5345263 -6189683 -4607523 -2537912
41610 -2537912 -1942834 -1994067 65622 4661833 8352470 8214710 5892097 4613168 3820479
41601C820479l326807n444091l352387Q98432K883719K186201J110315J96776
41593a027363n63562O91406M030463M943753O55834m014007l160341R62566K011974
41584D530723j3930k30450J381972L35832l080767l597715l01598K061110J709956
41575B795133J618100J950223o74709m925360m642157N91056L422047M19061k701990
41566b148596j413908L92856j510254l910412k231779J749248L831298L816027
41558a425520L154071J247392j454269j802503N17904J250749r14396j457515
41550h84087J317533K211137j110801k418880K098871N231574K2336p392283o702482
41541g627082K05685L181854M55282o24602K096141K516858j597631m141841r05927
$$ plain form
41601 3820479 493672 -4950419 -8302806 -7404374 -4520655 -2334454 -1224139 -1027363
41593 -1027363 -1590925 -899519 3130944 8074697 8730531 4716524 1556183 2518749 4530723
41584 4530723 4516793 4286343 5668315 6004147 2923380 -674335 -975933 1085177 2795133
41575 2795133 4413233 6363456 5688747 763387 -3878770 -3287714 134333 553394 -2148596
41566 -2148596 -3562504 -3169648 -4679902 -8590314 -10822093 -9072845 -5241547 -1425520
41558 -1425520 1728551 2975943 1521674 -280829 237075 1487824 573428 -884087
41550 -884087 433446 2644583 1533782 -885098 1213773 6445347 6467683 -924600 -7627082
41541 -7627082 -7421397 -4239543 -3784261 -4408863 -2312722 204136 -1393495 -5535336 -6441263
41532f441263M212610N976613M034604M92813k637112k567948J490980M373040
41524H934337O59326n607000n118772K017753N294689K8419n426534l482389J271006
41515a429165J594278J72851L224012P447445M307506n119263j0227219o230498
41507f260053j40936P84569j550652k020232p97377n27626J38760L712683P173687
41498E12823M910203j986619n717837k462505K620885L712313K169843J663218
41490E422324M80574m396756q582705m480599N693099J0145109L741893m347299
41482C675640m415721J4129m5060l488818j769000N318584P793331J109562o282989
41473A909658n535265Q6334J576865j995445l385046J008097O075541N838432
$$ plain form
41532 -6441263 -2228653 3747960 7782564 8275377 5638265 3070317 4561297 8934337
41524 8934337 9593663 3986663 -1132109 885644 6180333 6208752 782218 -2700171 -1429165
41515 -1429165 165113 337964 3561976 11009421 15316927 10197664 -29555 -6260053
41507 -6260053 -6400989 -5616420 -7167072 -9187304 -9984681 -10512307 -10373547 -6660864 512823
41498 512823 5423026 3436407 -2281430 -4743935 -2123050 1589263 3759106 5422324
41490 5422324 5902898 1506142 -7076563 -11557162 -5864063 4281046 8022939 3675640
41482 3675640 -740081 -725952 -771012 -4259830 -6028830 -710246 7083085 8192647 1909658
41473 1909658 -3625607 -3539273 -1962408 -3957853 -7342899 -6334802 -259261 5579171
41465E579171J478228j205071M9776J573574l90601m061736m578971j205392J282634
41456a478388l35577k629877p39927L757313M943698J673713q45425M29845J683179
41447F458554j002425m575584l250251K495966N956311K949559l328505o957524
41439a253899n855204k312694R18579K970037L892065L354631J292581r15353
41431B090743j379311k08877K09109j459816l071185j813232J282898K306639
41423b043032J46950j719509l48227K515112L503502K502532J560008P13681j350839
41414E480178l255494j891856J908354L005226o33915m009651k030522K599273
41406A171593L101715j299294m439513k637493M10158L17400j212031j57416K602351
$$ plain form
41465 5579171 7057399 5852328 5902104 7475678 7085077 3023341 -1555630 -2761022 -1478388
41456 -1478388 -1813965 -4443842 -5183769 -1426456 3517242 5190955 4345530 4775375 6458554
41447 6458554 5456129 880545 -2369706 126260 6082571 9032130 5703625 -1253899
41439 -1253899 -7109103 -9421797 -8503218 -5533181 -1641116 1713515 3006096 2090743
41431 2090743 711432 502555 711664 -748152 -3819337 -5632569 -4349671 -2043032
41423 -2043032 -1896082 -3615591 -3963818 -1448706 2054796 4557328 6117336 6831017 5480178
41414 5480178 2224684 332828 2241182 5246408 4612493 602842 -1427680 1171593
41406 1171593 4273308 2974014 -1465499 -4102992 -3692834 -3375434 -4587465 -4744881 -2142530
41397b142530K723945l22363k211653k95352K811274L484582J929475P87710P54880
41388G519968n9313k616712m655060l231864P77402K719972J41031l171352k231098
41379d807026J373456J619023k015154l082180J157614M481831J717226k519280
41371b074490j759862J346838N51083k028276K25773N214183M308257k541188
41363C242318n685568j550147K085178J01605j986206N77809L029144P40100j754982
41354a200749L97754K615734q82757n716139l985124K539829N427118K442972
41346A638638j305186k470859j852570q0351J954569J031037l363785n339009
41338i787516q56033M462896L583925l88181o2817L071180J999532k394424k890302
$$ plain form
41397 -2142530 581415 259052 -1952601 -2247953 563321 4047903 5977378 6765088 7519968
41388 7519968 7460655 4843943 188883 -3042981 -2265579 454393 595424 -2575928 -4807026
41379 -4807026 -3433570 -1814547 -3829701 -6911881 -5754267 -1272436 444790 -2074490
41371 -2074490 -3834352 -2487514 -1936431 -3964707 -3738934 1475249 5783506 3242318
41363 3242318 -2443250 -3993397 -1908219 -1806614 -3792820 -3215011 -185867 554233 -1200749
41354 -1200749 -802995 1812739 929982 -4786157 -8771281 -6231452 -804334 1638638
41346 1638638 333452 -2137407 -3989977 -4070328 -2115759 -1084722 -4448507 -9787516
41338 -9787516 -10643549 -6180653 -2596728 -2984909 -3047726 23454 2022986 -371438 -3261740
41329c261740O85969J524871j105054q64938K819303L013046j504394k991513
41321a684450J884607O272464M782022R11260j289783l209495n007563k850428
41313a91366K229871K569432l366210o296994q18235M995380K691986k964284
41305a150420k966717J138254J932405l86147j22893K343646J708674j862212
41297F34590l070231r08833O85748N83656J113443J813916p5315l246473l218682
41288e688181L54352L046388K225346o02603l193286l839568r81084L788053M808142
41279h2441k52798n029119k642269L788901N943063K717249l23450j471614l418886
41270g71364m639975p44611N155482M238924l658401p939456l164561K965711
$$ plain form
41329 -3261740 -2575771 -1050900 -2155954 -3020892 -201589 2811457 1307063 -1684450
41321 -1684450 200157 6472621 11254643 12165903 10876120 7666625 2659062 -191366
41313 -191366 2038505 4607937 1241727 -5055267 -5873502 -878122 1813864 -1150420
41305 -1150420 -4117137 -2978883 -1046478 -1432625 -1555518 788128 2496802 634590
41297 634590 -2435641 -3344474 -2658726 -2075070 -961627 852289 776974 -2469499 -5688181
41288 -5688181 -5333829 -2287441 -62095 -664698 -3857984 -7697552 -8678636 -4890583 -82441
41279 -82441 -335239 -5364358 -8006627 -4217726 1725337 4442586 4119136 2647522 -771364
41270 -771364 -5411339 -6155950 -1000468 3238456 -419945 -8359401 -11523962 -8558251
41262h558251K614176p00184l33487K087360J666118R8769J641384L875499J485147
41253C876531l735534n232286k176278N25405J409818L347645N595445L564750
41245G175496k176259m780487j580914J704445O69081r60026R63615K894029j44761
41236C764219m855148m061251J545316M057242N25320l080565j723958J530663
41228b298162J436551j437767k661486o01175K544370M125944K640312j734407
41220B014180n652191m424240J675753N866008L251532k178300l427958n69450
41212c444666Q39651m85770l55909K405142L429363N89574k028492r02619J524297
41203A570571J733810Q06517J171146J518690n02609l248885l281672q91432P01369
$$ plain form
41262 -8558251 -5944075 -6644259 -6977746 -4890386 -3224268 -3125499 -1484115 2391384 3876531
41253 3876531 140997 -5091289 -7267567 -6742162 -5332344 -1984699 3610746 7175496
41245 7175496 4999237 218750 -1362164 342281 1011362 51336 1014951 3908980 3764219
41236 3764219 -1090929 -5152180 -3606864 450378 975698 -2104867 -3828825 -2298162
41228 -2298162 -861611 -2299378 -4960864 -5562039 -3017669 1108275 3748587 2014180
41220 2014180 -3638011 -8062251 -6386498 -520490 2731042 552742 -2875216 -3444666
41212 -3444666 -2605015 -3090785 -3446694 -1041552 2387811 2977385 948893 46274 1570571
41203 1570571 3304381 4110898 5282044 6800734 6298125 3049240 -232432 -1123864 -422495
41194d22495N39222N13383J308552J222698p12120k893586k954396k42998L344917
41185b96823M547444J852386k156349l360808j455074j43510j216443j872179
41177d101356K34604K867064K945587J241758J5149j181513l516202n133483l658571
41168a0286963o52017P75384J316948L695084O427048M729300j673445o519222
41160b187883m863005M83341K878268J70135l376600k836479J556786M989530
41152c185907L944205K81568j606476p17995j2482j097597j703666J15153K406382
41143a576815K363885N77737l61486K70238J236388J610107J123202k87173j722627
41134C233456j811407r81464r15373j128258M18099K532112J413478k405803l518812
$$ plain form
41194 -422495 116727 630110 1938662 3161360 2449240 -444346 -3398742 -3641740 -296823
41185 -296823 4250621 6103007 3946658 585850 -869224 -1012734 -2229177 -4101356
41177 -4101356 -3866752 -999688 1945899 3187657 3202806 2021293 -1494909 -6628392 -10286963
41168 -10286963 -10938980 -10163596 -8846648 -5151564 1275484 6004784 4331339 -2187883
41160 -2187883 -7050888 -6567547 -3689279 -3519144 -6895744 -9732223 -8175437 -3185907
41152 -3185907 758298 1039866 -566610 -1284605 -1297087 -2394684 -4098350 -3983197 -1576815
41143 -1576815 787070 1364807 1003321 1273559 2509947 4120054 5243256 4956083 3233456
41134 3233456 1422049 440585 -474788 -1603046 -1184947 1347165 2760643 354840 -3163972
41125c163972n85491Q71169j517059j765045L611137P304233K373317n032546
41117B095743m702910J096318K255919j537391j462687L233732L295516l276786
41109I97454o252157l51036N433701K712631l070458k741898K073860L662662
41101B464759R14293j510941j885316j416049L74719L184954K814740k623505
41093B317654p230570m925799J186808L994992L085073K684751K556713l25473
41085C344149l535672k001166K037899J313586m015594n585911j82186N085770
41077c539125M118968L19211n63651Q15882J032241P55814K135078L209324Q39951
41068I123693l118379l939056j002762K022153L119944L559699L790724K133605
$$ plain form
41125 -3163972 -3749463 -2878294 -4395353 -6160398 -2549261 4754972 7128289 2095743
41117 2095743 -2607167 -1510849 745070 -792321 -2255008 978724 4274240 997454
41109 997454 -5254703 -5605739 -172038 2540593 -529865 -3271763 -1197903 2464759
41101 2464759 3379052 1868111 -17205 -1433254 -1058535 2126419 4941159 2317654
41093 2317654 -4912916 -9838715 -8651907 -4656915 -1571842 1112909 3669622 3344149
41085 3344149 -191523 -2192689 -154790 1158796 -2856798 -8442709 -8624895 -3539125
41077 -3539125 579843 899054 335403 1151285 2183526 2939340 5074418 8283742 9123693
41068 9123693 6005314 2066258 1063496 3085649 6205593 9765292 13556016 15689621
41060A5689621j432029l764920k623867J65575J364152L83415j081955k110534
41052F589458l064717l611622k565639j80059J345245Q12435k1800P99980J784145
41043A887426l06423m967162p049758l021463L923853P493786N916087K989212
41035F865558J713180M10985l130989o630691n888266j325660J954957J329700
41027d701226J50021J865684L936241J692679l438864m807422j97328M378101
41019a122114K919196k538993n530123l790051l80437J747074K140670J007830
41011e546948r06066j201077J481490M009157K107800k780337m366594j62949
41003g365524M901362N207341J234298k486841l270572j729112N47308K355606
$$ plain form
41060 15689621 14257592 10492672 7868805 8034380 9398532 9781947 8699992 6589458
41052 6589458 3524741 -86881 -2652520 -2832579 -1487334 -674899 -696699 103281 1887426
41043 1887426 1581003 -3386159 -10435917 -13457380 -9533527 -2039741 3876346 6865558
41035 6865558 8578738 8989723 5858734 -771957 -6660223 -7985883 -6030926 -4701226
41027 -4701226 -4551205 -2685521 1250720 2943399 -495465 -5302887 -5500215 -1122114
41019 -1122114 1797082 -741911 -6272034 -10062085 -10442522 -8695448 -6554778 -5546948
41011 -5546948 -6453014 -7654091 -6172601 -2163444 -55644 -2835981 -7202575 -7365524
41003 -7365524 -2464162 2743179 3977477 1490636 -1779936 -3509048 -2961740 -606134
40995f06134K976222K498040J549746L87040p95562j064119K010Q00938l24433
40986E423748k244388k755220k208226k176166j621973J283790M282507L245833
40978C229905o70048j881092P85783K295924P9786k043238j267867n01828j943842
40969a916517k389354L54608K360883L12885k212673j134784Q70565J96896L2060
40960c525431M205069P982061M458854l081390n368165j795391r2021j925637
40952H57949o40058M768680N420310k717539j0248836p609802J115990N478114
40944c575192L478565P32662m53443k030230k774013Q59153O518989O827637K54104
40935I838232n541573m051566J567264L698193J98267m481134n683922k712647
$$ plain form
40995 -606134 2370088 4868128 6417874 6804914 6009352 4945233 4947243 5748181 5423748
40986 5423748 3179360 424140 -1784086 -3960252 -5582225 -4298435 -15928 3229905
40978 3229905 2559857 678765 1464548 3760472 3840258 1797020 529153 27325 -1916517
40969 -1916517 -4305871 -3951263 -1590380 -1277495 -3490168 -4624952 -3754387 -3557491 -3525431
40960 -3525431 679638 8661699 13120553 10039163 4670998 2875607 2783586 857949
40952 857949 217891 4986571 10406881 7689342 -2559494 -10169296 -9053306 -3575192
40944 -3575192 -96627 636035 182592 -1847638 -4621651 -3762498 2756491 9584128 9838232
40935 9838232 4296659 245093 1812357 5510550 5708817 1227683 -4456239 -7168886
40927g168886J938897M634692K858969j979522m723263j933525L415748N390168
40919B433278K745182k63866q72157j313495l524739m677293j775448K458259
40911d790279L178601J047029Q66715L297778L722974J287m264906n739670n307258
40902g987729m081403j058556K498994K195471k083115l692866P56399M674088
40894h778717J515048l636775j316534O793758R736833M010185j824561j085037
40886E414200J979847J098113k048324k430482n44350m85339k571970l493080
40878c081385k028065j30502P27658Q81925P85879M69690J17140l45086j238324
40869c841070j758855l14245K753386M793530M267448K346707J74890k607616
$$ plain form
40927 -7168886 -5229989 -595297 2263672 284150 -4439113 -6372638 -2956890 2433278
40919 2433278 5178460 4914594 4042437 2728942 -795797 -5473090 -7248538 -4790279
40911 -4790279 -1611678 -564649 302066 3599844 7322818 7324105 3059199 -2680471 -7987729
40902 -7987729 -12069132 -13127688 -10628694 -8433223 -10516338 -14209204 -13452805 -8778717
40894 -8778717 -7263669 -10900444 -12216978 -5423220 4313613 8323798 6499237 5414200
40886 5414200 7394047 8492160 6443836 4013354 3469004 2983665 411695 -3081385
40878 -3081385 -5109450 -5239952 -4512294 -3630369 -2844490 -2374800 -2257660 -2602746 -3841070
40869 -3841070 -5599925 -5914170 -3160784 1632746 5900194 8246901 8421791 5814175
40861E814175n186919m706008n40541L273440K826363m15919k005370n90598J246825
40852b84552J172088n57583k394903k984862j646849R80134K979522K881890J031826
40843A176711j098507k079840j072055J197173K124775J38511k233819j226962
40835c074013K187965L199982P27317q26798P77983J760227m96355k087481L11296
40826B480123K157058j858962p114322m443866M940258R403668L328673n136768
40818C755862o359264j610987K064396K998869L899861L889495l40466o564321
40810A733445p746105k003034M045082M247580O66704p30115J302330K843221
40802D359108J359467j081929j333830O25172J945889M07909k823622l963582
$$ plain form
40861 5814175 627256 -4078752 -4619293 -1345853 1480510 1064591 -940779 -1531377 -284552
40852 -284552 887536 329953 -2064950 -5049812 -6696661 -5716527 -2737005 144885 1176711
40843 1176711 78204 -2001636 -3073691 -1876518 248257 386768 -1847051 -3074013
40835 -3074013 -886048 2313934 3041251 2214453 2992436 4752663 4256308 2168827 2480123
40826 2480123 4637181 2778219 -4336103 -8779969 -3839711 5563957 8892630 3755862
40818 3755862 -2603402 -4214389 -2149993 848876 4748737 8638232 8297766 1733445
40810 1733445 -6012660 -8015694 -3970612 276968 943672 213557 1515887 4359108
40802 4359108 5718575 4636646 3302816 3927988 5873877 6281786 3458164 -505418
40794e05418q18180L734281M254416l39910m643130l656425M47590J892427l9775
40785C25876p04221J775912L538915J714400j072320j821172k074318l757034
40777b073962m289779r13391L379780L973393K191828K420540L588541R61544
40769I238494m189587n046326o38474J716418j464621l609621O53904N492874
40761B153061K764586m472175o381457j462673K177174L12410j823434L64083
40753f368425L221327J797460j521225j073792K749307M135820Q03721k802219
40745I41974k083463J691054L778770K125376j062751k953806l065265k279034
40737b907145p20250J835373M113526L860382Q55800j974701j713782R13672K357782
$$ plain form
40794 -505418 -1323598 2410683 6665099 6325189 1682059 -1974366 -1526776 365651 325876
40785 325876 -378345 1397567 4936482 6650882 5578562 3757390 1683072 -2073962
40777 -2073962 -6363741 -7277132 -3897352 76041 2267869 4688409 8276950 9238494
40769 9238494 5048907 2581 -635893 1080525 -384096 -3993717 -3339813 2153061
40761 2153061 4917647 445472 -5935985 -7398658 -5221484 -4909074 -6732508 -6368425
40753 -6368425 -3147098 -1349638 -2870863 -3944655 -1195348 2940472 3744193 941974
40745 941974 -1141489 549565 4328335 6453711 5390960 2437154 -628111 -2907145
40737 -2907145 -3627395 -1792022 2321504 6181886 7037686 5062985 3349203 4262875 6620657
40728F620657O24097k327306l067048r04396J304388P83856j487261j921290P72034
40719C97731L491723K851870l1395j205963K69012J142010p86145l246564l081946
40710a99667q48271O45958P77075J093832J565040K21021k718930l447237M07554
40701b503625N175719M789047j068575n803153m428459j36003R21733r26530R3987
40692c885859N040720P513314L523803j914912k734825j279606l315643p209734
40684d262742o152730J69515M497950L192001N95209M17386L69092j592455k699856
40675e466630r88028P59125Q04629K027035N049495M345789k588102q180035m689796
40666h926518L423471N719805J234080j643486O35252K455991n8389k787526j386061
$$ plain form
40728 6620657 7244754 4917448 1850400 946004 2250392 3034248 1546987 -374303 397731
40719 397731 3889454 6741324 6709929 5503966 5772978 6914988 6128843 2882279 -199667
40710 -199667 -1047938 -401980 375095 1468927 3033967 3254988 536058 -2911179 -2503625
40701 -2503625 2672094 7461141 6392566 589413 -3839046 -3975049 -3053316 -3979846 -3885859
40692 -3885859 1154861 8668175 12191978 10277066 7542241 6262635 2946992 -4262742
40684 -4262742 -10415472 -10245957 -5748007 -2556006 -1960797 -1543411 -1174319 -2766774 -5466630
40675 -5466630 -6454658 -5695533 -4890904 -2863869 2185626 6531415 3943313 -4236722 -8926518
40666 -8926518 -5503047 216758 1450838 -192648 442604 2898595 2840206 52680 -1333381
40657a333381J737883K259875O45673m5467N18892N73181q1357j78919M24548
40648D520928M29816j049331l145929l535208o61230L540285M718205J606287
40640F423823j597950r37035J548720J395667j175403k441722j870932k161955
40632h16787l292577k315563O54097J895921L87434p24859p3125q5345j547753
40623e918557j601554P32385K257847J326046P95836K379287K987998L03061k462270
40614H00079j471970J674155K885182J607610P5364p94030j116335j93669J516476
40605D982862J129019k304748m632607j828726L621296N716287K891400j008942
40597H565841k680308k426685j743544j225831r31360m89049Q04239K360338K131761
$$ plain form
40657 -1333381 404502 2664377 3310050 3264583 3783475 4356656 4275299 4096380 4520928
40648 4520928 4950744 3901413 755484 -2779724 -3440954 99331 4817536 6423823
40640 6423823 4825873 3888838 5437558 6833225 5657822 3216100 1345168 -816787
40632 -816787 -4109364 -6424927 -5770830 -3874909 -3487475 -4212334 -4285459 -4370804 -5918557
40623 -5918557 -7520111 -6787726 -4529879 -3203833 -2407997 -28710 2959288 3262349 800079
40614 800079 -671891 1002264 3887446 5495056 5570420 4776390 3660055 3466386 4982862
40605 4982862 6111881 3807133 -825474 -2654200 967096 6683383 9574783 8565841
40597 8565841 5885533 3458848 1715304 489473 -441887 -930936 -126697 2233641 4365402
40588D365402p5491j187210O71664K569822J050140k011062k108578N64458J363838
40579E202983j187493k885697n24955K850272K164445k400673n396313l161829
40571e339260J406139K498977r57635l570344o89025M751508N878971J504824
40563E484155k324743j109510K514453M056007L340557K003421q35419n597380
40555G531541q223821m824786J341578L140515o59654l938969j908139L080609
40547d461126N361814K503998k707945m902625j162788M920838O111801P97184
40539F461151l618717n22271N947904O540509J70375n482039n706389l457251
40531C33272j825087L30227L108924L248507L57149r13930J377176K507595q80907
$$ plain form
40588 4365402 4289911 3102701 3774365 6344187 7394327 5383265 3274687 3839145 5202983
40579 5202983 4015490 1129793 604838 3455110 5619555 3218882 -2177431 -5339260
40571 -5339260 -3933121 -1434144 -2391779 -5962123 -6651148 -1899640 3979331 5484155
40563 5484155 3159412 2049902 4564355 8620362 11960919 13964340 13128921 7531541
40555 7531541 -692280 -5517066 -4175488 -1034973 -1694627 -5633596 -7541735 -4461126
40547 -4461126 900688 3404686 696741 -4205884 -5368672 -447834 5663967 6461151
40539 6461151 2842434 2320163 8268067 14808576 14978951 9496912 3790523 333272
40531 333272 -1491815 -1161588 1947336 5195843 5552992 4639062 6016238 8523833 7642926
40522G642926m442157k917233J499664L120736J267426o72160j389474j390995
40514B718733L61716L815825M583753m63620o548685o490086j239435K040787
40506a221012J352666J452235L763493L218109k126678n968976k910350L002851
40498E62338M182332n1072m144114m674040k975579j029750O34174J457107Q87547
40489e151057k08564n69864k77168L80335K031083L858288K542517k814664o846937
40480g056031l789793L844689P638432M268711j141321l381630l200472k971963
40472e789378j917774O85419K042760J01617k049949p43407J977561J675815r15640
40463d932976j277758R76566J547484q97737k297494L0364L159242L294404P13764
$$ plain form
40522 7642926 3200769 283536 1783200 4903936 6171362 5499202 4109728 2718733
40514 2718733 3080449 6896274 11480027 11016407 4467722 -2022364 -3261799 -1221012
40506 -1221012 131654 1583889 5347382 8565491 6438813 469837 -2440513 562338
40498 562338 4744670 4693598 549484 -4124556 -7100135 -8129885 -7495711 -6038604 -5151057
40489 -5151057 -5359621 -5929485 -6206653 -5826318 -3795235 63053 2605570 -209094 -7056031
40480 -7056031 -10845824 -7001135 637297 4906008 3764687 383057 -2817415 -5789378
40472 -5789378 -7707152 -7021733 -4978973 -4877356 -6927305 -7670712 -5693151 -4017336 -4932976
40463 -4932976 -6210734 -5234168 -3686684 -4584421 -6881915 -6851551 -3692309 -397905 315859
40454C15859k114134l659183k726628J265221N277586M321050j063021l672988
40446b056238K05495M404012K061374l139222k371273M086226O600729O70197
40438A0461300o379431o058450J84922M562569L354218m84648k603441j590136
40430A446903P89412J592156j06191j525874K06608K910230J676457l020621m684853
40421g15773n79328L309809J244935l284030l386742K58531J509260k87753L74974
40412a556117M705436O611445K609678k376636l114101j969283l446375n494346
40404d030299k884045L197709N846351K568936j347255q93820K240547L534477
40396H232601J955992m27708k348397l798302m309690l493649k231542j177173
$$ plain form
40454 315859 -1798275 -5457458 -8184086 -6918865 -1641279 2679771 1616750 -2056238
40446 -2056238 -1850743 2553269 4614643 1475421 -895852 3190374 9791103 10461300
40438 10461300 4081869 -1976581 -1791659 2770910 6125128 5640480 3037039 1446903
40430 1446903 2236315 3828471 3722280 2196406 2403014 5313244 6989701 3969080 -715773
40421 -715773 -1295101 2014708 3259643 -24387 -3411129 -3152598 -1643338 -1931091 -1556117
40412 -1556117 3149319 9760764 12370442 9993806 6879705 4910422 1464047 -4030299
40404 -4030299 -6914344 -3716635 2129716 4698652 3351397 2457577 4698124 8232601
40396 8232601 10188593 9760885 7412488 3614186 -695504 -4189153 -6420695 -7597868
40388g597868P22361L954687N990813M031219m04959k752615j385828O47812M66952
40379C672574j083273k026499k586586l657514l896933j152546L779554P086189
40371A34966N908202J261460l037815l795896j203989J372446R86941j390207
40363B36108k226664m23501J169380J61020j879840k196948r76568k01225l7829
40354f376067P53194J904309K066388J436382J142920O80207j008645k404686
40346a805998q56199K697385L948088J058255k732749l526195j280334J272821
40338a224926K037494P02770j690474l253827k645464n14182J472180K648567
40330b467862K994305J901588m38306j777185q35385P8253q82744p03056L527266
$$ plain form
40388 -7597868 -6875507 -2920820 3069993 7101212 6696253 3943638 2557810 3205622 3672574
40379 3672574 2589301 562802 -2023784 -5681298 -9578231 -10730777 -6951223 134966
40371 134966 6043168 7304628 4266813 470917 -733072 639374 1626315 236108
40363 236108 -1990556 -2414057 -1244677 -1083657 -2963497 -5160445 -6137013 -6338238 -6376067
40354 -6376067 -5622873 -3718564 -1652176 -215794 927126 1607333 598688 -1805998
40346 -1805998 -2662197 35188 3983276 5041531 2308782 -1217413 -2497747 -1224926
40338 -1224926 812568 1515338 -175136 -3428963 -6074427 -6588609 -5116429 -2467862
40330 -2467862 526443 2428031 1989725 212540 -622845 -544592 -1427336 -2130392 1396874
40321A396874P416857M492769k281898l368317J930272L370949l186019p645668
40313B125819j749935O651826N605697k199695m752595r9408K496731q98880l811694
40304C367866j870324Q30009O14820l7303R44539J056253q56645j609788R2028
40295B531455J012855q4705J06807K527630L183141P79583j67504K269103L144409
40286A5302774n60861l976219k760501o91757k295546m081792p21039M987395
40278E202454O282330K913171j37597j299290k355706k490792O2334K523843J000821
40269A1701568k407698k943767j532488k341635m110477k284553J583633J606341
40261g29076j606152j237332L727621O072966K095501k847278l455062j273573
$$ plain form
40321 1396874 8813731 13306500 11024602 7656285 9586557 12957506 9771487 2125819
40313 2125819 375884 7027710 12633407 10433712 5681117 5581709 8078440 7179560 3367866
40304 3367866 1497542 2327551 2942371 2905068 3849607 4905860 4049215 2439427 2531455
40295 2531455 3544310 3459605 3566412 6094042 9277183 10056766 9889262 12158365 15302774
40286 15302774 14741913 10765694 8005193 7313436 5017890 936098 215059 5202454
40278 5202454 11484784 14397955 14260358 12961068 10605362 8114570 8176904 10700747 11701568
40269 11701568 9293870 6350103 4817615 2475980 -1634497 -3919050 -2335417 -729076
40261 -729076 -2335228 -3572560 155061 6228027 8323528 5476250 2021188 747615
40253G47615P57587K880981M119649Q97947n619812p896911k591725L706334M337260
40244A338925J863879J903060L634814K963576L29107j203149j785335k711428
40236F333449k273937M75322J803233p53320k707748K56508L697207J075685m439478
40227C466921m204299J741071M702332J454574j636681m13627O72785k220085
40219C562991m878337k263260K740438L770330N04018j764499j61595K717678
40211D227764L304844J445847j12846O55046K325327J484693k374933n069575
40203E886167l067370J087293K110069n77091k867484k482259p21142J689182
40195A057365N002000O615460K954544l570238n562560p30860M751604N490719
$$ plain form
40253 747615 1505202 4386183 8505832 9403779 3783967 -4112944 -6704669 -2998335 1338925
40244 1338925 3202804 5105864 8740678 11704254 12033361 10830212 9044877 6333449
40236 6333449 4059512 4534834 6338067 5584747 2876999 3133507 6830714 7906399 3466921
40227 3466921 -737378 1003693 5706025 7160599 5523918 5110291 5783076 3562991
40219 3562991 -1315346 -3578606 -838168 2932162 3436180 1671681 1510086 4227764
40211 4227764 7532608 8978455 8865609 9520655 11845982 13330675 10955742 5886167
40203 5886167 2818797 3906090 6016159 5439068 2571584 89325 -631817 1057365
40195 1057365 6059365 12674825 15629369 12059131 6496571 5765711 10517315 16008034
40187A6008034L627480L078460K898451R63593o19842J011557M152094N324784
40179C6444611M237557J896511k465245q028900r924778n605515l11270k90493
40171A5952478l518979l512556J55173K214025R75887j55550M5942p94915k349375
40162I012130j014087K921479M162763O07441l224470l275110r81843J133964
40154I342267L343778N299550M237718K10258j916540K74886K258659j16970l488971
40145A9444635k767725p940o83140l821867l479754Q76943L204297R31373j175989
40136A2520833L79542K069188J54893k433254j446007P07270j075322n026966
40128E850177m331779J525281M720211Q82462l783075j934164L560277M379272
$$ plain form
40187 16008034 19635514 22713974 25612425 26576018 25956176 26967733 31119827 36444611
40179 36444611 40682168 42578679 40113434 32084534 22159756 16554241 16242971 15952478
40171 15952478 12433499 8920943 9076116 11290141 12266028 12110478 12156420 11361505 9012130
40162 9012130 7998043 10919522 15082285 15689726 12465256 9190146 8208303 9342267
40154 9342267 12686045 17985595 22223313 22433571 20517031 20791917 23050576 22933606 19444635
40145 19444635 16676910 16668970 15985830 12163963 8684209 9561152 12765449 13696822 12520833
40136 12520833 12900375 14969563 15124456 12691202 11245195 11952465 10877143 5850177
40128 5850177 1518398 3043679 7763890 8646352 4863277 2929113 6489390 10868662
40120A0868662j59755k630407K44464K943376J048645j598117k64582K136465
40112A2588751L07596l638631l130980J802811M020839K95067l978751l200857
40104E065845Q48172K806017J008288k046566l565619k333846Q82978L126228
40096E791497J965892n66517j51332K814778L108891n15212k100061K116570O624606
40087A9089112M708614q99293k586784m8911K66240l250615m918228j901674J223709
40078A1682170O56918r68092p34802q92068l434223m638559p77792M615474N283414
40069A0792440J496873j133807l84770R40892J139049J355792J203276j441062
40061A3968683n209719n371847j104090K317299J053887k035273k554313q30135
$$ plain form
40120 10868662 10708907 8078500 8322964 11266340 12314985 10716868 10452286 12588751
40112 12588751 12896347 9257716 6126736 7929547 11950386 12245453 8266702 5065845
40104 5065845 5914017 8720034 9728322 7681756 4116137 1782291 2665269 5791497
40096 5791497 7757389 7190872 7039540 9854318 12963209 12447997 10347936 12464506 19089112
40087 19089112 23797726 22898433 20311649 20262738 20528978 17278363 12360135 10458461 11682170
40078 11682170 12339088 11370996 10636194 9744126 6309903 1671344 893552 5509026 10792440
40069 10792440 12289313 11155506 10770736 11711628 12850677 14206469 15409745 13968683
40061 13968683 8758964 3387117 2283027 4600326 5654213 3618940 1064627 234492
40053B34492M53403J145649K081698J770859q40050k765548r62658K037661J646784
40044D802290j114869j228107J735019K946659P12574j000717q6527K11878j716733
40035E261467j794528K300247N350882K317221k559198j535261M398890O784858
40027B0524578K505385k242555j993590O57497M74425k857371n906094o571677
40019D590598m868621j349741K445197L983340K528120L97214j69063L63708O39442
40010H560194O72490O68368k59327k261930l479776k561841q99418m23150n40564
40001e24954P20594L360180M946102L349708p14383l637210k004279K963142N283358
39992A3742258J268392m482468m399203J248145M539470J818909j245980M97052
$$ plain form
40053 234492 687895 1833544 3915242 5686101 4846051 2080503 1117845 3155506 4802290
40044 4802290 3687421 2459314 4194333 7140992 7853566 6852849 6766322 6978200 5261467
40035 5261467 3466939 5767186 11118068 13435289 10876091 9340830 13739720 20524578
40027 20524578 23029963 20787408 18793818 19451315 19925740 17068369 11162275 4590598
40019 4590598 -278023 -1627764 817433 4800773 7328893 7726107 7557044 7920752 8560194
40010 8560194 9232684 9901052 9641725 7379795 3900019 1338178 438760 15610 -524954
40001 -524954 195640 3555820 8501922 11851630 11137247 7500037 5495758 8458900 13742258
39992 13742258 15010650 10528182 6128979 7377124 11916594 13735503 12489523 12986575
39984A2986575L451864J988210k142307l428843j477762L10189J402827K568880
39976A5659633J051068m717252q412100l221524N565848N945174k442249o715930
39968B712668m35641O577458M020307l428174m935166k26835K340659k17797l083568
39959C323911k923510j137544J056165L414164L369297j172744o317472o102320
39951f490053j482353J306279R58636K161490N887978O758151K473555j653051
39943I920632j276027M77303m76611k014481m87863K197593K079649J82459L7770
39934A0640424P55434j142687m371600l764496J265501M755449K195790l605018
39926F728797o455149l842299J289028L944453J651773k907415m203638m84208
$$ plain form
39984 12986575 16438439 18426649 16284342 12855499 11377737 11687926 13090753 15659633
39976 15659633 16710701 11993449 3581349 359825 5925673 11870847 9428598 2712668
39968 2712668 2277027 8854485 12874792 9446618 4511452 4284617 6625276 6407479 3323911
39959 3323911 400401 -737143 319022 3733186 7102483 5929739 -387733 -6490053
39951 -6490053 -7972406 -6666127 -5707491 -3546001 2341977 9100128 11573683 9920632
39943 9920632 8644605 9121908 8645297 6630816 6142953 8340546 10420195 10602654 10640424
39934 10640424 11395858 10253171 5881571 2117075 3382576 8138025 10333815 6728797
39926 6728797 273648 -3568651 -2279623 1664830 3316603 409188 -3794450 -4278658
39918d278658L264252J786637k629014l200535J209644M533585L027832N66636
39910D280379J559102L714278K377637j546922l285882j751791o1636O03247K165888
39901H054300M268216L211941j573343m715664k162438K185740J819354k281223
39893H806883k582510L453994Q454615N034828l530945p639002m357183j13630
39885G527050j59316j663936j89616K404802J613555j676001k779638j127509
39877C949391m47597j546417j206711J048074J486865o82706j030063K193939
39869C764775M013334R33566k509826j125207J896074L74544l960941m057274
39861f70955O59145L413259J201492j139879L24604K891074K933275J339725R8416
$$ plain form
39918 -4278658 -1014406 772231 -1856783 -5057318 -3847674 685911 3713743 4280379
39910 4280379 5839481 9553759 11931396 10384474 7098592 5346801 5285165 5888412 8054300
39901 8054300 12322516 15534457 13961114 9245450 7083012 9268752 11088106 8806883
39893 8806883 6224373 9678367 18132982 23167810 19636865 11997863 7640680 7527050
39885 7527050 7367734 5703798 5514182 7918984 9532539 7856538 5076900 3949391
39877 3949391 3501794 1955377 748666 1796740 3283605 2600899 1570836 3764775
39869 3764775 7778109 8711675 6201849 5076642 6972716 7347260 3386319 -670955
39861 -670955 -11810 3401449 4602941 3463062 3787666 6678740 9612015 10951740 11050156
39852A1050156j333036k944825k222928J146294K897197L02950l115921k841594
39844B938293J86937K290317K818686K984590K160283l0085q82935J092829J868113
39835A5427028k314350p176192n332109K003805N680771J712170l539070l576065
39827B885988m63240N73802l56728K0432J296627N98389j181061j76284L480024
39818F677949M716657J070932l068787k551365J161142K462666O5615j462508
39810I072301O84633K827644O98410l226351l071698J192852L544918J457571
39802A3180280l43088J816414M234672K344335j183499r67795J667761J003147
39794B1752227k778424l337826J148432M566801K637053m92813N72915L918358
$$ plain form
39852 11050156 9717120 6772295 4549367 5695661 8592858 8895808 5779887 2938293
39844 2938293 3125230 5415547 8234233 11218823 13379106 13349021 12466086 13558915 15427028
39835 15427028 13112678 5936486 604377 2608182 8288953 10001123 6462053 2885988
39827 2885988 2422748 2996550 2639822 2660254 3956881 4555270 3374209 3197925 6677949
39818 6677949 11394606 12465538 9396751 6845386 8006528 10469194 10534809 9072301
39810 9072301 9756934 12584578 13282988 10056637 6984939 8177791 11722709 13180280
39802 13180280 12837192 14653606 18888278 21232613 20049114 19081319 20749080 21752227
39794 21752227 18973803 15635977 16784409 21351210 23988263 23495450 24068365 27986723
39786B7986723L897898j57508l801383m119779k169405J58440J994115K673381
39778B6462482J981661R98590P53326P89169O46757J232836K689082K763008M3977
39769C8360888k821240k463724j89511k56325l093320m237912q79593M003069
39761B8422332N735170L661490Q30337l11585J66362J219307K296929L036585
39753D5056927K665989N83055k373330l747824j463277L642034P986333Q565434
39745F0915341N617126J686740q71919p57699K380573P091967R991707Q684103
39737I4737939M898874K873660M284984O625551P387294P896596J1024685J6095810
39729A55825393J8909567J7682740J6436115J9775333K5459847K6016368J8511934
$$ plain form
39786 27986723 31884621 31727113 27925730 23805951 21636546 21794986 23789101 26462482
39778 26462482 28444143 29442733 30196059 30985228 31631985 32864821 35553903 38316911 38360888
39769 38360888 35539648 33075924 32886413 32630088 29536768 25298856 24419263 28422332
39761 28422332 34157502 37818992 38649329 38337744 38504106 39723413 42020342 45056927
39753 45056927 47722916 48305971 45932641 42184817 40721540 44363574 52349907 60915341
39745 60915341 66532467 68219207 67347288 66589589 68970162 76062129 86053836 94737939
39737 94737939 99636813 102510473 106795457 113421008 120808302 128704898 139729583 155825393
39729 155825393 174734960 192417700 208853815 228629148 254088995 280105363 298617297
39722B98617297Q565404J954928l644702j3375427k4463098k8278217k3380122
39715B15996063j8631788k0223169k2734984j8532601j0287528o712816r141987
39708A09731190j0521992p060750l173795l367212n498891m920995j012356L211156
39700G7386355N230222M811496L712161M513465P744181J0262127R201672O870598
39692A29732277P808347J1406242J2586971J0447302J0419704J5695821K2033633
39685B20130297K4293896K3024429K0456764J4721481L573019r293700j7505565
39678B79400621k0090066k1266142k3208652k3896489k1936654j9083108j7229637
39671A32689873j6040092j4274115j1520114q645795p687162r871043j2439175
$$ plain form
39722 298617297 307182701 309137629 305492927 292117500 267654402 239376185 215996063
39715 215996063 197364275 177141106 154406122 135873521 125585993 118873177 109731190
39708 109731190 99209198 92148448 88974653 85607441 80108550 75187555 74175199 77386355
39700 77386355 82616577 87428073 91140234 95653699 103397880 113660007 122861679 129732277
39692 129732277 137540624 148946866 161533837 171981139 182400843 198096664 220130297
39685 220130297 244424193 267448622 287905386 302626867 306199886 296906186 279400621
39678 279400621 259310555 238044413 214835761 190939272 169002618 149919510 132689873
39671 132689873 116649781 102375666 90855552 82209757 74522595 64651552 52212377
39664E2212377j0292167l320944J399170j169326n974868m749187J507711L954228
39656C3566994q17004o243850n744628o97914L690707M869581K729178k050805
39648B9302259o498153o442165j965944J874623J976748Q05250R64145R32685
39640B0949448p16840j521471N28429K799224K209852R4321r93927j636884k623085
39631A9089067j706210J815169L245609r12827n908728m880121O00789L229251
39623A4571999J297549l38514L45125L30783q78961L51985M059323M925033J074854
39614B5739176k189904q82756J655863J222156m11241K10164J776084J099093
39606B8218635j066414j845318j162502o91897l73715L52552M54276j80955P24425
$$ plain form
39664 52212377 41920210 38599266 39998436 38829110 32854242 28105055 29612766 33566994
39656 33566994 32749990 26506140 20761512 20063598 23754305 28623886 31353064 29302259
39648 29302259 22804106 16361941 14395997 16270620 18247368 19052618 20016763 20949448
39640 20949448 20232608 18711137 19239566 22038790 24248642 24342963 23349036 21712152 19089067
39631 19089067 17382857 19198026 22443635 21530808 15622080 10741959 11342748 14571999
39623 14571999 15869548 15531034 15876159 16206942 15327981 15679966 19739289 24664322 25739176
39614 25739176 23549272 22666516 24322379 25544535 25133294 25343458 27119542 28218635
39606 28218635 27152221 25306903 24144401 23452504 23078789 23431341 23885617 23704662 24429087
39597B4429087L201922K725653k820104p660869n553510L67365K077009j038145
39589A5728408k190327R48882K731568l58951l764255k658012M95817Q51772r69940
39580A0814962j055774Q53014J609759J29123j778070k886977k935982o21445
39572D128610M417593Q055248N085064k725253o725867k211494M736631N205410
39564A9965942n61483m460134k785901p77307l112278o045661l841014J234254
39556c83582K067815j815657l284078J008904N309020L943102k16518j230806
39548E398200O27320R90701l21481J69939K104367J176585k920236m797078j637387
39539G90930K308254K513426P73887R90587K115544N37121k578598k306629J528941
$$ plain form
39597 24429087 27631009 30356662 27536558 19875689 14322179 14689544 16766553 15728408
39589 15728408 13538081 14486963 17218531 16859580 13095325 10437313 10933130 11784902 10814962
39580 10814962 9759188 10612202 12221961 12351084 10573014 7686037 4750055 4128610
39572 4128610 8546203 16601451 21686515 18961262 12235395 10023901 14760532 19965942
39564 19965942 19404459 14944325 12158424 11381117 8268839 2223178 -1617836 -383582
39556 -383582 1684233 -131424 -3415502 -2406598 2902422 6845524 6629006 5398200
39548 5398200 6025520 7016221 6694740 6864679 8969046 10145631 7225395 2428317 790930
39539 790930 3099184 5612610 6386497 7377084 9492628 10029749 7451151 5144522 6673463
39530F673463K716170j947110o395120l160219N097123P947317J338217o553337
39522E716504o440011L2451M170546K716063N5059o85163j523405l487878l427407
39513b873241j02355K177559K22815k244088l20006M030932M943980J402973k127728
39504E110841k559791j135664k86499j222151l720167n356654k886200K470933
39496i585352M181774q12270n938950l598573L163400N204913J573016J63050
39488e648992L923063O065031J901503l339614l456506q79337j156386l127819
39480e719057j602388L099397N149156K192026j297404p64694K204211K635930
39472E897177o28431l197022j379753J964002J121502l340734m250516J248008
$$ plain form
39530 6673463 9389633 7442523 1047403 -2112816 2984307 10931624 12269841 5716504
39522 5716504 -723507 -691056 3479490 6195553 6250612 5565449 4042044 554166 -2873241
39513 -2873241 -2975596 -798037 -575222 -2819310 -3139316 891616 5835596 7238569 5110841
39504 5110841 2551050 1415386 1128887 -93264 -3813431 -9170085 -12056285 -9585352
39496 -9585352 -5403578 -6215848 -12154798 -15753371 -12589971 -7385058 -5812042 -5648992
39488 -5648992 -1725929 4339102 6240605 2900991 -555515 -1434852 -2591238 -5719057
39480 -5719057 -7321445 -4222048 927108 3119134 1821730 1057036 3261247 5897177
39472 5897177 5268746 2071724 691971 2655973 3777475 436741 -3813775 -2565767
39464b565767O288805M542853R2097k69941O27426m000497j0193449p057815M514288
39455h022000J0345097L715180m919003m677651Q18835K874096J733321J879371
39447C747246J800299j342082l378959K66972M803746K923409k830865m489336
39439A500430j851043j095291k828053j818268K497063M780470K837096k69212
39431C753192k583588m196416l080717K102707O409906M104431j537035k525770
39423B446710J039633J898661j448818k974595n94908R69235Q2616O68163K831049
39414D917746J354463l650409m903433m05302K443492l98155k903750n19912J647525
39405b417735q94078l020906L59571L976684J130745l793117k236146L946323
$$ plain form
39464 -2565767 3723038 8265891 8357988 8088047 8715473 4714976 -5478473 -12536288 -8022000
39455 -8022000 2323097 6038277 1119274 -3558377 -2739542 134554 1867875 3747246
39447 3747246 5547545 4205463 826504 1093476 5897222 8820631 5989766 1500430
39439 1500430 -350613 -1445904 -4273957 -6092225 -3595162 1185308 4022404 3753192
39431 3753192 1169604 -3026812 -6107529 -4004822 2405084 6509515 4972480 2446710
39423 2446710 3486343 5385004 3936186 961591 366683 1335918 1418534 2086697 4917746
39414 4917746 6272209 2621800 -2281633 -2686935 -243443 -641598 -3545348 -4065260 -2417735
39405 -2417735 -3311813 -6332719 -5973148 -1996464 -865719 -4658836 -6894982 -2948659
39397b948659N610545J223022j877997j70297J880165J058633J97096J594149
39389F566657K570695N27264k552887l503154k452113j583177j716136j844461
39381c987312p88167J461607L334836K980777P41224q32620m74768j7153j251007
39372A167417k901727k641641m27391K002981L311948K727923J07457k607949
39364G39018k417884N38013K459603J331825k13102M43873J904821K030077J487174
39355H303418Q73644j687037o016849o978217j415922N200632N214680j82541
39347C311808k812893M49082M038869K771151j280506k976674r87443J824375
39339D337769K400832K89096k160409k031327O46578K478020J185043j300195
$$ plain form
39397 -2948659 2661886 3884908 2006911 1836614 3716779 4775412 4972508 6566657
39389 6566657 9137352 9664616 7111729 3608575 1156462 -426715 -2142851 -3987312
39381 -3987312 -4775479 -3313872 20964 3001741 3742965 2910345 2435577 2418424 1167417
39372 1167417 -1734310 -4375951 -4803342 -2800361 511587 3239510 3346967 739018
39364 739018 -1678866 -1140853 1318750 2650575 2437473 2881346 4786167 6816244 8303418
39355 8303418 9177062 7490025 1473176 -5505041 -6920963 -1720331 3494349 3311808
39347 3311808 498915 947997 4986866 7758017 6477511 3500837 2513394 4337769
39339 4337769 6738601 7027697 4867288 2835961 3482539 5960559 7145602 5845407
39331E845407k321185k577766l476550l010396J093823N872073O087591K011789
39323I524786j065522r79084p84902k063252j984948P99936K544837L6265l918309
39314B109807m288968p09633K782353L456309K421164J978706K556532K421839
39306A2728109k65634m811331p499537n065552J105673N753800N202044P16037
39298G863609l836129n931878n312754k719305P45617L527737M066800J845383
39290B49080j702681l480492j178080L692108O366288L835591j506647m575414
39282A699753l168968M69503K679206J537152j876066l854384j224045M051234
39274C13385N515379L28833n413946l782466L784106P796127L731097k098853
$$ plain form
39331 5845407 3524222 946456 -2530094 -5540490 -4446667 1425406 7512997 9524786
39323 9524786 8459264 7480180 6695278 4632026 2647078 3447014 5991851 6028116 2109807
39314 2109807 -2179161 -2888794 -106441 3349868 5771032 7749738 10306270 12728109
39306 12728109 12462475 7651144 151607 -4913945 -3808272 1945528 7147572 7863609
39298 7863609 4027480 -1904398 -7217152 -9936457 -9190840 -5663103 -1596303 249080
39290 249080 -1453601 -4934093 -6112173 -2420065 3946223 7781814 6275167 1699753
39282 1699753 -1469215 -999712 1679494 3216646 1340580 -2513804 -3737849 313385
39274 313385 5828764 6157597 743651 -3038815 745291 8541418 12272515 10173662
39266A0173662k375023P77581K43419m321143n838067j136277L443088J260801
39258B228041m219338m019926K841688P187220K855326m204466m756906M43845
39250a644516K994810k6631l213034k941979k096440k670735j537769K565926
39242h570368M772764J758778k229934k320739l79358K98841J748525N645808
39234G24317O529198k55267q116897p019491Q41656M112039N7043k427131J178963
39225d375570L900489K44139m330486l180225P53557J231995o34844K43748L266591
39216b880606L427506p290k683787k127004l09781N07470N02923P02910J351236
39207a516423J975775J727092K31237j386146j788037j731852k611522k974383
$$ plain form
39266 10173662 7798639 8576220 8819639 4498496 -1339571 -2475848 967240 2228041
39258 2228041 -1991297 -6011223 -3169535 4017685 6873011 2668545 -2088361 -1644516
39250 -1644516 1350294 1323663 -1889371 -4831350 -6927790 -9598525 -11136294 -8570368
39242 -8570368 -3797604 -2038826 -4268760 -6589499 -6968857 -6670016 -4921491 724317
39234 724317 7253515 6998248 -1118649 -8138140 -7296484 -3184445 -3127402 -5554533 -4375570
39225 -4375570 -475081 -230942 -4561428 -7741653 -6988096 -5756101 -6390945 -6147197 -2880606
39216 -2880606 546900 539610 -2144177 -4271181 -4580962 -4073492 -3570569 -2867659 -1516423
39207 -1516423 459352 2186444 2417681 1031535 -756502 -2488354 -5099876 -8074259
39199h074259l58505L193673K584143j962459l702481N76502N065018L832723
39191A154355p6023k88250K334667J919180j838521k872462J276878N327455M097500
39182A1034779m43731k789675j387458N09724L8944j856883k374175p19545J040108
39173C052088Q94803n34056j259536p76287j10937J22164j83871j467959l011177
39164c274768j982810K504036N715825K593829l827402n319855m25617L240126
39156g76636P68770l071851k557310M1245j39959j748740n38092K440922K848025
39147b733626O49355o67373m18927l06721L09319K654313L961207J083401k864223
39138A666725k296222J498095K124073j162330k370887O02311K296278p59992
$$ plain form
39199 -8074259 -8432764 -5239091 -2654948 -4617407 -8319888 -7743386 -2678368 1154355
39191 1154355 1078332 790082 3124749 5043929 3205408 332946 1609824 6937279 11034779
39182 11034779 10591048 7801373 6413915 6923639 6962583 5105700 2731525 2011980 3052088
39173 3052088 3946891 3412835 2153299 1377012 1266075 1388239 1204368 -263591 -3274768
39164 -3274768 -5257578 -2753542 2962283 5556112 1728710 -3591145 -4016762 -776636
39156 -776636 -7866 -3079717 -5637027 -5595782 -5735741 -7484481 -8022573 -5581651 -2733626
39147 -2733626 -2084271 -2751644 -3170571 -3477292 -3167973 -513660 3447547 4530948 1666725
39138 1666725 -629497 868598 2992671 1830341 -540546 61765 2358043 1598051
39130A598051m080777k717751J223347K985081K312687J657750J107851k07587
39122C878652o16411J476223L436693J353813l818329o906386n060517p28840
39114f985102J837255Q70863j953812l218245q13895L465185N241525K685315
39106A129089r46279j487778P72149K008380J78168k899220m377997l182716j43308
39097h949512K677303K846954k09304l649524l884564j134310Q99843M97024K12828
39088a0693262K026263L205196M70499l686200l586429R96728L983337K195077
39080e088791J16713K153953M997403L046814j965784l448011m99573J155932
39072D68656j018064k783356j109352J008670P28455K27408J503206J930820k94411
$$ plain form
39130 1598051 -2482726 -5200477 -3977130 -992049 1320638 2978388 4086239 3878652
39122 3878652 3262241 4738464 8175157 9528970 5710641 -1195745 -6256262 -6985102
39114 -6985102 -5147847 -4276984 -6230796 -9449041 -10262936 -6797751 -1556226 1129089
39106 1129089 182810 -1304968 -532819 1475561 1653729 -1245491 -5623488 -8806204 -8949512
39097 -8949512 -6272209 -3425255 -3634559 -7284083 -11168647 -12302957 -11403114 -10906090 -10693262
39088 -10693262 -8666999 -5461803 -4991304 -8677504 -12263933 -11267205 -7283868 -5088791
39080 -5088791 -4972078 -2818125 2179278 5226092 3260308 -187703 -687276 468656
39072 468656 -549408 -3332764 -4442116 -3433446 -2704991 -2477583 -974377 956443 662032
39063F62032j455826J319596L578424J31660n354835m911882J510114O047923
39055A527206M614106J127689n04386j404737k883940l105645j467813r18409
39047c015929k680011l287115l62207K721892J913939j044677j603170L58852
39039f998426R35466r81024j789259J021861M560087M142793l49544m049929l144610
39030f652585M37171J697043r40496l865449l240508M23453L720409M505117L107893
39021h07952R46623n39952q93598j595162m069579n941292k723556M752737Q806019
39012b065712M620526k328133l729831j15752J427847q33521j368334K520343
39004a872567O204737N345515J767695r26226k434171l626537l752287k590192
$$ plain form
39063 662032 -793794 525802 4104226 4235886 -1118949 -6030831 -4520717 1527206
39055 1527206 6141312 7269001 6764615 5359878 2475938 -629707 -2097520 -3015929
39047 -3015929 -5695940 -8983055 -9345262 -6623370 -4709431 -5754108 -7357278 -6998426
39039 -6998426 -6062960 -7043984 -8833243 -7811382 -3251295 891498 541954 -3507975 -6652585
39030 -6652585 -6215414 -4518371 -5458867 -9324316 -12564824 -12141371 -8420962 -3915845 -807952
39021 -807952 138671 -401281 -1294879 -2890041 -6959620 -12900912 -15624468 -10871731 -2065712
39012 -2065712 2554814 226681 -3503150 -3618902 -2191055 -3024576 -4392910 -1872567
39004 -1872567 4332170 9677685 11445380 10519154 8084983 4458446 706159 -1884033
38996a884033j750257j559492j86131K318869L080260J401565L61745J133652
38988B916178M04253l418351o004434l203390K359036N140818M161111K304979
38980D660200Q02036r54751j990259q89464O23457m19963l111006l295180M64842
38971d110088M719416N463419K347366j810859l937324k867889M4381K213936
38963B062358K272754R88293k86492r52283p77469K52909J251816J119667J63605
38954F095158n66755j218907k179855j964671N73034K608989N35666l265638k589267
38945a972246K526383M474641l21724n191324l354437J668323K138518j926291
38937a958157m144837k353261k79789L10227J980248N444864O943629L660751
$$ plain form
38996 -1884033 -3634290 -5193782 -5379913 -3061044 19216 1420781 1782526 2916178
38988 2916178 3320431 -97920 -6102354 -9305744 -6946708 -1805890 2355221 4660200
38980 4660200 5462236 4507485 2517226 1627762 2251219 1831256 -1279750 -4574930 -4110088
38971 -4110088 609328 6072747 8420113 6609254 2671930 -195959 -151578 2062358
38963 2062358 4335112 5323405 5036913 4084630 3307161 3560070 4811886 5931553 6095158
38954 6095158 5528403 4309496 2129641 164970 738004 3346993 3882659 617021 -1972246
38945 -1972246 554137 5028778 4707054 -484270 -3838707 -2170384 -31866 -1958157
38937 -1958157 -6102994 -8456255 -8736044 -8425817 -6445569 -1000705 5942924 9603675
38929I603675k089973n696381m948400j366796J444332J036781j113625j414002
38921d544389M57088R97870p92848j030210K089657M053742J493262j232281P24074
38912B215965L572818J037681m070190l905077R34624K389625r86958j922333
38904g33845J942964L369865j468504n413358j904846M166113M522373J38068
38896D618830j929638J0835J603677O82143n71178n24631J99568J149436K024638
38887G263680J272460j755684m556197m550952k758188j391230P817K532503M187055
38878B51264K306573j665495l644692k213116P28238L328251M593394L284690
38870F969107m54258l466030k930599l08401J137206J209616J620773J649321
$$ plain form
38929 9603675 7513702 1817321 -3131079 -4497875 -3053543 -2016762 -3130387 -4544389
38921 -4544389 -4087301 -3089431 -3882279 -4912489 -2822832 1230910 2724172 1491891 2215965
38912 2215965 5788783 6826464 2756274 -1148803 -214179 2175446 1188488 -733845
38904 -733845 1209119 4578984 3110480 -2302878 -4207724 -41611 4480762 4618830
38896 4618830 2689192 2700027 4303704 4985847 4414669 3890038 4089606 5239042 7263680
38887 7263680 8536140 6780456 2224259 -2326693 -5084881 -6476111 -6468294 -3935791 251264
38878 251264 2557837 892342 -2752350 -4965466 -4237228 -908977 3684417 6969107
38870 6969107 6514849 3048819 118220 -190181 947025 2156641 3777414 5426735
38862E426735o14550l620464l642967o37681J537105J022955p9382j81903m80083
38853a270235j679041k263002j467064o39343k08122J445525M346635N238548
38845C503901J851372l379754o097357m954382k009082L45170J179405Q89897
38837h670830O37211J152546J533756M60826j184299r51043J326004K728630J484857
38828a482342m61294p59991p8639K9654L67764K153773L530106J734829j832603
38819C201257k573555P29471L796695K763200p64056k736779k361708j768384
38811B86141j407896M86594L629492M493223J259795k636626k728270J67202J174397
38802D724052j329744l254681r96952K965335L374191o09224m552967m666237
$$ plain form
38862 5426735 4812185 1191721 -2451246 -3088927 -1551822 -528867 -608249 -790152 -1270235
38853 -1270235 -2949276 -5212278 -6679342 -7318685 -7526807 -6081282 -1734647 3503901
38845 3503901 5355273 1975519 -4121838 -9076220 -11085302 -10740132 -9560727 -8670830
38837 -8670830 -8033619 -6881073 -5347317 -4886491 -6070790 -7021833 -5695829 -2967199 -1482342
38828 -1482342 -1943636 -2703627 -2782266 -2752612 -2384848 -231075 3299031 5033860 3201257
38819 3201257 627702 1357173 5153868 7917068 7153012 4416233 2054525 286141
38811 286141 -1121755 -635161 2994331 7487554 8747349 6110723 3382453 3549655 4724052
38802 4724052 3394308 139627 -857325 2108010 5482201 4872977 320010 -4346227
38794d346227j817012P39285J352456P07990J66031O05705K112184L815071M317610
38785G653093K793177m01689m008678o265546n485026j497525L247187N151023
38777A186016K801109j539418m128743l197477j68598K165928K459291J735553
38769A313661J410153J023011p47377k973790k668726Q33818L982699L527970
38761E701419R24791m50550o12525j888196l825201l616796j347411q4238j56604
38752e355311J617894N402870O300998J915952k757204k315689Q74186O23991
38744F307687l392830n502933k743276J481893K899879J377308n53693j117605
38736a243570k44128R26359J097268N53223R23200J932078P23155l155001n151345
$$ plain form
38794 -4346227 -6163239 -5423954 -4071498 -3363508 -3197477 -2591772 -479588 3335483 7653093
38785 7653093 10446270 10044581 6035903 -229643 -5714669 -7212194 -3965007 1186016
38777 1186016 3987125 2447707 -1681036 -4878513 -5047111 -2881183 -421892 1313661
38769 1313661 2723814 3746825 2999448 25658 -2643068 -1809250 2173449 5701419
38761 5701419 6626210 6175660 5563135 3674939 -150262 -3767058 -5114469 -5198707 -5355311
38752 -5355311 -3737417 1665453 7966451 9882403 7125199 4809510 5683696 6307687
38744 6307687 2914857 -2588076 -5331352 -3849459 -949580 427728 -125965 -1243570
38736 -1243570 -1487698 -561339 535929 1089152 2012352 3944430 4667585 1512584 -3638761
38727c638761k100497J795531Q71970k614632k034493K108143K675329j611637
38719d549047l319894J267884N642323L712557p55143j288097J323796K821675
38711D856054L340081M181913K137830m580042r217881m757831L800917N503760
38703E264801q9312l211703k18943J898698q75235k955082l85290J743248p56247
38694D14935k797019Q57500N414561L538445k337941m061540o16768J765942M36342
38685B614457j004900l90481P7724p57021q15856Q43570K273731K049766M97215
38676E388205k301204n532772n510318K15527O895193O749902p8172m802254k042194
38667a018087L251879L795085m18352m352985n468283m533895k008410J708347
$$ plain form
38727 -3638761 -5739258 -3943727 -3071757 -5686389 -7720882 -5612739 -2937410 -4549047
38719 -4549047 -7868941 -6601057 -958734 2753823 1998680 710583 2034379 4856054
38711 4856054 8196135 12378048 14515878 9935836 717955 -4039876 -238959 5264801
38703 5264801 5175489 1963786 1744843 3643541 2768306 -186776 -572066 1171182 414935
38694 414935 -2382084 -1524584 3889977 7428422 5090481 1028941 412173 2178115 2614457
38685 2614457 1609557 1219076 1296800 539779 -276077 567493 2841224 4890990 5388205
38676 5388205 3087001 -2445771 -7956089 -7740562 -845369 5904533 5826361 1024107 -1018087
38667 -1018087 2233792 6028877 5610525 1257540 -4210743 -8744638 -10753048 -9044701
38659i044701M143477L076633J92332r44923R2241O57438l07836p20406J087504
38650a768241L535468L570387M08989l128919l260922L35915L355276J759810
38642D807763k549378l735781j09456L361287K333416q27963j414784K97698M68978
38633B631780j444775k187789o53458L85285p39928j898169q81984J336632K592296
38624h60110K201124M02837k289260l879019j795364L131014O043896L612443
38616F567561j743617n240894n325647l574668j161008J447298K763633J735025
38608d532317J48547L13530J093821n4698j683814K73624N108166O520561J549838
38599H737258m371803m909584j476617K30274o57860k56723K295111L291720J164629
$$ plain form
38659 -9044701 -4901224 -1824591 -1632259 -2577182 -2484941 -1827503 -2135339 -2855745 -1768241
38650 -1768241 1767227 5337614 5746603 2617684 -643238 -307323 3047953 4807763
38642 4807763 2258385 -1477396 -1586852 1774435 4107851 3279888 1865104 2162802 2631780
38633 2631780 1187005 -1000784 -1654242 -1268957 -2008885 -3907054 -4789038 -3452406 -860110
38624 -860110 1341014 1743851 -545409 -4424428 -6219792 -3088778 2955118 6567561
38616 6567561 4823944 -416950 -5742597 -9317265 -10478273 -9030975 -6267342 -4532317
38608 -4532317 -4383770 -4070240 -2976419 -3031117 -4714931 -4441307 666859 7187420 8737258
38599 8737258 4365455 -544129 -2020746 -1790472 -2448332 -2705055 -409944 2881776 4046405
38590D046405q03272j27430J164946O55493o52512j143366j608917k657678k381136
38581c507467K46031K531094J974344L49189L49064Q83772j67086j161680L17887
38572A815148J849614m84945m342802l409637K384943N827767L100712j152223
38564E588577j959433p62611m51060J16685J817718J168857l444442o261918k007035
38555f194662M450411M390024j149400l027020J288151M152966O51209l997732
38547E63947l783944q06277L77519O21907K124530K014736k516156o520230k953333
38538a0877301N714748R567814M833031j975539m396455l367056k111933m18395
38530c031086K311789L668023K204138P15651J319458R62448l378436q069074
$$ plain form
38590 4046405 3243133 3115703 4280649 4936142 4283630 3140264 1531347 -1126331 -3507467
38581 -3507467 -3261436 -730342 1244002 1593191 1942255 2826027 2658941 1497261 1815148
38572 1815148 3664762 3179817 -1162985 -4572622 -2187679 3640088 6740800 5588577
38564 5588577 3629144 2866533 2415473 2532158 4349876 5518733 2074291 -4187627 -6194662
38555 -6194662 -1744251 2645773 1496373 -1530647 -242496 3910470 4561679 563947
38547 563947 -3219997 -4026274 -3648755 -3026848 -902318 1112418 -1403738 -7923968 -10877301
38538 -10877301 -5162553 4405261 9238292 7262753 2866298 -500758 -2612691 -3031086
38530 -3031086 -719297 2948726 5152864 5868515 7187973 8150421 4771985 -3297089
38522c297089o980483p01361L893199K917442n72879k128280q83155J768742M314855
38513a669009M682261J323392l682359n693226l151207O25371K400594K485009
38505b679174J861440k02271l074860l056969J395418N541366L998286j181198
38497B602038l005443L84512L257989R62854l594694m745457j988348M55111M29762
38488e241676L48791K453481M607665L024447j893612n034425k743120K337962
38480b140487M527294K235916p65682j164275m1623K57369Q8690P07119Q05351
38471D509672j592586m841650n006657j543724J713451J958042P37047N79323
38463c487082J064308L73626j131673j430062j82676P76760M17747M6209R72988
$$ plain form
38522 -3297089 -10277572 -10978933 -7085734 -4168292 -4741171 -6869451 -7752606 -5983864 -1669009
38513 -1669009 3013252 4336644 654285 -5038941 -8190148 -7564777 -5164183 -2679174
38505 -2679174 -817734 -1020005 -4094865 -7151834 -5756416 -215050 3783236 2602038
38497 2602038 -403405 -18893 3239096 4201950 607256 -4138201 -6126549 -5671438 -5241676
38488 -5241676 -4892885 -2439404 2168261 5192708 3299096 -1735329 -4478449 -2140487
38480 -2140487 2386807 4622723 3857041 2692766 2651143 2908512 2997202 3704321 4509672
38471 4509672 2917086 -1924564 -6931221 -8474945 -6761494 -4803452 -4066405 -3487082
38463 -3487082 -2422774 -2049148 -3180821 -4610883 -4793559 -4016799 -3599052 -3552843 -2579855
38454b579855J988406Q12762k186604l648419j565689J634256K290748O25466
38446b628929j84133M67209j25164k372415k437873J519830N067870L447666j105543
38437A648518k706349n12923J127708J99100q64825o29370o96597j256355J25285
38428c565808L393523M547682J857811q37568j60872J404550m9351l182387l642392
38419b34812j158691R5808k071036m755019m056304n5663L421310L326323R80183
38410d507901M39227K868040M260554J021067l866381m317032j27755K724751
38402a505430J378932k47252Q01879J387747j124825k869524K90879M918074M788996
38393G819476N53642j868148n50995J112825J037830K37924j108210l342114l807889
$$ plain form
38454 -2579855 -591449 221313 -1965291 -5613710 -7179399 -5545143 -3254395 -2628929
38446 -2628929 -2813062 -2345853 -2471017 -4843432 -7281305 -5761475 -693605 2754061 1648518
38437 1648518 -1057831 -1570754 -443046 -243946 -1108771 -1738141 -2434738 -3691093 -3565808
38428 -3565808 -172285 4375397 6233208 5395640 5234768 6639318 6589967 3407580 -234812
38419 -234812 -1393503 -1297695 -3368731 -8123750 -12180054 -12235717 -8814407 -5488084 -4507901
38410 -4507901 -4068674 -1200634 3059920 4080987 214606 -4102426 -4230181 -1505430
38402 -1505430 -126498 -373750 428129 1815876 691051 -2178473 -1887594 3030480 7819476
38393 7819476 8373118 6504970 5953975 7066800 8104630 8342554 7234344 3892230 84341
38384H4341O1676M572319L437930k163609m365703n74361K753510O50365l246818
38375A209650l745980j825747q36746m65426O46392R36593m73707m92305K464023
38366b583253L851572j81867m921862k949210M307621Q088791M661143p27430
38358I545505k678189j975803j522974j540730j304100j452505k086862j689616
38350d705274J68823J776141K173640K161613J520860j110768m285376l869161
38342f169502O36097M059624K944666R25803K546838N306563L504349k089309
38334A1665129m783298k001309J317528O66287k079425l057431k180617j292052
38326a745188k38781J471029J905373k81458k068866K67305M782042N722727J651710
$$ plain form
38384 84341 146017 4718336 8156266 5992657 1626954 1052593 3806103 4456468 1209650
38375 1209650 -2536330 -4362077 -5198823 -5664249 -5017857 -4081264 -4554971 -5047276 -2583253
38366 -2583253 1268319 1086452 -3835410 -6784620 -2476999 5611792 10272935 9545505
38358 9545505 6867316 4891513 3368539 1827809 523709 -928796 -3015658 -4705274
38350 -4705274 -4536451 -2760310 -586670 1574943 3095803 1985035 -2300341 -6169502
38342 -6169502 -5533405 -1473781 1470885 2396688 4943526 10250089 13754438 11665129
38334 11665129 6881831 4880522 6198050 6864337 4784912 1727481 -453136 -1745188
38326 -1745188 -1983969 -512940 1392433 1110975 -957891 -690586 4091456 9814183 11465893
38317A1465893k775582l857484l192969l189009k432593J164830N418022N957712
38309H558820K159404k289909m337792m228247l225473j499678P13681J873229
38301b275965P30576j505555k047521Q2954K402066J782051j212866k589558n19120
38292e152938J571476J50359k198675l09528M533303N232331k0064m044789j909924
38283b148449Q59572k160054o239301k429306O497058Q258776j22404o897494
38275d381602l044942M716792N217366n31425k865915R40425M121600K136839
38267F309138j556057k437801r76026K54287N52230R3506j298098k574828j793164
38258c426813M63269R50229j384590l258626j681967J704843L146685J821907
$$ plain form
38317 11465893 8690311 4832827 1639858 -1549151 -3981744 -2816914 2601108 8558820
38309 8558820 10718224 8428315 4090523 -137724 -3363197 -4862875 -4149194 -2275965
38301 -2275965 -1545389 -3050944 -5098465 -5015511 -2613445 -831394 -2044260 -4633818 -5152938
38292 -5152938 -3581462 -3431103 -5629778 -5939306 -1406003 3826328 3806264 -238525 -2148449
38283 -2148449 -1288877 -3448931 -9688232 -12117538 -5620480 2638296 2515892 -4381602
38275 -4381602 -7426544 -2709752 2507614 1976189 -889726 50699 4172299 6309138
38267 6309138 4753081 2315280 1339254 1593541 2145771 2239277 941179 -1633649 -3426813
38258 -3426813 -2963544 -2013315 -3397905 -6656531 -8338498 -6633655 -3486970 -1665063
38250a665063P8864j71939R43559K609599M021844L666789J0728n883085r575678
38241e964382p021133M52390O420712N956489J023803k465057k099480o12829
38233d309487k51962M09060K357743K978671M68348j828470p5895L260542K630358
38224E638908j615285l343500k11584K754191J156601k361557k863297k97945
38216a143468J663503J179742p25713k539835k763448j55875L671497M161377
38208C347780m18355n199801m517110J48008K345842p9223k624900j381036J880897
38199f497898L470587K970619K245376J699962K27655k123038l570374k687307
38191d264418r5007J996570J838681L2570r57980J90826J842130J712982J44556
$$ plain form
38250 -1665063 -1586199 -1758138 -814579 1795020 5816864 9483653 9494381 3611296 -5964382
38241 -5964382 -12985515 -12533125 -6112413 -155924 867879 -1597178 -3696658 -4309487
38233 -4309487 -4561449 -4152389 -1794646 1184025 1652373 -176097 -251992 3008550 5638908
38224 5638908 4023623 680123 468539 3222730 4379331 2017774 -845523 -1143468
38216 -1143468 520035 1699777 974064 -1565771 -4329219 -4485094 -813597 3347780
38208 3347780 2929425 -2270376 -6787486 -6639478 -4293636 -4372859 -6997759 -8378795 -6497898
38199 -6497898 -3027311 -56692 2188684 3888646 4116301 1993263 -1577111 -4264418
38191 -4264418 -4359425 -2362855 -524174 -491604 -1449584 -1258758 583372 2296354 2440910
38182B440910p32170m27472l45363q42007p46333j52792p70830k451902k270936
38173f298895J081897M471121M315335J556733j69234r9470q52873l485640n143354
38164d624380k900949J953070N128354M217719J099550p19709l37533j7938j382706
38155B415478k597348j162668J454188J199175k025897l053316Q59004M608237
38147A696853J997150m317144n600054K37045N143832K657931k733715k784837
38139c702939K205940M784171K092169r86239r47361q01068l118611m171343k18552
38130d863833M720429L967405j142317k864301P84124K873492j095213n514156
38122c134370l151014L575791O055798J819386k929319k823573K27069J402839
$$ plain form
38182 2440910 1708740 1281268 935905 93898 -652435 -805227 -1576057 -4027959 -6298895
38173 -6298895 -5216998 -745877 3569458 5126191 4956957 4857487 4004614 518974 -4624380
38164 -4624380 -7525329 -5572259 -443905 3773814 4873364 4153655 3816122 3798184 2415478
38155 2415478 -181870 -1344538 109650 1308825 -717072 -3770388 -2911384 1696853
38147 1696853 3694003 -623141 -6223195 -5986150 -842318 1815613 -918102 -3702939
38139 -3702939 -1496999 3287172 5379341 4393102 3445741 2644673 -473938 -4645281 -4863833
38130 -4863833 -143404 3824001 2681684 -182617 601507 3474999 2379786 -3134370
38122 -3134370 -6285384 -2709593 3346205 5165591 2236272 -587301 -360232 1042607
38114A042607m22265k455050j922521J155278L777428K620292j551097l513994
38106a269322m16939L079820J173477l338530k566973L343282N131169r22664
38098D213320o165748k994666K948384K239473k949560l289974J600572L094040
38090a304159j041328k867169J650154N410463J980755m007740m676722p07248
38082e562994J537481K45875j146997o58067O72559J940826K406119N51431k659686
38073b673453k554827K410790O037308K753957k609263j373406M579071M638982
38065A1209159l472755q739894l227049N544698N760192j549787n394556j548306
38057a418298L031072K500267J28673R53053L089948J459522l481057o039850
$$ plain form
38114 1042607 620342 -1834708 -3757229 -2601951 1175477 3795769 2244672 -1269322
38106 -1269322 -1686261 1393559 2567036 -771494 -3338467 4815 5135984 4213320
38098 4213320 -1952428 -4947094 -1998710 240763 -2708797 -5998771 -4398199 -1304159
38090 -1304159 -2345487 -5212656 -3562502 1847961 3828716 -179024 -4855746 -5562994
38082 -5562994 -4025513 -3779638 -4926635 -5584702 -4912143 -2971317 -565198 -13767 -2673453
38073 -2673453 -5228280 -2817490 3219818 5973775 3364512 1991106 6570177 11209159
38065 11209159 7736404 -1003490 -4230539 1314159 7074351 5524564 130008 -1418298
38057 -1418298 1612774 4113041 4241714 5194767 8284715 9744237 6263180 223330
38049B23330l239988J742093M271361L281114Q70627q36098j266473j046671j000437
38040B998858j203831j134690j035439j919897l099105j629596L100220O083917
38032B160437K513299l841722m122729K508326O217436Q16785o162455m513883
38024d424506L005755N336596M26111k820528P2384K790688L33969k573869p39276
38015A407324K106840K76023l677286l396406P98186L219963J861961l96730j508904
38006F90971j474636K4987K101042J519797j851671k314330K824978O275351Q25079
37997H621568p697859p789646n7988M075563R24041r91106K888929N485852J645879
37988G105233k448620p27924K014186m75539m210714k480659J594883N77912l938147
$$ plain form
38049 223330 -3016658 -1274565 2996796 6277910 7148537 6312439 5045966 3999295 2998858
38040 2998858 1795027 660337 -375102 -2294999 -5394104 -7023700 -3923480 2160437
38032 2160437 4673736 832014 -3290715 -782389 5435047 6251832 89377 -4424506
38024 -4424506 -1418751 3917845 4343956 1523428 1595812 4386500 4720469 2146600 1407324
38015 1407324 3514164 3790187 112901 -3283505 -2485319 734644 2596605 2199875 690971
38006 690971 -783665 -758678 1342364 2862161 1010490 -1303840 1521138 7796489 8621568
37997 8621568 923709 -6865937 -6923925 -2848362 -1924321 -2915427 -26498 5459354 7105233
37988 7105233 4656613 3928689 5942875 5467336 1256622 -1224037 370846 948758 -2989389
37979b989389m254794O4531K338813Q90613O96279K839023K264438k203593m574959
37970d929038j379131K968875L882452K949719K772217J630813k011542m685702
37962A198663k821958J022814J830313n11144k196975j948423j665552j589262
37954f681524L92431M131064N910190L313482j226834l506760k548762q15153
37946a031866m05263r47981j276514j385587j604447r65164J667856M883447N249423
37937D183904J604888k766789l772368j221745J668709K508787J560962n8732
37929C707616j797119l039420k800158p94184J888177L494016K885789O27559
37921D172276j047353m76847R17657J44002k619348l273614M88675N196874N872214
$$ plain form
37979 -2989389 -7244183 -7179652 -4840839 -3950226 -3253947 -414924 1849514 -354079 -4929038
37970 -4929038 -6308169 -3339294 543158 3492877 6265094 7895907 5884365 1198663
37962 1198663 -1623295 -600481 1229832 718688 -1478287 -3426710 -5092262 -6681524
37954 -6681524 -6289093 -2158029 3752161 7065643 5838809 2332049 -216713 -1031866
37946 -1031866 -1437129 -2385110 -3661624 -5047211 -6651658 -7616822 -5948966 -1065519 4183904
37937 4183904 5788792 3022003 -750365 -1972110 -303401 2205386 3766348 3707616
37929 3707616 1910497 -1128923 -3929081 -4723265 -2835088 658928 3544717 4172276
37921 4172276 3124923 2648076 3565733 3709735 1090387 -2183227 -1694552 3502322 9374536
37912I374536K226857k186762m935455n547494l505455N51662L238775K362244
37904A578908R10813K340545L742580O9038n941083o078207J98673L560670j053864
37895f71927o370022m160872K454538N048547K659130N89257L07632r74749k714358
37886c832824j443091J711689J751416j409958k214910J180842L845453K574021
37878B162638Q54076K110788L779011K121934j674100m318427n414317n570526
37870e948923l161436K398001O923382N855082P37608k885331k640178n35917
37862G42288J395144K389407J078447l038200o621543n459595n97609K648870
37854g462791K181516J303904K460137L262728J015177k373451l023265n86042
$$ plain form
37912 9374536 11601393 9414631 4479176 -1068318 -4573773 -4022111 -783336 1578908
37904 1578908 2489721 4830266 8572846 8641884 2700801 -3377406 -3178733 381937 -671927
37895 -671927 -7041949 -11202821 -8748283 -3699736 -1040606 -451349 -143717 -1118466 -3832824
37886 -3832824 -5275915 -3564226 -1812810 -3222768 -5437678 -4256836 -411383 2162638
37878 2162638 3016714 5127502 8906513 11028447 9354347 5035920 -378397 -5948923
37870 -5948923 -9110359 -6712358 211024 6066106 6803714 3918383 1278205 742288
37862 742288 2137432 4526839 5605286 2567086 -4054457 -9514052 -10111661 -7462791
37854 -7462791 -5281275 -3977371 -1517234 1745494 2760671 387220 -2636045 -3222087
37846c222087J598802R53745j537446k673143n94991K608082K618879j380400
37838a628559m289530j492532L768605M246191m88862l240263m91564K407070
37830a209444P86493j524122L01518K734141o8141m957785l842603K637856N227611
37821H5524O23518l448551p50308M151150L928312o10853l421555k486930m67448
37812b397141Q67202J628889J271479m70989j691789j006689k83570j293490j996294
37803e372392k968K665775K636215P93119Q1917j77651k234067l820788p07597
37794f138437M967866N803028j74954o225954o481241l061873p69559j0470J170409
37785a0921185K328395K166588J747029K309226K461415R22891n87575m87418
$$ plain form
37846 -3222087 -1623285 -669540 -2206986 -4880129 -5475120 -2867038 -248159 -1628559
37838 -1628559 -5918089 -7410621 -3642016 604175 115313 -3124950 -3616514 -1209444
37830 -1209444 -422951 -1947073 -1645555 1088586 1020445 -3937340 -7779943 -5142087 85524
37821 85524 709042 -2739509 -3489817 661333 4589645 3978792 557237 -1929693 -2397141
37812 -2397141 -1529939 98950 1370429 899440 -792349 -1799038 -2082608 -3376098 -5372392
37803 -5372392 -5375360 -2709585 -73370 719749 801666 624015 -1610052 -5430840 -6138437
37794 -6138437 -1170571 4632457 4457503 -1768451 -8249692 -11311565 -12081124 -12091594 -10921185
37785 -10921185 -8592790 -6426202 -4679173 -2369947 91468 1014359 426784 -60634
37777f0634m23138j657962j632206J460031L870395J580455k227098j494912K533170
37768A948101K834258j880843m983284k748405L10797j2491r49491Q43165K612199
37759b025994J048158p83280J211700M010822K196607k064003j943992K529351
37751D179369M358905J087909k007940j657423j185386k681418k808536m96926
37743a211446p54251n118360o044298J411780Q949026N941593l581406o250505
37735f657867L49109M901442Q80893m290444k817172J532548J868190k7137J280651
37726b979787M188967L394512K2349n12250J455028P48316k465007k225698K444279
37717D070709M682863O20364m147220l325419N01604N36635l677960o194573l590364
$$ plain form
37777 -60634 -483772 -2141734 -3773940 -2313909 1556486 3136941 909843 -585069 1948101
37768 1948101 4782359 2901516 -2081768 -4830173 -4519376 -4531867 -5481358 -4638193 -2025994
37759 -2025994 -977836 -1761116 -549416 3461406 5658013 3594010 1650018 4179369
37751 4179369 8538274 9626183 7618243 5960820 4775434 2094016 -714520 -1211446
37743 -1211446 -1965697 -7084057 -13128355 -11716575 -2767549 3174044 -407362 -6657867
37735 -6657867 -6308758 -1407316 -526423 -4816867 -7634039 -6101491 -4233301 -4260438 -2979787
37726 -2979787 1209180 4603692 4626041 4113791 5568819 6317135 3852128 1626430 4070709
37717 4070709 8753572 9373936 5226716 1901297 2402901 2939536 -738424 -6932997 -10523361
37708a0523361J186229L856182L642904K237748Q44072m12822j602505k446001
37700c217554k184958k15647K460574L291805J119258j649376j716668O36818
37692a475748K041597J060477l8255M76647P27644j238898l232528j863262J441758
37683b100568J774207j486943k940245N44958M091636J575399m694715o483020
37675i719291j098019N087146N622217J689139j425569j603330m16989Q76458
37667i88238K195089K747550J513770o37351j587075p12684N08948M84905r22759
37658B602155k457810k553062j061100M0122q45974j850088K81011M502898N436452
37649D094604Q70651m216593m106238J63641L314547L314495K145864R12931j113443
$$ plain form
37708 -10523361 -9337132 -5480950 -1838046 399702 1243774 830952 -771553 -3217554
37700 -3217554 -5402512 -5618159 -3157585 134220 1253478 -395898 -2112566 -1475748
37692 -1475748 565849 1626326 1588071 2064718 2792362 1553464 -1679064 -3542326 -2100568
37683 -2100568 -326361 -1813304 -4753549 -4208591 -116955 1458444 -3236271 -9719291
37675 -9719291 -10817310 -5730164 -107947 1581192 155623 -1447707 -1864696 -988238
37667 -988238 1206851 3954401 5468171 4830820 3243745 2531061 3040009 3524914 2602155
37658 2602155 144345 -2408717 -3469817 -3429695 -4275669 -6125757 -5844746 -1341848 4094604
37649 4094604 4965255 748662 -3357576 -3193935 120612 3435107 5580971 6493902 5380459
37640E380459l201655l251098j312907M28060J107130J488424J354849K9962j075991
37631I47233k29228Q05132j086800m546386m656508j77721M604761O074649M900745
37622F635877K604502n95268l036994j843926J777505K399370j553412m462531
37614A925123j930011K240964K316531k65805j23295K566459K648751q89589l238617
37605E250511k044161j146259l605207o087708l980738J260851M198411L191243
37597b963057J713689J932762J270523k570194o342769m860889J156758N193444
37589e469733L870781J541415L074388N716986L140412m138599q319701m904280
37581e488331J635242M715608L517655J143525j045543l246818l995880j520826
$$ plain form
37640 5380459 2178804 -1072294 -2385201 -1957141 -850011 638413 1993262 2023224 947233
37631 947233 718005 1523137 436337 -4110049 -8766557 -8944278 -4339517 1735132 6635877
37622 6635877 9240379 8645111 5608117 3764191 5541696 7941066 6387654 1925123
37614 1925123 -4888 2236076 4552607 4286802 4163507 6729966 9378717 8489128 5250511
37605 5250511 3206350 2060091 -1545116 -7632824 -11613562 -10352711 -6154300 -2963057
37597 -2963057 -1249368 683394 1953917 -616277 -6959046 -11819935 -10663177 -5469733
37589 -5469733 -1598952 -57537 3016851 8733837 11874249 7735650 -584051 -5488331
37581 -5488331 -3853089 862519 4380174 5523699 4478156 1231338 -2764542 -4285368
37573d285368K498787L973280J304843k802049m350221j759278K713700M584572
37565A878266J603213k903039l478071j016J801661r41733l310304r1172N437113
37556e082N695638P643m293079k174330K861823M476293J540862j819324j947565
37547D342879O99187K757170J684481j533366l532941k705823j045446r74506
37539c08365j991787k157020j267833l57471N37247J716232K288278J765379J659691
37530A884351K795837K845304j47050l575348l574702r95774L30167o9175K03932
37521c02458O19785j564674m841801m226914L51260K930941Q64381j187045L68187
37512f988338K150171O61292q89551J610522N143913L827597j711536n395481
$$ plain form
37573 -4285368 -1786581 2186699 3491542 689493 -3660728 -5420006 -2706306 1878266
37565 1878266 3481479 578440 -2899631 -2900647 -1098986 -2040719 -5351023 -5442195 -5082
37556 -5082 5690556 5698199 1405120 -769210 2092613 6568906 8109768 6290444 4342879
37547 4342879 5042066 7799236 9483717 7950351 4417410 1711587 666141 -308365
37539 -308365 -2300152 -4457172 -5725005 -6082476 -5545229 -3828997 -1540719 224660 1884351
37530 1884351 4680188 7525492 7378442 3803094 228392 -767382 -437215 -506390 -302458
37521 -302458 317327 -1247347 -6089148 -10316062 -9964802 -7033861 -6169480 -7356525 -6988338
37512 -6988338 -4838167 -4176875 -5066426 -3455904 1688009 5515606 3804070 -1591411
37504a591411m209106j79348M245873P208449N607699j494094q376986p736942
37496f525866m32436N296872M511859Q9699l507522m990332l986475k01359L510358
37487f235202L027955k13159j75624L937691N456547J065234l197329j669155
37479A996958J821811J060646k027291j799607M96493n51609l803507l023409
37471e829515J656219L127333p62608l522805q28473K984631K982599J218289
37463A025670J573617K698956J298923j699499l134445k601984j379692N63231
37455a655223K717371K459537p12086k582119j10200L110593J899880k627238
37447B500515n056440l477359n72344J347178J897423R05586n73035M96154M471099
$$ plain form
37504 -1591411 -5800517 -5979865 -1733992 5474457 11082156 9588062 1211076 -6525866
37496 -6525866 -6958302 -1661430 2850429 2940128 -567394 -5557726 -9544201 -9745560 -6235202
37487 -6235202 -3207247 -3420406 -3596030 341661 5798208 6863442 3666113 1996958
37479 1996958 3818769 4879415 2852124 1052517 1549010 997401 -2806106 -5829515
37471 -5829515 -4173296 -1045963 -1808571 -5331376 -6159849 -3175218 -192619 1025670
37463 1025670 2599287 5298243 6597166 4897667 1763222 -838762 -2218454 -1655223
37455 -1655223 1062148 3521685 2809599 227480 117280 3227873 5127753 2500515
37447 2500515 -2555925 -6033284 -6605628 -5258450 -3361027 -2455441 -3028476 -2532322 1938777
37438A938777O146318J683631m255065m579239o60019K85015k723000l467370
37430e630952J35576K648294J119206L0076K599239M628258J863784k602290l610349
37421A180842j821014j056588j591172j239700k09591j10366l63845L15702R18073
37412c977659J77039n49255K37710J104823L48081o87484k28987N07741p8556
37403c146547o28371K11421K61463k373433m428977j546904M246311O398433K866477
37394A859873j444947j763088R89869K698120J172107k330030m890207m552266
37386h260569j970263P19647K672723M320515M616665J729653k331825k138022
37378f41476L280297P186752L858119l092023n941345l314517L2380J332388J561665
$$ plain form
37438 1938777 8085095 9768726 5513661 934422 274403 559418 -2163582 -5630952
37430 -5630952 -5495376 -2847082 -1727876 -1697800 901439 5529697 7393481 4791191 1180842
37421 1180842 -640172 -1696760 -3287932 -4527632 -4737223 -4847589 -5211434 -4895732 -3977659
37412 -3977659 -3800620 -4349875 -4112165 -3007342 -2659261 -3346745 -3575732 -3067991 -3146547
37403 -3146547 -3774918 -3563497 -3302034 -5675467 -10104444 -11651348 -7405037 -1006604 1859873
37394 1859873 414926 -1348162 -358293 2339827 3511934 1181904 -3708303 -8260569
37386 -8260569 -10230832 -9511185 -6838462 -2517947 2098718 3828371 1496546 -641476
37378 -641476 2638821 9825573 13683692 10591669 4650324 1335807 1368187 2700575 4262240
37369D262240O62397k462965n511199m462936j40180K450856J882162J853289
37361a466336L960618M571431J032285l834399o042671n357432l375967k16767
37353a0729238L914462O427055M763245J13473l336370k618206J152948L645749
37345C333118J430088l793277o160608k529865L059715M357431R45073k019145
37337a377470j267553J103130J737666L55461p42498M09211L070019L555398p56353
37328F087011o188653n545868J274074M922137m7243n489546j634719O397426
37320b25381N615492l768479q002310j787687L724681J55083m421311j40607P316946
37311a533573O122819k103882n164418M40633N514010L453764j283791k421847
$$ plain form
37369 4262240 4924637 2461672 -3049527 -7512463 -7652643 -5201787 -3319625 -1466336
37361 -1466336 2494282 7065713 8097998 4263599 -1779072 -7136504 -10512471 -10729238
37353 -10729238 -6814776 -387721 4375524 4488997 1152627 -1465579 -312631 3333118
37345 3333118 4763206 969929 -5190679 -7720544 -4660829 -303398 641675 -1377470
37337 -1377470 -2645023 -1541893 195773 551234 -191264 217947 3287966 6843364 6087011
37328 6087011 -101642 -5647510 -4373436 548701 501458 -4988088 -6622807 -225381
37320 -225381 5390111 1621632 -6380678 -8168365 -4443684 -4288601 -8709912 -8850519 -1533573
37311 -1533573 4589246 2485364 -2679054 -2238421 3275589 6729353 5445562 3023715
37303C023715r63483j102191k864482l064970n21071K708941L834034J870997
37295B921490j083603j307589K021729M645087K242770l214432n615098l026956
37287b416602Q587n99905k948140k683060M61131K626847J535620n00558j15511
37278d631591K245689K933545L97736k350272j883208Q78090K330345J314992
37270A235326l26577j466059k445774k416044N9793L247621L258965l3565k217612
37261a103926r75780Q13038O11740K79755J658479K482984N32724j823054j462957
37252A013003J46991j75117j674414j405061L32764P53912n97159j818579k221720
37243e645380k283564j400277P25479J936676N30140j200743j18119K567271L192377
$$ plain form
37303 3023715 2060232 958041 -1906441 -4971411 -5492482 -2783541 1050493 2921490
37295 2921490 1837887 530298 2552027 7197114 9439884 6225452 610354 -2416602
37287 -2416602 -2408015 -3007920 -5956060 -8639120 -8177989 -5551142 -4015522 -4516080 -4631591
37278 -4631591 -2385902 547643 945379 -1404893 -3288101 -2410011 -79666 1235326
37270 1235326 908749 -557310 -3003084 -5419128 -5359335 -2111714 1147251 1113686 -1103926
37261 -1103926 -2079706 -1266668 -654928 -375173 1283306 3766290 4299014 2475960 1013003
37252 1013003 1159994 984877 -689537 -2094598 -1761834 -1007922 -1605081 -3423660 -5645380
37243 -5645380 -7928944 -9329221 -8603742 -6667066 -6136926 -7337669 -7455788 -4888517 -1696140
37234a696140J292408p04353j979103l163747l011429K004L568432L828760J327814
37225e35354Q4064J126970J727811Q59671M43499R32805N90126l28205M26303
37216E327690K175559J411610j995534l622736j221040J969243K539006J199135
37208G782933k73027k037270l734256l177423l21845J227477k87499j315766J489613
37199f47063N373729N096752M10472l940863m534109k258932K77007J390773N86776
37190A754542j454863k895699k136166N67081L234296L554280N17575l969108
37182h28062n583873k037549L097293L968052J69025k664593r86778J976590J851418
37173a038477m08027r73242P80122K332287K345956J567388O45620j06600P0270
$$ plain form
37234 -1696140 -403732 -1108085 -3087188 -6250935 -9262364 -9260360 -5691928 -1863168 -535354
37225 -535354 -451290 675680 2403491 3263162 3706661 4639466 5229592 4901387 5327690
37216 5327690 7503249 8914859 6919325 3296589 2075549 4044792 6583798 7782933
37208 7782933 7509906 5472636 1738380 -1439043 -1760888 -533411 -820910 -2136676 -647063
37199 -647063 4726666 9823418 10233890 6293027 1758918 -500014 -223007 1167766 1754542
37190 1754542 299679 -2596020 -4732186 -4165105 -930809 2623471 3141046 -828062
37182 -828062 -6411935 -8449484 -5352191 -1384139 -1215114 -3879707 -4866485 -2889895 -1038477
37173 -1038477 -1446504 -2419746 -1639624 692663 3038619 4606007 5251627 5145027 5215297
37164E215297R69632O45229j589355l170175j962304M379l81450k324172k781932
$$ plain form
37164 5215297 6184929 6830158 5240803 2070628 108324 112703 -268747 -2592919 -5374851
$$ [...]
##END NTUPLES=NMR SPECTRUM
##END=
