##TITLE=31Pdec_LAZN1812
 , 24 sc
 19.12.2019
##JCAMPDX= 6.0         $$ Bruker NMR JCAMP-DX V2.0
##DATA TYPE= NMR SPECTRUM
##DATA CLASS= NTUPLES
##ORIGIN= UXNMR, Bruker Analytische Messtechnik GmbH
##OWNER= root
$$ XWIN-NMR		Version 3.5
$$ Thu Dec 19 13:49:07 2019 Russian Standard Time (UT+4h)  she@DPX200
##.OBSERVE FREQUENCY= 81.013821
##.OBSERVE NUCLEUS= ^31P
##.ACQUISITION MODE= SIMULTANEOUS
##.ACQUISITION SCHEME= undefined
##.AVERAGES= 24
##.DIGITISER RES= 17
##SPECTROMETER/DATA SYSTEM= spect
##.PULSE SEQUENCE= zgpg30
##.SOLVENT NAME= D2O
##.SHIFT REFERENCE= (INTERNAL, D2O, 0, 182.463)
##AUDIT TRAIL= $$ (NUMBER, WHEN, WHO, WHERE, WHAT)
$$ ##TITLE= Audit trail, XWIN-NMR		Version 3.5
$$ ##JCAMPDX= 5.01
$$ ##ORIGIN= Bruker BioSpin GmbH
$$ ##OWNER= she
$$ F:/spectra/data/she/nmr/P31/1/pdata/1/auditp.txt
$$ ##AUDIT TRAIL=  $$ (NUMBER, WHEN, WHO, WHERE, WHAT)
(   1,<2019-12-19 13:48:06.93 +0400>,<she>,<DPX200>,
      <created by zg, POWCHK disabled, PULCHK disabled
       configuration hash MD5:
       00 E9 B6 7A A2 85 ED C7 34 08 36 98 17 FE 4E 26
       data hash MD5: 32K
       C6 27 25 50 EE 58 DA 87 6E ED 22 A2 0E 53 90 16>)
(   2,<2019-12-19 13:48:09.29 +0400>,<she>,<DPX200>,
      <Start of raw data processing
       efp BC_mod = 2 LB = 1 FT_mod = 6 PKNL = 1 PHC0 = -1679.752 PHC1 = 67.80118 SI = 64K 
       data hash MD5: 64K
       C0 FC A7 01 6C C9 2A F3 71 4E 84 0C 6F 06 4B 80>)
(   3,<2019-12-19 13:48:40.29 +0400>,<she>,<DPX200>,
      <pk PHC0 = 60.07704 PHC1 = -75.6 
       data hash MD5: 64K
       B1 80 8F 3D 76 C6 3D F8 5F CA AA 41 FC 99 2C A6>)
(   4,<2019-12-19 13:48:43.34 +0400>,<she>,<DPX200>,
      <abs ABSG = 5 
       data hash MD5: 64K
       57 5C D8 48 57 B1 04 B0 05 4D DD 4A 8C B1 80 33>)
$$ ##END=
$$ 
$$ hash MD5
$$ 63 4E 54 2E F6 73 C6 52 D9 E9 F5 80 C5 C6 E7 0D
##$RELAX= 
##$RELAX= 
##$RELAX= 
##$RELAX= 
##$RELAX= 
##$RELAX= 
##$RELAX= 
##$RELAX= 
$$ Bruker specific parameters
$$ --------------------------
##$DU= <F:/spectra>
##$EXPNO= 1
##$NAME= <P31>
##$PROCNO= 1
##$TYPE= <nmr>
##$USER= <she>
##$AMP= (0..31)
100 100 100 100 100 100 100 100 100 100 100 100 100 100 100 100 100 100 
100 100 100 100 100 100 100 100 100 100 100 100 100 100 
##$AQSEQ= 0
##$AQ_mod= 1
##$AUNM= <au_zg>
##$AUTOPOS= <>
##$BF1= 81.014009
##$BF2= 200.13
##$BF3= 200.13
##$BF4= 200.13
##$BF5= 200.13
##$BF6= 200.13
##$BF7= 200.13
##$BF8= 200.13
##$BYTORDA= 1
##$CFDGTYP= 0
##$CFRGTYP= 5
##$CHEMSTR= <none>
##$CNST= (0..31)
1 1 145 1 1 1 1 1 1 1 1 1 1 1 1 1 1 1 1 1 1 1 1 1 1 1 1 1 1 1 1 1 
##$CPDPRG= <waltz16>
##$CPDPRG1= <>
##$CPDPRG2= <waltz16>
##$CPDPRG3= <>
##$CPDPRG4= <mlev>
##$CPDPRG5= <mlev>
##$CPDPRG6= <mlev>
##$CPDPRG7= <mlev>
##$CPDPRG8= <mlev>
##$CPDPRGB= <>
##$CPDPRGT= <>
##$D= (0..31)
0 1 0 0 0 0 0 0 0 0 0 0.03 2e-05 3e-06 0 0 0 0 0 0 0 0 0 0 0 0 0 0 0 0 
0 0 
##$DATE= 1576748886
##$DBL= (0..7)
120 120 120 11 120 120 24 19 
##$DBP= (0..7)
150 150 150 150 150 150 150 150 
##$DBP07= 0
##$DBPNAM0= <>
##$DBPNAM1= <>
##$DBPNAM2= <>
$$ [...]
##$SUBNAM3= <"">
##$SUBNAM4= <"">
##$SUBNAM5= <"">
##$SUBNAM6= <"">
##$SUBNAM7= <"">
##$SUBNAM8= <"">
##$SUBNAM9= <"">
##$SW= 369.568048894756
##$SWIBOX= (0..15)
0 1 3 0 0 0 0 0 0 0 0 0 0 0 0 0 
##$SW_h= 29940.119760479
##$TD= 32768
##$TD0= 1
##$TE= 0
##$TE2= 300
##$TE3= 300
##$TEG= 300
##$TL= (0..7)
0 120 53 12 22 120 120 120 
##$TP= (0..7)
150 150 150 150 150 150 150 150 
##$TP07= 0
##$TPNAME0= <>
##$TPNAME1= <>
##$TPNAME2= <>
##$TPNAME3= <>
##$TPNAME4= <>
##$TPNAME5= <>
##$TPNAME6= <>
##$TPNAME7= <>
##$TPOAL= (0..7)
0.5 0.5 0.5 0.5 0.5 0.5 0.5 0.5 
##$TPOFFS= (0..7)
0 0 0 0 0 0 0 0 
##$TUNHIN= 0
##$TUNHOUT= 0
##$TUNXOUT= 0
##$USERA1= <user>
##$USERA2= <user>
##$USERA3= <user>
##$USERA4= <user>
##$USERA5= <user>
##$V9= 5
##$VALIST= <valist>
##$VCLIST= <CCCCCCCCCCCCCCC>
##$VD= 0
##$VDLIST= <DDDDDDDDDDDDDDD>
##$VPLIST= <PPPPPPPPPPPPPPP>
##$VTLIST= <TTTTTTTTTTTTTTT>
##$WBST= 1024
##$WBSW= 4
##$XGAIN= (0..3)
0 0 0 0 
##$XL= 0
##$YL= 0
##$YMAX_a= 9913
##$YMIN_a= -8774
##$ZGOPTNS= <>
##$ZL1= 120
##$ZL2= 120
##$ZL3= 120
##$ZL4= 120
##$ABSF1= 182.463
##$ABSF2= -187.1042
##$ABSG= 5
##$ABSL= 3
##$ALPHA= 0
##$AQORDER= 0
##$ASSFAC= 0
##$ASSFACI= 0
##$ASSFACX= 0
##$ASSWID= 0
##$AUNMP= <proc_1d>
##$AZFE= 0.1
##$AZFW= 0.5
##$BCFW= 0
##$BC_mod= 2
##$BYTORDP= 0
##$COROFFS= 0
##$CY= -3
##$DATMOD= 1
##$DC= 0
##$DFILT= <>
##$DTYPP= 0
##$F1P= 0
##$F2P= 0
##$FCOR= 1
##$FTSIZE= 65536
##$FT_mod= 6
##$GAMMA= 0
##$GB= 0
##$INTBC= 1
##$INTSCL= 5.30512e-09
##$ISEN= 30
##$LB= 1
##$LEV0= 0
##$LPBIN= 0
##$MAXI= 10000
##$MC2= 0
##$MEAN= 0
##$ME_mod= 0
##$MI= 50
##$NCOEF= 0
##$NC_proc= -8
##$NLEV= 6
##$NOISF1= 182.463
##$NOISF2= 159.3651
##$NSP= 0
##$NTH_PI= 0
##$NZP= 0
##$OFFSET= 182.463
##$PC= 4
##$PHC0= -1619.675
##$PHC1= -7.79882
##$PH_mod= 1
##$PKNL= yes
##$PPARMOD= 0
##$PSCAL= 0
##$PSIGN= 0
##$REVERSE= no
##$SF= 81.0140089999434
##$SI= 65536
##$SIGF1= 159.3651
##$SIGF2= -187.1042
##$SINO= 113.3802
##$SIOLD= 16384
##$SREGLST= <1H.CDCl3>
##$SSB= 0
##$STSI= 65536
##$STSR= 0
##$SW_p= 29940.119760479
##$SYMM= 0
##$S_DEV= 0
##$TDeff= 32768
##$TDoff= 0
##$TI= <>
##$TILT= no
##$TM1= 0
##$TM2= 0
##$TOPLEV= 0
##$USERP1= <user>
##$USERP2= <user>
##$USERP3= <user>
##$USERP4= <user>
##$USERP5= <user>
##$WDW= 1
##$XDIM= 65536
##$YMAX_p= 475506440
##$YMIN_p= -36070965
$$ End of Bruker specific parameters
$$ ---------------------------------
##NTUPLES= NMR SPECTRUM
##VAR_NAME=  FREQUENCY,     SPECTRUM/REAL,   SPECTRUM/IMAG
##SYMBOL=    X,             R,               I
##VAR_TYPE=  INDEPENDENT,   DEPENDENT,       DEPENDENT
##VAR_FORM=  AFFN,          ASDF,            ASDF
##VAR_DIM=   65536,         65536,           65536
##UNITS=     HZ,            ARBITRARY UNITS, ARBITRARY UNITS
##FACTOR=    0.456856943014862, 1,           1
##FIRST=     14782.0589164792, 0,            0
##LAST=      -15158.0608439998, 0,           0
##MIN=       -15158.0608439998, -36070965,   0
##MAX=       14782.0589164792, 475506440,    0
$$ Real data points
##PAGE= N=1
##DATA TABLE= (X++(R..R)), XYDATA
$$ [...]
$$ plain form
36828 3401800 1240116 1961216 555747 -3463155 -5366005 -1326403 7297614 15767736
36820 15767736 19935295 18200317 11680190 3485763 -3319387 -7633279 -9445102 -7807115
36812 -7807115 -2170380 4268581 6085639 2020101 -3347357 -6261055 -8382858 -11552226
36804 -11552226 -12188537 -6592684 897972 2174602 -2889550 -6376382 -4900663 -4352872
36796 -4352872 -8939171 -12999378 -9471656 -1082713 3715644 2720274 1034782 1720153
36788 1720153 2039628 -630809 -4584827 -6974682 -7554598 -7727415 -8085652 -7847227 -5591184
36779 -5591184 -712520 5117383 9251489 11558933 14043846 15788347 12395001 3451457
36771 3451457 -3903587 -3701520 333241 858239 -1793426 -1646909 1779825 2795569 -268158
$$ packed form
36828C401800k161684P21100j405469m018902j902850M039602Q624017Q470122
36820A5767736M167559j734978o520127q194427o805150m313892j811823J637987
36812g807115N636735O438961J817058m065538n367458k913698k121803l169368
36804a1552226o36311N595853P490656J276630n064152l486832J475719N47791
36796d352872m586299m060207L527722Q388943M798357r95370j685492O85371
36788A720153L19475k670437l954018k389855n79916j72817l58237K38425K256043
36779e591184M878664N829903M134106K307444K484913J744501l393346q943544
36771C451457p355044K02067M034761N24998k651665J46517L426734J015744l063727
$$ plain form
36762 -268158 -2575897 -1741472 -1362016 -3417053 -4582895 -3011042 -1674612 -1602737 901920
36753 901920 5821858 5619444 -3603958 -13207935 -12311993 -3151897 2297097 -696150 -4419667
36744 -4419667 -1171642 6518008 11166648 10716927 9263640 9608031 9634323 7203619 5551750
36735 5551750 9863805 18316379 21285366 13001309 298379 -5761037 -4314833 -3518719
36727 -3518719 -6441690 -7458790 -3847225 -949394 -1897076 -1689181 2694080 5183948
36719 5183948 1227972 -2495881 1688500 8981622 9329882 3216694 -915339 -1356945
36711 -1356945 -2966856 -4056523 3216177 17626535 26152397 20658654 7829484 -1806102
36703 -1806102 -6155345 -8044651 -7375093 -3143100 2126817 5780038 9060771 13269962
$$ packed form
36762b68158k307739Q34425L79456k055037j165842J571853J336430P1875K504657
36753I01920M919938k02414r223402r603977Q95942R160096N448994k993247l723517
36744d419667L248025P689650M648640m49721j453287L44391K6292k430704j651869
36735E551750M312055Q452574K968987q284057j2702930o059416J446204P96114
36727c518719k922971j017100L611565K897831r47682K07895M383261K489868
36719E183948l955976l723853M184381P293122L48260o113188m132033m41606
36711a356945j609911j089667P272700J4410358Q525862n493743j2829170r635586
36703a806102m349243j889306O69558M231993N269917L653221L280733M209191
$$ plain form
36695 13269962 15636529 13348346 8554168 5362343 4384865 3614955 2458194 1991846
36687 1991846 3019095 5737452 9330031 10971716 8155628 2686055 -1363451 -4271327
36679 -4271327 -10308292 -19226970 -23716576 -18627529 -8216041 -603551 1297219 112318
36671 112318 -1028239 -464557 1773240 2710158 -1144267 -7280998 -7316452 2562199 15156165
36662 15156165 20624328 17975259 13663778 11749258 10584890 7413111 1494238 -6206486
36654 -6206486 -12612980 -13223143 -6934272 1032515 4329968 2274378 -1381537 -4334567
36646 -4334567 -6898421 -9142446 -10514156 -10984446 -9715848 -4773957 2618922 6354548
36638 6354548 2428222 -4417991 -5949068 -1128787 3286005 2395835 -1135522 -1521501
$$ packed form
36695A3269962K366567k288183m794178l191825r77478p69910j156761m66348
36687A991846J027249K718357L592579J641685k816088n469573m049506k907876
36679d271327o036965q918678m489606N089047J0411488P612490J900770j184901
36671A12318j140557N63682K237797R36918l854425o136731l5454R878651J2593966
36662A5156165N468163k649069m311481j914520j164368l171779n918873p700724
36654f206486o406494o10163O288871P966787L297453k055590l655915k953030
36646d334567k563854k244025j371710m70290J268598M941891P392879L735626
36638F354548l926326o846213j531077M820281M414792q90170l531357l85979
$$ plain form
36630 -1521501 3266330 9552406 11119867 5176970 -3431117 -6337478 -1884448 2408148
36622 2408148 614774 -3145119 -2270784 962486 -573442 -6131617 -7448595 -1893225
36614 -1893225 3278237 1862214 -3219590 -5728535 -4270403 -1478331 466549 537518
36606 537518 -1482254 -3848182 -4182629 -2870676 -1798577 297081 6335555 14122428
36598 14122428 16931287 12917275 8347288 8519528 10799866 10558761 9234719 11378543
36590 11378543 16651058 19782154 17360724 11260618 6209552 6052222 10887541 16196677
36582 16196677 16669088 12134625 7321342 5092240 3751866 2277523 3200023 7465962
36574 7465962 11245941 11555890 10551184 10119904 7140770 -322312 -6627019 -5402753
$$ packed form
36630a521501M787831O286076J567461n942897q608087k906361M453030M292596
36622B408148j793374l759893Q74335L233270j535928n558175j316978N555370
36614a893225N171462j416023n081804k508945J458132K792072J944880P0969
36606E37518k019772k365928l34447J311953J072099K095658O038474P786873
36598A4122428K808859m014012m569987J72240K280338k41105j324042K143824
36590A1378543N272515L131096k421430o100106n051066j57330M835319N309136
36582A6196677M72411m534463m813283k229102j340374j474343R22500M265939
36574G465962L779979L09949j004706m31280k979134p463082o304707J224266
$$ plain form
36566 -5402753 395930 2928557 1733189 3077894 7938653 9978419 6951590 5023979
36558 5023979 8072021 10610751 6687536 -416336 -3480348 -1743008 280146 976131
36550 976131 2143170 3523622 3367078 3464518 7324886 13336820 15716518 13026915 10028923
36541 10028923 9640498 8827896 5000051 969241 -210523 -587395 -2850739 -4547550
36533 -4547550 -2334580 1088385 877048 -925586 2154664 9231869 10647491 1437708
36525 1437708 -10345970 -13669053 -8225495 -2479147 -1097783 -899247 1289576 3113570
36517 3113570 1232667 -2812997 -4665450 -3378359 -2468227 -4600794 -7601928 -7436680
36509 -7436680 -4049832 -1502036 -1802711 -1979312 290729 1690446 -1116092 -3379973
$$ packed form
36566e402753N798683K532627j195368J344705M860759K039766l026829j927611
36558E023979L048042K538730l923215p103872l064012J737340K023154O95985
36550I76131J167039J380452j56544R7440L860368O011934K379698k689603k997992
36541A0028923l88425q12602l827845m030810j179764l76872k263344j696811
36533d547550K212970L422965k11337j802634L080250P077205J415622r209783
36525A437708j1783678l323083N443558N746348J381364J98536K188823J823994
36517C113570j880903m045664j852453J287091R10132k132567l001134J65248
36509g436680L386848K547796l00675j76601K270041J399717k806538k263881
$$ plain form
36501 -3379973 2649054 14155141 17754766 6839149 -8302870 -13253230 -6401970 3353503
36493 3353503 10248776 14390829 14605370 8753415 791749 -1708712 1518822 2790118
36485 2790118 -1638404 -6677963 -7836537 -7931843 -10418493 -12620942 -10801519 -7060728
36477 -7060728 -5709579 -6077960 -4149195 469018 3549427 1604083 -4301728 -9357914
36469 -9357914 -8602795 -1615269 5657695 6479928 1366591 -2908389 -2829686 -1772020 -2632878
36460 -2632878 -2803364 -114766 1627751 -1557789 -6187552 -5336313 1520135 7902838
36452 7902838 8992466 6844919 6878888 11690211 18330801 20853053 16752777 10691100
36444 10691100 8775666 9672641 6908983 488666 -1724240 2621942 4611735 -1767675
$$ packed form
36501c379973O029027J1506087L599625j0915617j5142019m950360O851260R755473
36493C353503O895273M142053K14541n851955p961666k500461L227534J271296
36485B790118m428522n039559j158574r5306k486650k202449J819423L740791
36477g060728J351149l68381J928765M618213L080409j945344n905811n056186
36469i357914P55119O987526P272964Q22233n113337m274980P8703J057666q60858
36460b632878j70486K688598J742517l185540m629763Q51239O856448O382703
36452G902838J089628k147547L3969M811323O640590K522252m100276o061677
36444A0691100j915434Q96975k763658o420317k212906M346182J989793o379410
$$ plain form
36436 -1767675 -8119949 -4026482 5606948 7834380 2592257 2381698 10895009 16142918
36428 16142918 9463547 -661575 -1415488 6355340 11653467 9362960 4032852 285626
36420 285626 -2564006 -6279804 -9971497 -11903786 -11670210 -9760372 -7184253 -5807790
36412 -5807790 -7210942 -10763009 -13798356 -13897277 -10848331 -6897173 -5055739 -6264002
36404 -6264002 -8411506 -9324794 -10003652 -12703384 -16183964 -15952644 -10196428 -2991561 -171294
36395 -171294 -3606643 -10521792 -16716483 -19189512 -16877430 -10456556 -1836268 6020291
36387 6020291 9392861 6371536 524482 -788546 5123427 11703354 11002955 4210768
36379 4210768 -801386 -1159635 -1566800 -4677485 -6270186 -3186753 344868 -534388 -2847704
$$ packed form
36436a767675o352274M093467R633430K227432n242123k10559Q513311N247909
36428A6142918o679371j0125122p53913P770828N298127k290507n330108l747226
36420B85626k849632l715798l691693j932289K33576J909838K576119J376463
36412e807790j403152l552067l035347r8921L048946L951158J841434j208263
36404f264002k147504r13288o78858k699732l480580K31320N756216P204867K820267
36395a71294l435349o915149o194691k473029K312082O420874Q620288P856559
36387F020291L372570l021325n847054j313028N911973O579927p00399o792187
36379D210768n012154l58249m07165l110685j592701L083433L531621q79256k313316
$$ plain form
36370 -2847704 -381297 5432093 5703008 -4024466 -16543710 -19989679 -10514890 3628043
36362 3628043 10629332 7029305 105481 -1717763 1592758 4040298 3055387 1882883
36354 1882883 3186600 5787753 8807835 13512930 18518720 18168964 9458806 -2981962
36346 -2981962 -12296280 -16639409 -17814073 -16239933 -11505532 -5349522 94707 5137674
36338 5137674 10049976 11974959 8277796 1172256 -4749271 -7792897 -8390033 -5572525
36330 -5572525 947249 6890464 7016382 2335618 -795436 1329174 6679229 11953170
36322 11953170 15755439 17206106 15560872 12018591 8954847 7286646 6965876 8537165
36314 8537165 10668600 8329332 -1193543 -11775428 -14307211 -8958058 -4953261 -7312839
$$ packed form
36370b847704K466407N813390K70915r727474j2519244l445969R474789J4142933
36362C628043P001289l600027o923824j823244L310521K447540r84911j172504
36354A882883J303717K601153L020082M705095N005790l49756q710158j2440768
36346b981962r314318m343129j174664J574140M734401O156010N444229N042967
36338E137674M912302J924983l697163p105540n921527l043626n97136K817508
36330e572525O519774N943215J25918m680764l131054K124610N350055N273941
36322A1953170L802269J450667j645234l542281l063744j668201l20770J571289
36314H537165K131435k339268r522875j0581885k531783N349153M004797k359578
$$ plain form
36306 -7312839 -10819772 -9226354 -3438391 2807710 8729159 13320159 12432974 5203589
36298 5203589 -844920 2291024 12423679 20096869 20356256 16236432 12032158 8842753
36290 8842753 6649390 5845130 5951841 6107083 6660599 7398118 5597514 -47717 -4785551
36281 -4785551 -2191020 6888977 14786680 16843512 15688439 14825437 13706910 11638178
36273 11638178 11187384 13669302 15223719 12016943 6646455 4590258 5986932 6031377
36265 6031377 3199915 1872754 4959084 7770548 2732708 -10739074 -23796818 -26479630
36257 -26479630 -17558266 -5201295 1872137 2610877 2433203 5494000 10534085 14160665
36249 14160665 15437547 15909968 16871062 18172621 18870110 18090124 15957413 13904053 12952163
$$ packed form
36306g312839l506933J593418N787963O246101N921449M591000q87185p229385
36298E203589o048509L135944J0132655P673190K59387m119824m204274l189405
36290H842753k193363q04260J06711J55242N53516P37519j800604n645231m737834
36281d785551K594531R079997P897703K056832j155073q63002j118527k068732
36273A1638178m50794K481918J554417l206776n370488k056197J396674M4445
36265F031377k831462j327161L086330K811464n037840j3471782j3057744k682812
36257b6479630Q921364J2356971P073432P38740j77674L060797N040085L626580
36249A4160665J276882M72421R61094J301559O97489p79986k132711k053360r51890
$$ plain form
36240 12952163 11964496 9538806 7192482 7515295 9056559 7278102 1850524 -1791568
36232 -1791568 -713239 781501 -1269620 -3162573 246775 5834723 5954092 -375184
36224 -375184 -7479999 -12685138 -17644921 -20489968 -16104228 -6195038 -99223 -1955481
36216 -1955481 -5167963 -3849108 -1472631 -2367024 -2752519 1639594 5586328 1769004
36208 1769004 -6048495 -7454732 -1013523 4445857 3777278 1206740 929136 1106723 236192
36199 236192 1759609 7984736 14983019 17726334 16135923 12514245 6842772 -1502739
36191 -1502739 -10113757 -15344305 -16473119 -15729672 -15114377 -14474891 -11924467 -6106357 839392
36182 839392 3981926 1848284 28693 4294591 11757462 14568405 11492086 8697656
$$ packed form
36240A2952163r87667k425690k346324L22813J541264j778457n427578l642092
36232a791568J078329J494740k051121j892953L409348N587948J19369o329276
36224c75184p104815n205139m959783k845047M385740R909190O095815j856258
36216a955481l212482J318855K376477q94393l85495M392113L946734l817324
36208A769004p817499j406237O441209N459380o68579k570538k77604J77587q70531
36199B36192J523417O225127O998283K743315j590411l621678n671473q345511
36191a502739q611018n230548j128814P43447O15295O39486K550424N818110O945749
36182H39392L142534k133642j819591M265898P462871K810943l076319k794430
$$ plain form
36174 8697656 8572127 5988133 -1432030 -7315573 -5944963 -1435005 -1568960 -7077628
36166 -7077628 -12855904 -16010510 -16790363 -14595795 -9138673 -3720975 -2107380 -3550050
36158 -3550050 -5072127 -6369082 -7959454 -7254330 -1998015 4420013 6725352 5143849
36150 5143849 3388338 1232140 -3976154 -9267250 -7437134 2016195 10225742 10051509
36142 10051509 4470512 904858 1880525 4879867 7707037 9768756 10085083 7984001
36134 7984001 5271816 4717998 5882037 4425521 -2895115 -12807288 -16973069 -10802459
36126 -10802459 44351 5129891 1339229 -4677335 -7200809 -8623739 -12157295 -13678574
36118 -13678574 -8214952 -495479 105727 -6110347 -9102877 -4014541 2868696 5506658
$$ packed form
36174H697656j25529k583994p420163n883543J370610M509958j33955n508668
36166g077628n778276l154606p79853K194568N457122N417698J613595j442670
36158c550050j522077j296955j590372P05124N256315O418028K305339j581503
36150E143849j755511k156198n208294n291096J830116R453329Q209547j74233
36142A0051509n580997l565654R75667K999342K827170K061719L16327k101082
36134G984001k712185n53818J164039j456516p320636r912173m165781O170610
36126a0802459J0846810N085540l790662o016564k523474j422930l533556j521279
36118a3678574N463622P719473O01206o216074k992530N088336O883237K637962
$$ plain form
36110 5506658 6727181 10857160 15028509 14107718 9503970 6785234 7269431 7257061 3917497
36101 3917497 -2137867 -8575634 -12345757 -10796606 -4860060 563715 1876678 460739
36093 460739 -686552 -757649 580325 4224405 7357355 3165601 -9340597 -19359577
36085 -19359577 -15805017 -2634322 5558957 2766950 -2384309 -1274173 3187295 4261846
36077 4261846 2890684 4315978 7972418 8734582 6225246 5127421 6094275 3640795
36069 3640795 -4535386 -12041562 -11582956 -4499861 1612803 2381185 -286457 -2950297
36061 -2950297 -4105691 -3257870 -446438 2655111 3937401 3559898 3232541 3298392 3458758
36052 3458758 5509392 10942852 15823952 13442955 3697136 -5311900 -7474476 -5426803
$$ packed form
36110E506658J220523M129979M171349r20791m603748k718736M84197j2370l339564
36101C917497o055364o437767l770123J549151N936546N423775J312963j415939
36093D60739j147291p1097J337974L644080L132950m191754j2506198j0018980
36085a9359577L554560J3170695Q193279k792007n151259J110136M461468J074551
36077D261846j371162J425294L656440P62164k509336j097825R66854k453480
36069C640795q176181p506176M58606P083095O112664P68382k667642k663840
36061b950297j155394Q47821K811432L101549J282290l77503l27357O5851J60366
36052C458758K050634N433460M881100k380997r745819r009036k162576K047673
$$ plain form
36044 -5426803 -4172691 -3604652 -1982753 -1621115 -4962113 -8928824 -9689685 -9687438 -12993917
36035 -12993917 -16866324 -15963927 -12395815 -12250219 -13601192 -8777703 795173 3738801
36027 3738801 -3708288 -10408176 -6828287 972420 2359091 -727468 1571000 9404556
36019 9404556 11635098 2176015 -11151686 -16967310 -13617835 -8505016 -7427155 -8629882
36011 -8629882 -7540792 -4548534 -4770611 -9606042 -12852097 -9203385 -3012830 -2087441
36003 -2087441 -5278358 -5136076 -2155988 -5147452 -14968518 -20023670 -14027638 -6860565
35995 -6860565 -8822901 -14197536 -11879167 -4067104 -809793 -1690393 1973017 9229071
35987 9229071 9268598 -41680 -7665564 -6666424 -3343754 -4442353 -6498808 -4087569 568887
$$ packed form
36044e426803J254112N68039J621899L61638l340998l966711p60861K247l306479
36035a2993917l872407R02397L568112J45596j350973M823489R572876K943628
36027C738801p447089o699888L579889P800707J386671l086559K298468P833556
36019I404556K230542r459083j3327701n815624L349475N112819J077861j202727
36011h629882J089090K992258k22077m835431l246055L648712O190555R25389
36003b087441l190917J42282K980088k991464r821066n055152N996032P167073
35995f860565j962336n374635K318369P812063L257311q80600L663410P256054
35987I229071L9527r310278p623884R99140L322670j098599k056455K411239M656456
$$ plain form
35978 568887 2921661 3738988 5201840 5630460 4042275 4354943 9091643 13674036 12728488
35969 12728488 7976278 4410974 2351513 -1168887 -5963160 -8865694 -8569056 -6413673
35961 -6413673 -4144972 -3599875 -5987888 -9040804 -8187909 -2982701 1565292 2478861 2688276
35952 2688276 4316067 3911969 -971078 -6124569 -7474368 -8354099 -13186522 -18527475
35944 -18527475 -18265881 -14067196 -12027271 -11654326 -7621579 -1110173 666444 -3271367
35936 -3271367 -5695355 -3254479 -862996 -862612 2323262 11005982 16342283 9728882 -3615522
35927 -3615522 -10883432 -7993221 -1639560 2583815 5501870 8027327 7930148 5268654
35919 5268654 4359255 6762935 7425000 2085208 -5258475 -7261548 -3381475 205378
$$ packed form
35978E68887K352774Q17327J462852M28620j588185L12668M736700M582393r45548
35969A2728488m752210l565304k059461l520400m794273k902534K96638K155383
35961f413673K268701N45097k388013l052916Q52895N205208M547993R13569K09415
35952B688276J627791m04098m883047n153491j349799q79731m832423n340953
35944a8527475K61594M198685K039925L72945M032747O511406J776617l937811
35936c271367k423988K440876K391483L84L185874Q682720N336301o613401j3344404
35927c615522p267910K890211O353661M223375K918055K525457r7179k661494
35919E268654r09399K403680O62065n339792p343683k003073L880073L586853
$$ plain form
35911 205378 243441 418210 4137519 8105772 6943927 1574003 -1667489 183771 3364753
35902 3364753 4157955 4907261 9768259 16733350 18626583 12560063 4447050 1744951
35894 1744951 4137712 4628933 -987035 -9203276 -13982197 -13697362 -10871334 -7451567
35886 -7451567 -3734670 -1052042 -1657456 -5258420 -8989272 -12040233 -16751402 -22896407
35878 -22896407 -24760668 -18217620 -8216843 -3851893 -6765120 -9952570 -8408017 -4973082
35870 -4973082 -3489598 -1954955 3061498 9138361 10629848 6946779 3166091 2492032
35862 2492032 2466995 -163950 -4051473 -4769068 -348127 6430167 11186705 12448809 12202750
35853 12202750 11931835 9833033 4072066 -2275461 -3221331 2483680 9241866 11606045
$$ packed form
35911B05378L8063J74769L719309L968253j161845n369924l241492J851260L180982
35902C364753P93202P49306M860998O965091J893233o066520q113013k702099
35894A744951K392761M91221n615968q216241m778921K84835K826028L419767
35886g451567L716897K682628o05414l600964l730852l050961m711169o145005
35878b2896407j864261O543048J0000777M364950k913227l187450J544553L434935
35870d973082J483484J534643N016453O076863J491487l683069l780688o74059
35862B492032k5037k630945l887523p17595M420941O778294M756538J262104k46059
35853A2202750k70915k098802n760967o347527r45870N705011O758186K364179
$$ plain form
35845 11606045 9760980 6097212 842710 -5027958 -6642192 -853301 7115652 8854337
35837 8854337 4022098 553573 3349080 8646346 11081100 10766439 10576778 10744454 9427044
35828 9427044 5746705 -254781 -8029433 -14887600 -17035233 -14550474 -12206403 -12775227
35820 -12775227 -12848499 -8580877 -2323166 762165 286405 106472 1820637 3794634 5886001
35811 5886001 9827293 14471437 15690306 12494758 8912403 7750439 6417368 1739303
35803 1739303 -4229436 -6652827 -4339568 -568750 1471109 1331494 29412 -1299202
35795 -1299202 -1417375 449838 3729259 7106265 9763844 11314870 11324202 9885607 7848561
35786 7848561 5671255 3259694 1561777 2041947 3248563 1197561 -3773286 -3988672
$$ packed form
35845A1606045j845065l663768n254502n870668j614234N788891P968953J738685
35837H854337m832239l468525K795507N297266K434754l14661j89661J67676j317410
35828I427044l680339o001486p774652o858167k147633K484759K344071n68824
35820a2775227p3272M267622O257711L085331m75760j79933J714165J973997K091367
35811E886001L941292M644144J218869l195548l582355j161964j333071m678065
35803A739303n968739k423391K313259L770818K039859j39615j302082j328614
35795a299202j18173J867213L279421L377006K657579J551026R332j438595k037046
35786G848561k177306k411561j697917M80170J206616k051002m970847k15386
$$ plain form
35778 -3988672 6307244 20576179 25683338 18246309 8265922 4570128 4312220 1628364
35770 1628364 -390650 5420444 17124674 24484512 22831984 18347750 17808827 19690916
35762 19690916 18597953 13497294 7695792 3916922 2946841 4819591 8010490 9006270
35754 9006270 5801448 1216987 317447 4483061 9431997 9311771 2544297 -5970711
35746 -5970711 -8954211 -4294913 2279689 4051456 1529829 311051 1780117 1483712
35738 1483712 -2366218 -5078325 -3216896 -149588 905613 3759870 12197210 20224901
35730 20224901 18458890 9009233 4439387 10198269 17024661 15059952 7811889 5411021
35722 5411021 9341227 12171424 10253123 8081264 8956624 8819607 3268971 -4279883
$$ packed form
35778c988672J0295916J4268935N107159p437029r980387l695794k57908k683856
35770A628364k019014N811094J1704230P359838j652528m484234n38923J882089
35762A9690916j092963n100659n801502l778870r70081J872750L190899R95780
35754I006270l204822m584461q99540M165614M948936j20226o767474q515008
35746e970711k983500M659298O574602J771767k521627j218778J469066k96405
35738A483712l849930k712107J861429L067308J055201K854257Q437340Q027691
35730B0224901j766011r449657m569846N758882O826392j964709p248063k400868
35722E411021L930206K830197j918301k171859Q75360j37017n550636p548854
$$ plain form
35714 -4279883 -6565013 -2305124 2681329 3450878 822152 -1850583 -2727293 -1168960
35706 -1168960 2850090 6926303 7081486 3143034 330093 2149681 4676291 2586478
35698 2586478 -1424156 496179 9478658 17417440 17560181 11578929 4173761 -2907923
35690 -2907923 -8042380 -7383278 -947617 3763594 675660 -5569497 -5702657 1173729
35682 1173729 7413388 8199039 6058814 4243368 2574165 1141576 2042541 5255830
35674 5255830 7425759 6566163 4053875 1111427 -1995726 -2359782 4154164 15440277
35666 15440277 22584428 20449835 14398407 12420891 14492953 14593831 10467650 5906937
35658 5906937 4260653 4472818 4049121 2510068 854413 -367410 -1481159 -2964115
$$ packed form
35714d279883k285130M259889M986453P69549k628726k672735q76710J558333
35706a168960M019050M076213J55183l938452k812941J819588K526610k089813
35698B586478m010634J920335Q982479P938782J42741n981252p405168p081684
35690b907923n134457O59102O435661M711211l087934o245157j33160O876386
35682A173729O239659P85651k140225j815446j669203j432589R00965L213289
35674E255830K169929q59596k512288k942448l107153l64056O513946J1286113
35666A5440277P144151k134593o051428j977516K072062J00878m126181m560713
35658E906937j646284K12165m23697j539053j655655j221823j113749j482956
$$ plain form
35650 -2964115 -4536388 -4926332 -3231767 -470307 1527516 2707068 4458788 6827265
35642 6827265 8598584 10296609 13755149 17844693 18416259 14359681 9998714 8771754
35634 8771754 8029051 3698920 -2783223 -6611111 -6890591 -7136245 -8988332 -9777592 -7130213
35625 -7130213 -2714914 87860 524161 1300640 5509694 12733096 18223266 17346719 11503884
35616 11503884 7658841 10477197 16806768 19876490 17081835 11109099 4982344 -688078
35608 -688078 -5856855 -9333617 -9701473 -6781788 -2070782 1981859 4115376 5885346
35600 5885346 9236106 12197827 10335079 3992757 217482 4270313 12277845 16008458
35592 16008458 12380270 4375826 -4667151 -12605155 -16358006 -14196545 -9874835 -9203255
$$ packed form
35650b964115j572273l89944J694565K761460J997823J179552J751720K368477
35642F827265J771319J698025L458540M089544N71566m056578m360967j226960
35634H771754p42703m330131o482143l827888k79480k45654j852087p89260K647379
35625g130213M415299K802774M36301P76479M209054P223402N490170q76547n842835
35616A1503884l845043K818356O329571L069722k794655n972736o126755n670422
35608f88078n168777l476762l67856K919685M711006M052641K133517J769970
35600E885346L350760K961721j862748o342322l775275M052831Q007532L730613
35592A6008458l628188q004444r042977p938004l752851K161461M321710O71580
$$ plain form
35584 -9203255 -12183554 -13231471 -9458500 -3808382 744835 4909357 9123531 10493102
35576 10493102 6634535 -234068 -5465650 -6503975 -3973002 -53519 3361834 6232081
35568 6232081 9812390 13068432 11622301 3680350 -4923448 -6576432 -1792123 2138776
35560 2138776 1609005 -557744 -2418528 -5065787 -6319488 -1120383 8363920 11645256
35552 11645256 4237519 -4664126 -5292652 -827862 224776 -1314759 1546309 8287876
35544 8287876 11433320 9374586 7982495 8937177 6654443 -697443 -6271840 -4873847
35536 -4873847 -1036765 -1848124 -6994628 -10852483 -10759787 -8695883 -7054476 -6322248 -5624413
35527 -5624413 -3447013 988107 6336330 10839653 14898525 18835971 19200896 12538827
$$ packed form
35584i203255k980299j047917L772971N650118M553217M164522M214174J369571
35576A0493102l858567o868603n231582j038325K530973L919483L415353K870247
35568F232081L580309L256042j446131p941951q603798j652984M784309L930899
35560B138776n29771k166749j860784k647259j253701N199105R484303L281336
35552A1645256p407737q901645o28526M464790J052638j539535K861068O741567
35544H287876L145444k058734j392091R54682k282734p351886n574397J397993
35536d873847L837082q11359n146504l857855R2696K063904J641407P32228O97835
35527e624413K177400M435120N348223M503323M058872L937446L64925o662069
$$ plain form
35519 12538827 2821926 -1392860 1134074 2070492 -3731212 -10085994 -9033304 -2565661
35511 -2565661 1601589 1584874 1585059 3185569 3314205 191944 -3943940 -5740459 -3040877
35502 -3040877 3732721 9424268 7319713 -889728 -3238350 7431812 21125825 22775830
35494 22775830 13324828 7173624 9645575 10580542 3404556 -2958254 1314537 11124001
35486 11124001 14882568 11273720 7504825 6105001 3869604 928633 730030 2017379
35478 2017379 42180 -4032665 -3374451 3692176 10670884 12552988 11632680 11368058 11000930
35469 11000930 9583042 9499485 11585700 11176362 3973189 -6749915 -13261110 -12415534
35461 -12415534 -8141208 -5666171 -6148485 -7010364 -5733463 -2929723 -1921091 -4751695
$$ packed form
35519A2538827r716901m214786K526934R36418n801704o354782J052690O467643
35511b565661M167250j6715J85J600510J28636l122261m135884j796519K699582
35502c040877O773598N691547k104555q209441k348622J0670162J3694013J650005
35494B2775830r451002o151204K471951R34967p175986o362810M272791R809464
35486A1124001L758567l608848l768895j399824k235397k940971j98603J287349
35478B017379j975199m074845O58214P066627O978708J882104r20308k64622l67128
35469A1000930j417888q3557K086215m09338p203173j0723104o511195Q45576
35461a2415534M274326K475037m82314q61879J276901K803740J008632k830604
$$ plain form
35453 -4751695 -8953098 -9807787 -5654195 962622 6973842 10760833 10620536 5336052
35445 5336052 -2210062 -5666431 -2062225 4446974 8008390 7957571 7859903 9880276 13071276
35436 13071276 15845726 17199603 16115209 12242149 7101999 3027660 1069748 726731
35428 726731 860074 242934 -1326531 -1845087 662361 3590014 578928 -10291030 -21557264
35419 -21557264 -23453922 -15042101 -4872296 -945435 -3399443 -7446616 -10055154 -11743738
35411 -11743738 -13554628 -14554091 -12672155 -7379683 -994823 3114398 3542030 1469859
35403 1469859 -1376560 -4021387 -5393587 -3985760 617714 6683501 11141616 10935658
35395 10935658 4822319 -3952818 -8079394 -3210701 5569572 8760456 4403766 -189985
$$ packed form
35453d751695m201403q54689M153592O616817O011220L786991j40297n284484
35445E336052p546114l456369L604206O509199L561416n0819r7668K020373L191000
35436A3071276K774450J353877j084394l873060n140150m074339j957912l43017
35428G26731J33343o17140j569465n18556K507448K927653l011086j0869958j1266234
35419b1557264j896658Q411821J0169805L926861k454008m047173k608538j688584
35411a1743738j810890r99463J881936N292472O384860M109221M27632k072171
35403A469859k846419k644827j372200J407827M603474O065787M458115k05958
35395A0935658o113339q775137m126576M868693Q780273L190884m356690m593751
$$ plain form
35387 -189985 92351 1456007 -773644 -4088913 -4383003 -4011954 -7011038 -10155778 -6885954
35378 -6885954 1877920 8701406 10469181 10689938 11362445 10334780 7436117 5635584
35370 5635584 4576409 252682 -6723205 -9681315 -5676416 -22823 2390916 3773147
35362 3773147 7152450 9692488 7840069 4286222 3925345 6390745 7908183 7453207
35354 7453207 6096590 3463606 161303 627342 7549816 15800606 18249618 15978777
35346 15978777 16030559 19730534 20375669 13506533 3023788 -5054875 -9459977 -11558119
35338 -11558119 -11179146 -8335925 -5898848 -6587725 -8861089 -8972763 -6217826 -3415682
35330 -3415682 -2530178 -2286674 -698890 1783508 2972413 2289932 1979253 4155510 7513210
$$ packed form
35387a89985K82336J363656k229651l315269k94090L71049k999084l144740L269824
35378f885954Q763874O823486J767775K20757O72507j027665k898663j800533
35370E635584j059175m323727o975887k958110M004899N653593K413739J382231
35362C773147L379303K540038j852419l553847l60877K465400J517438m54976
35354G453207j356617k632984l302303M66039O922474Q250790K449012k270841
35346A5978777N1782L699975O45135o869136j0482745q078663m405102k098142
35338a1558119L78973K843221K437077o88877k273364j11674K754937K802144
35330c415682Q85504K43504J587784K482398J188905o82481l10679K176257L357700
$$ plain form
35321 7513210 8648591 6658735 4383317 4241311 4973534 4257083 2759943 3097240 5625459
35312 5625459 7705778 6933178 3227176 -1970265 -6805992 -9680992 -10586678 -11572101 -14423692
35303 -14423692 -18358208 -21328952 -22514298 -21722753 -17857144 -10805747 -3812189 -526146
35295 -526146 15685 2020073 6580684 10510611 12005225 13071211 14578173 13231349
35287 13231349 6709742 -1444256 -6011256 -7031634 -8324267 -10215814 -8406034 -798157
35279 -798157 8173417 11747812 7464741 -1277236 -8453956 -9609348 -5005890 270293
35271 270293 1067277 -2087976 -3913017 -1670630 1615551 3204783 6121908 14105904
35263 14105904 23383973 25595440 19161623 11810489 9894080 10916170 10189868 9421784
$$ packed form
35321G513210J135381j989856k275418j42006P32223p16451j497140L37297K528219
35312E625459K080319p72600l706002n197441m835727k875000r05686r85423k851591
35303a4423692l934516k970744j185346P91545L865609P051397O993558L286043
35295e26146N41831K004388M560611L929927J494614J065986J506962j346824
35287A3231349o521607q153998m567000j020378j292633j891547J809780P607877
35279g98157Q971574L574395m283071q741977p176720j155392M603458N276183
35271B70293P96984l155253j825041K242387L286181J589232K917125P983996
35263A4105904R278069K211467o433817p351134j916409J022090p26302p68084
$$ plain form
35255 9421784 12647418 17092875 15550590 7407784 503975 513745 3982108 4295956 183655
35246 183655 -4600845 -6792663 -5945127 -3507319 -1860072 -2484141 -3609926 -1741103 3468139
35237 3468139 8523343 11201317 12804814 13808133 11588799 5487185 169658 -166474
35229 -166474 1936683 965300 -3796641 -8528246 -10964632 -11727648 -10959227 -8165555 -4597839
35220 -4597839 -1617883 2358060 8867626 14388699 13746036 8663779 7240639 13214868
35212 13214868 20609470 21648584 16184838 10124061 7034254 4696520 -654077 -8831381
35204 -8831381 -14910296 -13880473 -6277791 1849679 5574521 5973147 6590578 7589075 7086096
35195 7086096 6335963 8521321 12928856 15456276 15048372 14344303 13406715 8900118 1384331
$$ packed form
35255I421784L225634M445457j542285q142806o903809R770L468363L13848m112301
35246A83655m784500k191818Q47536K437808J647247o24069j125785J868823N209242
35237C468139N055204K677974J603497J003319k219334o101614n317527l36132
35229a66474K103157r71383m761941m731605k436386p63016P68421K793672L567716
35220d597839K979956L975943O509566N521073o42663n082257j423140N974229
35212A3214868P394602J039114n463746o060777l089807k337734n350597q177304
35204h831381o078915J029823P602682Q127470L724842L98626O17431R98497n02979
35195G086096p50133K185358M407535K527420m07904p04069r37588m506597p515787
$$ plain form
35186 1384331 -2757641 -87724 4531813 5434804 4007041 3814991 2186920 -6288203
35178 -6288203 -19446159 -27590744 -24841740 -15673474 -8600990 -6704805 -6213930 -2556842
35170 -2556842 3890803 8025741 5932131 119972 -2948964 -803260 2585416 3699722
35162 3699722 4967972 9847061 15532643 15691995 9301157 1741621 -2924099 -6041086
35154 -6041086 -9718195 -12351829 -11059046 -6054076 -617476 1964347 596779 -2997381
35146 -2997381 -5374241 -4536286 -1998765 -145466 1613372 5297709 9673502 11085558
35138 11085558 9492285 9404825 13010235 16212689 14217270 7917856 1655102 -2693988
35130 -2693988 -5835208 -7403869 -6326992 -3899189 -2667276 -2469388 -893282 2369341
$$ packed form
35186A384331m141972K669917M619537R02991j427763j92050j628071q475123
35178f288203j3157956q144585K749004R168266P072484J896185M90875L657088
35170b556842O447645M134938k093610n812159l068936K145704L388676J114306
35162C699722J268250M879089N685582J59352o390838p559536m665720l116987
35154f041086l677109k633634J292783N004970N436600K581823j367568l594160
35146b997381k376860Q37955K537521J853299J758838L684337M375793J412056
35138A1085558j593273q7460L605410L202454j995419o299414o262754m349090
35130b693988l141220j568661J076877K427803J231913J97888J576106L262623
$$ plain form
35122 2369341 4718245 4292426 1599659 -2358943 -6487169 -8314043 -6160886 -3128153
35114 -3128153 -4870911 -12092312 -19080421 -21217670 -19775423 -17294880 -13236704 -7871272
35106 -7871272 -5642775 -9142266 -13169206 -11100999 -5005088 -2671376 -5628184 -7287374
35098 -7287374 -3439874 2425627 5952819 7520890 8361815 6965786 2870974 -706098
35090 -706098 -1451863 -1090781 -1166077 -231448 1877557 2134062 193896 576974 4560437
35081 4560437 5926357 764204 -4346973 -1743809 4511317 4489927 -1908877 -5044259
35073 -5044259 -270685 7115350 11966055 14860398 16062734 13048274 7051470 4096502
35065 4096502 5918352 6749498 2496486 -3599203 -7768711 -11037166 -13629734 -11289915
$$ packed form
35122B369341K348904m25819k692767l958602m128226j826874K153157L032733
35114c128153j742758p221401o988109k137249J442247K480543M058176N365432
35106g871272K228497l499491m026940K068207O095911K333712k956808j659190
35098g287374L847500N865501L527192J568071Q40925j396029m094812l577072
35090g06098p45765L61082p5296R34629K109005K56505j940166L83078L983463
35081D560437J365920n162153n111177K603164O255126k1390o398804l135382
35073e044259M773574P386035M850705K894343J202336l014460n996804k954968
35065D096502J821850Q31146m253012o095689m169508l268455k592568K339819
$$ plain form
35057 -11289915 -2607108 6349041 10642030 13698897 19153173 21222408 12139859 -3983232
35049 -3983232 -13907691 -11430094 -3232391 1773410 1953496 56749 -3241473 -9121514
35041 -9121514 -16405739 -20574648 -17456510 -7972219 1200753 3690708 610628 -1096558
35033 -1096558 1786591 4932176 3985382 860153 -999614 -2617624 -5616226 -6721538
35025 -6721538 -2590151 2899006 3033008 -1946221 -6086056 -7143953 -7682812 -7900599 -5368180
35016 -5368180 -2180773 -4027967 -10080151 -11621432 -4349547 4683449 6947037 3664108
35008 3664108 1967466 4299087 7621223 10390323 14002910 17917900 18765190 15302885
35000 15302885 10496017 7314684 5150199 1907297 -2311091 -5539595 -7151494 -8848902
$$ packed form
35057a1289915Q682807Q956149M292989L056867N454276K069235r082549j6123091
35049c983232r924459K477597Q197703N005801J80086j896747l298222n880041
35041i121514p284225m168909L118138R484291R172972K489955l080080j707186
35033a096558K883149L145585r46794l125229j859767j618010k998602j105312
35025f721538M131387N489157J34002m979229m139835j057897n38859k17787K532419
35016e368180L187407j847194o052184j541281P271885R032996K263588l282929
35008C664108j696642K331621L322136K769100L612587L914990Q47290l462305
35000A5302885m806868l181333k164485l242902m218388l228504j611899j697408
$$ plain form
34992 -8848902 -12086660 -15644483 -16624418 -13513656 -7735142 -2681231 -1781430 -6367999
34984 -6367999 -13745981 -18048611 -15303272 -7795162 -1586344 -32664 -1881812 -4691221
34976 -4691221 -6494802 -4892430 401758 3928336 -385666 -9000520 -10814507 -2683726
34968 -2683726 4759921 2258623 -4616218 -5203881 -762210 -1320115 -8856869 -14677181
34960 -14677181 -13130627 -7865147 -3315683 817528 4329156 3996611 -408344 -4160997
34952 -4160997 -4618316 -4504782 -5799904 -6146719 -3911422 -1295372 221966 2341118 5397654
34943 5397654 6550971 5026887 4121753 5466474 6169059 4003830 611501 -2406730
34935 -2406730 -5330112 -6565343 -3197409 2544564 4130844 957210 646396 7371760
$$ packed form
34992h848902l237758l557823r79935L110762N778514N053911Q99801m586569
34984f367999p377982m302630K745339P508110O208818J553680j849148k809409
34976d691221j803581J602372N294188L526578m314002q614854j813987Q130781
34968b683726P443647k501298o874841n87663M441671n57905p536754n820312
34960a4677181J546554N265480M549464M133211L511628l32545m404955l752653
34952d160997m57319J13534j295122l46815K235297K616050J517338K119152L056536
34943E397654J153317j524084r05134J344721P02585k165229l392329l018231
34935b406730k923382j235231L367934N741973J586280l173634l10814O725364
$$ plain form
34927 7371760 15074953 16979800 14781929 12958840 11030330 7928904 7178171 9965549
34919 9965549 9171466 -796670 -12993344 -16096702 -9972455 -3644225 -756664 2484153
34911 2484153 6268596 5203797 -1252064 -6056448 -5099422 -2544275 -2727036 -4002291
34903 -4002291 -4227116 -5668274 -9618654 -11305036 -5902814 3129206 7100615 2999555
34895 2999555 -2576445 -1401771 6603594 13519056 13375889 9737297 10574816 16597714
34887 16597714 19697401 14656872 6974926 4969729 8764175 12701264 14834185 16898331
34879 16898331 17188694 11612653 1966550 -4082086 -2746130 1790729 4120603 3151150
34871 3151150 74075 -3654697 -5086129 -1828856 3519553 6300881 7812468 13779585
$$ packed form
34927G371760P703193J904847k197871j823089j928510l101426p50733K787378
34919I965549p94083r968136j2196674l103358O124247O328230K887561L240817
34911B484153L784443j064799o455861m804384R57026K555147j82761j275255
34903d002291k24825j441158l950380j686382N402222R032020L971409m101060
34895B999555n576000J174674Q005365O915462j43167l638592Q37519O022898
34887A6597714L099687n040529p681946k005197L794446L937089K132921K064146
34879A6898331K90363n576041r646103o048636J335956M536859K329874r69453
34871C151150l077075l728772j431432L257273N348409K781328J511587N967117
$$ plain form
34863 13779585 23273459 26920314 20040300 10471013 7749782 10340264 10242913 5859487
34855 5859487 2726654 3851402 6747305 9457928 12795432 15893478 15312414 10269159
34847 10269159 4419782 867067 -891828 -1787619 -1039983 856643 1124494 -342569
34839 -342569 1080187 7435672 12055808 7265702 -2699673 -4190150 7990641 22209546
34831 22209546 24630283 16643179 10447974 11205897 13288769 13479995 16722246 24893042
34823 24893042 29578561 23262214 11214217 4356178 4889005 7254043 9840648 15989347
34815 15989347 24049407 26088397 18864566 8793573 3047425 1646822 1515079 2878727
34807 2878727 7153245 11966509 12932643 9238880 4456881 2252580 3057767 4721106
$$ packed form
34863A3779585R493874L646855o880014r569287k721231K590482r7351m383426
34855E859487l132833J124748K895903K710623L337504L098046n81064n043255
34847A0269159n849377l552715j758895q95791P47636J896626K67851j467063
34839c42569J422756O355485M620136m790106r965375j490477J2180791J4218905
34831B2209546K420737p987104o195205P57923K082872J91226L242251Q170796
34823B4893042M685519o316347j2047997o858039N32827K365038K586605O148699
34815A5989347Q060060K038990p223831j0070993n746148j400603j31743J363648
34807B878727M274518M813264R66134l693763m781999k204301Q05187J663339
$$ plain form
34799 4721106 5423592 5600052 6542920 7515761 6592211 5039638 7073213 12591741 14347653
34790 14347653 7205751 -3093201 -6647960 -2806212 -10555 -3242833 -8862504 -12039610
34782 -12039610 -11936550 -8351266 -521578 8409119 12261031 9916592 6884727 6506342
34774 6506342 5702472 2236241 -133284 2382406 7829140 12463137 15528640 16621059
34766 16621059 13532307 6691603 831041 -1764128 -4749172 -10457580 -14513798 -12562066
34758 -12562066 -7301642 -3362206 160179 6068354 12088862 14020967 12858939 12702028
34750 12702028 14048399 14640483 14299464 13565293 10603825 5236049 2736609 6944053
34742 6944053 12498271 11448653 5516974 3655626 8307901 12555655 11565466 8669662
$$ packed form
34799D721106P02486J76460R42868R72841r23550j552573K033575N518528J755912
34790A4347653p141902j0298952l554759L841748K795657l232278n619671l177106
34782a2039610J03060L585284P829688Q930697L851912k344439l031865l78385
34774F506342q03870l466231k369525K515690N446734M633997L065503J092419
34766A6621059l088752o840704n860562k595169k985044n708408m056218J951732
34758a2562066N260424L939436L522385N908175O020508J932105j162028j56911
34750A2702028J346371N92084l41019p34171k961468n367776k499440M207444
34742F944053N554218j049618n931679j861348M652275M247754r90189k895804
$$ plain form
34734 8669662 7763829 6824003 2742694 -2543247 -4870457 -3858781 -2894549 -4444618 -6957765
34725 -6957765 -5808212 2133462 13378108 18962280 13704916 2894153 -3834600 -3979857
34717 -3979857 -3335594 -6570073 -11469909 -13082155 -9756535 -4255691 -1329539 -3844798
34709 -3844798 -9024354 -10054482 -4403341 1643308 679156 -5902599 -10520999 -9821168
34701 -9821168 -6808383 -4197255 -1961210 -727790 -1196211 -442020 4820939 11465697
34693 11465697 13192723 10624923 10720785 15175098 17351397 13217268 7901140 7729782
34685 7729782 11830367 15268227 15380833 12053441 6773650 3785606 6659108 11669455
34677 11669455 11080815 5222734 3299581 8536160 11604332 5166875 -3571552 -3677199
$$ packed form
34734H669662r05833r39826m081309n285941k327210J011676R64232j550069k513147
34725f957765J149553P941674J1244646N584172n257364j0810763o728753j45257
34717c979857O44263l234479m899836j612246L325620N500844K926152k515259
34709c844798n179556j030128N651141O046649r64152o581755m618400O99831
34701i821168L012785K611128K236045J233420m68421P54191N262959O644758
34693A1465697J727026k567800R5862M454313K176299m134129n316128j71358
34685G729782M100585L437860J12606l327392n279791k988044K873502N010347
34677A1669455n88640n858081j923153N236579L068172o437457q738427j05647
$$ plain form
34669 -3677199 2836562 5602476 2940993 3026277 9175589 14608781 13536635 9022927
34661 9022927 6923821 8157904 9849399 9709034 7128962 3396214 1993599 5280643
34653 5280643 10234226 11239686 7853438 5834174 9263963 15516077 19848868 21462657
34645 21462657 22327942 22461154 19644829 13478944 7545901 6650283 12042427 19695041
34637 19695041 23905417 22713500 19001147 16502649 16537327 18719568 21978534 23675742
34629 23675742 20791948 14079298 8269649 5936171 4258844 552088 -2779203 -2783078
34621 -2783078 -1714082 -2813152 -3411649 901878 6919178 6532061 -601349 -4725975
34613 -4725975 1111369 12088751 18845822 18403796 14021792 8755870 4016399 1672029
$$ packed form
34669c677199O513761K765914k661483Q5284O149312N433192j072146m513708
34661I022927k099106J234083J691495j40365k580072l732748j402615L287044
34653E280643M953583J005460l386248k019264L429789O252114M332791J613789
34645B1462657Q65285J33212k816325o165885n933043q95618N392144P652614
34637A9695041M210376j191917l712353k498498L4678K182241L258966J697208
34629B3675742k883794o712650n809649k333478j677327l706756l331291l875
34621b783078J068996j099070n98497M313527O017300l87117p133410m124626
34613d725975N837344J0977382O757071m42026m382004n265922m739471k344370
$$ plain form
34605 1672029 2794072 5479585 7353009 9053282 12215725 15330305 15138225 11784699
34597 11784699 9306449 10311634 12489601 11669378 7348982 3958139 6098554 12634348
34589 12634348 16800218 13695907 6824648 4654801 10692162 19828583 25035798 24310389
34581 24310389 19773802 13932739 9668454 10290970 15385079 19158214 17689752 15794660
34573 15794660 20670174 29435764 30357413 18648296 4218539 -875560 2803123 6252154
34565 6252154 7001146 11167882 20888592 28802472 28898347 26009604 28357730 34602238 35283204
34556 35283204 26112804 13559486 6309612 6158328 9068510 11025833 10211281 6424248
34548 6424248 1457119 -1444592 -849455 1025884 1261798 -75113 -501526 1729885 6141255
$$ packed form
34605A672029J122043K685513J873424J700273L162443L114580j92080l353526
34597A1784699k478250J005185K177967q20223m320396l390843K140415O535794
34589A2634348M165870l104311o871259k169847O037361R136421N207215p25409
34581B4310389m536587n841063m264285O22516N094109L773135j468462j895092
34573A5794660M875514Q765590R21649j1709117j4429757n094099L678683L449031
34565F252154P48992M166736R720710P913880R5875k888743K348126O244508O80966
34556C5283204r170400j2553318p249874j51284K910182J957323q14552l787033
34548F424248m967129k901711N95137J875339K35914j336911m26413K231411M411370
$$ plain form
34539 6141255 10530202 12243609 10631940 8930700 11276078 16535277 18019633 11901512
34531 11901512 3548886 2057025 9579786 19182696 22732531 18200319 9511008 1885261
34523 1885261 -2153262 -3706899 -4922587 -5536827 -3488875 796856 3878431 4708465
34515 4708465 6912562 12589716 17613620 17783172 16403382 19531274 25683267 27559011
34507 27559011 23719431 20890411 23092928 25766083 23824552 19217030 16411212 15758108
34499 15758108 15912036 18043965 22327570 24188115 20076337 14247854 13532849 17032613
34491 17032613 17593121 13255270 10627275 15202326 23755348 29215478 29221965 26638476 24190228
34482 24190228 22034849 19569171 16684756 13112721 8487409 3644016 678285 901779
$$ packed form
34539F141255M388947J713407j611669j701240K345378N259199J484356o118121
34531A1901512q352626j491861P522761R602910L549835m532212q689311p625747
34523A885261m038523j553637j215688o14240K047952M285731L081575Q30034
34515D708465K204097N677154N023904J69552j379790L127892O151993J875744
34507B7559011l839580k829020K202517K673155j941531m607522k805818o53104
34499A5758108J53928K131929M283605J860545m111778n828483p15005L499764
34491A7032613N60508m337851k627995M575051Q553022N460130O487k583489k448248
34482B4190228k155379k465678k884415l572035m625312m843393k965731K23494
$$ plain form
34474 901779 3211102 5298845 6442370 8186595 11905537 16830025 21449559 25482238
34466 25482238 28530720 28173394 22869910 16624023 16454836 23489539 30316969 30009773
34458 30009773 24781501 22302707 25870907 32260691 37638118 40929569 41622160 38810280
34450 38810280 33700987 29880471 29582488 31623189 33717520 34915253 35357860 35761057
34442 35761057 37663223 42094991 47372348 50205024 49707801 48412657 48458096 48514103 45589235
34433 45589235 38827112 30900468 26476986 29155619 38417848 49436697 57127373 60218064
34425 60218064 60310985 58422938 55128048 52951427 54492055 57726390 57244849 51713956
34417 51713956 46584462 47235373 52400236 56880239 58313493 58567451 60357002 65165185
$$ packed form
34474I01779K309323K087743J143525J744225L718942M924488M619534M032679
34466B5482238L048482l57326n303484o245887j69187P034703O827430l07196
34458C0009773n228272k478794L568200O389784N377427L291451O92591k811880
34450C8810280n109293l820516k97983K040701K094331J197733M42607M03197
34442C5761057J902166M431768N277357K832676m97223j295144M5439N6007k924868
34433D5589235o762123p926644m423482K678633R262229J1018849P690676L090691
34425F0218064R2921j888047l294890k176621J540628L234335m81541n530893
34417E1713956n129494O50911N164863M480003J433254K53958J789551M808183
$$ plain form
34409 65165185 72966735 81345239 86044744 85015039 81365715 80411956 84489019 92064745
34401 92064745 100401549 106934406 109442544 107805745 105484610 107146991 114535852 125529393
34393 125529393 136604686 145419988 152169481 159270491 168238416 176440310 179730082 179419735
34385 179419735 182880529 194716342 211024892 225595693 237624493 248808374 257349912
34378 257349912 261657210 266660150 278061937 291948729 299438921 301724011 310197056 329062352
34370 329062352 348236964 359002066 367364132 383704641 406092277 423577995 432152175
34363 432152175 437797755 445286440 452978686 459119184 465348407 471933456 475506440 473991338
34355 473991338 469641721 465454700 461827474 457638378 451539840 441901257 428680656 415178385
$$ packed form
34409F5165185P801550Q378504M699505j029705l649324r53759M077063P575726
34401I2064745Q336804O532857K508138j636799k321135J662381P388861J0993541
34393A25529393J1075293Q815302O749493P101010Q967925Q201894L289772l10347
34385A79419735L460794J1835813J6308550J4570801J2028800J1183881Q541538
34378B57349912M307298N002940J1401787J3886792P490192K285090Q473045J8865296
34370C29062352J9174612J0765102Q362066J6340509K2387636J7485718Q574180
34363D32152175N645580P488685P692246O140498O229223O585049L572984j515102
34355D73991338m349617m187021l627226m189096o098538r638583j3220601j3502271
$$ plain form
34347 415178385 404402691 394262380 380642969 364730987 352032862 343777317 334838817
34340 334838817 321343743 304832431 287382261 268769513 251236486 240657605 238023540
34333 238023540 234622540 221688873 202130834 187126013 182494041 183230656 180790093 171614457
34325 171614457 158628968 147554503 141715764 138415522 131458590 119182440 107777826
34318 107777826 103613979 104647973 103843804 99585617 97280241 100340839 104752885 104561496
34310 104561496 98975098 91566764 85117006 79990559 76160691 74194733 74208543 75173227
34302 75173227 75445968 73595252 69065113 62658471 56443430 52779402 52684346 54424568
34294 54424568 54028100 48533795 39354994 31698291 30121756 34750096 41127182 42940569
$$ packed form
34347D15178385j0775694j0140311j3619411j5911982j2698125q255545q938500
34340C34838817j3495074j6511312j7450170j8612748j7533027j0578881k634065
34333B38023540l401000j2933667j9558039j5004821m631972P36615k440563r175636
34325A71614457j2985489j1074465n838739l300242o956932j2276150j1404614
34318A07777826m163847J033994q04169m258187k305376L060598M412046j91389
34310A04561496n586398p408334o449758n126447l829868j965958J3810R64684
34302G5173227K72741j850716m530139o406642o215041l664028r5056J740222
34294E4424568l96468n494305r178801p656703j576535M628340O377086J813387
$$ plain form
34286 42940569 36519342 25230741 18188095 20695687 26452160 24309990 13398539 5198178
34278 5198178 7843324 15096698 16369160 11987766 10708477 15468276 20550848 22209928
34270 22209928 23289505 25531639 25059465 19269269 12439331 9828025 9805593 6433193
34262 6433193 -1764571 -9204507 -9191043 -634729 10955494 18391515 18979753 15797505
34254 15797505 12913565 11316652 10874208 13175436 18674166 23255119 22616157 19039963
34246 19039963 18606851 22088253 24152537 21875235 18312893 16787260 17420281 20418967
34238 20418967 26323847 31079236 27983646 18075126 11738530 15085188 20939976 19488422
34230 19488422 12508748 9437979 12802525 15814607 13404065 8194143 4749017 3682799
$$ packed form
34286D2940569o421227j1288601p042646K507592N756473k142170j0911451q200361
34278E198178K645146P253374J272462m381394j279289M759799N082572J659080
34270B2209928J079577K242134m72174n790196o829938k611306k2432l372400
34262F433193q197764p439936J3464Q556314J1590223P436021N88238l182248
34254A5797505k883940j596913m42444K301228N498730M580953o38962l576194
34246A9039963m33112L481402K064284k277302l562342j525633O33021K998686
34238B0418967N904880M755389l095590r908520o336596L346658N854788j451554
34230A9488422o979674l070769L364546L012082k410542n209922l445126j066218
$$ plain form
34222 3682799 3001829 1315436 -1422825 -3587228 -2189930 3755598 10530933 13175888
34214 13175888 11165063 7903810 5434998 2917156 -44125 -1902091 -1458426 594294
34206 594294 2663519 3527101 3261963 3670142 5937241 7251525 3436707 -3298563 -4380113
34197 -4380113 3325196 10914371 8967020 1491315 304664 7915936 15008133 14521942
34189 14521942 9153092 3721145 -839840 -3089891 639645 8954056 13507196 9607234
34181 9607234 2777677 -226940 -672460 -1969819 -801743 7244651 17101152 18947216
34173 18947216 12410872 6860531 6738989 5539009 -2351984 -11490734 -12780345 -6375654
34165 -6375654 -999476 -2227614 -6719544 -7952411 -3636578 3317837 8348540 8733521
$$ packed form
34222C682799o80970j686393k738261k164403J397298N945528O775335K644955
34214A3175888k010825l261253k468812k517842k961281j857966M43665K052720
34206E94294K069225Q63582k65138M08179K267099J314284l814818o735270j081550
34197d380113P705309P589175j947351p475705j186651P611272P092197m86191
34189A4521942n368850n431947m560985k250051L729536Q314411M553140l899962
34181I607234o829557l004617m45520j297359J168076Q046394R856501J846064
34173A8947216o536344n550341j21542j199980p890993r138750j289611O404691
34165f375654N376178j228138m491930j232867M315833O954415N030703L84981
$$ plain form
34157 8733521 5459405 2405049 2215783 2704594 -679827 -8214066 -14291173 -14244214 -10448581
34148 -10448581 -8581630 -9303514 -7812845 -1743103 5041923 8398538 9595580 11740026
34140 11740026 13680728 12162842 8547714 8011854 11360301 12426914 6176188 -3730958
34132 -3730958 -8721905 -5357259 1352113 4640377 3486766 1948287 2154629 671631
34124 671631 -6287732 -15220249 -16422674 -4483748 14464200 28441304 31436074 27262618
34116 27262618 22821870 20705195 18602080 13248257 3970923 -6102001 -11934710 -11101283
34108 -11101283 -6526954 -3307732 -2989118 -2745419 -131798 3413916 4414473 1436797
34100 1436797 -3026296 -4233866 427349 7738789 10750157 6412386 -236020 -1727649
$$ packed form
34157H733521l274116l054356j89266M88811l384421p534239o077107M6959L795633
34148a0448581J866951p21884J490669O069742O785026L356615J197042K144446
34140A1740026J940702j517886l615128n35860L348447J066613o250726r907146
34132c730958m990947L364646O709372L288264j153611j538479K06342j482998
34124F71631o959363q932517j202425J1938926J8947948J3977104K994770m173456
34116B7262618m440748k116675k103115n353823r277334j0072924n832709Q33427
34108a1101283M574329L219222L18614K43699K613621L545714J000557k977676
34100A436797m463093j207570M661215P311440L011368m337771o648406j491629
$$ plain form
34092 -1727649 3345379 10032360 13629623 13267340 10192343 6486657 5014166 6713941
34084 6713941 8147242 5576516 1049160 -114760 2187812 2197931 -2789062 -8169236
34076 -8169236 -8845403 -5601188 -1945485 1299471 5025782 8604431 10807067 11864127
34068 11864127 12418263 12517684 12980226 14784952 15597035 10567495 -819489 -11766144
34060 -11766144 -15039840 -10926415 -6108373 -6184707 -10592501 -13278912 -8207944 3351794
34052 3351794 11789969 9454041 1080501 -1879384 3169607 8048321 8451944 10426278
34044 10426278 17748906 22883472 18440362 9774529 6703695 8584692 7857629 4096068
34036 4096068 3384599 5822479 4834558 -896018 -4964564 -4266841 -3472065 -6000679 -8492644
$$ packed form
34092a727649N073028O686981L597263l62283l074997l705686j472491J699775
34084F713941J433301k570726m527356j163920K302572J0119m986993n380174
34076h169236o76167L244215L655703L244956L726311L578649K202636J057060
34068A1864127N54136R9421M62542J804726Q12083n029540j1386984j0946655
34060a1766144l273696M113425M818042p6334m407794k686411N070968J1559738
34052C351794Q438175k335928q373540k959885N048991M878714M03623J974334
34044A0426278P322628N134566m443110q665833l070834J880997p27063l761561
34036D096068p11469K437880r87921n730576m068546O97723P94776k528614k491965
$$ plain form
34027 -8492644 -7606372 -5707185 -5918816 -6475929 -3770593 2108412 7437839 8442561 4126914
34018 4126914 -2305094 -5529357 -4271480 -3482784 -6723307 -9547008 -6278038 -348515
34010 -348515 -18599 -5514987 -9398787 -9394402 -11066232 -16260022 -18768477 -14947621 -9823674
34001 -9823674 -8210717 -7484789 -3995270 223346 2057946 2512263 2772218 1054515 -2324071
33992 -2324071 -2935247 304286 2088212 -354263 -2284379 -483240 417297 -3028405
33984 -3028405 -5565420 -2596271 553399 -1786643 -3741754 2901051 12731954 12932745
33976 12932745 3022008 -4654778 -4042695 -2318966 -5581853 -9244022 -7148238 -1118824
33968 -1118824 3550487 5190790 4178996 520873 -3056308 -1325887 6086498 12389755
$$ packed form
34027h492644Q86272J899187k11631n57113K705336N879005N329427J004722m315647
34018D126914o432008l224263J257877P88696l240523k823701L268970N929523
34010c48515L29916n496388l883800M385j671830n193790k508455L820856N123947
34001i823674J612957P25928L489519M218616J834600M54317K59955j717703l378586
33992b324071o11176L239533J783926k442475j930116J801139R00537l445702
33984c028405k537015K969149L149670k340042j955111O642805R830903K00791
33976A2932745r910737p676786O12083J723729l262887l662169K095784O029414
33968a118824M669311J640303j011794l658123l577181J730421P412385O303257
$$ plain form
33960 12389755 12254071 8399933 6485322 7823303 10303214 12248664 11988278 7422479
33952 7422479 -540922 -7123126 -8904031 -7084508 -3933721 98675 3870631 4726366
33944 4726366 2838782 2062855 3771960 4426531 2235170 1078981 3804450 6667829
33936 6667829 5476874 2750620 3015717 4876767 4198550 2105266 2929585 6435522 9255707
33927 9255707 12420718 19418945 27012363 26664273 17286121 8882253 9726597 16088724
33919 16088724 19151930 16932400 13887830 12405031 10930126 9244213 9956054 13971836
33911 13971836 18124124 18484834 14165138 7604751 2721106 2559699 6978146 12616856
33903 12616856 16435240 18777768 21511832 24132967 24123979 20839166 16376318 12313623
$$ packed form
33960A2389755j35684l854138j914611J337981K479911J945450k60386m565799
33952G422479p963401o582204j780905J819523L150787M032396L771956Q55735
33944D726366j887584p75927J709105O54571k191361j156189K725469K863379
33936F667829j190955k726254K65097J861050o78217k093284Q24319L505937K820185
33927I255707L165011O998227P593418l48090r378152q403868Q44344O362127
33919A6088724L063206k219530l044570j482799j474905j685913P11841M015782
33911A3971836M152288L60710m319696o560387m883645j61407M418447N638710
33903A2616856L818384K342528K734064K621135q988l284813m462848m062695
$$ plain form
33895 12313623 8278822 4589481 3441666 5466052 7187342 4602614 -1481038 -5918333
33887 -5918333 -4806120 1044129 7749231 11601948 10889734 6556461 1631764 -1278662
33879 -1278662 -2248117 -2897098 -3584139 -3498274 -3148871 -4217676 -6417270 -6953187 -4297615
33870 -4297615 -594380 916909 -660484 -3872115 -6612954 -7101145 -5188140 -3412622
33862 -3412622 -4292675 -5881225 -3411159 3250442 7959196 6807241 4080544 5753699
33854 5753699 10836876 14154524 14424985 13669668 11267166 5495262 -605166 -2237740
33846 -2237740 -902456 -1710990 -3127110 1351657 9984766 11624438 2114694 -7501179
33838 -7501179 -5591943 4893200 13024486 14907202 13926464 11666243 7872610 5597949
$$ packed form
33895A2313623m034801l689341j147815K024386J721290k584728o083652m437295
33887e918333J112213N850249O705102L852717p12214m333273m924697k910426
33879a278662r69455o48981o87041Q5865L49403j068805k199594n35917K655572
33870d297615L703235J511289j577393l211631k740839m88191J913005J775518
33862c412622q80053j588550K470066O661601M708754j151955k726697J673155
33854E753699N083177L317648K70461p55317k402502n771904o100428j632574
33846b237740J335284q08534j416120M478767Q633109J639672r509744r615873
33838g501179J909236J0485143Q131286J882716r80738k260221l793633k274661
$$ plain form
33830 5597949 7030706 6969521 -110534 -8610835 -7639571 2509616 10455899 11093092 11552492
33821 11552492 16608798 19228404 12147199 269703 -6538815 -7352338 -8708383 -12492266
33813 -12492266 -13116749 -6402481 4244249 11315458 10262432 3408230 -1850559 -237097
33805 -237097 5319974 7489372 4672763 2646063 4773086 6659126 3923120 -687868
33797 -687868 -2813391 -3587873 -5175035 -4185555 2878311 11050748 11864444 4940857 -3022514
33788 -3022514 -8989745 -14681571 -17786498 -12144426 869716 9795864 6399928 -4164292
33780 -4164292 -10175698 -5824414 5570261 15948498 17823778 10331891 2299516 3845950
33772 3845950 12639146 15068597 4509914 -8940395 -12439470 -7046047 -2704307 -2305928
$$ packed form
33830E597949J432757o1185p080055q500301R71264J0149187P946283O37193M59400
33821A1552492N056306K619606p081205j1877496o808518q13523j356045l783883
33813a2492266o24483O714268J0646730P071209j053026o854202n258789J613462
33805b37097N557071K169398k816609k026700K127023J886040k736006m610988
33797f87868k125523p74482j587162R89480P063866Q172437Q13696o923587p963371
33788c022514n967231n691826l104927N642072J3014142Q926148l395936j0564220
33780d164292o011406M351284J1394675J0378237J875280p491887q032375J546434
33772C845950Q793196K429451j0558683j3450309l499075N393423M341740L98379
$$ plain form
33764 -2305928 -590095 3900537 6217593 4718421 4178262 6851946 8008912 3884777
33756 3884777 -1843418 -3486789 -723664 3374615 7837176 12692556 14903342 10624447
33748 10624447 1422378 -5759612 -6039377 -1580656 2140494 3150220 3870860 5844079
33740 5844079 6455426 2553506 -4504071 -10146799 -12256141 -12465716 -11842435 -9018614 -3798676
33731 -3798676 1088081 3877100 5995975 8105206 7720872 4021875 1241064 2996675
33723 2996675 6470969 6890373 4597251 2276620 -1535918 -9215010 -16626828 -16988337
33715 -16988337 -11439306 -7684117 -7909156 -6534925 -1345491 1999300 -280480 -3825235
33707 -3825235 -3702163 -1120668 1674325 6196799 12408628 15247547 12150197 8129516
$$ packed form
33764b305928J715833M490632K317056j499172n40159K673684J156966m124135
33756C884777n728195j643371K763125M098279M462561M855380K210786m278895
33748A0624447r202069p181990k79765M458721L721150J009726P20640J973219
33740E844079O11347l901920p057577n642728k109342k09575O23281K823821N219938
33731c798676M886757K789019K118875K109231l84334l698997k780811J755611
33723B996675L474294M19404k293122k320631l812538p679092p411818l61509
33715a6988337N549031L755189k25039J374231N189434L344791k279780l544755
33707c825235J23072K581495K794993M522474O211829K838919l097350m020681
$$ plain form
33699 8129516 7712086 7962858 5740874 5178922 9874586 13578109 8310710 -2449579
33691 -2449579 -8662216 -8604980 -8418967 -9053508 -5172678 3001215 8021550 7083444 5350390
33682 5350390 5230567 2532951 -3374604 -5715245 -1536549 2499364 1717249 2355563 11069932
33673 11069932 22065778 23648476 14189866 3856507 2031057 8593411 16083195 16296058
33665 16296058 7021422 -4300491 -7027816 -753162 2820055 -3765909 -11687598 -7967704
33657 -7967704 5263152 13707211 10958824 4944138 3714517 5177774 4489067 2985112
33649 2985112 4011770 5582098 3472872 -1102656 -2177617 3177479 10893172 13839128
33641 13839128 8721018 -241765 -4462089 537700 9862445 14541018 11658117 6291750
$$ packed form
33699H129516m17430K50772k221984n61952M695664L703523n267399j0760289
33691b449579o212637N7236J86013o34541L880830Q173893N020335r38106j733054
33682E350390j19823k697616n907555k340641M178696M035913p82115O38314Q714369
33673A1069932J0995846J582698r458610j0333359j825450O562354P489784K12863
33665A6296058r274636j1321913k727325O274654L573217o585964p921689L719894
33657g967704J3230856Q444059k748387o014686j229621J463257o88707j503955
33649B985112J026658J570328k109226m575528j074961N355096P715693K945956
33641A3839128n118110q962783m220324M999789R324745M678573k882901n366367
$$ plain form
33633 6291750 3759311 4017115 4496811 4207283 3094986 936241 -870834 451191 4672104
33624 4672104 7336144 5466715 1757541 358607 1195199 1708201 1746780 2672332 3166826
33615 3166826 379671 -5049994 -9142456 -10203546 -10743089 -12759129 -14294751 -12449670
33607 -12449670 -7448132 -1673212 3600544 8148922 10519775 8687144 3508652 -680973
33599 -680973 -480013 2619922 4292652 2873898 844426 554407 632106 -1776359 -6403593
33590 -6403593 -9407053 -7431526 -1192469 4614103 4612388 -2478561 -11200676 -13445303 -7239133
33581 -7239133 508171 2664352 781876 1110559 4072444 4402922 1520202 1662409 6814214
33572 6814214 9209941 2625828 -6723889 -8009067 -884182 5189089 4930138 2310891
$$ packed form
33633F291750k532439K57804M79696k89528j112297k158745j807075J322025M220913
33624D672104K664040j869429l709174j398934Q36592N13002L8579R25552M94494
33615C166826k787155n429665m092462j061090n39543k016040j535622J845081
33607a2449670N001538N774920N273756M548378K370853j832631n178492m189625
33599f80973K00960L099935J672730j418754k029472k90019P7699k408465m627234
33590f403593l003460J975527O239057N806572j715p090949q722115k244627O206170
33581g239133P747304K156181j882476L28683K961885L30478k882720J42207N151805
33572F814214K395727o584113r349717j285178P124885O073271k58951k619247
$$ plain form
33564 2310891 1597178 1579299 965475 2194077 5871981 7088160 2100376 -5262956 -8607286
33555 -8607286 -7377764 -5592629 -4596330 -2292127 1396901 3294012 1584405 -2151582
33547 -2151582 -6131734 -10407058 -15006344 -18912088 -21864844 -24871682 -27941771 -29140149
33539 -29140149 -26617869 -20193067 -11119372 -2380360 1383064 -2143515 -8405235 -9455547
33531 -9455547 -3920412 377283 -3206436 -10795446 -13577059 -9999115 -6347547 -5994576
33523 -5994576 -4953801 56021 5428279 6618753 5596925 6952736 9412499 7451352
33515 7451352 754382 -3966683 -2103615 2604811 3393982 -1367084 -7885998 -11974844
33507 -11974844 -11417371 -5528532 4067980 12986113 17433387 18057442 18410246 19890405
$$ packed form
33564B310891p13713j7879o13824J228602L677904J216179m987784p363332l344330
33555h607286J229522J785135R96299K304203L689028J897111j709607l735987
33547b151582l980152m275324m599286l905744k952756l006838l070089j198378
33539b9140149K522280O424802R073695Q739012L763424l526579o261720j050312
33531i455547N535135M297695l583719p589010k781613L577944L651568L52971
33523e994576J040775N009822N372258J190474j021828J355811K459763j961147
33515G451352o696970m721065J863068M708426P89171m761066o518914m088846
33507a1974844N57473N888839R596512Q918133M447274O24055L52804J480159
$$ plain form
33499 19890405 20265160 17039887 10351983 2559387 -3414380 -5701478 -5309719 -5883107
33491 -5883107 -9572320 -13643656 -13647384 -9436487 -4874860 -1702270 2280484 7895403 11755353
33482 11755353 11261059 8889657 8188264 8249326 6025062 2220905 642124 2435247 4864323
33473 4864323 5690193 5332303 4581499 3406626 2404565 2529253 3058583 2599004 2121506
33464 2121506 3749281 6349168 6111320 2297796 -1525488 -3216362 -4721684 -6986791
33456 -6986791 -6740637 -1843121 3823328 4985880 1906006 -1345129 -3138840 -4462222
33448 -4462222 -4942088 -3615351 -2242652 -2634925 -1545170 5978308 17781591 24755083
33440 24755083 21221726 10570509 -479989 -8087772 -10361220 -6302564 1034735 5498999
$$ packed form
33499A9890405L74755l225273o687904p792596n973767k287098L91759n73388
33491e883107l689213m071336l728M210897M561627L172590L982754N614919L859950
33482A1755353m94294k371402p01393O1062k224264l804157j578781J793123K429076
33473D864323Q25870l57890p50804j174873j002061J24688N29330m59579m77498
33464B121506J627775K599887k37848l813524l823284j690874j505322k265107
33456f986791K46154M897516N666449J162552l079874l251135j793711j323382
33448d462222m79866J326737J372699l92273J089755P523478J1803283O973492
33440B4755083l533357j0651217j1050498p607783k273448M058656P337299M464264
$$ plain form
33432 5498999 5843611 8048108 15301216 20719573 16252151 4932248 -3208377 -5102083
33424 -5102083 -6286651 -9227076 -8951104 -2489489 5231319 8832667 9383551 9314111 6418589
33415 6418589 -866654 -6744076 -4228996 4011535 8464506 6000524 2928229 3690658
33407 3690658 4035341 -737152 -6746348 -6589185 -151298 5623107 6604953 5665753 6648773
33398 6648773 8848659 9086132 5942300 196574 -6372541 -10988789 -11042445 -7172628 -3393739
33389 -3393739 -2516528 -3358196 -4108086 -5754449 -9169049 -11099656 -7528047 -411237 3552296
33380 3552296 1839470 -197429 3501352 11880509 18508643 19054455 14807389 10392934
33372 10392934 10048758 14634910 20124215 20310118 13275529 4203350 -301189 549172
$$ packed form
33432E498999L44612K204497P253108N418357m467422j1319903q140625j893706
33424e102083j184568k940425K75972O461615P720808L601348N50884o9440k895522
33415F418589p285243n877422K515080Q240531M452971k463982l072295P62429
33407C690658L44683m772493o009196J57163O437887N774405R81846r39200R83020
33398F648773K199886K37473l143832n745726o569115m616248n3656L869817L778889
33389c393739Q77211q41668p49890j646363l414600j930607L571609P116810L963533
33380C552296j712826k036899L698781Q379157O628134N45812m247066m414455
33372A0392934l44176M586152N489305J85903p034589r072179m504539Q50361
$$ plain form
33364 549172 2526267 2837799 2083769 408905 -3641704 -9036310 -11101642 -7335207 -1659704
33355 -1659704 490979 -386137 813542 5523763 8714926 5737699 -1326513 -6681306
33347 -6681306 -8082443 -7937081 -8034363 -6814037 -2854005 1683545 3035762 -133793 -6162562
33338 -6162562 -12447686 -16452293 -16133841 -11717699 -6346309 -2842212 -503866 2729600
33330 2729600 6042599 6882529 5792499 6104336 8156452 7825845 2505573 -4907958 -9953573
33321 -9953573 -11225546 -8976185 -3036262 4363356 7096266 1262817 -8882386 -15449173
33313 -15449173 -16086824 -14461255 -12993125 -10453952 -6827774 -5103143 -6366776 -7175329
33305 -7175329 -4151527 1567944 6444291 8877075 9635258 9575202 8417849 4973272 -1616374
$$ packed form
33364E49172J977095L11532p54030j674864m050609n394606k065332L766435N675503
33355a659704K150683q77116J199679M710221L191163k977227p064212n354793
33347f681306j401137J45362r7282J220326L960032M537550J352217l169555o028769
33338f162562o285124m004607L18452M416142N371390L504097K338346L233466
33330B729600L312999Q39930j090030L11837K052116l30607n320272p413531n045615
33321i953573j271973K249361N939923P399618K732910n833449j0145203o566787
33313a5449173o37651J625569J468130K539173L626178J724631j263633q08553
33305g175329L023802N719471M876347K432784P58183o0056j157353l444577o589646
$$ plain form
33296 -1616374 -9569382 -14105565 -12120501 -7146801 -6357499 -11903056 -18590316 -21445433
33288 -21445433 -21834900 -23250370 -23914912 -17999653 -4228825 9997948 15040346 9004075
33280 9004075 -173813 -3440415 -371726 2052015 54642 -1899561 932371 5160956
33272 5160956 4219978 -1063442 -3739879 -1803181 -509810 -2395074 -2461509 3082476 9373501
33263 9373501 9162079 2613522 -3856734 -5939873 -4614495 -2920827 -2988173 -5026101 -7042981
33254 -7042981 -6890237 -5476290 -5459103 -6401022 -5325780 -2985439 -4306456 -10586393 -16820900
33245 -16820900 -19433642 -20580541 -21514664 -18817392 -12136205 -8133220 -9821427 -9165555
33237 -9165555 792276 12658847 14276529 7065092 2849665 5021786 5806882 2125933
$$ packed form
33296a616374p953008m536183J985064M973700P89302n545557o687260k855117
33288b1445433l89467j415470o64542N915259J3770828J4226773N042398o036271
33280I004075r177888l266602L068689K423741j997373j954203K831932M228585
33272E160956r40978n283420k676437J936698J293371j885264o6435N543985O291025
33263I373501k11422o548557o470256k083139J325378J693668o7346k037928k016880
33254g042981J52744J413947J7187r41919J075242K340341j321017o279937o234507
33245a6820900k612742j146899r34123K697272O681187M002985j688207O55872
33237i165555R957831J1866571J617682p211437m215427K172121P85096l680949
$$ plain form
33229 2125933 920206 5803792 10207121 8573017 4670128 3599837 3865755 2553140
33221 2553140 904556 -279759 -3621550 -8486757 -8574410 -1930234 3567483 1288161
33213 1288161 -3910033 -3810597 374263 1595184 -763666 -917988 3009158 6427021 5251133
33204 5251133 -627791 -9623145 -18356573 -20525727 -12013085 2845669 14688031 18351472
33196 18351472 15132131 8207500 1015061 -1760298 2145024 8248768 9974946 7267284
33188 7267284 5533469 6683159 6927699 3710901 -584987 -2651686 -1451154 2853649
33180 2853649 8594568 11340245 8099547 2898448 2594444 6795997 8326319 4867661
33172 4867661 2822095 6408640 9993474 6751595 -313958 -2700157 1245923 5065938
$$ packed form
33229B125933j205727M883586M403329j634104l902889j070291K65918j312615
33221B553140j648584j184315l341791m865207q7653O644176N497717k279322
33213A288161n198194R9436M184860J220921k358850j54322L927146L417863j175888
33204E251133n878924q995354q733428k169154Q512642J4858754J1842362L663441
33196A8351472l219341o924631p192439k775359L905322O103744J726178k707662
33188G267284j733815J149690K44540l216798m295888k066699J200532M304803
33180B853649N740919K745677l240698n201099l04004M201553J530322l458658
33172D867661k045566L586545L584834l241879p065553k386199L946080L820015
$$ plain form
33164 5065938 4238112 1079481 -1201240 -3666648 -8058834 -12026799 -12148527 -10071743
33156 -10071743 -10944553 -14893820 -14523496 -4516387 8975204 13935280 7267670 -1727503
33148 -1727503 -4194527 -1944487 -1170825 -1971811 -666472 1479241 -79797 -4157662
33140 -4157662 -4367850 840121 5607675 5496108 2794291 1323868 1486186 2279056 3142444
33131 3142444 2298975 -1538839 -4663872 -1613350 5607111 8419502 4093010 -347086
33123 -347086 -128075 -258128 -5296301 -9614108 -6146988 1071496 2415419 -3130949 -8468311
33114 -8468311 -10440993 -11997780 -13618688 -12220046 -9230938 -10931032 -18657851 -25922309
33106 -25922309 -27384342 -24164656 -18419600 -9777376 -328449 3434166 -1694898 -10357509
$$ packed form
33164E065938q27826l158631k280721k465408m392186l967965j21728K076784
33156a0071743q72810l949267L70324J0007109J3491591M960076o667610q995173
33148a727503k467024K250040P73662q00986J305339K145713j559038m077865
33140d157662k10188N207971M767554j11567k701817j470423J62318P92870Q63388
33131C142444q43469l837814l125033L050522P220461K812391m326492m440096
33123c47086K19011j30053n038173m317807L467120P218484J343923n546368n337362
33114h468311j972682j556787j620908J398642K989108j700094p726819p264458
33106b5922309j462033L219686N745056Q642224R448927L762615n129064q662611
$$ plain form
33098 -10357509 -14837307 -12964381 -7215347 -497667 3782415 2024432 -4712176 -9544320
33090 -9544320 -7741519 -2941274 -1381733 -3225169 -4556040 -5087244 -7616328 -11028977
33082 -11028977 -10370540 -4622145 1202687 3517967 4959699 9006032 13565381 13612817
33074 13612817 8242383 1560693 -2724143 -4452691 -4628039 -2995039 294673 2631475
33066 2631475 1366491 -1964509 -2593450 1162252 4796566 3020930 -3195066 -7833407
33058 -7833407 -7493293 -4652337 -2930912 -2433838 -1314060 772102 2950993 4988542
33050 4988542 6715953 6981230 5054774 1770644 -2364030 -8274306 -15125452 -18033458
33042 -18033458 -12833402 -2698198 3895481 2711264 -1875923 -3453522 -1647949 -1167838
$$ packed form
33098a0357509m479798J872926N749034O717680M280082j757983o736608m832144
33090i544320J802801M800245J559541j843436j330871n31204k529084l412649
33082a1028977O58437N748395N824832K315280J441732M046333M559349M7436
33074A3612817n370434o681690m284836j728548j75348J633000L289712K336802
33066B631475j264984l331000o28941L755702L634314j775636o215996m638341
33058g833407L40114K840956J721425M97074J119778K086162K178891K037549
33050D988542J727411K65277j926456l284130m134674n910276o851146k908006
33042a8033458N200056J0135204O593679j184217m587187j577599J805573M80111
$$ plain form
33034 -1167838 -4567746 -9142624 -11067227 -9964534 -7971646 -5897243 -2644079 1610981
33026 1610981 4116624 2960322 145434 -1122025 -1414497 -4366729 -10740277 -16322939
33018 -16322939 -16986790 -13085751 -7265797 -934593 4627795 6726880 4787469 3529727
33010 3529727 8039741 16253375 20847439 18958008 15696993 16805154 21742111 25966590
33002 25966590 26672183 23878950 18727729 13563105 11551251 13101665 13999804 10101749
32994 10101749 3199684 -567426 1990793 7808253 11705146 11700716 9682769 8604975
32986 8604975 9964513 12906241 14854141 13652968 9929145 7058383 7941379 11486253
32978 11486253 12861298 8209427 -663146 -7364543 -7643923 -4206895 -3275470 -6796626
$$ packed form
33034a167838l399908m574878j924603J102693J992888K074403L253164M255060
33026A610981K505643j156302k814888j267459k92472k952232o373548n582662
33018a6322939o63851L901039N819954O331204N562388K099085j939411j257742
33010C529727M510014Q213634M594064j889431l261015J108161M936957M224479
33002B5966590P05593k793233n151221n164624k011854J550414Q98139l898055
32994A0101749o902065l767110K558219N817460L896893m430k017947j077794
32986H604975J359538K941728J947900j201173l723823k870762Q82996L544874
32978A1486253J375045m651871q872573o701397k79380L437028R31425l521156
$$ plain form
32970 -6796626 -10162748 -8086740 -770072 6792083 10064196 8182792 3090155 -2748922
32962 -2748922 -7608403 -10281585 -9391563 -4208654 2917520 6539024 3293112 -3163807
32954 -3163807 -5388328 -742977 6196848 10352356 11582896 12043885 12185830 12064199 12988968
32945 12988968 14421123 12512630 5959281 494814 2441825 9608995 14125524 13417398
32937 13417398 12460939 14841921 17615500 17057393 14492810 13247808 13096918 10926781
32929 10926781 5304097 -1711555 -6454175 -6683647 -3799598 -1654923 -1634637 -445647
32921 -445647 4356714 8789466 7246728 1498533 -1362112 227288 652705 -2573600
32913 -2573600 -4795134 -3340635 -2521186 -4793102 -4815122 1028392 6215079 3612782 -2202571
$$ packed form
32970f796626l366122K076008P316668P562155L272113j881404n092637n839077
32962b748922m859481k673182Q90022N182909P126174L621504l245912o456919
32954c163807k224521M645351O939825M155508J230540M60989J41945j21631R24769
32945A2988968J432155j908493o553349n464467J947011P167170M516529p08126
32937A3417398r56459K380982K773579n58107k564583j245002j50890k170137
32929A0926781n622684p015652m742620k29472K884049K144675K0286J188990
32921d45647M802361M432752j542738n748195k860645J589400M25417l226305
32913b573600k221534J454499Q19449k271916k2020N843514N186687k602297n815353
$$ plain form
32904 -2202571 -1925096 3105633 3377451 -2651006 -6234952 -3080003 321614 -1817993
32896 -1817993 -6111371 -7558464 -7807178 -10431074 -13952770 -15030178 -13932414 -11860735
32888 -11860735 -7048475 1355706 9062092 11398818 9467935 6876727 3325324 -3126586
32880 -3126586 -9638875 -10548833 -5360360 378211 2548469 2545784 3263083 4793858 5424888
32871 5424888 4295541 1997405 285539 1469054 6112889 10995698 11278911 5498290
32863 5498290 -2646590 -7787985 -7500536 -3756520 -759829 -1195482 -4031064 -6183725
32855 -6183725 -6054612 -4195203 -982145 3688217 7942461 8563125 5864602 4786094
32847 4786094 8453215 13222230 13148456 7329156 -62328 -4837865 -4813084 596608 8655926
$$ packed form
32904b202571K77475N030729K71818o028457l583946L154949L401617k139607
32896a817993m293378j447093k48714k623896l521696j077408J097764K071679
32888a1860735M812260Q404181P706386K336726j930883k591208l551403o451910
32880c126586o512289r09958N188473N738571K170258k685P17299J530775O31030
32871E424888j129347k298136j711866J183515M643835M882809K83213n780621
32863E498290q144880n141395K87449L744016K996691m35653k835582k152661
32855f183725J29113J859409L213058M670362M254244O20664k698523j078508
32847D786094L667121M769015p3774n819300p391484m775537K4781N409692Q059318
$$ plain form
32838 8655926 13229808 11085203 6924342 7424624 11502384 11930632 6116033 -746803
32830 -746803 -3949642 -4696730 -5344251 -4681045 -1042080 3951240 7882106 10750240 13260386
32821 13260386 14778543 15051653 14990413 13988847 9970983 3995468 619095 1065374 688494
32812 688494 -3065118 -5165327 -1066656 3959905 1200177 -7685448 -11495891 -4810604
32804 -4810604 5213248 9981116 10581512 13138353 18054839 20025948 16701736 11611955
32796 11611955 8414177 6779282 5155659 4059836 4506144 5372669 4703688 2670277
32788 2670277 1299372 1784181 3775212 6780390 9969691 10551114 5300769 -4684638
32780 -4684638 -13057459 -14449339 -10231595 -5714623 -3189165 -1121934 724942 -11360
$$ packed form
32838H655926M573882k144605m160861N00282M077760M28248n814599o862836
32830g46803l202839p47088o47521O63206L638965M993320L930866K868134K510146
32821A3260386J518157K73110o1240j001566m017864n975515l376373M46279l76880
32812F88494l753612k100209M098671N026561k759728q885625l810443O685287
32804d810604J0023852M767868O00396K556841M916486J971109l324212n089781
32796A1611955l197778j634895j623623j095823M46308Q66525o68981k033411
32788B670277j370905M84809J991031L005178L189301N81423n250345r985407
32780d684638q372821j391880M217744M516972K525458K067231J846876p36302
$$ plain form
32772 -11360 -3439967 -5303424 -2186252 3562144 6287710 2910982 -4774915 -11697757
32764 -11697757 -12626671 -6556840 787812 2093404 -2327068 -4402648 285893 5826032
32756 5826032 4946748 64804 -859441 3689514 8202430 9795080 10494843 10161089 5676287
32747 5676287 -1026275 -2495127 2930580 6786335 2630390 -3961507 -4181445 329178
32739 329178 632403 -5380751 -10336309 -8683759 -3450232 -328055 -793891 -3220030 -6412727
32730 -6412727 -9717165 -12614171 -15743195 -19706684 -22188859 -19627086 -12830258 -7435287
32722 -7435287 -7110186 -9325706 -9422594 -5789883 511144 7627887 12182980 10458104 3570578
32713 3570578 -1745277 -1153019 1535788 750474 -2022781 -1668035 642159 -1479278 -8492945
$$ packed form
32772a1360l428607j863457L117172N748396K725566l376728p685897o922842
32764a1697757r28914O069831P344652J305592m420472k075580M688541N540139
32756E826032q79284m881944r24245M548955M512916J592650O99763l33754m484802
32747E676287o702562j468852N425707L855755m155945o591897k19938M510623
32739C29178L03225o013154m955558J652550N233527L122177m65836k426139l192697
32730f412727l304438k897006l129024l963489k482175K561773O796828N394971
32722g435287L25101k215520r6888L632711O301027P116743M555093j724876o887526
32713C570578n315855N92258K688807p85314k773255L54746K310194k121437p013667
$$ plain form
32704 -8492945 -12654286 -9514923 -4831367 -5450025 -8722431 -6951636 1035257 9071688
32696 9071688 12621484 12280700 8849445 1548213 -7166108 -10690345 -5690171 3001729
32688 3001729 8203311 8648492 8245210 9078529 9033297 5922646 447762 -5700903 -11899595
32679 -11899595 -17077548 -17966366 -11581625 -20585 8913701 7935347 -2286709 -13051956
32671 -13051956 -16145507 -11925026 -7751515 -8944028 -13254115 -14698998 -10936195 -5379361
32663 -5379361 -2807604 -4308760 -6875931 -7518415 -6921633 -7909815 -10487236 -11000425 -7899099
32654 -7899099 -5445399 -7897786 -12060056 -11194015 -5924897 -4468112 -10166996 -15927746
32646 -15927746 -15396048 -13149477 -16941424 -24548501 -26879375 -21950428 -16783362 -15359005
$$ packed form
32704h492945m161341L139363M683556o18658l272406J770795P986893Q036431
32696I071688L549796l40784l431255p301232q714321l524237N000174Q691900
32688C001729N201582M45181m03282Q33319m5232l110651n474884o148665o198692
32679a1899595n177953q88818O384741J1561040Q934286r78354j0222056j0765247
32671a3051956l093551M220481M173511j192513m310087j444883L762803N556834
32663e379361K571757j501156k567171o42484N96782r88182k577421n13189L101326
32654g899099K453700k452387m162270Q66041N269118J456785n698884n760750
32646a5927746N31698K246571l791947p607077k330874M928947N167066J424357
$$ plain form
32638 -15359005 -13513591 -7993365 -2550148 -988511 -621646 2403423 6265588 7197617
32630 7197617 6095746 5846118 5025634 347154 -6021007 -7612794 -2658555 2732684
32622 2732684 1815485 -5301567 -12527984 -14139381 -9516300 -2968188 616477 319764
32614 319764 -1135024 -2122258 -4138812 -8065324 -11497974 -12233218 -11594293 -11189026 -9219232
32605 -9219232 -4176086 264649 -663406 -5181728 -7132363 -5397246 -5162158 -9086235
32597 -9086235 -13307131 -14210778 -13450479 -13128997 -11072203 -5135601 1526479 4112010 2817922
32588 2817922 1795683 3067928 4997785 5551461 4089391 1205959 -638455 1772845
32580 1772845 7651303 10674859 6123109 -1992919 -5242438 -1338467 4052706 5657762
$$ packed form
32638a5359005J845414N520226N443217J561637L66865L025069L862165R32029
32630G197617j101871k49628q20484m678480o368161j591787M954239N391239
32622B732684r17199p117052p226417j611397M623081O548112L584665k96713
32614C19764j454788r87234k016554l926512l432650p35244O38925M05267J969794
32605i219232N043146M440735r28055m518322j950635J735117K35088l924077
32597i086235m220896r03647P60299L21482K056794N936602O662080K585531j294088
32588B817922j022239J272245J929857N53676j462070k883432j844414K411300
32580A772845N878458L023556m551750q116028l249519L903971N391173J605056
$$ plain form
32572 5657762 3957952 1779336 433230 747161 3419062 6069984 4037604 -2877241
32564 -2877241 -8044279 -6259619 -1688505 -2924482 -11348346 -19173928 -19375896 -13312078
32556 -13312078 -7059891 -3881152 -3126824 -4244057 -7905300 -12924273 -15220404 -12025541
32548 -12025541 -6022573 -2944969 -4682973 -6847640 -4769710 -435579 -646698 -8226624
32540 -8226624 -17981487 -22778940 -21195574 -16905437 -12583165 -8025852 -3838358 -2957152
32532 -2957152 -6731663 -11806971 -13060188 -8846415 -2140862 2726680 3524846 1176915
32524 1176915 -1593256 -3048322 -4078835 -6126315 -7782778 -5926783 -1004911 2022510
32516 2022510 445965 -1345264 2306734 9473283 12629206 9349014 5750095 7684985
$$ packed form
32572E657762j699810k178616j346106L13931K671901K650922k032380o914845
32564b877241n167038J784660M571114j235977q423864p825582k01968O063818
32556a3312078O252187L178739P54328j117233l661243n018973k296131L194863
32548a2025541O002968L077604j738004k164667K077930M334131k11119p579926
32540h226624r754863m797453J583366M290137M322272M557313M187494Q81206
32532b957152l774511n075308j253217M213773O705553M867542P98166k347931
32524A176915k770171j455066j030513k047480j656463J855995M921872L027421
32516B022510j576545j791229L651998P166549L155923l280192l598919J934890
$$ plain form
32508 7684985 13260815 17070960 17977456 18548289 19095865 16856829 10797048 3873152 76022
32499 76022 986403 4812319 7328126 5031456 -585735 -3387625 189521 5734568 5944736
32490 5944736 58758 -5536937 -5678281 -1422319 3478351 6962808 8490787 8228894
32482 8228894 8048947 10389488 14612359 17004733 15417184 11167576 5660825 -1230584
32474 -1230584 -7943535 -10256122 -6211731 625689 4984153 4560882 -313246 -7861071
32466 -7861071 -13470655 -11286468 -873410 10661637 16544689 17395785 17268388 16455184
32458 16455184 12840605 7344580 2856291 -64150 -1635545 412567 6992064 12771407
32450 12771407 11416462 4355181 -1781981 -4852391 -7316822 -8135978 -3439730 4010042
$$ packed form
32508G684985N575830L810145R06496N70833N47576k239036o059781o923896l797130
32499G6022R10381L825916K515807k296670n617191k801890L577146N545047K10168
32490E944736n885978n595695j41344M255962M900670L484457J527979k61893
32482H228894j79947K340541M222871K392374j587549m249608n506751o891409
32474a230584o712951k312587M044391O837420M358464m23271m874128p547825
32466g861071n609584K184187J0413058J1535047N883052Q51096j27397q13204
32458A6455184l614579n496025m488289k920441j571395K048112O579497N779343
32450A2771407j354945p061281o137162l070410k464431q19156M696248P449772
$$ plain form
32442 4010042 5215503 -2228883 -9700992 -9742173 -5392250 -3008952 -2980813 -3281836 -5781250
32433 -5781250 -11771046 -15823487 -11847276 -2845078 2080654 -1054556 -8466264 -15282779
32425 -15282779 -19013800 -17773506 -11278601 -3606328 144469 33832 -127880 423893
32417 423893 -860279 -3509853 -3076314 2039188 7211571 6957312 771948 -7331081 -12288001
32408 -12288001 -10551670 -2518845 6489719 10205580 7225617 1094497 -4801283 -9436274
32400 -9436274 -11724923 -9929088 -4517278 1406592 5497401 7568240 7423301 4437946
32392 4437946 -30969 -2903386 -3089436 -2356363 -1738061 200381 4555993 9937484 13910821
32383 13910821 14581584 10862943 4035100 -1070132 -183477 4354809 5382071 -2930
$$ packed form
32442D010042J205461p444386p472109m1181M349923K383298K8139l01023k499414
32433e781250n989796m052441L976211R002198M925732l135210p411708o816515
32425a5282779l731021J240294O494905P672273L750797j10637j61712N51773
32417D23893j284172k649574M33539N115502N172383k54259o185364q103029m956920
32408a2288001J736331Q032825R008564L715861k979963o131120n895780m634991
32400i436274k288649J795835N411810N923870M090809K070839j44939k985355
32392D437946m468915k872417j86050P33073O18302J938442M355612N381491L973337
32383A3910821O70763l718641o827843n105232Q86655M538286J027262n385001
$$ plain form
32375 -2930 -6803115 -9328384 -8477235 -9128866 -12734476 -15393579 -12465664 -3766942 4985349
32366 4985349 6017818 -2963719 -14856440 -19372615 -13583743 -3825188 2494503 3322443
32358 3322443 443629 -3443309 -4820220 -1292568 4417092 6458394 3652221 972037
32350 972037 1453484 1833341 -965126 -4406658 -5276936 -5024662 -5622149 -4787589 -673086
32341 -673086 2753182 963266 -3537573 -4618821 -944557 4328812 9215559 12411264
32333 12411264 10507725 2956721 -2598871 1999949 13483022 20717644 19550510 15762200
32325 15762200 13319667 9394612 3401732 1406168 6459319 12070260 11453778 7722660
32317 7722660 8401622 13680744 16762794 14063689 9226185 7119253 8060244 8632967 5856431
$$ packed form
32375b930o800185k525269Q51149o51631l605610k659103K927915Q698722Q752291
32366D985349J032469q981537j1892721m516175N788872R758555O319691Q27940
32358C322443k878814l886938j376911L527652N709660K041302k806173k680184
32350I72037M81447L79857k798467l441532q70278K52274n97487Q34560M114503
32341f73086L426268j789916m500839j081248L674264N273369M886747L195705
32333A2411264j903539p551004n555592M598820J1483073P234622j167134l788310
32325A5762200k442533l925055n992880j995564N053151N610941o16482l731118
32317G722660O78962N279122L082050k699105m837504k106932R40991N72723k776536
$$ plain form
32308 5856431 149212 -4789553 -5318291 -1319616 4472835 9726448 12785522 10986630
32300 10986630 3249103 -5346922 -6875544 -656650 4500450 1076444 -7940887 -13732179
32292 -13732179 -12054141 -5505437 1583846 6607561 8904814 9878443 11801197 14630514
32284 14630514 15888463 14973260 14408669 14944621 13209345 7013595 -501938 -4832020
32276 -4832020 -4649175 -13258 8850560 17293028 16689098 5178281 -6840351 -8888860
32268 -8888860 -4031916 -2689109 -6670436 -8818907 -6385189 -4129743 -3788807 -902373
32260 -902373 5441170 9227584 7697789 6401028 9214691 10914271 5876251 -1675477
32252 -1675477 -2902150 3811913 12114547 16254563 15552114 12304731 9148682 6977977
$$ packed form
32308E856431n707219m938765n28738L998675N792451N253613L059074j798892
32300A0986630p737527q596025j528622O218894N157100l424006r017331n791292
32292a3732179J678038O548704P089283N023715K297253R73629J922754K829317
32284A4630514J257949r15203n64591N35952j735276o195750p515533m330082
32276d832020J82845M635917Q863818Q442468o03930j1510817j2018632k048509
32268h888860M856944J342807l981327k148471K433718K255446L40936K886434
32260i02373O343543L786414j529795j296761K813663J699580n038020p551728
32252a675477j226673O714063Q302634M140016p02449l247383l156049k170705
$$ plain form
32244 6977977 3423886 -3666414 -9971532 -7424441 3782340 12386429 10394695 3937645
32236 3937645 2884322 5671726 4048019 -1214511 -1018146 6312990 11593917 9496470
32228 9496470 6388477 8893662 13276408 12542809 7807017 5512464 7065213 7818405
32220 7818405 4660297 -693276 -5329155 -8177462 -9760005 -11450355 -14269995 -16797607
32212 -16797607 -15945079 -11412071 -6972663 -5283330 -4122701 -385886 4921126 8730834
32204 8730834 10269418 9845608 5919297 -2276935 -11029945 -15520959 -15633150 -14230253
32196 -14230253 -11317585 -5055641 2389437 5754648 3716287 -102278 -3336199 -6512596
32188 -6512596 -8025610 -4183836 3535086 7823886 5737273 3619489 7319494 13096126
$$ packed form
32244F977977l554091p090300o305118K547091J1206781Q604089j991734o457050
32236C937645j053323K787404j623707n262530J96365P331136N280927k097447
32228I496470l107993K505185M382746p33599m735792k294553J552749P53192
32220G818405l158108n353573m635879k848307j582543j690350k819640k527612
32212a6797607Q52528M533008M439408J689333J160629L736815N307012L809708
32204H730834J538584m23810l926311q196232q753010m491014j12191J402897
32196a4230253K912668O261944P445078L365211k038361l818565l233921l176397
32188f512596j513014L841774P718922M288800k086613k117784L700005N776632
$$ plain form
32180 13096126 14215225 11795213 11526192 12701370 9284082 1419171 -2795726 844289
32172 844289 6244954 6014286 1218920 -2202526 -2492860 -2560371 -4033269 -5778659 -7180156
32163 -7180156 -8446915 -7957246 -3511950 2957567 5605310 1585220 -4626541 -6182442
32155 -6182442 -1871096 3197425 4425874 2621180 1301995 1561428 1901289 1951011 3184751
32146 3184751 5407904 5446471 1340345 -3839935 -4658074 751787 8859052 14049198 12597231
32137 12597231 4985912 -3602278 -6573351 -2482273 2764325 3298097 1590551 4970819
32129 4970819 14091838 20260707 16218675 5097250 -4269169 -7375338 -6125836 -3983299
32121 -3983299 -3016748 -3973439 -5676849 -5480974 -3076205 -2123463 -5124879 -8819527 -8491634
$$ packed form
32180A3096126J119099k420012k69021J175178l417288p864911m214897L640015
32172H44289N400665k30668m795366l421446k90334o7511j472898j745390j401497
32163g180156j266759M89669M445296O469517K647743m020090o211761j555901
32155f182442M311346N068521J228449j804694j319185K59433L39861M9722J233740
32146C184751K223153L8567m106126n180280q18139N409861Q107265N190146j451967
32137A2597231p611319q588190k971073M091078N246598N33772j707546L380268
32129D970819R121019O168869m042032j1121425r366419l106169J249502K142537
32121c983299R66551r56691j703410J95875K404769R52742l001416l694648L27893
$$ plain form
32112 -8491634 -4817235 -1714354 913152 6245308 12752728 14260729 9565736 5422126
32104 5422126 6402417 7503285 1949629 -7944022 -13845303 -12797179 -9142224 -6146073
32096 -6146073 -2406028 2562481 5510675 5013499 4816521 7694974 9666333 5280789
32088 5280789 -3190195 -7259522 -3343662 2179826 1096252 -6571330 -13443631 -14052128
32080 -14052128 -10096767 -6717366 -6507330 -8443807 -10658321 -12012103 -11520498 -8495437
32072 -8495437 -3958467 -384148 1109356 2325602 5386696 9243873 10615055 8484317
32064 8484317 5802794 5849823 8309953 10083485 8834221 4426411 -2019725 -8567858
32056 -8567858 -12500646 -12119391 -8865919 -6042148 -5110458 -4837703 -4333385 -4753172 -6747292
$$ packed form
32112h491634L674399L102881K627506N332156O507420J508001m694993m143610
32104E422126R80291J100868n553656r893651n901281J048124L654955K996151
32096f146073L740045M968509K948194m97176j96978K878453J971359m385544
32088E280789q470984m069327L915860N523488j083574p667582o872301o08497
32080a4052128L955361L379401K10036j936477k214514j353782M91605L025061
32072h495437M536970L574319J493504J216246L061094L857177J371182k130738
32064H484317k681523M7029K460130J773532j249264m407810o446136o548133
32056h567858l932788L81255L253472K823771R31690K72755N04318m19787j994120
$$ plain form
32047 -6747292 -7970181 -5144971 1841682 9312166 13236222 12571286 9369959 6212911
32039 6212911 3821980 1527225 -44234 1475345 6323646 10097080 8506437 3915621
32031 3915621 2784944 6174079 7903065 4139612 -560104 -556954 2338708 2875613 1171624
32022 1171624 1406678 4314755 7456984 11061597 16471142 19889230 15724773 6682193
32014 6682193 2384227 5948786 9674654 7042832 1309326 -2210504 -5132633 -11178109
32006 -11178109 -17995218 -20558459 -18868739 -16060987 -12197547 -6183177 -972032 -275187
31998 -275187 -1988807 -1228984 1503248 1441713 -2190557 -5541191 -7564714 -11580325 -18351282
31989 -18351282 -23416355 -23284896 -19714258 -15817414 -11804093 -6864498 -2386947 -915608
$$ packed form
32047f747292j222889K825210O986653P470484L924056o64936l201327l157048
32039F212911k390931k294755j571459J519579M848301L773434j590643m590816
32031C915621j130677L389135J728986l763453m699716L150K895662N36905j703989
32022A171624K35054K908077L142229L604613N409545L418088m164457r042580
32014F682193m297966L564559L725868k631822n733506l519830k922129o045476
32006a1178109o817109k563241J689720K807752L863440O014370N211145O96845
31998b75187j713620P59823K732232o1535l632270l350634k023523m015611o770957
31989a8351282n065073J31459L570638L896844M013321M939595M477551J471339
$$ plain form
31981 -915608 -3139981 -6972240 -8968690 -7108062 -3152303 -946724 -1171417 -254173 3426217
31972 3426217 5673608 2517192 -3043685 -5163449 -3488661 -2021673 -1772566 -412683
31964 -412683 2283109 4555069 6669032 8630328 5921261 -4869065 -17577008 -22418075
31956 -22418075 -20088336 -20314279 -25469371 -26327586 -17382585 -5958879 -590174 589568
31948 589568 3128911 5652517 3666900 -1717803 -6240775 -9334276 -12105049 -12614265
31940 -12614265 -9271361 -5012449 -2369249 1423000 8522516 14200753 13119671 7912617
31932 7912617 4655865 3526587 1133805 -1511863 -1375881 -860901 -4416762 -9597923
31924 -9597923 -10070271 -6496776 -5797669 -9585626 -11779473 -8892531 -5035588 -4635733 -6535869
$$ packed form
31981i15608k224373l832259j996450J860628L955759K205579k24693R17244L680390
31972C426217K247391l156416n560877k119764J674788J466988K49107J359883
31964d12683K695792K271960K113963J961296k709067j0790326j2707943m841067
31956b2418075K329739k25943n155092q58215Q945001J1423706N368705J179742
31948E89568K539343K523606j985617n384703m522972l093501k770773n09216
31940a2614265L342904M258912K643200L792249P099516N678237j081082n207054
31932G912617l256752j129278k392782k645668J35982N14980l555861n181161
31924i597923m72348L573495O99107l787957k193847K886942L856943L99855j900136
$$ plain form
31915 -6535869 -7487516 -6404953 -3632701 -385555 541110 -2116716 -4594161 -2474640
31907 -2474640 2526175 5747515 7791974 12154633 15829606 11466296 -129569 -8827013
31899 -8827013 -8999638 -5985437 -5609032 -5883317 -3603468 -1121470 -865328 -16379 3242894
31890 3242894 4285043 -604496 -6626922 -7024013 -2989719 -403530 -468023 -430604 -390367
31881 -390367 -2205762 -3901834 -2194863 1020710 1484340 437925 2480197 6313131
31873 6313131 5506760 -630062 -4658719 -2024188 2405214 2615891 268124 -121021 -329650
31864 -329650 -5700359 -14638522 -18003114 -11043665 -736855 2705569 -1457241 -5244627
31856 -5244627 -4223903 -2907264 -6012906 -10204477 -9647955 -6057886 -6349513 -11470673
$$ packed form
31915f535869r51647J082563K772252L247146R26665k657826k477445K119521
31907b474640N000815L221340K044459M362659L674973m363310j1595865q697444
31899h827013j72625L014201L76405k74285K279849K481998K56142Q48949L259273
31890C242894J042149m889539o022426l97091M034294K586189o4493L7419M0237
31881c90367j815395j696072J706971L215573M63630j046415K042272L832934
31873F313131q06371o136822m028657K634531M429402K10677k347767l89145k08629
31864c29650n370709q938163l364592O959449J0306810L442424m162810l787386
31856e244627J020724J316639l105642m191571N56522L590069k91627n121160
$$ [...]
##END NTUPLES=NMR SPECTRUM
##END=
