##TITLE=31Pdec_LACO1812
 , 24 sc
 19.12.2019
##JCAMPDX= 6.0         $$ Bruker NMR JCAMP-DX V2.0
##DATA TYPE= NMR SPECTRUM
##DATA CLASS= NTUPLES
##ORIGIN= UXNMR, Bruker Analytische Messtechnik GmbH
##OWNER= root
$$ XWIN-NMR		Version 3.5
$$ Thu Dec 19 13:55:08 2019 Russian Standard Time (UT+4h)  she@DPX200
##.OBSERVE FREQUENCY= 81.013821
##.OBSERVE NUCLEUS= ^31P
##.ACQUISITION MODE= SIMULTANEOUS
##.ACQUISITION SCHEME= undefined
##.AVERAGES= 24
##.DIGITISER RES= 17
##SPECTROMETER/DATA SYSTEM= spect
##.PULSE SEQUENCE= zgpg30
##.SOLVENT NAME= D2O
##.SHIFT REFERENCE= (INTERNAL, D2O, 0, 182.463)
##AUDIT TRAIL= $$ (NUMBER, WHEN, WHO, WHERE, WHAT)
$$ ##TITLE= Audit trail, XWIN-NMR		Version 3.5
$$ ##JCAMPDX= 5.01
$$ ##ORIGIN= Bruker BioSpin GmbH
$$ ##OWNER= she
$$ F:/spectra/data/she/nmr/P31/1/pdata/1/auditp.txt
$$ ##AUDIT TRAIL=  $$ (NUMBER, WHEN, WHO, WHERE, WHAT)
(   1,<2019-12-19 13:53:55.17 +0400>,<she>,<DPX200>,
      <created by zg, POWCHK disabled, PULCHK disabled
       configuration hash MD5:
       00 E9 B6 7A A2 85 ED C7 34 08 36 98 17 FE 4E 26
       data hash MD5: 32K
       0D 37 86 4E 94 8C 8C 8E 33 8D 9D 2D D0 86 D7 14>)
(   2,<2019-12-19 13:53:58.40 +0400>,<she>,<DPX200>,
      <Start of raw data processing
       efp BC_mod = 2 LB = 1 FT_mod = 6 PKNL = 1 PHC0 = -1619.675 PHC1 = -7.79882 SI = 64K 
       data hash MD5: 64K
       F5 27 9B E2 E5 E4 8E 98 B1 94 80 FD 55 31 78 DC>)
(   3,<2019-12-19 13:54:16.32 +0400>,<she>,<DPX200>,
      <pk PHC0 = 4.835584 PHC1 = -12 
       data hash MD5: 64K
       F4 36 0A 5B 0C 1C A5 7C DE 5B 26 4A D1 C5 02 5E>)
(   4,<2019-12-19 13:54:19.28 +0400>,<she>,<DPX200>,
      <abs ABSG = 5 
       data hash MD5: 64K
       3C 9D AD D2 B4 87 45 A6 77 3E 35 2C D2 FB 32 99>)
(   5,<2019-12-19 13:54:41.71 +0400>,<she>,<DPX200>,
      <pk PHC0 = 12.71609 PHC1 = -24.2 
       data hash MD5: 64K
       97 55 E5 07 09 58 E0 1E F9 BC 5D B5 73 47 2C 00>)
(   6,<2019-12-19 13:54:44.70 +0400>,<she>,<DPX200>,
      <abs ABSG = 5 
       data hash MD5: 64K
       19 11 AA 84 86 4B AB 4D 63 0B 63 A2 DE A0 40 89>)
$$ ##END=
$$ 
$$ hash MD5
$$ 34 76 93 76 F2 8D 8E E1 0A D2 7C 22 CF A6 F5 14
##$RELAX= 
##$RELAX= 
##$RELAX= 
##$RELAX= 
##$RELAX= 
##$RELAX= 
##$RELAX= 
##$RELAX= 
$$ Bruker specific parameters
$$ --------------------------
##$DU= <F:/spectra>
##$EXPNO= 1
##$NAME= <P31>
##$PROCNO= 1
##$TYPE= <nmr>
##$USER= <she>
##$AMP= (0..31)
100 100 100 100 100 100 100 100 100 100 100 100 100 100 100 100 100 100 
100 100 100 100 100 100 100 100 100 100 100 100 100 100 
##$AQSEQ= 0
##$AQ_mod= 1
##$AUNM= <au_zg>
##$AUTOPOS= <>
##$BF1= 81.014009
##$BF2= 200.13
##$BF3= 200.13
##$BF4= 200.13
##$BF5= 200.13
##$BF6= 200.13
##$BF7= 200.13
##$BF8= 200.13
##$BYTORDA= 1
##$CFDGTYP= 0
##$CFRGTYP= 5
##$CHEMSTR= <none>
##$CNST= (0..31)
1 1 145 1 1 1 1 1 1 1 1 1 1 1 1 1 1 1 1 1 1 1 1 1 1 1 1 1 1 1 1 1 
##$CPDPRG= <waltz16>
##$CPDPRG1= <>
##$CPDPRG2= <waltz16>
##$CPDPRG3= <>
##$CPDPRG4= <mlev>
##$CPDPRG5= <mlev>
##$CPDPRG6= <mlev>
$$ [...]
##$SUBNAM3= <"">
##$SUBNAM4= <"">
##$SUBNAM5= <"">
##$SUBNAM6= <"">
##$SUBNAM7= <"">
##$SUBNAM8= <"">
##$SUBNAM9= <"">
##$SW= 369.568048894756
##$SWIBOX= (0..15)
0 1 3 0 0 0 0 0 0 0 0 0 0 0 0 0 
##$SW_h= 29940.119760479
##$TD= 32768
##$TD0= 1
##$TE= 0
##$TE2= 300
##$TE3= 300
##$TEG= 300
##$TL= (0..7)
0 120 53 12 22 120 120 120 
##$TP= (0..7)
150 150 150 150 150 150 150 150 
##$TP07= 0
##$TPNAME0= <>
##$TPNAME1= <>
##$TPNAME2= <>
##$TPNAME3= <>
##$TPNAME4= <>
##$TPNAME5= <>
##$TPNAME6= <>
##$TPNAME7= <>
##$TPOAL= (0..7)
0.5 0.5 0.5 0.5 0.5 0.5 0.5 0.5 
##$TPOFFS= (0..7)
0 0 0 0 0 0 0 0 
##$TUNHIN= 0
##$TUNHOUT= 0
##$TUNXOUT= 0
##$USERA1= <user>
##$USERA2= <user>
##$USERA3= <user>
##$USERA4= <user>
##$USERA5= <user>
##$V9= 5
##$VALIST= <valist>
##$VCLIST= <CCCCCCCCCCCCCCC>
##$VD= 0
##$VDLIST= <DDDDDDDDDDDDDDD>
##$VPLIST= <PPPPPPPPPPPPPPP>
##$VTLIST= <TTTTTTTTTTTTTTT>
##$WBST= 1024
##$WBSW= 4
##$XGAIN= (0..3)
0 0 0 0 
##$XL= 0
##$YL= 0
##$YMAX_a= 12291
##$YMIN_a= -11434
##$ZGOPTNS= <>
##$ZL1= 120
##$ZL2= 120
##$ZL3= 120
##$ZL4= 120
##$ABSF1= 182.463
##$ABSF2= -187.1042
##$ABSG= 5
##$ABSL= 3
##$ALPHA= 0
##$AQORDER= 0
##$ASSFAC= 0
##$ASSFACI= 0
##$ASSFACX= 0
##$ASSWID= 0
##$AUNMP= <proc_1d>
##$AZFE= 0.1
##$AZFW= 0.5
##$BCFW= 0
##$BC_mod= 2
##$BYTORDP= 0
##$COROFFS= 0
##$CY= -3
##$DATMOD= 1
##$DC= 0
##$DFILT= <>
##$DTYPP= 0
##$F1P= 0
##$F2P= 0
##$FCOR= 1
##$FTSIZE= 65536
##$FT_mod= 6
##$GAMMA= 0
##$GB= 0
##$INTBC= 1
##$INTSCL= 5.30512e-09
##$ISEN= 30
##$LB= 1
##$LEV0= 0
##$LPBIN= 0
##$MAXI= 10000
##$MC2= 0
##$MEAN= 0
##$ME_mod= 0
##$MI= 50
##$NCOEF= 0
##$NC_proc= -6
##$NLEV= 6
##$NOISF1= 182.463
##$NOISF2= 159.3651
##$NSP= 0
##$NTH_PI= 0
##$NZP= 0
##$OFFSET= 182.463
##$PC= 4
##$PHC0= -1602.123
##$PHC1= -43.99882
##$PH_mod= 1
##$PKNL= yes
##$PPARMOD= 0
##$PSCAL= 0
##$PSIGN= 0
##$REVERSE= no
##$SF= 81.0140089999434
##$SI= 65536
##$SIGF1= 159.3651
##$SIGF2= -187.1042
##$SINO= 113.3802
##$SIOLD= 16384
##$SREGLST= <1H.CDCl3>
##$SSB= 0
##$STSI= 65536
##$STSR= 0
##$SW_p= 29940.119760479
##$SYMM= 0
##$S_DEV= 0
##$TDeff= 32768
##$TDoff= 0
##$TI= <>
##$TILT= no
##$TM1= 0
##$TM2= 0
##$TOPLEV= 0
##$USERP1= <user>
##$USERP2= <user>
##$USERP3= <user>
##$USERP4= <user>
##$USERP5= <user>
##$WDW= 1
##$XDIM= 65536
##$YMAX_p= 469241486
##$YMIN_p= -7583812
$$ End of Bruker specific parameters
$$ ---------------------------------
##NTUPLES= NMR SPECTRUM
##VAR_NAME=  FREQUENCY,     SPECTRUM/REAL,   SPECTRUM/IMAG
##SYMBOL=    X,             R,               I
##VAR_TYPE=  INDEPENDENT,   DEPENDENT,       DEPENDENT
##VAR_FORM=  AFFN,          ASDF,            ASDF
##VAR_DIM=   65536,         65536,           65536
##UNITS=     HZ,            ARBITRARY UNITS, ARBITRARY UNITS
##FACTOR=    0.456856943014862, 1,           1
##FIRST=     14782.0589164792, 0,            0
##LAST=      -15158.0608439998, 0,           0
##MIN=       -15158.0608439998, -7583812,    0
##MAX=       14782.0589164792, 469241486,    0
$$ Real data points
##PAGE= N=1
##DATA TABLE= (X++(R..R)), XYDATA
$$ [...]
37067a773356M4440L67890O19850M56682j94887o67545m46143j06690m36616r53863
37057c090238m50623J058201K126231J804761P11891r6388l22359j84284O1460
37048A618652K5344m83845q09774j57389Q82408Q25036l62284r53247j34022P01244
37038A152123L44930k52850J12158O17890o347r05999m50548O82175L81474j246057
37028D28949j834016o10915M35062O1279k03850R78082K073277J067115j088636
37019A306347j809371p17723K58704K23679L11927J118609J386856J64076j426405
37010H16699j743329q24597P6185K85991q898n45532r42307m80234Q91772J819904
37000f54346J119136k77037m45079O21834J034539J54546l48772N23095J117406
$$ plain form
37067 -1773356 -1728916 -1361026 -741176 -284494 -479381 -1146926 -1593069 -1699759 -2136375 -3090238
37057 -3090238 -3540861 -2482660 -356429 1448332 2160223 2063835 1741476 1557192 1618652
37048 1618652 1643996 1160151 350377 192988 1075396 1900432 1538148 584901 450879 1152123
37038 1152123 1497053 1244203 1356361 1974251 1967904 1061905 611357 1293532 1675006 428949
37028 428949 -1405067 -2015982 -1580920 -1519641 -1723491 -745409 1327868 2394983 1306347
37019 1306347 -503024 -1220747 -962043 -738364 -426437 692172 2079028 2243104 816699
37010 816699 -926630 -1751227 -1675042 -1389051 -1397949 -1943481 -2885788 -3366022 -2474250 -654346
37000 -654346 464790 187753 -257326 364508 1399047 1553593 1204821 1727916 2845322
36991B845322k14450k125066k137911m59507N22569K8129m20727m5866J66047
36982a841460j8775O85583K222098K225565l17756k754960k349570k91087M41814
36973a998548l26673n10584J58460K7835p59703o5875K042496K365879m94671
36964D38616l188013k031128J642098L358083J653262n48454n96836N72021P39937
36955B039586j2127J61809J552585K083433L23040k103547k473926p58834L14508
36946A126527p43048k056386j446103J43622L65340n70011l75068J236007J930416
36937c88704P04923m36937M5710O93971k38646j700471j642292k95735O30556
36928b627625Q49636J271302J690437J035114m25863j201632q01192j21260J95419
$$ plain form
36991 2845322 2630872 505806 -1632105 -2091612 -1569043 -1540914 -1961641 -2007507 -1841460
36982 -1841460 -1860235 -1174652 1047446 3273011 2955255 200295 -2149275 -2440362 -1998548
36973 -1998548 -2325221 -2835805 -2677345 -2649510 -3409213 -3475088 -1432592 933287 438616
36964 438616 -2749397 -4780525 -3138427 219656 1872918 1324464 727628 1299649 2039586
36955 2039586 2027459 2189268 3741853 5825286 6148326 4044779 1570853 812019 1126527
36946 1126527 383479 -1672907 -3119010 -2975388 -2610048 -3180059 -3555127 -2319120 -388704
36937 -388704 316219 -120718 -75008 618963 380317 -1320154 -2962446 -3258181 -2627625
36928 -2627625 -1777989 -506687 1183750 2218864 1793001 591369 -209823 -331083 -135664
36919a35664K12806j35566p01993m02558J337367K885469K239541K14178n80051
36910D933529J75964J59473j455842k385158r26012J244636J627489L22127q46431
36901B849775j072715p00036J30346J193469J456251K54744j451379k271809k078978
36892a690332j387818j15992J581356K270884Q74767j254427j725980l00668R92363
36883g55847P78846k57363r27732r39496m93112J82353N65256K35214k16906K47495
36873a581292J396092J687995L73267j354586j861992j007986k8705M4785n69928
36864b902350p36213L20940J898452K279404P53340j261784j848366r38493p3459
36855b508529j12879l83627j28465L99244O06022L81440q0954n48986o75847l83630
$$ plain form
36919 -135664 77142 -58424 -760417 -1162975 174392 3059861 5299402 5513580 4933529
36910 4933529 5109493 5268966 3813124 1427966 501954 1746590 3374079 3696206 2849775
36901 2849775 1777060 1077024 1207370 2400839 3857090 4111834 2660455 388646 -1690332
36892 -1690332 -3078150 -3194142 -1612786 658098 1532865 278438 -1447542 -1748210 -755847
36883 -755847 22999 -234364 -1162096 -2101592 -2594704 -2412351 -1847095 -1611881 -1828787 -1581292
36873 -1581292 -185200 1502795 1876062 521476 -1340516 -2348502 -2377207 -2332422 -2902350
36864 -2902350 -3638563 -3317623 -1419171 860233 1613573 351789 -1496577 -2435070 -2508529
36855 -2508529 -2621408 -3005035 -3133500 -2734256 -2128234 -1746794 -1827748 -2376734 -3052581 -3436211
36845c436211l05065r55874j565031q96752P42074J710319J482553J299158J786544
36836a38285J663491Q294j677701j381773L56640J160392K58424n98130J14168
36827b34480J565421J891853O44288r18386j524879j163666p12400p46977r32990
36818b132216n60120M91423J541818J868822J391692N09076m04913j103511j335179
36809B66892r54393j42669O20212Q16077K44556o52476r59234j99171R24930J147361
36799A112085P8207j346123j878217j056527O18943K071907K255188J010815n74335
36790B291943j188045o63903J64389P17730R65328P20327k01405j104639r34884
36781G66841J08763O83809K75468k19242j46657J21936M32453J178074J793071
$$ plain form
36845 -3436211 -3741276 -4697150 -6262181 -7158933 -6416859 -4706540 -3223987 -1924829 -138285
36836 -138285 1525206 1533500 -144201 -1525974 -1169334 -8942 249482 -348648 -234480
36827 -234480 1330941 3222794 3867082 2948696 1423817 260151 -452249 -1199226 -2132216
36818 -2132216 -2692336 -2200913 -659095 1209727 2601419 3110495 2705582 1602071 266892
36809 266892 -687501 -830170 -209958 606119 850675 198199 -761035 -960206 -35276 1112085
36799 1112085 1190292 -155831 -2034048 -3090575 -2471632 -399725 1855463 2866278 2291943
36790 2291943 1103898 439995 604384 1322114 2287442 3007769 2806364 1701725 766841
36781 766841 875604 1559413 1834881 1615639 1468982 1590918 2023371 3201445 4994516
36772D994516Q37502j436681k609173j539394k48039n83183j126381J07698J750237
36763A47102J063194j297359k049289m73664P23505P9257n48919L97713J594556
36754c63904J463477Q23882J019607J382174N46912j114507k161168k102541j292103
36745a798171Q5379J498355J665327K23020j133092p26053O81769J101092K55592
36736A853218l66045p784M70716K46235k77007k45128M62331J058833O08454q25151
36726B978672j787339j020350M67110L58681j418803k016682J43571K458745J643999
36717A807604j330368k628129j116294N71773N65740J69037Q16095J445959O09455
36708I10872q46069j141814l09775K38360J1125l45375n40138p91511p82654J24028
$$ plain form
36772 4994516 5832018 4395337 1786164 246770 -1269 -584452 -1710833 -1603135 147102
36763 147102 1210296 -87063 -2136352 -2610016 -1886511 -1807254 -2356173 -1958460 -363904
36754 -363904 1099573 1923455 2943062 4325236 4872148 3757641 1596473 -506068 -1798171
36745 -1798171 -1712792 -214437 1450890 1673910 540818 -185235 496534 1597626 1853218
36736 1853218 1487173 1479389 1950105 2196340 1919333 1674205 2136536 3195369 3803823 2978672
36726 2978672 1191333 170983 638093 996774 -422029 -2438711 -2295140 163605 1807604
36717 1807604 477236 -2150893 -3267187 -2695414 -2129674 -1960637 -1144542 301417 910872
36708 910872 64803 -1077011 -1386786 -1148426 -1137301 -1482676 -2022814 -2814325 -3596979 -3472951
36698c472951J608328K418766J814416K51962j317350k147327j832571n51487
36690c228214P74350J222049Q59863N13324O02439P79588O85170M29096K24191
36681B861856P4804o2837k47025o54235j202100j199523j59983J046307R01649
36672A358913n87343j586692r77386J7724r1435n25778L59764J819674J337902
36663A125343j240243k772232j244420J094094J005547r91970j699988j74635
36655d898504J233214Q05095k24858q1085R32895J417838R94991K53233l72060
36646F0759o64088l70164L47680Q69366R40075P69689K60640o44018q85584N98685
36636A283040K423887J752956j391011l348933j870545O26937J000531P8152M14126
$$ plain form
36698 -3472951 -1864623 554143 2368559 2620521 1303171 -844156 -2676727 -3228214
36690 -3228214 -2453864 -1231815 -371952 141372 743811 1523399 2208569 2637665 2861856
36681 2861856 2936660 2873823 2626798 1972563 770463 -429060 -589043 457264 1358913
36672 1358913 771570 -815122 -1792508 -1774784 -1866219 -2391997 -2032233 -212559 1125343
36663 1125343 -114900 -2887132 -4131552 -3037458 -2031911 -3023881 -4723869 -4898504
36655 -4898504 -3665290 -2860195 -3085053 -3166138 -2233243 -815405 179586 432819 60759
36646 60759 -603329 -973493 -625813 243553 1183628 1953317 2213957 1569939 684355 1283040
36636 1283040 3706927 5459883 4068872 719939 -1150606 -523669 476862 555014 969140
36627I69140J409263M97968j853518k401994l24724J613621J612161J039546J151669
36618C713132R66582r5796m61449P53574J613940K75345j877312k239366p43564
36609A905086N29550N30992O3884k1881J76568K02455k10937q95786j097386k99502
36599H83043N97658K44020p57884l34988J526209K119620K41012j439015l82021
36590B697654J672530J406351r10353k217042j610653r96176j077395k65975J775655
36581D74596K673158Q06046k069019l158553j982693j12202J127782J473326J182796
36572D15237P41891N91443N93276K46733m40268r83119j211126j126766l18628
36563a491327J182999J865111L91736j798228j787332N39577J933300M60275j675293
$$ plain form
36627 969140 2378403 2876371 1022853 -1379141 -1703865 -90244 1521917 2561463 3713132
36618 3713132 4679714 4583918 4122469 4876043 6489983 6765328 4888016 2648650 1905086
36609 1905086 2434636 2965628 3029512 3007631 3184199 3386654 3175717 2279931 1182545 883043
36599 883043 1480701 1724721 966837 631849 2158058 4277678 4518690 3079675 2697654
36590 2697654 4370184 5776535 4866182 2649140 1038487 42311 -1035084 -1301059 474596
36581 474596 3147754 3953800 1884781 -1273772 -3256465 -3368667 -2240885 -767559 415237
36572 415237 1157128 1748571 2341847 2588580 2148312 1165193 -45933 -1172699 -1491327
36563 -1491327 -308328 1556783 1948519 150291 -1637041 -1097464 835836 1296111 -379182
36554c79182j586082J82540J157547Q83990P84527J083424O18458n36522q32786
36545A375914P0455O31466O6532l46914M06081J180727M79934j067996j608266
36536A187933p55677J50144K35150N3140J70367J24909n36753j133053p04690
36527a208530M54698J077450O51269J4624L2309L96276J81825q43545j929465
36518a173089k162690j302205R517P40581N06256J72664Q29728J998719J812117
36509A431598l66276k459185k016399N24017K342422J837045K04492p84772j016266
36500c03324j251781j374050o45902Q21579J943617J911960R09142l16205j062359
36491F32677r69003k01847N76581O68695j16619j292482j910521j166806P02557
$$ plain form
36554 -379182 -1965264 -1782724 -625177 258813 1043340 2126764 2745222 2208700 1375914
36545 1375914 1446369 2077835 2144367 1797453 2203534 3384261 3864195 2796199 1187933
36536 1187933 432256 582400 817550 870690 1041057 1165966 629213 -503840 -1208530
36527 -1208530 -753832 323618 974887 989511 1021820 1418096 1599921 756376 -1173089
36518 -1173089 -3335779 -4637984 -4628467 -3887886 -3381630 -3208966 -2379238 -380519 1431598
36509 1431598 1065322 -1393863 -3410262 -2886245 -543823 1293222 1497714 712942 -303324
36500 -303324 -1555105 -2929155 -3575057 -2753478 -809861 1102099 2011241 1695036 632677
36491 632677 -336326 -538173 38408 707103 590484 -701998 -2612519 -3779325 -3076768
36482c076768K190238J864878J33600j013375l56840J090797J466716L37271j065785
36473A570732j533286j046396k94737L01214P70456J082079Q83957j1936j004907
36464G17176j062798j4607R65747P75342n9104j11558P81652J188288J89585j221623
36454B148100j496036n33904M12780L80377m56749j307574j550059j087061k70010
36445c760136N46171J329807J971300J831700N06393j019986j130485J75225J012146
36436A462135K72177o93020j82730J123968J154257l65331j450449p06706Q62622
36427A476923J427887O30114l99209o73192l13849p8962l36763n92855j18610
36418A021484R08043J311894L72781j067533j618353j111511m91044j73900L20953
$$ plain form
36482 -3076768 -886530 978348 1111948 98573 -258267 832530 2299246 2636517 1570732
36473 1570732 37446 -1008950 -1303687 -1002473 -232017 850062 1734019 1722083 717176
36464 717176 -345622 -360229 605518 1380860 1321756 1210198 1991850 3180138 3369723 2148100
36454 2148100 652064 118160 530940 911317 454568 -853006 -2403065 -3490126 -3760136
36445 -3760136 -3213965 -1884158 87142 1918842 2425235 1405249 274764 449989 1462135
36436 1462135 1734312 1041292 858562 1982530 3136787 2771456 1321007 614301 1476923
36427 1476923 2904810 3534924 3135715 2462523 2148674 2069712 1732949 1140094 1021484
36418 1021484 1929527 3241421 3614202 2546669 928316 -183195 -674239 -848139 -527186
36409e27186R87099Q56350m38445j650874j446150k72961L93141K84439N18645
36400a295942J487034J930173P92487j040546j884342j473207q40970l85387M56185
36391b254515J513860J508574R6794j124879q08225Q8980j33052j184402j369649
36382c666514m06754K82256Q1055M7379Q57196J631642J533509J061301R26322
36373B347392Q76256M36931k58686j039747j966953k485386j668604L0333Q19133
36364b909331K30161M5656J364316K515793J574159n97876j777500j567975j052066
36355b174663m01493P92262J635139R37073l42857k03548J049098J164082k77800
36346B177293j160501m07599L94952q6933q27977o04251j73237o22865j160991
$$ plain form
36409 -527186 459913 1316263 877818 -773056 -2219206 -2492167 -2099026 -1814587 -1295942
36400 -1295942 191092 2121265 2913752 1873206 -11136 -1484343 -2325313 -2710700 -2254515
36391 -2254515 -740655 767919 864713 -260166 -1068391 -979411 -1112463 -2296865 -3666514
36382 -3666514 -4073268 -3791012 -3709957 -3662578 -2805382 -1173740 359769 1421070 2347392
36373 2347392 3223648 3660579 3401893 2362146 395193 -2090193 -3758797 -3728464 -2909331
36364 -2909331 -2679170 -2633514 -1269198 1246595 2820754 2222878 445378 -1122597 -2174663
36355 -2174663 -2576156 -1783894 -148755 788318 445461 241913 1291011 2455093 2177293
36346 2177293 1016792 609193 1004145 917212 89235 -515016 -688253 -1311118 -2472109
36337b472109m10643J108737J567965M36868r09671j080134j88954N57728L11363
36328a078850m33693l66810Q65667J871825J307282n9221l97150M17692Q18619
36319B945361K79424k4053L24951P8481j182733j782401o13775P71668N22656
36310A319579n60538m77585O42167R03289j37665p95940M5835J337145J500597
36301C776884M53499o74405j131321j188708j356717j420049o77671P45359J502390
36292B9261P42840l26468P1661J509886J808431L94432p89533l73914M62534J88728
36282C717858p79965j335907j510140j525707o83405J059698J957642Q73474o16871
36273A156677n99685J25517k42872j099395o03458O74298M53423j245215j946916
$$ plain form
36337 -2472109 -2882752 -1774015 -206050 230818 -678853 -1758987 -1947941 -1390213 -1078850
36328 -1078850 -1512543 -1879353 -1013686 858139 2165421 2106200 1709050 2126742 2945361
36319 2945361 3224785 3200732 3525683 3604164 2421431 639030 25255 796923 1319579
36310 1319579 759041 281456 923623 1826912 1689247 893307 939142 2276287 3776884
36301 3776884 4230383 3555978 2424657 1235949 -120768 -1540817 -2218488 -1473129 29261
36292 29261 772101 445633 517294 2027180 3835611 4230043 3440510 3066596 3529130 3717858
36282 3717858 2937893 1601986 91846 -1433861 -2117266 -1057568 900074 1773548 1156677
36273 1156677 556992 682509 439637 -659758 -1263216 -588918 -135495 -1380710 -3327626
36264c327626p26626O18099Q33467P85880J068530P77168l23981r20148n49440
36255a764677n24055j257507j072995Q28058K496057K127897P87215K74682K12561
36246B107236m79655r48579K6826J091803m609k349769k626291j17200K037223
36237a263015J497661j9574K13845J692789J766027o4175j422566p66078L31587
36228A966501l23780k162376k621009q56106J087386J266707M50004N43378J464575
36219H15280J338000m04254j878987j250043Q99774K462898K225454O75869r42899
36210C941092j666008j305511n01662o7692q6364o7392N02l98720j071194q96677
36200b119626M75359J645406J172891l42273r96570j53243Q03796M29017r07397
$$ plain form
36264 -3327626 -4054252 -3436153 -2602686 -1816806 -748276 28892 -295089 -1215237 -1764677
36255 -1764677 -2288732 -3546239 -4619234 -3791176 -1295119 832778 1619993 1894675 2107236
36246 2107236 1627581 679002 705828 1797631 1793022 -556747 -3183038 -3300238 -1263015
36237 -1263015 234646 215072 428917 2121706 3887733 3823558 2400992 1634914 1966501
36228 1966501 1642721 -519655 -3140664 -3996770 -2909384 -1642677 -1192673 -649295 815280
36219 815280 2153280 1749026 -129961 -1380004 -480230 1982668 4208122 4883991 3941092
36210 3941092 2275084 969573 467911 400219 313855 246463 246965 -151755 -1222949 -2119626
36200 -2119626 -1644267 1139 1174030 831757 -164813 -318056 485740 914757 7360
36191G360j555421o35664R20435J489904O77412l12007l30549K81530M76552J48988
36181A168540P332O1914n07731j791014k614899k050916n79373O82240J157331
36172d466576R18816M23385L65308R35058J151380O4151j343434j047245Q67393
36163b131764J844313N26441j154864r88714J95453J85075r65050j239361N7029
36154c671442J529365J987683J587397P26060m50400j346534j267360o07213l69782
36145a882226n39674k97926K66357K31532l43468l31777M93586R97408N74441
36136h31747l336r8357j04335k73139p1433N96575Q42087K39771l74544l17833
36126c96291q6173j63202m9518N14087N72026m94811j433265o79345J132608J827757
$$ plain form
36191 7360 -1548061 -2183725 -1263290 226614 904026 592019 261470 543000 1019552 1168540
36181 1168540 1175872 1237786 730055 -1060959 -3675858 -5726774 -6306147 -5623907 -4466576
36172 -4466576 -3547760 -3124375 -2759067 -1824009 -672629 -608478 -1951912 -2999157 -2131764
36163 -2131764 -287451 238990 -915874 -1904588 -1709135 -1524060 -2489110 -3728471 -3671442
36154 -3671442 -2142077 -154394 1433003 2159063 1708663 362129 -905231 -1512444 -1882226
36145 -1882226 -2421900 -2719826 -2453469 -2221937 -2565405 -2897182 -2403596 -1406188 -831747
36136 -831747 -835083 -933440 -1037775 -1310914 -1382347 -785772 56315 296086 -78458 -396291
36126 -396291 -482464 -645666 -695184 -181097 390929 -103882 -1537147 -2216492 -1083884 743873
36116G43873P05362o06790n75851K24905K16056q43769j533133p42171P37643
36107a673875J141453O6350r32049m95948N93822O46851l17246o94715k0992K10235
36097a476114q68160j744542o79557J543412K620822J872112P63122M61870M43343
36088B936308j33007r24820j024483l86862J15788r6625n43275k84920Q08170
36079D66274J635735J011195q28641k308548k235842r80386K27915O29760L01256
36070b081282j89560q2080J010933K336314K414711Q26762j016865j585438j072458
36061E61037o56004n52258l8903Q75314J180215M52586m13440m85670O478J86898
36051A116253l11514j041432j217240l97612R10822J432092M92285r07917j157061
$$ plain form
36116 743873 1449235 842445 266594 491499 707555 -136214 -1669347 -2411518 -1673875
36107 -1673875 -532422 -466072 -1398121 -1894069 -1300247 -653396 -970642 -1665357 -1686349 -1476114
36097 -1476114 -2344274 -4088816 -4768373 -3224961 -604139 1267973 2031095 2492965 2936308
36088 2936308 2803301 1878481 853998 467136 582924 486299 -56976 -341896 466274
36079 466274 2102009 3113204 2284563 -23985 -2259827 -3240213 -3012298 -2382538 -2081282
36070 -2081282 -2270842 -2352922 -1341989 994325 3409036 4235798 3218933 1633495 561037
36061 561037 -94967 -647225 -686128 189186 1369401 1821987 1408547 922877 929355 1116253
36051 1116253 804739 -236693 -1453933 -1851545 -940723 491369 983654 75737 -1081324
36042a081324j13651P93227O06487q5515m08084l87779k90895J37494Q90349J072303
36032A132612J71254p23201k55748J037195J293037k3600j426826j608678r78201
36023a382156m48649L0383P78022J244298Q30170K05142M07883R50607L77688
36014B993388j187108j712287j73855J641219J428323n39164j990651j712616
36006a252751n55378K89693M79174M156r50524j378833k55469J526850J658118
35997d34964k75926j640632l17901K030118K227079J65739j212347l01507J159597
35988A399256R70052o35864j897083j815394n58165J162302K131649J251873p80643
35979A227983j543773O9578J927115J378557r25649j919586n06229J112304Q41793
$$ plain form
36042 -1081324 -1194975 -401748 204739 119224 -288860 -676639 -967534 -830040 60309 1132612
36032 1132612 1303866 580665 324917 1362112 2655149 2631549 1204723 -403955 -1382156
36023 -1382156 -1830805 -1800422 -1022400 221898 1052068 1257210 1665093 2615700 2993388
36014 2993388 1806280 93993 -79862 1561357 2989680 2450516 459865 -1252751
36006 -1252751 -1808129 -1518436 -1039262 -1035106 -1985630 -3364463 -3619932 -2093082 -434964
35997 -434964 -710890 -2351522 -2669423 -639305 1587774 1753513 541166 239659 1399256
35988 1399256 2369308 1733444 -163639 -1979033 -2537198 -1374896 756753 2008626 1227983
35979 1227983 -315790 -246212 1680903 3059460 2133811 214225 -292004 820300 1662093
35970A662093n89742j274826q60647l01958J502L16802M50498K715m61889J10378
35960i45074J473512J982382P23672j168560j894006j050316K27637P20134J95506
35951B64887o11782o36539N59719K020591K030509J87882j553138r31860J544259
35942B874528K754845P55046k566572l642375j515291J267155K017861Q47257
35934B792454l35381o22610p13021j191820j554784j159390j53547R48408J834018
35925a55673K116161J323308j76315j019848n29646J14572m51114j465261r81262
35916a225078R91354K131916J133636l89136m25446N09462N54850m70346j112436
35907A698776q30455n68685q17564q84373l88155R3170K99155P42315J357029
$$ plain form
35970 1662093 1072351 -202475 -1063122 -1365080 -1363578 -1046776 -596278 -593563 -1055452 -945074
35960 -945074 528438 2510820 3234492 2065932 171926 -878390 -650753 69381 264887
35951 264887 -346895 -983434 -423715 1596876 3627385 3815267 2262129 1330269 2874528
35942 2874528 5629373 6384419 3817847 175472 -1339819 -72664 1945197 2792454
35934 2792454 2457073 1834463 1121442 -70378 -1625162 -2784552 -2938099 -1989691 -155673
35925 -155673 1960488 3283796 3107481 2087633 1557987 1672559 1221445 -243816 -1225078
35916 -1225078 -233724 1898192 3031828 2642692 2217246 2726708 3281558 2811212 1698776
35907 1698776 868321 299636 -517928 -1402301 -1790456 -1697286 -1398131 -655816 701213
35898G01213J161118J0455p12345j37880O28961K57927o93676p70708J24978R07472
35888A477515J130321J191699J122483O01192l3611j30863L8197l11188r27626
35879D158119p47458K73039R15717N26314j89181n18073o94120j096378j572997
35870A054982j930397k083062j526657R3108J685746J577171J59404j35305J538412
35861D33402K729953J180143j627571k516515j090272K42738J53336k32090Q1761
35852f45115L99219K6178m49042m55021m04162m76783K9656J124922J392130J13694
35842F55676j182686q27709M24491O82228m4809r6823R06793J498405Q85676N1573
35832B952815k30204o18822j479518j596808n5995J772005J803602J64356j093107
$$ plain form
35898 701213 1862331 1872786 1160441 1022561 1651522 1909449 1215773 445065 570043 1477515
35888 1477515 2607836 3799535 4922018 5523210 5489599 5358736 5396933 5085745 4158119
35879 4158119 3410661 3683700 4599417 5125731 4936550 4418477 3724357 2627979 1054982
35870 1054982 -875415 -2958477 -4485134 -4392026 -2706280 -1129109 -969705 -1105010 433402
35861 433402 3163355 4343498 2715927 199412 -890860 -648122 -494786 -726876 -645115
35852 -645115 -245896 -219718 -668760 -1123781 -1527943 -2004726 -1975070 -850148 541982 655676
35842 655676 -527010 -1354719 -930228 -248000 -292809 -389632 517161 2015566 2901242 2952815
35832 2952815 2722611 2103789 624271 -972537 -1028532 743473 2547075 2711431 1618324
35823A618324r08987k44358j23423k24768L6342L08608N3586l50328j84244L84798
35813C65550M88158j96274j005219j086380k72435P81737J140279M58461n32197
35804A41680p27781l172O11312L72014j81054k01044J18429L5283l20520j34591
35794b89444N18427M67549p58870j892179j450812K36047J372992R03960l58985
35785a251315r14594l04206O54314J021806O75004J29790j45400l7577K73399
35776A01221L53098k43142j251367j424773K09011K676159L542746J622888j467265
35767D118576l103887k431566o64418P41967J238419R41571L76187L33766J033047
35758B583662J569098J107085K78232J88249L92285m87418k128398k444218p39652
$$ plain form
35823 1618324 709337 464979 341556 116788 153130 461738 515324 164996 -19248 365550
35813 365550 853708 657434 -347785 -1434165 -1706600 -924863 215416 673877 141680
35804 141680 -586101 -589273 22039 394053 212999 11955 130384 165667 -154853 -289444
35794 -289444 228983 696532 -62338 -1954517 -3405329 -3169282 -1796290 -892330 -1251315
35785 -1251315 -2165909 -2470115 -1815801 -793995 -118991 10799 -134601 -172178 101221
35776 101221 454319 211177 -1040190 -2464963 -2255952 420207 3962953 5585841 4118576
35767 4118576 1014689 -1416877 -2081295 -1339328 -100909 840662 1216849 1550615 2583662
35758 2583662 4152760 5259845 5538077 5726326 6118611 5631193 3502795 1058577 318925
35749C18925R57679Q12794j92549j1413J334939K062844J332389L5032p88989
35740E861651r83519q83594q79864j145066j113602J20610K098142K687899P37387
35731F500044j913434k629517j385399j86019J88782O66902J448977J505054P11698
35722D907088K28765K77000k88845j543814j819095m17515J043059J141886N81807
35713D110336L54639m3136j000428j295017j32219R46872L27114r00493p25478
35704A642190M03973N42405k91140l88007L52048K58024r36432j524251q54579
35695g95769l20401o33315o25439K63499P31373J43661L8353J427892K604829
35686B834683J673747l02716r26283j25577J15439r26671j922093j865874j237561
$$ plain form
35749 318925 1276604 2089398 1896849 1885436 3220375 5283219 6615608 6650640 5861651
35740 5861651 4878132 3994538 3114674 1969608 856006 976616 3074758 5762657 6500044
35731 6500044 4586610 1957093 571694 385675 574457 1241359 2690336 4195390 4907088
35722 4907088 5135853 5412853 5124008 3580194 1761099 1343584 2386643 3528529 4110336
35713 4110336 4464975 4421839 3421411 2126394 1994175 2941047 3268161 2367668 1642190
35704 1642190 2046163 2588568 2297428 1909421 2261469 2519493 1583061 58810 -795769
35695 -795769 -1116170 -1749485 -2374924 -2111425 -1380052 -1236391 -1198038 229854 2834683
35686 2834683 4508430 4205714 3279431 3153854 3269293 2342622 420529 -1445345 -2682906
35677b682906o10551J63089R88791J184436O10054N3290O1107L05523M32643O19442
35667A124918Q95830P65170J2969p42807q10938l02654J45271J96429M7347M4368
35657A375903K82169N09109M21993Q7827j47225k43202m98149p73651l83067P07335
35647A339042J322618O20388m49401l98835N17543O79673l51316j174399p49143
35638A356170J23574J83322m75677p88604k90967M03732M30956l64028j134343
35629e55865q08614M76170J143342J41036j367287j451777j37739Q63540R00200
35620g96994R21967J163650N41584r28801j380136k1965J212347N58697q39837
35611D30512r61001p5742K45350l4136N5979J43735p66440j849151j302010O14717
$$ plain form
35677 -2682906 -3293457 -3130368 -2141577 -957141 -347087 -293797 -232690 72833 505476 1124918
35667 1124918 2020748 2785918 2798887 2056080 1245142 942488 1087759 1284188 1331535 1375903
35657 1375903 1658072 2167181 2589174 2677001 2529776 2286574 1788425 1014774 631707 1339042
35647 1339042 2661660 3282048 2832647 2433812 2951355 3631028 3279712 2105313 1356170
35638 1356170 1479744 1663066 1187389 398785 107818 511550 942506 578478 -555865
35629 -555865 -1364479 -888309 255033 396069 -971218 -2422995 -2560734 -1697194 -796994
35620 -796994 124973 1288623 1830207 901406 -478730 -500695 711652 1270349 430512
35611 430512 -530489 -606231 -360881 -395017 -339038 -195303 -961743 -2810894 -4112904 -3498187
35601c498187J807570J522271R20295N29777l45597j424848j233043L00090J374524
35592d7148J128659O34341M64948j84959j082316m71105J581511K159537j85809
35583C997659k649118k150216J29472J022665L10616J21427P10046M05698p61239
35574A137010q80576K72062P04690k32725p36994J29222P67489n3873j057482
35565D8823p71585M0206m798m97009k90906K31424j63909j321781j787435p90047
35555e307017J095515K866887L595495K539155p558k279004k613465j326055q2221
35546a518268K91369K76579J87188l90917j388039j680332m84766J309365J961499
35537a436322Q65433p89127j365788m82538Q02891J383079J327492J441844J844427
$$ plain form
35601 -3498187 -1690617 -168346 751949 1281726 936129 -488719 -1721762 -1421672 -47148
35592 -47148 1081511 1715852 2180800 1995841 913525 442420 2023931 4183468 3997659
35583 3997659 1348541 -801675 -672203 350462 661078 782505 1492551 1898249 1137010
35574 1137010 256434 528496 1233186 1000461 263467 392689 1160178 1106305 48823
35565 48823 -722762 -682556 -687354 -1184363 -1475269 -1243845 -1407754 -2729535 -4516970 -5307017
35555 -5307017 -4211502 -1344615 2250880 4790035 4782477 2503473 -109992 -1436047 -1518268
35546 -1518268 -1226899 -950320 -763132 -1154049 -2542088 -4222420 -4707186 -3397821 -1436322
35537 -1436322 -570889 -1360016 -2725804 -3208342 -2405451 -1022372 305120 1746964 3591391
35528C591391J632578J99343j648153k387146j411379L89609J557836J314740
35520C238819M4230j164344j462848q74037k3493N64239O49639N0861j090728
35511f7662j844833j161210O45343J843283J265870k64295j086696p03786Q7693
35502a286293N68988P08308O33349L66038P7971n1458k06075n99000r08932o96876
35492a393980k27763r4130j05291M93131J536421J706087L21848j426483j800446
35483i90606o15527P09570R50597K12567o48341j015682p36838O4587R69025J312843
35473B12195P12722m19701j143596q77351P3970Q80415R31951K46696n81423p31517
35463f95639K12602J671442K346108J479872k77809j601675j855819j284255k17472
$$ plain form
35528 3591391 5223969 5423312 3775159 1388013 -23366 366243 1924079 3238819
35520 3238819 3283049 2118705 655857 -218180 -241673 322566 972205 1023066 -67662
35511 -67662 -1912495 -3073705 -2428362 -585079 680791 416496 -670200 -1373986 -1286293
35502 -1286293 -717305 -8997 624352 990390 1068361 1016903 810828 211828 -697104 -1393980
35492 -1393980 -1621743 -1715873 -1821164 -1328033 208388 1914475 2236323 809840 -990606
35483 -990606 -1606133 -896563 54034 266601 -381740 -1397422 -2134260 -2069673 -1100648 212195
35473 212195 924917 505216 -638380 -1515731 -1441761 -561346 370605 617301 35878 -695639
35463 -695639 -483037 1188405 3534513 5014385 4736576 3134901 1279082 -5173 -222645
35454b22645J036977J655552Q37004p72112j326769j61065J074818O16185r28782
35445A809163j560574p90472l8019k30265n77622j79968M79127M78938P581l2601
35435f34712M43735M98996m42000j600520j586600o8489J562728J558277r6258
35426c64843j500033j138775K80422J089442J111168J478608K228920J858244
35418E043153j65387k059875k017413o49623J77096N0675P076L42106J65319p97534
35408I5593j496391j112529j51139N63137R97726J383134J408409P38478j96458
35399B229960o72931n98164l41784K2610O12254J069073P61400k52109j041435
35390A788874q24278J64456R87634R55112J65491o64092q04059j45939O63598
$$ plain form
35454 -222645 814332 2469884 3306888 2534776 1208007 1046942 2121760 2737945 1809163
35445 1809163 248589 -541883 -579902 -810167 -1387789 -1567757 -1088630 -609692 -602111 -634712
35435 -634712 -190977 308019 -133981 -1734501 -3321101 -3389590 -1826862 -268585 -364843
35426 -364843 -1864876 -3003651 -2723229 -1633787 -522619 955989 3184909 5043153
35418 5043153 4877766 2817891 800478 150855 327951 378626 385702 727808 893127 95593
35408 95593 -1400798 -2513327 -2664466 -2101329 -1103603 279531 1687940 2426418 2229960
35399 2229960 1557029 958865 617081 639691 1251945 2321018 3082418 2830309 1788874
35390 1788874 964596 1129052 2116686 3071798 3237289 2573197 1769138 1623199 2286797
35381B286797Q58657L50943k94371o64737r25521j266609j317342o02207N38552
35372a035838J076517N72572j47219p0511N38419M78219n26564j153614k76411
35363e44430J196396J315162k12833j515255j130096O9930M32044M6028K66208
35354g6846J162544J255101R3157o72379K08891J446766J064665n74091j400941
35345B506867q44122l90294q24286r83750r5178N00251n50177k058038j700704
35336d439431N73990K366013K037048M99790n39829o95526n62346l91491p5556
35327a227338J80684J09250J9231M41966J252661J731357J455230O65089k11400
35318D416730r33122j287108j005585j20964P74837R19797J35165q97958j280017
$$ plain form
35381 2286797 3145454 3496397 3202026 2537289 1611768 345159 -972183 -1574390 -1035838
35372 -1035838 40679 613251 466032 395521 933940 1412159 885595 -268019 -544430
35363 -544430 651966 1967128 1754295 239040 -891056 -821126 -389082 -343054 -76846
35354 -76846 1085698 2340799 2433956 1761577 1970468 3417234 4481899 3907808 2506867
35345 2506867 1662745 1272451 448165 -535585 -630763 -130512 -680689 -2738727 -4439431
35336 -4439431 -3865441 -1499428 537620 1037410 497581 -197945 -760291 -1151782 -1227338
35327 -1227338 -1046654 -937404 -918173 -476207 776454 2507811 3963041 4628130 4416730
35318 4416730 3483608 2196500 1190915 1069951 1844788 2764585 2899750 2001792 721775
35309G21775q51608l07469k11237k07768L56677J242647J436294N61162n40860
35300B199613j000687j029863j217278j259363l47263J282207K175707J417575
35292B220648j23369q44601l11301M80480N68812J27783m2379L28994P00714M71578
35282C577359k69514q23341o52573m4090R1879p37278j810096j826732n46447
35273c040833O66954M77812n80829p70808L69945J313172P87059l49587n01728
35264a628843J82247J71063q70968j471884o53454O16797J058075R61407J318322
35255c17238J916024J684880N93342j97071j65445j82671r78299j840350j589902
35246a076730k91195Q01599Q29612K09619j39265L8478K24376k7159m93948o73482
$$ plain form
35309 721775 -129833 -437302 -648539 -856307 -499630 743017 2179311 2740473 2199613
35300 2199613 1198926 169063 -1048215 -2307578 -2654841 -1372634 803073 2220648
35292 2220648 2097279 1252678 941377 1421857 1990669 2118452 2076073 2405067 3105781 3577359
35282 3577359 3307845 2484504 1831931 1787841 1879720 1142442 -667654 -2494386 -3040833
35273 -3040833 -2373879 -1896067 -2476896 -3247704 -2877759 -1564587 -777528 -1127115 -1628843
35264 -1628843 -1446596 -1275533 -2146501 -3618385 -4271839 -3655042 -2596967 -1635560 -317238
35255 -317238 1598786 3283666 3877008 3679937 3514492 3331821 2353522 513172 -1076730
35246 -1076730 -1367925 -566326 263286 472905 333640 372118 596494 569335 75387 -598095
35236e98095n49473o07725j022976j226533o27810M75565J187568J167481R91561
35227h10437J225486J596567J421418N73410l76869q86227r27055p15576l09243
35218G91474K78342P36787O02108j24874p35232m89374M70103J167336Q76275
35209C572945q7846q66053j106410j128817j122325p12292L85027J615738J977283
35200B527250J150045j27365r11763r45033n06418J96880R62991J163119K27836
35191C737542j191442j401092K57080K081549J824078l53464j949622j390355
35183A614274N4215L77175l13102m33876K47141K55418r38571j674594n09295
35174a321215J369232J593737p1077j428167r09921N09271J019629L87032l19802
$$ plain form
35236 -598095 -1147568 -1755293 -2778269 -4004802 -4632612 -4157047 -2969479 -1801998 -810437
35227 -810437 415049 2011616 3433034 4006444 3629575 2743348 1816293 1100717 791474
35218 791474 1069816 1806603 2408711 2283837 1548605 1059231 1529334 2696670 3572945
35209 3572945 3485099 2619046 1512636 383819 -738506 -1450798 -1065771 549967 2527250
35200 2527250 3677295 3549930 2638167 1693134 1186716 1383596 2346587 3509706 3737542
35191 3737542 2546100 1145008 1402088 3483637 5307715 4954251 3004629 1614274
35183 1614274 1668489 2045664 1732562 1298686 1545827 1801245 862674 -811920 -1321215
35174 -1321215 48017 1641754 1570677 142510 -767411 -258140 761489 1148521 828719
35165H28719n79131p31519q02121l41534M61326P20987K76080N1281M31748M07721
35155G23557p08781j684968q49482J333606K630426J888890J95091r11255j072293
35146A544791o77334p3247K56101j71485r01508p45205M59480J316364Q14968
35137A822925k72146q00855q94911j000921m87917J129397K416722J520867q27830
35128B605331j892245p02756P47323O79556j3384L68106J527756J770591N62764
35119E653042r56954j655086j424018p18217m3436J78136P837J35989R36035J595903
35109C709231J030754m50860j336463q84657N035K30643n5981k9585M19499O70851
35099C308467M13431j02264p13206j411657j716513r04118P40113J741030J184802
$$ plain form
35165 828719 249588 -481931 -1284052 -1625586 -1164260 -443273 -167193 -115912 315836 723557
35155 723557 14776 -1670192 -2519674 -1186068 1444358 3333248 3528339 2617084 1544791
35146 1544791 867457 794210 1050311 878826 -22682 -767887 -308407 1007957 1822925
35137 1822925 1550779 749924 -144987 -1145908 -1633825 -504428 1912294 3433161 2605331
35128 2605331 713086 10330 757653 1437209 1423825 1791931 3319687 5090278 5653042
35119 5653042 4696088 3041002 1616984 898767 855331 1033467 1041304 1177293 2113328 3709231
35109 3709231 4739985 4289125 2952662 2068005 2073040 2303683 2247702 2218117 2637616 3308467
35099 3308467 3721898 3619634 2906428 1494771 -221742 -1125860 -385747 1355283 2540085
35090B540085j1529m15606o0042J7273k44483P1486Q95661R21290j77367r47134
35080B589634m92481r389o44728j290147l51324J373081J766496P37604J47870
35071C826616N52069M53056p92984j662614r70158K82402P07627N28275N06675
35062C430964L04922o54789j720577j748774o26426R01994K149358K470671J389602
35053E896945l96131j283089r23273p66162j464504j505557M1919J299115L38490
35044A237753j405926j250782L68708Q19845p9335R1772J725792K136116K19709
35035C863652j289444j39876J738176J318592q75649j945651j053055L9542J42429
35026A798716j74262l71012p11085j064234p25745K36547Q51970P36287N05173
$$ plain form
35090 2540085 2528556 2112950 2052908 2070181 1825698 1897184 2792845 3714135 3536768 2589634
35080 2589634 2097153 2087764 1443036 152889 -198435 1174646 2941142 3678746 3826616
35071 3826616 4378685 4831741 4038757 2376143 1405985 1688387 2396014 2924289 3430964
35062 3430964 3735886 3081097 1360520 -388254 -1014680 -112686 2036672 4507343 5896945
35053 5896945 5500814 4217725 3294452 2528290 1063786 -441771 -399852 899263 1237753
35044 1237753 -168173 -1418955 -1050247 -230402 -309737 -217965 1507827 3643943 3863652
35035 3863652 2574208 2434332 4172508 5491100 4615451 2669800 1616745 1656287 1798716
35026 1798716 1624454 1253442 542357 -521877 -1247622 -1011075 -159105 577182 1082355
35017A082355N03506L13748j78437l48706Q8824M79195K04500m18199o85458m51539
35007E89789j01950J09792L63537R43943J621126J449469k87001k667089l453916
34998a432300j627901J000301J793505N20403o94437m85136K39594K43668r0780
34989e33083K87656J217876J532429P08170n82037j365763j202352l41935M17437
34980A38398K60249p59368j558264j205638o1881P12592N75914J7915l01618k30850
34970b412551J16052P21641J464303J828675J215554l44871j913044k272054r90040
34961b586335J135927K721906K825429J425011o96018k289239k336843j017477
34953h17639K51586L59394j50529l8518O32014O52111j71496n05132L22583J083142
$$ plain form
35017 1082355 1585861 1899609 1721172 1372466 1461290 1940485 2144985 1726786 1041328 589789
35007 589789 487839 597631 961168 1905111 3526237 4975706 4688705 2021616 -1432300
34998 -1432300 -3060201 -2059900 -266395 254008 -440429 -925565 -685971 -442303 -533083
34989 -533083 -245427 972449 2504878 3213048 2631011 1265248 62896 -279039 138398
34980 138398 398647 -360721 -1918985 -3124623 -3186504 -2473912 -1897998 -1880083 -2181701 -2412551
34970 -2412551 -2296499 -1574858 -110555 1718120 2933674 2588803 675759 -1596295 -2586335
34961 -2586335 -1450408 1271498 4096927 5521938 4825920 2536681 199838 -817639
34953 -817639 -566053 -206659 -357188 -395706 236308 888419 716923 211791 534374 1617516
34943A617516N82993m62433q11055q21382j487043k151961j262058Q39561J997982
34934a957880J394290N88856P78257R66586J9924j123425q99072L13927P67331
34925H48794o3090r98225j057547n07150O48K31436J82684n0994j09726K53111
34915a270059N97304K48404o43818j093462m27939R28628J824882J369159j64597
34906A368502j285188p47149P15053J076840j01874q62570Q1913J050556J8268
34897A314351j790058j553764N36589J375367j52368j466766n06832J211697J414417
34888C82633N26786K31762M87530K88262l7487L61432Q27380K84935n09411j48845
34878B694977P13679L23681r90137j245671k87344n7154j064117j369712K8994
$$ plain form
34943 1617516 2200509 1738076 927021 105639 -1381404 -3533365 -4795423 -3955862 -1957880
34934 -1957880 -563590 25266 803523 1770109 1790033 666608 -232464 81463 848794
34925 848794 785704 -212521 -1270068 -1777218 -1776570 -1545134 -1362450 -1413444 -1523170 -1270059
34915 -1270059 -672755 -424351 -1068169 -2161631 -2589570 -1660942 163940 1533099 1368502
34906 1368502 83314 -663835 51218 1128058 1026184 163614 245527 1296083 1314351
34897 1314351 -475707 -2029471 -1492882 -117515 -269883 -1736649 -2243481 -1031784 382633
34888 382633 909419 1141181 1628711 1916973 1879486 2240918 3068298 3353233 2843822 2694977
34878 2694977 3408656 3732337 2742200 1496529 1209185 1152031 87914 -1281798 -1252804
34869a252804J365812R92773m9038M1627J002541J305813N72669l44733p84565
34860B850095n32332M23168J294312P40116j092524j951762l75175J871276J970228
34851E197402j40652j968010j907451o02452Q08240J817168J879119N26534j408167
34842D201731k242784j606191q10490o92331n55336J57537O51522K09612l94829
34833a081559q7991P74263J047774N49593J909l32344p36248r28266j19185J543087
34823F31033K586332J883353J70547p49922j73470P05791L58539j064706j808018
34814B539479p26847J104850J617270L48344j057451j153827n25330n65255j163455
34805D17778q82840O50857J887833J464683J53580k76876M70162J099374Q65196
$$ plain form
34869 -1252804 113008 1105781 1056743 1098370 2100911 3406724 3979393 3634660 2850095
34860 2850095 2317763 2740931 4035243 4775359 3682835 1731073 1355898 3227174 5197402
34851 5197402 5056750 3088740 1181289 578837 1387077 3204245 5083364 5609898 4201731
34842 4201731 1958947 352756 -457734 -1150065 -1705401 -1547864 -896342 -686730 -1081559
34833 -1081559 -1169550 -395287 652487 1202080 1203989 871645 135397 -792869 -912054 631033
34823 631033 3217365 5100718 5271265 4521343 4347873 5053664 5412203 4347497 2539479
34814 2539479 1812632 2917482 4534752 4883096 3825645 2671818 2146488 1581233 417778
34805 417778 -465062 185795 2073628 3538311 3691891 3415015 3885177 4984551 5849747
34796E849747M54468M05329L3467j121770j897213j029497N06308M48606j410155
34787B239290k618453j440560P63171J647693J061950N82540P51870O29223j41120
34778C475604o25022k81910J41182j2981k47415N6964N32937N68191L73705M38457
34768D419712N19342R9897n54536p43318n02966m88803p34730n03452L91377J000828
34758B903351N25461m42918p12227k21712j17699r76177j759993j144189N68529
34749a377574J673707J187337l9928o09455k81125J46532J47294o1528j18112
34740F67148J05836O40390J313387J549245Q66727l93550j333055j449499q98396
34731A068233q2517L76988l04420j968298k770795j070219J848370K732623O73287
$$ plain form
34796 5849747 6304215 6709544 6743011 5621241 3724028 2694531 3200839 3649445 2239290
34787 2239290 -379163 -1819723 -1056552 591141 1653091 2235631 2987501 3616724 3475604
34778 3475604 2850582 2568672 2709854 2696873 2449458 2506422 3039359 3607550 3981255 4419712
34768 4419712 4939054 5038951 4484415 3741097 3238131 2749328 2014598 1511146 1902523 2903351
34758 2903351 3428812 2985894 2273667 2051955 1934256 958079 -801914 -1946103 -1377574
34749 -1377574 296133 1483470 1443542 834087 552962 699494 846788 785260 667148
34740 667148 772984 1413374 2726761 4276006 5142733 4749183 3416128 1966629 1068233
34731 1068233 985716 1362704 1058284 -910014 -3680809 -4751028 -2902658 -170035 503252
34722E03252j445672j033556N61621N19349q51995q25764J008284J925339N40727
34713I01585q85360j09124J584834J672803L95361r7849M79975M77446k96025
34704D123646l4269J591065K118841n9301k805640k988492q28771O95345J73895
34695A986319p42650k89779R81634J478615Q06921k82354j231802j870410j782371
34686i45877n70502J226941K210923J432329n42973k037949j845031m59185N03438
34677a027886K89153q7865N49510J652536J724268N82591n81077j273525k049064
34668b21359k534524j280098J403072K631061P58075j804243j838992Q5349J023140
34659a778519N46724Q40345K175323K043918l26362k088730j149447N20132K29987
$$ plain form
34722 503252 -942420 -1975976 -1414355 -895006 -1747001 -2572765 -1564481 360858 901585
34713 901585 16225 -92899 1491935 3164738 3560099 3462250 3942225 4419671 4123646
34704 4123646 4089377 5680442 7799283 7739982 4934342 1945850 1117079 1812424 1986319
34695 1986319 1243669 953890 1935524 3414139 4221060 3938706 2706904 836494 -945877
34686 -945877 -1516379 -289438 1921485 3353814 2810841 772892 -1072139 -1531324 -1027886
34677 -1027886 -738733 -826598 -277088 1375448 3099716 3682307 3101230 1827705 -221359
34668 -221359 -2755883 -4035981 -2632909 -1848 756227 -1048016 -2887008 -2801659 -1778519
34659 -1778519 -1231795 -391450 1783873 3827791 3501429 1412699 263252 783384 1013371
34650A013371j166074j071695N18259J403130Q55068R9055k77484o86082o29884
34641E7664Q18750K552877K155897l66391k080831j215601N54048J042982N89749
34632D109144N72153P33523M128j159656j271519j23768J034039J298612P61096
34623E957752k66224j339645j519060l06669J160223J181635k03248j236897q96679
34614B531188o3868J06498k17611k30201J33419K95041J8124l50532l87379J2679
34604A847358N21068N40287j29338p63304m57697N15485R00223K73377k73923
34595B973536J41032P21868K20593j034062j559129q98217j35583j45551m70730
34586a86243l44577P7478J25291k71982m51052J65889J328994J924674Q98267
$$ plain form
34650 1013371 -152703 -1224398 -706139 696991 1552059 1651114 1373630 687548 57664
34641 57664 876414 3429291 5585188 5218797 3137966 1922365 2476413 3519395 4109144
34632 4109144 4681297 5414820 5418948 4259292 2987773 2864005 3898044 5196656 5957752
34623 5957752 5691528 4351883 2832823 2526154 3686377 4868012 4664764 3427867 2531188
34614 2531188 2467320 2573818 2356207 2126006 2259425 2554466 2572590 2222058 1834679 1847358
34604 1847358 2368426 2908713 2779375 2016071 1558374 2073859 2974082 3247459 2973536
34595 2973536 3114568 3836436 4057029 3022967 1463838 565621 430038 284487 -186243
34586 -186243 -530820 -453342 -328051 -600033 -1051085 -885196 443798 2368472 3266739
34577C266739j306172k570726j340523J082247J803895J47190j401313q53914
34569a172577L90364n0478j609224j604184M98676K225524J847711O13263K40490
34560A379565K91020l48720r65673r9835J657302K073788M55423j380513j700938
34551A361419r58302n67284o69620j93837J233629K427255K017330K87361r26597
34542D011354m08690Q10894P34368q45104j988140j383704k00678j75125r68324
34533d13149r65451P674O21973M48266M19277P01667K26321r39373q86440J087302
34523C08067K590325J297527j329160j897902k0866J241642K7510j806324j805091
34514a394272m32138J79061l94791o33014L53092J696346K174366J466834j2900
$$ plain form
34577 3266739 1960567 -610159 -1950682 -868435 935460 1082650 -318663 -1172577
34569 -1172577 -782213 -832691 -2441915 -4046099 -3547423 -1321899 525812 1139075 1379565
34560 1379565 1670585 1321865 356192 256357 1913659 3987447 4442870 3062357 1361419
34551 1361419 403117 -164167 -833787 -1027624 206005 2633260 4650590 4937951 4011354
34542 4011354 3602664 4413558 5147926 4302822 2314682 930978 730300 555175 -413149
34533 -413149 -1378600 -1370926 -748953 -300687 118590 820257 1046578 107205 -779235 308067
34523 308067 2898392 4195919 2866759 968857 947991 2189633 2217143 410819 -1394272
34514 -1394272 -1826410 -1647349 -2042140 -2675154 -2322062 -625716 1548650 3015484 3002584
34505C002584j450655j772554n85576Q55877P76851o82162j363671o3529J611952
34496C29117J460349j93855j097784l48313O22995N06089p3269L2591N20065K64613
34486B022598p53002j403917j118648n51940m18919n59736m82316j49481J91988
34477c223373M55714N50178K14339m34557n48618M95507J866420J872134J26544
34468A374288j602605j385876M51051J734776J166750k31421o27909M05087J663373
34459B947514J828827P40830n79622q81224M5196R26703M00233j022952j332099
34450C073406J53301J498717P79430j045306j501353k20082P74104L42556k70774
34441C583999J81832R06200N13491p65295j523842j061625J50802J278365J616398
$$ plain form
34505 3002584 1551929 -220625 -806201 49676 826527 144365 -1219306 -1282835 329117
34496 329117 1789466 1595611 497827 149514 772509 1278598 1205329 1237920 1757985 2022598
34486 2022598 1269596 -134321 -1252969 -1804909 -2223828 -2783564 -3265880 -3415361 -3223373
34477 -3223373 -2767659 -2217481 -2003142 -2437699 -2986317 -2490810 -624390 1247744 1374288
34468 1374288 -228317 -1614193 -1163142 571634 1738384 1506963 879054 1284141 2947514
34459 2947514 4776341 5517171 4937549 4056325 4101521 5028224 5428457 4405505 3073406
34450 3073406 3226707 4725424 5504854 4459548 2958195 2738113 3512217 3854773 3583999
34441 3583999 3765831 4672031 5185522 4420227 2896385 1834760 1985562 3263927 4880325
34432D880325Q51362m90776j312900j078765j71175R26176J858271J825319K78221
34423G566058j492081j277788P70606J756488J58709j683876j056209R68055J278334
34414F988296n85705k168839j912932o56553N03423J461028K053216J830797J170066
34405H682797R19647Q41383L9116j109602j206643m6784J101742J407064J062957
34396A1691677K44017p34922o49845J107413K663844J817510k76132m86682J292640
34387A6669520J913501K49620r22860L83712K233342K235652J167494R11395J307534
34378B6148910J362493J430923J976927K147897J655377K021859L857056N098753
34370D5700195M304642L446045M757814O979894P746510P729655R065373J1342309
$$ plain form
34432 4880325 5731687 5240911 3928011 2849246 2678071 3604247 5462518 7287837 7566058
34423 7566058 6073977 4796189 5566795 7323283 7481992 5798116 4741907 5709962 6988296
34414 6988296 6402591 4233752 2320820 1664267 2167690 3628718 5681934 7512731 8682797
34405 8682797 9602444 10443827 10482943 9373341 8166698 8119914 9221656 10628720 11691677
34396 11691677 11935694 11200772 10550927 11658340 14322184 16139694 15863562 15376880 16669520
34387 16669520 18583021 18832641 17909781 18293493 20526835 22762487 23929981 24841376 26148910
34378 26148910 27511403 28942326 30919253 33067150 34722527 36744386 40601442 45700195
34370 45700195 50004837 53450882 58208696 65188590 72935100 80664755 89730128 101072437
34362A01072437J2733572J3799168J6490790K0395525K3657681K6739590L1373595
34355B46262358L6446530L9039730L9109105L8587282L5790358K5851491Q154632
34348D69241486j1124224k5837564l5341151m1224807m2854166l9513959l3896454
34341B39449161k9648102k7048862k4102641k0459247j7377870j4959580j2315420
34334I3537439r861727q809972q629467p412864m888759l012359l104666m032096
34326D3785529l944918k732680j890894k376923l370141l430246k519468k060564
34318B1459695k691827l013049j618546M91710J112246p9068j431179j985141
34310A2244841k170668j959523p02509Q63771Q85499o20639j371058l05211Q15892
$$ plain form
34362 101072437 113806009 127605177 144095967 164491492 188149173 214888763 246262358
34355 246262358 282708888 321748618 360857723 399445005 435235363 461086854 469241486
34348 469241486 458117262 432279698 396938547 355713740 312859574 273345615 239449161
34341 239449161 209801059 182752197 158649556 138190309 120812439 105852859 93537439
34334 93537439 83675712 74865740 66236273 58823409 53934650 50922291 47817625 43785529
34326 43785529 39840611 37107931 35217037 32840114 29469973 26039727 23520259 21459695
34318 21459695 18767868 15754819 14136273 14627983 15740229 15661161 14229982 12244841
34310 12244841 10074173 8114650 7412141 8275912 9161411 8540772 7169714 6864503 7680395
34301G680395L72992q27840j497589j836557k108159j456114J82388J078390L99169
34292A987075j65674O71108J415704N18804o77043l12563N91341M7859j156138
34283B920473q08014P54000J233470K86159k44876L31463Q40913P11398N34057
34274F559043K99070m73570j082356n62169J30506n36325j593104q32400J092167
34265C000862J196779r21952k162907p75565J105992J087603k09950j016115j015608
34256B89139n39287N28420J509165Q70734j020513j427758O72242K428510J287998
34247D598650r52331j118364J66389k35979k450098l088773n84499K264657K306908
34238I06560J59302j329157j098963m92238o19581r32631n29620M30427J195014
$$ plain form
34301 7680395 8053387 7225547 5727958 3891401 1783242 327128 509516 1587906 1987075
34292 1987075 1821401 2492509 3908213 4427017 3749974 3437411 4028752 4076611 2920473
34283 2920473 2112459 2866459 4099929 4386088 4141212 4472675 5313588 6024986 6559043
34274 6559043 6858113 6384543 5302187 4740018 4870524 4334199 2741095 1908695 3000862
34265 3000862 4197641 3275689 1112782 337217 1443209 2530812 2320862 1304747 289139
34256 289139 -250148 278272 1787437 2658171 1637658 209900 882142 3310652 4598650
34247 4598650 3646319 2527955 2694344 2458365 8267 -3080506 -3665005 -1400348 906560
34238 906560 1065862 -263295 -1362258 -1854496 -2474077 -3406708 -3936328 -3505901 -2310887
34229b310887J532303J654082J442420O27743l24019m61817K26948N86715K5835
34220B999323n00341q5005N25299J59280p31950p97241o0315K27274j94887k81989
34210A259448L45790Q38415P67141O79238O68103Q4804q37483p96315M25549J230604
34200D665294M92129q85287j554980j453560j031834k20637P50612Q61170j57736
34191A465171r66115n05622L71477L93493j19450j20170K48875J18050l95217
34182D90492l91588K79044R01905J009039O48479p2086q66905j137848o92028
34173A68504q9278K86636P48385J336287J349198N85763o8731j62892n08622j398809
34163B246441j429341L28184K197675J840286m65192k327822k430141j419936
$$ plain form
34229 -2310887 -778584 875498 2317918 2945661 2621642 2159825 2386773 2973488 2999323
34220 2999323 2498982 2413977 2939276 3098556 2366606 1569365 1509050 1736324 1541437 1259448
34210 1259448 1605238 2443653 3210794 3890032 4558135 4642939 3805456 3009141 3434690 4665294
34200 4665294 5157423 4272136 2717156 1263596 231762 11125 761737 1622907 1465171
34191 1465171 499056 -6566 364911 758404 638954 518784 767659 885709 490492
34182 490492 98904 377948 1279853 2288892 2937371 2865285 1998380 860532 168504
34173 168504 79226 365862 1114247 2450534 3799732 4385495 4316764 4153872 3645250 2246441
34163 2246441 817100 1145284 3342959 5183245 4718053 2390231 -39910 -1459846
34155a459846j80646Q53383R89134j31829j280256q39827O60471J035035l06985
34146f61366j427175p14416R66884J792377J346807N69938K42167L73420N71044
34137C059680M29755j14070n73538m37260N1815J58290k82203o40159m34272k109
34127A215929o1190q23605j570114j179045M96360J876411J214571r03360j882574
34118a616617n23567J329137J549817O41194L50806P11336M83270l13311n11538
34109B100527p5266j94515j165030j973495j974376j371755k32501J274600J931338
34100a680473P01925j209946j558710l00788M81582O043j83858R06626K089252
34091g48347K046456J073347j6224q96101r73235L90681K109809J904401l80298
$$ plain form
34155 -1459846 -1640492 -787109 202025 70196 -1210060 -2049887 -1389416 -354381 -661366
34146 -661366 -2088541 -2802957 -1836073 -43696 1303111 1873049 2115216 2488636 3059680
34137 3059680 3489435 3375365 2801827 2364567 2416382 2574672 2292469 1652310 1218038 1215929
34127 1215929 1154739 331134 -1238980 -2418025 -1921665 -45254 1169317 265957 -1616617
34118 -1616617 -2140184 -811047 738770 1379964 1730770 2442106 2925376 2612065 2100527
34109 2100527 2025261 1830746 665716 -1307779 -3282155 -4653910 -4886411 -3611811 -1680473
34100 -1680473 -978548 -2188494 -3747204 -4047992 -3566410 -3560367 -3744225 -2837599 -748347
34091 -748347 1298109 2371456 2355232 1459131 485896 876577 2986386 4890787 4510489
34082D510489k049067j366543j8613k35548j410779j502720k64140R46958J436968
34073D7005J360281N96052p19615j348980m52119P14769L65563j064102j515037
34064b016183l81124P52024N23192n10779r26246j83016R90649J427233O88367
34055C64117l48061m16006M56143R49205M26283k02936j72604j25173p22518j256544
34045a048094r32665m35265p11415j100979l38207J226399K087495J840478J333367
34036A921114Q50478j61148j523671k046124j174427J69671P22105J45334q64044
34027a960712j163211j12501J492983J947919P39342o27828p31044j74516k61157
34018h50725p60499n92851R9822L98295M94061J151431J735458R55925o00228
$$ plain form
34082 4510489 2461422 1094879 1076266 840718 -570061 -2072781 -2336921 -1389963 47005
34073 47005 1407286 2003338 1283723 -65257 -517376 197393 562956 -501146 -2016183
34064 -2016183 -2397307 -1645283 -1122091 -1632870 -2559116 -2742132 -1751483 -324250 364117
34055 364117 16056 -399950 56193 1005398 1431681 1228745 1056141 930968 208450 -1048094
34045 -1048094 -1980759 -2416024 -3127439 -4228418 -4566625 -3340226 -1252731 587747 1921114
34036 1921114 2771592 2610444 1086773 -959351 -2133778 -1964107 -1242002 -1096668 -1960712
34027 -1960712 -3123923 -3236424 -1743441 204478 943820 315992 -415052 -589568 -850725
34018 -850725 -1611224 -2204075 -2104253 -1705958 -1211897 -60466 1674992 2630917 2030689
34009B030689r94803j24343L5373j125112j641672k70460J296597J082263j55859
34000A32673m40634K43239L74240k69342l46670N46145J016903O1568j265588
33991E2534j262409Q7472J161976Q89470j6271l30091j02193l42048j214179j681650
33981b757389j176504m52435j40211L69108J534199K228558J237382m87784q37726
33972d82802M29453J416708Q90668l25794j015549r91761m27886O49972J554930
33963A697939J099388n94716j719164j122021J12875M10169j5739K00664J367162
33954A436557K338247K009381L61870j717541l027314k764100j203786N11279
33946b055407J488073J617775J009587k57989j535871j707524m99669J009244
$$ plain form
34009 2030689 1035886 911543 946916 -178196 -1819868 -2090328 -793731 288532 132673
34000 132673 -307961 -64722 309518 40176 -306494 239651 1256554 1318122 52534
33991 52534 -1209875 -1122403 39573 929043 912772 582681 480488 138440 -1075739 -2757389
33981 -2757389 -3933893 -4386328 -4526539 -4157431 -2623232 -394674 842708 354924 -482802
33972 -482802 -53349 1363359 2254027 1928233 912684 -79077 -506963 143009 1697939
33963 1697939 2797327 2202611 483447 -638574 -525699 -115530 -131269 69395 1436557
33954 1436557 3774804 5784185 6146055 4428514 1401200 -1362900 -2566686 -2055407
33946 -2055407 -567334 1050441 2060028 1802039 266168 -1441356 -1941025 -931781
33938i31781J705856J565020J014649R6069j016470j483819p50995M50619Q95557
33929A544705L54630l47466m45004J29024Q54464R28602q1835j457225j767980
33920b88085o37104N49332L69139p52399j209347l97565O58343P95412R4417m09169
33910a227026o424R08112J324089Q39536J47553N6334M11502N63911M96181N69773
33900D083541M65891l79356j352501j135225J38824P23237j64965j088995n79397
33891G11054P55910J376508R37669J31671o22296j122949q37058L39269J335353
33882C005131J041903k23352j240920j359875p15971L06606J042133P53224l03058
33873B305821q44465l69167N2766l31274n83878J69747R67672O25670n7997L52308
$$ plain form
33938 -931781 774075 2339095 3353744 3449813 2433343 949524 198529 649148 1544705
33929 1544705 1899335 1551869 1106865 1235889 2090353 3018955 2937120 1479895 -288085
33920 -288085 -925189 -375857 -6718 -759117 -1968464 -2366029 -1707686 -912274 -817857 -1227026
33910 -1227026 -1233450 -325338 998751 1838287 1985840 2042174 2453676 3017587 3513768 4083541
33900 4083541 4549432 4170076 2817575 1682350 1821174 2544411 2379446 1290451 711054
33891 711054 1466964 2843472 3781141 3912812 3290516 2167567 1330509 1669778 3005131
33882 3005131 4047034 3823682 2582762 1222887 506916 813522 1855655 2608879 2305821
33873 2305821 1461356 1092189 1144955 813681 229803 399550 1367222 1992892 1934895 2287203
33863B287203J294358J051627l26958j103417o04864J15389K70029P6845m36142
33854B624070j426098j972423p82658J555971K857728K234031R86678K64249l47106
33845E994442j303402j921798j607764r16554n61485m31516k14963j2022J39747
33836h35315M17582O33330M71070L23074P02921R33988m7200j580981j769871
33827g51402l20326R75151J032030P90492J062374J066302J62010p18021o00142
33818B698468m758J68815Q107j32157m40005q68883q38543m16754l66057m73239
33808f65006L54894J726509J734353J96354o23025J53092K87077j532845k843290
33799a211887j306132J174936J538674N14084O83656J445393L05681j909029j906312
$$ plain form
33863 2287203 3581561 4633188 4306230 3202813 2597949 2713338 2983367 3060212 2624070
33854 2624070 1197972 -774451 -1557109 -1138 2856590 5090621 6077299 6341548 5994442
33845 5994442 4691040 2769242 1161478 244924 -316561 -748077 -963040 -975062 -835315
33836 -835315 -417733 215597 686667 1009741 1712662 2646650 2599450 1018469 -751402
33827 -751402 -1071728 -96577 935453 1725945 2788319 3854621 4016631 3298610 2698468
33818 2698468 2693710 2862525 2870632 2738475 2298470 1429587 591044 174290 -191767 -665006
33808 -665006 -310112 1416397 3150750 3347104 2724079 2877171 3164248 1631403 -1211887
33799 -1211887 -2518019 -1343083 195591 709675 1393331 2838724 3144405 1235376 -670936
33790f70936K19786Q10784j059157j842992M06517K609747J681674o91415j197937
33781B66071L3534O33866J69891q638K60258K4843n33076l96174K67920M42335
33771A160830J10940l2507j20112n96709q38401j30419N98994O497j174625r84032
33761a999544O19129J601782R70290j6299j42040J72738K29323K96489O25654
33752B357522O24120k5395n29716k17258K76385m0505j039155j723307j455034
33743a772343l62681R39733J581055J005667k02910o95178Q248R39580J136571
33734B577742P71149K74354n66276j685747j971377p82064N32737K79763q43032
33725a412751n55138J394115K451437Q88182j545917j983593k95153J069169N69259
$$ plain form
33790 -670936 -451150 359634 -699523 -2542515 -2135998 473749 2155423 1464008 266071
33781 266071 299605 933471 1103362 1094724 1354982 1379825 846749 450575 718495 1160830
33771 1160830 1271770 1239263 1119151 522442 -315959 -446378 152616 159113 -1015512 -1999544
33761 -1999544 -1380415 221367 1191657 1175358 1033318 1206056 1435379 1731868 2357522
33752 2357522 2981642 2956247 2426531 2209273 2485658 2445153 1405998 -317309 -1772343
33743 -1772343 -2135024 -1195291 385764 1391431 1188521 493343 501591 1441171 2577742
33734 2577742 3348891 3623245 3056969 1371222 -600155 -1382219 -849482 -569719 -1412751
33725 -1412751 -1967889 -573774 1877663 2765845 1219928 -763665 -1058818 10351 579610
33716E79610p55248j203858n85611J36858M38873N97545P90033O35035j25520
33707E07717q95391o99859M98267J453388J115520R0890k29863J79030J962r59854
33697A061807j004685O79768J974359N27358k426361l350571j313389R36574J235877
33688a679263P25266J093675J542903N61060j021398j223372k11972L7350j002515
33679a178266j791902j385835n97091j71666K71722R15467J091056P01943P59100
33670a385472J602749J952670P90588r14916j498037p89422N6795K96480J22015
33661B33450j11262k46496j30246K54499O01619O04685K06656n71387j452120
33652f10602j534506j64594J558041J516504m94437k052610j433822j39898m22245
$$ plain form
33716 579610 -175638 -1379496 -1965107 -1828249 -1389376 -791831 -1798 633237 507717
33707 507717 -387674 -1087533 -589266 864122 1979642 2070532 1840669 2019699 2021661 1061807
33697 1061807 57122 736890 2711249 3238607 812246 -2538325 -3851714 -2915140 -1679263
33688 -1679263 -953997 139678 1682581 2243641 1222243 -1129 -213101 -175751 -1178266
33679 -1178266 -2970168 -4356003 -4953094 -5124760 -4853038 -3937571 -2846515 -2144572 -1385472
33670 -1385472 217277 2169947 2960535 2045619 547582 -241840 -185045 111435 233450
33661 233450 122188 -124308 -254554 -55 601564 1206249 1412905 841518 -610602
33652 -610602 -2145108 -2309702 -751661 764843 270406 -1782204 -3216026 -3355924 -3778169
33643c778169j596244j163831J044741K486193J806105O18878O03254J025464
33635A046391M75419o47979j019797o10452l60251l47721P9235O76260L89972
33626c18923q30962j635872j047951L55501J439476J828165J722744J156100J51598
33617B819876q07588j180624j018635o08973K25163J577210K326551Q69265k392558
33608A809687m464976k955267P64202L059144K425965O91155k13463n33448r17102
33599c34103n79257R21508J752803J39819k301066k297324K55424K013324J099399
33590F70527n05101n06542M00738M66909p4169m2837K22137k56224q75709m30405
33580i30676M95175M18028l43486k69023M39543J69885q48210m52086J639875
$$ plain form
33643 -3778169 -5374413 -6538244 -5493503 -3007310 -1201205 -582327 20927 1046391
33635 1046391 1521810 873831 -145966 -756418 -1116669 -1464390 -1385155 -708895 -318923
33626 -318923 -1149885 -2785757 -3833708 -3478207 -2038731 -210566 1512178 2668278 2819876
33617 2819876 2012288 831664 -186971 -795944 -570781 1006429 3332980 4202245 1809687
33608 1809687 -2655289 -5610556 -4846354 -1787210 638755 1329910 1116447 582999 -334103
33599 -334103 -913360 8148 1760951 1900770 -400296 -2697620 -2442196 -428872 670527
33590 670527 165426 -341116 59622 526531 452362 409525 631662 375438 -500271 -930676
33580 -930676 -435501 -17473 -360959 -629982 -190439 -20554 -868764 -1320850 319025
33571C19025K714491J071913j289028j721840n94166J45895K95009Q17791J195058
33562B954148J36126j576792j718886j86512O66613j95740q75110J85781J548131
33553I37759J146950l45193o82276L52717P89846k63933j341221j061614q0916
33544e47881L09407J38818R1057j23169j190365k403054k068361N9138K119820
33535c614590K511540J765086J215155Q41671k20584j591990j715496j85041J381763
33526C87514J377215J15845r14152r11501k20846M17791M51591j25589n43770
33517C4098k1097R33779R98629K68394N10865K152721K748402M19874k601956
33508E443709k650586j37878Q83463j101519k803730j370733J278240J664935
$$ plain form
33571 319025 3033516 4105429 2816401 1094561 500395 646290 941299 1759090 2954148
33562 2954148 3090274 1513482 -205404 -391916 274697 78957 -796153 -610372 937759
33553 937759 2084709 1739516 1057240 1409957 2199803 1935870 594649 -466965 -547881
33544 -547881 -238474 -99656 -8599 -131768 -1322133 -3725187 -5793548 -5734410 -3614590
33535 -3614590 -1103050 662036 1877191 2718862 2498278 906288 -809208 -994249 387514
33526 387514 1764729 1880574 966422 54921 -165925 251866 703457 577868 34098
33517 34098 13001 946780 1945409 2213803 2724668 4877389 7625791 8045665 5443709
33508 5443709 2793123 2655245 3538708 2437189 -366541 -1737274 -459034 1205901
33500A205901j00303j202853o14937K14866L44811K57040J11051m48170q25751
33491a058345p4444J076538R73043k21256q04794n22546o90240j170963k25671
33482b718678J884346K329860J81741j626889q19620O72459L04088o79650J39653
33473c32690J527307N55988j867045j967605O33066K160956Q56754n08400J96896
33464A255227R51868l03626j665837o42451J246191R91957o66743n66571J282862
33455A882877J547776q83816l005056k324095k38573P09601M26395L10464N91882
33446i82545N82442M05023O83633J159875J041298L05500m20970q67150j126081
33437G81025j132260q93650p01125m46146M95987J913685K262975O83351j374096
$$ plain form
33500 1205901 1105598 -97255 -712192 -497326 -152515 104525 215576 -232594 -1058345
33491 -1058345 -1132789 -56251 916792 695536 -109258 -631804 -1322044 -2493007 -2718678
33482 -2718678 -834332 1495528 1677269 50380 -769240 -96781 207307 -472343 -332690
33473 -332690 1194617 1750605 -116440 -2084045 -1450979 709977 1566731 1058331 1255227
33464 1255227 2207095 1903469 237632 -404819 841372 1833329 1166586 600015 1882877
33455 1882877 3430653 2546837 -458219 -2782314 -3020887 -2311286 -1884891 -1574427 -982545
33446 -982545 -400103 4920 688553 1848428 2889726 3195226 2774256 1907106 781025
33437 781025 -351235 -1244885 -1946010 -2392156 -1896169 17516 2280491 2963842 1589746
33428A589746j984270j472789j518605k015418j086440J489525L154628K022327
33420A78704k95834r33851K68075R04399k82123j684679j287823M96908J444015
33411a192209M50718j142381j392565k64123M72006j63370q50681R7144J956544
33402b028917K256087L36126j420649q34862J031039J647890Q33784O35890J608079
33393D064467J657230m95716k772735k405531R3576J656707Q51228p06862j227514
33384G14850j017800j096427j221813o37236K95274O79555O83908J092192J592683
33375A085186J055864m35139j322779p40956L59540Q29073Q58428J094556J256552
33366D040325O62412n58629j705745k347367k119784n29199J927728L249256K026316
$$ plain form
33428 1589746 -394524 -1867313 -3385918 -5401336 -6487776 -4998251 -1843623 178704
33420 178704 -117130 -1050981 -782906 121493 -160630 -1845309 -3133132 -2636224 -1192209
33411 -1192209 -741491 -1883872 -3276437 -3540560 -3068554 -3231924 -4082605 -3985461 -2028917
33402 -2028917 227170 563296 -857353 -1692215 -661176 986714 1820498 2456388 4064467
33393 4064467 5721697 5225981 2453246 47715 141291 1797998 2649226 1942364 714850
33384 714850 -302950 -1399377 -2621190 -3258426 -2963152 -2283597 -1599689 -507497 1085186
33375 1085186 2141050 1705911 383132 -357824 1716 830789 1689217 2783773 4040325
33366 4040325 4702737 4144108 2438363 90996 -2028788 -2557987 -630259 2618997 4645313
33357D645313l93839j387805m50830N04636J45742p90082j242112j216965q35559
33348a021501K36824J502218J421297l07975j695538j077655M35578O91529l49410
33339a64633r61205m84706M1305j38387n36135n09232k6173O72566J145238P19925
33329b41437n32824j253392n07080N28319K25450o99607j89511J584003K191094
33320A105015Q59468k55203K64774P82842l18859j560873p72237J058517J134559
33311B298003p39611j885827q43000P80631J059601K57546l07167k84145r5847
33302B40184J62766N38912O05270m0100j002350j483567j234033o71319k48886
33293c133123l3943K13090O95373J204418J162558L26055o89960j028009o14225
$$ plain form
33357 4645313 4251474 2863669 2412839 2917475 3063217 2273135 1031023 -185942 -1021501
33348 -1021501 -784677 717541 2138838 1830863 135325 -942330 -506752 184777 -164633
33339 -164633 -1125838 -1610544 -1569239 -1707626 -2243761 -2752993 -2779166 -2106600 -961362 -241437
33329 -241437 -774261 -2027653 -2534733 -2006414 -1780964 -2480571 -2670082 -1086079 1105015
33320 1105015 1964483 1709280 1974054 2756896 2438037 877164 104927 1163444 2298003
33311 2298003 1558392 -327435 -1170435 -389804 669797 927343 620176 336031 240184
33302 240184 402950 941862 1547132 1507032 504682 -978885 -2212918 -2884237 -3133123
33293 -3133123 -3167066 -2953976 -2258603 -1054185 108373 434428 -255532 -1283541 -1897766
33284a897766m6104L87154Q30170J051633M80540o31170j003255Q3460J655119
33275I09781K212602J539888N88416n7090o61209j349155j578515r59117l905
33266F41696M02217J3023o22274q27834l94283L01836N54363m9044r66393r68532
33256a915225M10403J892499J701112j26802j582621j291129l05881l39561j019151
33247b576356n09758J295487K119365N78574j484904j354223Q49262K431032J726170
33238C074649j57445j299580j238970p68171n26720n06839l56961L16365J455375
33229h297K099560J172024q65525k027899j250415j8805l88177j871387j860800
33220e019721O70128L421223L563210J156760j387728k463025k377172j703529
$$ plain form
33284 -1897766 -1943870 -1556716 -726546 325087 805627 174457 -828798 -745338 909781
33275 909781 3122383 4662271 5250687 5193597 4532388 3183233 1604718 645601 641696
33266 641696 1043913 1056936 434662 -393172 -787455 -485619 68744 19700 -946693 -1915225
33256 -1915225 -1504822 387677 2088789 1961987 379366 -911763 -1217644 -1557205 -2576356
33247 -2576356 -3086114 -1790627 328738 907312 -577592 -1931815 -1082553 1348479 3074649
33238 3074649 2917204 1617624 378654 -389517 -916237 -1423076 -1780037 -1463672 -8297
33229 -8297 2091263 3263287 2397762 369863 -880552 -899357 -1287534 -3158921 -5019721
33220 -5019721 -4349593 -928370 2634840 3791600 2403872 -59153 -2436325 -4139854
33212d139854l99547J014055J175228j08949r34431J60999J775736J552240j97307
33203a01830r53716N9845Q03208j12689j225492q03253L34701M07738l38527l33480
33193b263495M92044P47630J13836k31074J97184M17470j88110q20903o34247
33184b169665M5798M66058M80052L21897Q9613j41954k49157k65640j81355K67269
33174a337084R34602Q60433l96394j505933r37737N36520P55902m41335r02817
33165b433843L05306J350076O82801n02273m31713M32726O51702M35047Q34515
33156A324344J317943N07396j109233j505843k06627J003055Q06002k9474l63584
33147A743979m09446q33724j332236j165721m42225L8254j00036m53187m09179
$$ plain form
33212 -4139854 -4539401 -3525346 -2350118 -2459067 -3393498 -3232499 -1456763 95477 -101830
33203 -101830 -1055546 -995701 -192493 -305182 -1530674 -2333927 -1999226 -1591488 -1930015 -2263495
33193 -2263495 -1771451 -1023821 -909985 -1141059 -943875 -526405 -714515 -1535418 -2169665
33184 -2169665 -2123867 -1657809 -1177757 -855860 -766247 -908201 -1157358 -1422998 -1604353 -1337084
33174 -1337084 -402482 457951 61557 -1444376 -2382113 -1845593 -1089691 -1531026 -2433843
33165 -2433843 -2128537 -778461 -95660 -597933 -1029646 -596920 54782 489829 1324344
33156 1324344 2642287 3149683 2040450 534607 327980 1331035 2137037 2107563 1743979
33147 1743979 1334533 500809 -831427 -1997148 -2439373 -2401119 -2501155 -2954342 -3363521
33138c363521K63953J197889J627137J105700J39368k48876K76371R35364P61379
33129B694764l49379j647472k271363j797467l69866J326661K255680J631539
33121A473097k24297j703308j254096O83506J726665L53514j866427k107777j06954
33112c026077J540961J164904J50373L19294J062891P94933j66896l39048J45475
33103A646810j69228j250158j387818r4731R49057N44856k80056j79028L71466
33094A51170Q5729r81164j543566q52510N49377J546784J398540L21218n78601
33085I6977m44605J44858q6689j076436j280460m8258J136199P43156n33311q68372
33075b216941L8125Q18730O31173P1786j59870k07713k86414m4643O63102J157400
$$ plain form
33138 -3363521 -3099568 -1901679 -274542 831158 970526 721650 998021 1933385 2694764
33129 2694764 2345385 697913 -1573450 -3370917 -3740783 -2414122 -158442 1473097
33121 1473097 1248800 -454508 -1708604 -1025098 701567 1055081 -811346 -2919123 -3026077
33112 -3026077 -1485116 -320212 -169839 149455 1212346 2007279 1840383 1501335 1646810
33103 1646810 1477582 227424 -1160394 -1255125 -306068 238788 -41268 -220296 151170
33094 151170 236899 -744265 -2287831 -3140341 -2590964 -1044180 354360 675578 96977
33085 96977 -347628 -202770 -289459 -1365895 -2646355 -2694613 -1558414 -815258 -1348569 -2216941
33075 -2216941 -2178816 -1360086 -728913 -657127 -816997 -1024710 -1311124 -1355767 -692665 464735
33065D64735Q56542L05679M30181J009187Q49376l85073j428374j031066L39415
33056A410602J159502P89340r1427p11586q86992n82201Q0562L06683n96831j664911
33046g87259r92455J360703K816860J736613j76396n02594L41845K95836p23144
33037C370009r59895r0960L32105k19371m84613J1384R5441n62804m80563R48813
33027A959546J928076Q96292j032181j795894j119749p0005P82309J248615P78854
33018C575863n91441j514213j025342j11243k10793j016381j149368k32043J038114
33009a236847K089233K486357J630181k21151j506692j247580m05183p7421L31390
33000A842287J463704J993077N39576j523719j778348n20171n2694o88741m77264
$$ plain form
33065 464735 1321277 1626956 2057137 3066324 3915700 3530627 2102253 1071187 1410602
33056 1410602 2570104 3359444 3268017 2556431 1669439 1087238 1167800 1474483 877652 -787259
33046 -787259 -1779714 -419011 2397849 4134462 3958066 3455472 3797317 4093153 3370009
33037 3370009 2410114 2319154 2651259 2431888 1947275 1958659 2054100 1491296 1010733 1959546
33027 1959546 3887622 4783914 3751733 1955839 836090 766085 1548394 2797009 3575863
33018 3575863 2984422 1470209 444867 333624 122831 -893550 -2042918 -2274961 -1236847
33009 -1236847 852386 3338743 4968924 4747773 3241081 1993501 1588318 1510897 1842287
33000 1842287 3305991 5299068 5838644 4314925 2536577 2016406 1963712 1274971 797707
32991G97707J021390J760036O61181p26586j000925q37183j000555p57768L19936
32982B37233R99905L71167n18913m79521m1187l9907R4315R90963J684206J083374
32972D381635o1292m38687l66839q24448j222315k58848J529818K199788J236147
32963F174959K8013n00400q29675j176504p98452L40618Q21983l03021j962754
32954A794767k430129j432206j5503R90520J415715J163727K55923o60602p80647
32945C01565k42449k0633m98155q55554l40928M52894L61561n44179q50485K76240
32935a960123J825619K135738Q97577n90621r36362J9979J202337J302832M0888
32926C937864j361365j405995k31087M51726k69258j237248j147353n60656o21301
$$ plain form
32991 797707 1819097 3579133 4240314 3513728 2512803 1675620 675065 -82703 237233
32982 237233 1237138 1608305 1089392 609871 568684 528777 623092 1614055 3298261 4381635
32972 4381635 4320343 3881656 3514817 2690369 1468054 1209206 2739024 4938812 6174959
32963 6174959 6202972 5702572 4872897 3696393 2897941 3238559 4060542 3757521 1794767
32954 1794767 -635362 -2067568 -2083071 -1092551 323164 1486891 1742814 1082212 301565
32945 301565 59116 38483 -459672 -1315226 -1656154 -1203260 -841699 -1385878 -2236363 -1960123
32935 -1960123 -134504 2001234 2898811 2308190 1371828 1391807 2594144 3896976 3937864
32926 3937864 2576499 1170504 939417 1391143 1121885 -115363 -1262716 -1823372 -2444673
32917b444673p93419K02537J802195K160897J164117N56839Q32435M42898j166103
32908B757723k191591j425014l68157p26109j650066j405579k62386L61975M27946
32899d481258P75311J053588M26806l00376L80628J890355K041299M26989q75769
32890A337573m77942M25945J66390r74757j496420q16118K81429P93246M72090
32881b88564p3872m3832N92822J024247Q15781N73935P14250M48565p73363j634313
32871A355656n38290J573502K043073K67128j363990q80437P22356J278348L29487
32862D786833q88577j302446q04457J12997P11405M61087l72631j015704j151110
32853E37397r67168m22136M85138Q78987r6534j460953j174399Q41966K213169
$$ plain form
32917 -2444673 -3238092 -3035555 -1233360 927537 2091654 2648493 3480928 3923826 2757723
32908 2757723 566132 -858882 -1227039 -1953148 -3603214 -5008793 -5271179 -4909204 -4481258
32899 -4481258 -3705947 -2652359 -2225553 -2525929 -2145301 -254946 1786353 2213342 1337573
32890 1337573 859631 1285576 1451966 477209 -1019211 -1835329 -1553900 -760654 -288564
32881 -288564 -362436 -406268 186554 1210801 2026582 2600517 3314767 3763332 2989969 1355656
32871 1355656 817366 2390868 4433941 4701069 3337079 2456642 3178998 4457346 4786833
32862 4786833 3898256 2595810 1791353 1904350 2615755 3076842 2704211 1688507 537397
32853 537397 -429771 -851907 -366769 512218 415684 -1045269 -2219668 -1377702 835467
32844H35467J374378l60991r56035k66123O39956J244943J342242M36556j132555
32835C157838j710677n17716Q27957N65864n88843q76620m19739n73895j167492
32826a303323p57890O81387J598423J367189Q87524O27589R1393o11186o91438
32817A889668m24813q97960j687880j065574Q60384J632423J86200j265844o95583
32808a468979N79876L21945q54810p51384N31872Q40254l09071j025757l09953
32799b446007N19268M11311L69231J399727K403755J694461m05332j966417j907334
32790G2663q35030K03499P31743P59719N37216L41893L8031p77046j702734j385900
32780b015946N63334K204371J312280j424112k873571j379873J310724K572929
$$ plain form
32844 835467 2209845 1848854 892819 626696 1266652 2511595 3853837 4290393 3157838
32835 3157838 1447161 929445 1757402 2323266 1734423 857803 438064 -135831 -1303323
32826 -1303323 -2061213 -1379826 218597 1585786 2473310 3100899 3192292 2581106 1889668
32817 1889668 1464855 566895 -1120985 -2186559 -1326175 306248 492448 -773396 -1468979
32808 -1468979 -889103 -567158 -1421968 -2173352 -1641480 -801226 -1110297 -2136054 -2446007
32799 -2446007 -1926739 -1515428 -1146197 253530 2657285 4351746 3946414 1979997 72663
32790 72663 -762367 -558868 172875 932594 1469810 1811703 1849734 1072688 -630046 -2015946
32780 -2015946 -1452612 751759 2064039 639927 -2233644 -3613517 -2302793 270136
32772B70136J920994O83239o6813j71690O9471j1874r92064k092965j488938R76150
32762i04354K653558J328299j516313k694647j639051k97178N38301J706101K578829
32753A753545J081886k185096l308786n06681K724059K433596k40657j359328
32745C92538r7738J084018J030056R40258J101148J67368j734560k352752q51221
32736c20885O22210K30436r22559r69584k11648j09824o75679o79351K28155J100631
32726a708098J117326L85799m86690r57112q65191n16418j97569L03683J087130
32717a837140J354940L80920q93097p60997N91671J093453j1787q42142J81391
32708g42788J752950J549301m89891k298045k368498r90039O40320J416533Q91201
$$ plain form
32772 270136 2191130 2874369 2807556 2635866 2705337 2693463 1701399 -391566 -1880504 -904354
32762 -904354 1749204 3077503 1561190 -1133457 -2772508 -3069686 -2531385 -825284 1753545
32753 1753545 2835431 650335 -2658451 -3165132 -441073 1992523 1751866 392538
32745 392538 294800 1378818 2408874 3349132 4450280 4617648 2883088 530336 -320885
32736 -320885 301325 531761 -390798 -1360382 -1572030 -1681854 -2357533 -3036884 -2808729 -1708098
32726 -1708098 -590772 -204973 -691663 -1648775 -2513966 -3030384 -3227953 -2924270 -1837140
32717 -1837140 -482200 -101280 -994377 -1755374 -1163703 -70250 -82037 -924179 -742788
32708 -742788 1010162 2559463 2069572 -228473 -2596971 -3587010 -2946690 -1530157 -638956
32699f38956k70062q20644m26852Q0921K49790N77571J072068Q14621k36736p47316
32689c45595l53364n30617j699045j713976O32409K798731K026554j59618m10186
32680B45293Q98013O30786j222357j193994J572304L306214J370673j720282k393482
32671A493168j107824n95386j238554j190258J19811J285681J287597O02452J46935
32662H03622L30028P99316M94419j150525k649194j758698R25045J880588l57976
32653f83375k501990j134362K046058K762653N86063q62654J84993J283920J57436
32644A838742j738946j744320L8637J208803M16943j279439j989797r98156O56953
32635c590580J317754N77725k95971k71205p3613o83235j219002k06917J548181
$$ plain form
32699 -638956 -909018 -1729662 -2156514 -2075593 -1825803 -1248232 -176164 638457 401721 -345595
32689 -345595 -698959 -1229576 -2928621 -4642597 -4010188 -1211457 815097 655479 245293
32680 245293 1143306 1774092 551735 -642259 930045 4236259 5606932 3886650 1493168
32671 1493168 385344 -210042 -1448596 -2638854 -2519043 -1233362 54235 656687 803622
32662 803622 1133650 1932966 2427385 1276860 -1372334 -3131032 -2205987 -325399 -683375
32653 -683375 -3185365 -4319727 -2273669 488984 1075047 212393 397386 1681306 1838742
32644 1838742 99796 -1644524 -1605887 -397084 19859 -1259580 -3249377 -4247533 -3590580
32635 -3590580 -2272826 -1695101 -1991072 -2262277 -2335890 -3019125 -4238127 -4445044 -2896863
32626b896863J712871J32835p14047L75617J463263P25783p16454r52792l37590
32617a207377l13218o55264j85110P47516Q10246J36112j9863K63434k28410j192215
32607a844149p66376J280767K548921J314827r20413j597126n18028M44982K49024
32598A92429l10891k48034L05448O23830L90445o1161j28948L87111P78655L3068
32588A961952j624917k437891j210162Q10538J323441O0560q86600q0964J298785
32579g85258J283886j79580j462528j550311r04062k47721L51056R80542J304605
32570a209371R17395n6878r35832r72549n9702Q86344O92222n23542j159115j62231
32560b583259J395729J773084R46363J67590l28533j270286k113880j194529J228569
$$ plain form
32626 -2896863 -1183992 -1051157 -1765204 -1389587 73676 799459 83005 -869787 -1207377
32617 -1207377 -1520595 -2175859 -2360969 -1613453 -803207 -667095 -686958 -423524 -651934 -1844149
32607 -1844149 -2610525 -1329758 1219163 2533990 1613577 16451 -501577 -56595 192429
32598 192429 -118462 -366496 -61048 562782 953227 892066 763118 1150229 1928884 1961952
32588 1961952 337035 -2100856 -3311018 -2500480 -1177039 -1116479 -2003079 -2084043 -785258
32579 -785258 498628 319048 -1143480 -2693791 -3597853 -3845574 -3494518 -2513976 -1209371
32570 -1209371 -291976 -348854 -1284686 -2257235 -2316937 -1430593 -738371 -1261913 -2421028 -2583259
32560 -2583259 -1187530 585554 1531917 1699507 1370974 100688 -2013192 -3207721 -1979152
32551a979152K375527P25356j581190j821055m39893L32680J25895J85765N18762
32542a557305O9020o96418k17245J107245J088438n86339j597801p41291K29534
32533b902162k33093r66791m65213M51670L88952j9634M66502J126459N72730
32524a580580m82879l30927O02891M23868p53699p96342P58560J738383Q33482
32515D12757m37918m83276j25812o48180j169791j61910J525646J543398l19637
32506A35277j585765o06000J177187J423142P8609q95050l63599P20873R26933
32497A011607J64709n47627n19060k9547K09815j76930q80034j083482k48021
32488b098570J031448J364390K13059j235393j487123n86113L31469Q71870J485474
$$ plain form
32551 -1979152 396375 1121731 -459459 -2280514 -2720407 -2387727 -2261832 -2076067 -1557305
32542 -1557305 -1488285 -2184703 -2401948 -1294703 -206265 -792604 -2390405 -3131696 -2902162
32533 -2902162 -3135255 -4102046 -4567259 -4115589 -3726637 -3746271 -3279769 -2153310 -1580580
32524 -1580580 -2063459 -2394386 -1791495 -1367627 -2121326 -2917668 -2159108 -420725 412757
32515 412757 -25161 -508437 -634249 -1282429 -2452220 -2614130 -1088484 454914 135277
32506 135277 -1450488 -2056488 -879301 543841 622450 -272600 -636199 84674 1011607
32497 1011607 1176316 628689 109629 80082 289897 112967 -767067 -1850549 -2098570
32488 -2098570 -1067122 297268 510327 -725066 -2212189 -2798302 -2466833 -1594963 -109489
32479a09489J930391J280984j89615p91819J43970J108892O82259m86859j169006
32470B399708j523098j954835j455843O90596K568818J677161j034750j980888
32462f13131p7230J712805Q92385j111673j606991o23493j04949m80585l59187
32453b372049Q62317K073998K159704J196503j09497j042642r51121J90633J226734
32444C234580Q60788n93078j451577q69393J44501L01083k91738p02575p30825
32435i8234r22484j277685r96385J68414J137255Q33636j55118k51262P75190
32426g86673J294478K12629j190830r90214M76073R98982k06419j251611l30053
32417a773638J577233J974985K16587j672870j567778K84461J770538J468205
$$ plain form
32479 -109489 1820902 3101886 2912271 2120452 2264422 3373314 4055573 3568714 2399708
32470 2399708 876610 -1078225 -2534068 -1843472 725346 2402507 1367757 -613131
32462 -613131 -690361 1022444 1914829 803156 -803835 -1427328 -1532277 -2012862 -2372049
32453 -2372049 -1509732 564266 2723970 3920473 3810976 2768334 1817213 2007846 3234580
32444 3234580 4095368 3502290 2050713 1181320 1325821 1626904 1335166 632591 -98234
32435 -98234 -1020718 -2298403 -3294788 -3126374 -1989119 -1155483 -1310601 -1561863 -786673
32426 -786673 507805 720434 -470396 -1460610 -984537 14445 -191974 -1443585 -1773638
32417 -1773638 -196405 1778580 1995167 322297 -1245481 -961020 809518 2277723
32409B277723J56540m02399J48800L29298r17263k367907j971766K40064K050500
32400d56410J971869Q98340L44142L26456o9603r64180j622416j590361r59700
32391b121863Q3342J122794J328764L43148q56369q73217L17462J210247N34969
32382A089277j278448k521128j893953J72868J835683J738088N68642J52638R48887
32373H12554J400058K66009j374240j470313J55198J429600N55071j819153l225353
32364c270569j979255R56970K887144K342653O60273k6287L63078M37437J98698
32355B570142R92802K359777J721158j461501l828048k570572M19637J504029
32347A707424N81223K08391P46178K01558j431826j650381Q0787R72253n66132
$$ plain form
32409 2277723 2434263 2031864 2180664 2509962 1592699 -775208 -2746974 -2506910 -456410
32400 -456410 1515459 2413799 2757941 3084397 3014794 2050614 428198 -1162163 -2121863
32391 -2121863 -2038521 -915727 413037 756185 -100184 -973401 -655939 554308 1089277
32382 1089277 -189171 -2710299 -4604252 -4431384 -2595701 -857613 -288971 -136333 812554
32373 812554 2212612 2478621 1104381 -365932 -210734 1218866 1773937 -45216 -3270569
32364 -3270569 -5249824 -4292854 -1405710 936943 1597216 1570929 1934007 2371444 2570142
32355 2570142 3562944 5922721 7643879 6182378 2354330 -216242 203395 1707424
32347 1707424 2288647 2497038 3243216 3444774 2012948 362567 443354 1415607 849475
32338H49475k185726j289005J068639K120211J315936J63820m14873n44152k91232
32329G93093J05337j70347j165558j467405l88020M10280o37536k084840j347548
32320e952544J190372K509319J355766j57483P4810J312061J586768O08230k83350
32311B243949k08944M16597Q23200P49842L70753o8057l63199l62999j07665L6599
32301C530076l36511j031951j245411o87936k92564q82800j500041n30017J468872
32292a508283J949721P7864j719403j231105L56034O86773P4211N21564J837163
32283A044539J726072k26859j538684n87998R98684R66607l93261j139335m91795
32274C57970O49275J217726Q58880j98285j264322j543281r41408j71710K18597
$$ plain form
32338 849475 -1336251 -2625256 -1556617 563594 1879530 2043350 1628477 1084325 793093
32329 793093 898430 728083 -437475 -1904880 -2292900 -1882620 -2520156 -4604996 -5952544
32320 -5952544 -4762172 -2252853 -897087 -1054570 -979760 332301 1919069 2527299 2243949
32311 2243949 2035005 2451602 3274802 4024644 4395397 4327340 3964141 3601142 3493477 3530076
32301 3530076 3193565 2161614 916203 228267 -64297 -947097 -2447138 -2977155 -1508283
32292 -1508283 441438 519302 -1200101 -2431206 -2075172 -1388399 -1314188 -792624 1044539
32283 1044539 2770611 2543752 1005068 417070 1415754 2382361 1989100 849765 357970
32274 357970 1007245 2224971 3083851 2885566 1621244 77963 -863445 -1035155 -816558
32265h16558L57971M05274J75223l01697o19911o61348o33620l34359O08918J635447
32255a84660J637762P08038P3380p0128q99835k422226k611374m99706J710230
32246b558519J572759j5563m30510N78299J032837M09773K87628J121823J193053
32237C191580k92401j499074q34607M07658J18749j265145j528167j03187J331610
32228d72984J615162J516208J798142J517858m11096k800307l019100m72895K110309
32219A381297J821943p76917k444942j453429N47644J232550N74693R602r7941
32210G94500m55024r47887o10688N25488J209758Q87732L83016K65392k0284p67029
32200A264974j111580m38596M11170L45088l95295p99043n28320R8403Q78564
$$ plain form
32265 -816558 -458587 -53313 121910 -179787 -799698 -1461046 -2094666 -2429025 -1820107 -184660
32255 -184660 1453102 2161140 2234520 2164392 1264557 -1157669 -3769043 -4268749 -2558519
32246 -2558519 -985760 -1001323 -1431833 -853534 179303 589076 876704 1998527 3191580
32237 3191580 2899179 1400105 565498 973156 1091905 -173240 -1701407 -1804594 -472984
32228 -472984 1142178 2658386 4456528 5974386 5563290 2762983 -256117 -729012 1381297
32219 1381297 3203240 2426323 -18619 -1472048 -924404 308146 882839 892441 794500
32210 794500 339476 -608411 -1219099 -693611 516147 1403879 1786895 2052287 2032003 1264974
32200 1264974 153394 -285202 125968 471056 75761 -723282 -1251602 -1153199 -274635
32191b74635J546259J455484M49659m66897l33739L36522L57286l12043o76405
32182B081491l88255j34281l28883m93012j59405M01295N91639R8636r26771j840530
32172a098076j856141r85795l05400n58693q91459K4234J842514K709932J684913
32163E66029q1455q84057l17468P37543J248760P77174l96243j541810k057453
32154a948980j784525p64736P21515J648594Q77150r17871j244146Q74177K843795
32145C04973J853580p81269j382376N02544J562379Q3895j608816j269464m3077
32136g77631J96570m2858K76349K76583p78231j166528N63209K360715J457033
32127B365211j003861j642680k24649M05004n75075q32263P00569J950276J346669
$$ plain form
32191 -274635 1271624 2727108 3176767 2709870 2376131 2712653 3069939 2757896 2081491
32182 2081491 1693236 1558955 1230072 737060 577655 978950 1570589 1669225 742454 -1098076
32172 -1098076 -2954217 -3940012 -4245412 -4804105 -5695564 -5671330 -3828816 -1118884 566029
32163 566029 484574 -399483 -716951 20592 1269352 2046526 1650283 108473 -1948980
32154 -1948980 -3733505 -4498241 -3776726 -2128132 -1250982 -2168853 -3412999 -2538822 304973
32145 304973 2158553 1377284 -5092 497452 2059831 2143726 534910 -734554 -777631
32136 -777631 -581061 -623919 -347570 -70987 -849218 -2015746 -1452537 908178 2365211
32127 2365211 1361350 -281330 -505979 -100975 -676050 -1508313 -807744 1142532 2489201
32118B489201J82732m3887Q4352k29438k88833L33673M90666m25660r99193j07648
32108A485965J027289Q18880k45010q43080r83592j160390q10306M38645J251390
32099I79791L97959r38823p87050M93389Q97112K9806n54477r3307M34033K85297
32089A143730M0663K75619N91572M44459j02791p34706j163290j040186l78293
32080i23223J43209J17024J94641R01967J310108L71671r10658n54334J190656
32071A841061J749587q5502k222462k096467n1868J399158Q55484p08536j578715
32062h98260j106611J22184J137514J343078P92022k794n11510n37795k81416
32053E6412r8963r2883q551K26425J08182o79771j304352o29123Q67225J327817
$$ plain form
32118 2489201 2671933 2628046 2712398 2482960 2194127 2527800 3018466 2592806 1593613 1485965
32108 1485965 2513254 3332134 3087124 2244044 1260452 100062 -710244 -271599 979791
32099 979791 1377750 438927 -348123 145266 1042378 1072184 517707 424400 858433 1143730
32089 1143730 1184393 1460012 2051584 2496043 2393252 1658546 495256 -544930 -923223
32080 -923223 -780014 -662990 -468349 433618 1743726 2115397 1204739 650405 1841061
32071 1841061 3590648 3505146 1282684 -813783 -865651 533507 1388991 680455 -898260
32062 -898260 -2004871 -1882687 -745173 597905 1389927 1387133 875623 337828 56412
32053 56412 -42551 -135434 -143985 82440 190622 -489149 -1793501 -2422624 -1555399 -227582
32043b27582J75899q79950l88884P30405R12586M23179M11194O16601O0114p72055
32033A061507o46981P043k46515j019631m55875J379075K068714N48292j164667
32024A530962j074079N9817M63893J9839l89971p41503j380203j726700j097611
32015d335556r7921K33929Q7038L79060J096339J413271J158395R76429J122560
32006B033544J064334L44754p87977j624794j540903n21255O03605Q32291J47522
31997E51121m79022m26696j25073j43855l11616j57556L63488R26653J102571
31988A300015M84752p53122j485541p93599N53656R72754L63693J6992K05427
31979H65027j59918j073911r28509N78911J361621K57334q23364o3290J010591
$$ plain form
32043 -227582 -51683 -931633 -1320517 -590112 322474 745653 1156847 1773448 1833562 1061507
32033 1061507 414526 421569 175054 -844577 -1300452 78623 2147337 2695629 1530962
32024 1530962 456883 516700 980593 1000432 610461 -131042 -1511245 -3237945 -4335556
32015 -4335556 -4433477 -4199548 -4112510 -3733450 -2637111 -1223840 -65445 910984 2033544
32006 2033544 3097878 3442632 2654655 1029861 -511042 -1032297 -428692 403599 551121
31997 551121 72099 -354597 -479670 -623525 -935141 -1092697 -729209 197444 1300015
31988 1300015 1784767 1031645 -453896 -1247495 -693839 278915 642608 659600 865027
31979 865027 705109 -368802 -1297311 -718400 643221 900555 77191 13901 1024492
31970A024492J1328k180068k737354j345659k30197j54688M50676K121001L060382
31961A9913K063040L50875n18210o13984n22056q0972O26629N56623p71287k176145
31951a065574k347666j514724o30449J36196J031284J628385J261511J58005p47512
31942b090544r07746m95220O5159M28338M71822M12774M77732L85276k65698j020492
31932b538599q40479L16084J080485M41378q06653j095678k0056J458825K280002
31923B75309K022999P65723r34615k025271j737182n59045J43112k62470q83693
31914c195133n09815O78224J209267K78387r83938q38261O98878J731099R91659
31905F0367m38272o80390L25254Q72751r642j292659j528785p56481p9801J62195
$$ plain form
31970 1024492 1035820 -1144248 -3881602 -5227261 -5457458 -5612146 -5161470 -3040469 19913
31961 19913 2082953 2433828 1915618 1301634 779578 698606 1325235 1881858 1110571 -1065574
31951 -1065574 -3413240 -4927964 -5558413 -5422217 -4390933 -2762548 -1501037 -1343032 -2090544
31942 -2090544 -2998290 -3493510 -3428351 -3000013 -2528191 -2115417 -1637685 -1252409 -1518107 -2538599
31932 -2538599 -3379078 -3062994 -1982509 -1541131 -2347784 -3443462 -3463518 -2004693 275309
31923 275309 2298308 3064031 2129416 104145 -1633037 -2192082 -2048970 -2311440 -3195133
31914 -3195133 -3704948 -3026724 -1817457 -1539070 -2523008 -3361269 -2662391 -931292 60367
31905 60367 -377905 -1058295 -733041 139710 130068 -1162591 -2691376 -3447857 -3527658 -3365463
31895c365463Q48433K477455L786194K793883o04368l784615l904704j100952
31887b854137J623123J778273j47911j833094j822314n32227P39294J085109O04989
31878a358895K18425O14708J293094J185188K05028p08916j112879j388446j391852
31869b444545l81257J160341J438333P9748q65163j8198J054060M62117q15729
31860c30293o22995Q45667J689825J452220J046238L83354j148013k404643j639477
31851g28117K64123O48909p60406j495802m22882Q12599R93668J002837J374963
31842A689892J045591k63020j049702p16334o94484j527009j447783M22128J972898
31833e67823J275589l13358m70821M90468O95692m4807m15441m8242L00847L53671
$$ plain form
31895 -3365463 -2517030 -39575 3746619 6540502 5936134 2151519 -1753185 -2854137
31887 -2854137 -1231014 547259 399348 -1433746 -3256060 -3788287 -3048993 -1963884 -1358895
31878 -1358895 -1140470 -525762 767332 1952520 2157548 1448632 335753 -1052693 -2444545
31869 -2444545 -2825802 -1665461 -227128 -147380 -1012543 -1030741 23319 485436 -330293
31860 -330293 -953288 -107621 1582204 3034424 4080662 4464016 3316003 911360 -728117
31851 -728117 -463994 184915 -575491 -2071293 -2494175 -1681576 -687908 314929 1689892
31842 1689892 2735483 2472463 1422761 706427 11943 -1515066 -2962849 -2540721 -567823
31833 -567823 707766 394408 -76413 414055 1109747 1064940 649499 601257 902104 1255775
31823A255775L88386L28104O9120j3629R9648k47413j012160j128426m37950k27548
31813i26093q13619o66541O91565J248731j57787j399094l50139J470320J328534
31804D25877l95879j258785p20193p9304L71103J108158J297031l2125j580669
31795h64786j516962o93938j016663j608472k22144K222684K539797O03982l52690
31786i09192P70471J286746l44117j835359j087058M47855N16602m55627p44758
31777b354437j22142O00308J138684J334126P21608l10101n02556K01243L49559
31768A056292m16458n25340P20678J664300R27167m67902r70334o33781j02695
31759A251927O08022J052486J35896j653397j974692j86615J128678J11721j265162
$$ plain form
31823 1255775 1644161 1972265 2041385 2027756 2127404 1879991 867831 -260595 -698545 -926093
31813 -926093 -1739712 -2406253 -1714688 -465957 -623744 -2022838 -2372977 -902657 425877
31804 425877 29998 -1228787 -1948980 -2028284 -1657181 -549023 748008 715883 -864786
31795 -864786 -2381748 -3075686 -4092349 -5700821 -5922965 -3700281 -1160484 -556502 -909192
31786 -909192 -138721 1148025 803908 -1031451 -2118509 -1670654 -1154052 -1609679 -2354437
31777 -2354437 -2476579 -1876271 -737587 596539 1318147 1008046 505490 706733 1056292
31768 1056292 639834 114494 835172 2499472 3426639 2958737 1988403 1354622 1251927
31759 1251927 1859949 2912435 3048331 1394934 -579758 -766373 362305 474026 -791136
31750g91136n07165J111919O48961j545155k285232m44486J642995J803155N73122
31741B06978l55706m00161j50180k58506o72868n83927N57097J765950J342467
31732A451144n24755j485000l15194J212228J124006J38215p9606J08302o15672
31723A013668j756710j806106r23999m01460j86660O00810J352230Q05216k26163
31714a529174K65598J933142K208108L33539j388934j110920J45556N46487l7151
31705A366251o23203o93860k51024M95006Q62686K36842p84352r63616k92185
31696f47455Q2679j41685j26250K36219J303q16467q04516M79716J418906O52959
31686C35409r12571j497176p43436L65957J000929J016665O49655L08859J82255
$$ plain form
31750 -791136 -1298301 -186382 462579 -1082576 -3367808 -3812294 -2169299 -366144 206978
31741 206978 -148728 -548889 -699069 -957575 -1630443 -2214370 -1657273 108677 1451144
31732 1451144 926389 -558611 -873805 338423 1462429 1600644 1521038 1629340 1013668
31723 1013668 -743042 -2549148 -3473147 -3874607 -4061267 -3460457 -2108227 -1303011 -1529174
31714 -1529174 -1263576 669566 2877674 3211213 1822279 711359 856915 1403402 1366251
31705 1366251 743048 49188 -201836 293170 1155856 1392698 608346 -355270 -647455
31696 -647455 -564776 -706461 -832711 -596492 -595189 -1411656 -2216172 -1736456 -317550 335409
31686 335409 -577162 -2074338 -2817774 -2451817 -1450888 -434223 215432 524291 706546
31677G06546j30111r42372j579602j140884K2690Q02369J036315J252476J075882
31668A103309j66411j436734r38003P28552R39859p92106j753014k50561J737578
31659h27531J765306M09702l60584k79988j97174j24669Q7597k97980j324920
31650a150241j339464L89928J779593R45884o54392p29761l2793n67428j456051
31641b814725l93307J681624J540914q14881j824772j78082J189850K75526p50248
31632b088101L47592J901177J324814m63843p32739N93351J209682L04689o04836
$$ plain form
31677 706546 576435 -365937 -1945539 -3086423 -3063733 -2261364 -1225049 27427 1103309
31668 1103309 936898 -499836 -1437839 -709287 230572 -561534 -2314548 -2565109 -827531
31659 -827531 937775 1347477 986893 706905 509731 385062 472659 174679 -1150241
31650 -1150241 -2489705 -2099777 -320184 625700 -28692 -758453 -791246 -1358674 -2814725
31641 -2814725 -3208032 -1526408 14506 -800375 -2625147 -2803229 -1613379 -1337853 -2088101
31632 -2088101 -1740509 160668 1485482 1021639 288900 882251 2091933 2396622 1791786
$$ [...]
##END NTUPLES=NMR SPECTRUM
##END=
