##TITLE=31Pdec_IVM2501-1
 CDCl3, 24 sc
 8.2.2019
##JCAMPDX= 6.0         $$ Bruker NMR JCAMP-DX V2.0
##DATA TYPE= NMR SPECTRUM
##DATA CLASS= NTUPLES
##ORIGIN= UXNMR, Bruker Analytische Messtechnik GmbH
##OWNER= root
$$ XWIN-NMR		Version 3.5
$$ Fri Feb  8 16:50:44 2019 Russian Standard Time (UT+4h)  she@DPX200
##.OBSERVE FREQUENCY= 81.013821
##.OBSERVE NUCLEUS= ^31P
##.ACQUISITION MODE= SIMULTANEOUS
##.ACQUISITION SCHEME= undefined
##.AVERAGES= 24
##.DIGITISER RES= 17
##SPECTROMETER/DATA SYSTEM= spect
##.PULSE SEQUENCE= zgpg30
##.SOLVENT NAME= CDCl3
##.SHIFT REFERENCE= (INTERNAL, CDCl3, 0, 182.463)
##AUDIT TRAIL= $$ (NUMBER, WHEN, WHO, WHERE, WHAT)
$$ ##TITLE= Audit trail, XWIN-NMR		Version 3.5
$$ ##JCAMPDX= 5.01
$$ ##ORIGIN= Bruker BioSpin GmbH
$$ ##OWNER= she
$$ F:/spectra/data/she/nmr/P31/1/pdata/1/auditp.txt
$$ ##AUDIT TRAIL=  $$ (NUMBER, WHEN, WHO, WHERE, WHAT)
(   1,<2019-02-08 16:49:48.85 +0400>,<she>,<DPX200>,
      <created by zg, POWCHK disabled, PULCHK disabled
       configuration hash MD5:
       00 E9 B6 7A A2 85 ED C7 34 08 36 98 17 FE 4E 26
       data hash MD5: 32K
       CE 1E 15 B4 1E F1 56 03 43 62 DF C6 3C 4C A2 20>)
(   2,<2019-02-08 16:49:52.68 +0400>,<she>,<DPX200>,
      <Start of raw data processing
       efp BC_mod = 2 LB = 1 FT_mod = 6 PKNL = 1 PHC0 = -1454.54 PHC1 = 81.19894 SI = 64K 
       data hash MD5: 64K
       14 71 59 C5 CE D1 24 90 A1 FB 21 65 F1 8B CC F5>)
(   3,<2019-02-08 16:50:08.54 +0400>,<she>,<DPX200>,
      <pk PHC0 = -1.879501 PHC1 = 0 
       data hash MD5: 64K
       6D 38 9C 82 D7 09 E9 4F 27 53 92 B1 5B 4F 94 E5>)
(   4,<2019-02-08 16:50:11.28 +0400>,<she>,<DPX200>,
      <abs ABSG = 5 
       data hash MD5: 64K
       B2 08 B5 3C CA 8A 3E FB EC 39 1C 07 47 45 FB 33>)
$$ ##END=
$$ 
$$ hash MD5
$$ B9 8F DF 0F 7A 8A CC 12 7E ED 28 4B A7 0F 04 3A
##$RELAX= 
##$RELAX= 
##$RELAX= 
##$RELAX= 
##$RELAX= 
##$RELAX= 
##$RELAX= 
##$RELAX= 
$$ Bruker specific parameters
$$ --------------------------
##$DU= <F:/spectra>
##$EXPNO= 1
##$NAME= <P31>
##$PROCNO= 1
##$TYPE= <nmr>
##$USER= <she>
##$AMP= (0..31)
100 100 100 100 100 100 100 100 100 100 100 100 100 100 100 100 100 100 
100 100 100 100 100 100 100 100 100 100 100 100 100 100 
##$AQSEQ= 0
##$AQ_mod= 1
##$AUNM= <au_zg>
##$AUTOPOS= <>
##$BF1= 81.014009
##$BF2= 200.13
##$BF3= 200.13
##$BF4= 200.13
##$BF5= 200.13
##$BF6= 200.13
##$BF7= 200.13
##$BF8= 200.13
##$BYTORDA= 1
##$CFDGTYP= 0
##$CFRGTYP= 5
##$CHEMSTR= <none>
##$CNST= (0..31)
1 1 145 1 1 1 1 1 1 1 1 1 1 1 1 1 1 1 1 1 1 1 1 1 1 1 1 1 1 1 1 1 
##$CPDPRG= <waltz16>
##$CPDPRG1= <>
##$CPDPRG2= <waltz16>
##$CPDPRG3= <>
##$CPDPRG4= <mlev>
##$CPDPRG5= <mlev>
##$CPDPRG6= <mlev>
##$CPDPRG7= <mlev>
##$CPDPRG8= <mlev>
##$CPDPRGB= <>
##$CPDPRGT= <>
##$D= (0..31)
0 1 0 0 0 0 0 0 0 0 0 0.03 2e-05 3e-06 0 0 0 0 0 0 0 0 0 0 0 0 0 0 0 0 
0 0 
##$DATE= 1549630188
##$DBL= (0..7)
120 120 120 11 120 120 24 19 
##$DBP= (0..7)
150 150 150 150 150 150 150 150 
##$DBP07= 0
##$DBPNAM0= <>
##$DBPNAM1= <>
##$DBPNAM2= <>
$$ [...]
##$SUBNAM3= <"">
##$SUBNAM4= <"">
##$SUBNAM5= <"">
##$SUBNAM6= <"">
##$SUBNAM7= <"">
##$SUBNAM8= <"">
##$SUBNAM9= <"">
##$SW= 369.568048894756
##$SWIBOX= (0..15)
0 1 3 0 0 0 0 0 0 0 0 0 0 0 0 0 
##$SW_h= 29940.119760479
##$TD= 32768
##$TD0= 1
##$TE= 0
##$TE2= 300
##$TE3= 300
##$TEG= 300
##$TL= (0..7)
0 120 53 12 22 120 120 120 
##$TP= (0..7)
150 150 150 150 150 150 150 150 
##$TP07= 0
##$TPNAME0= <>
##$TPNAME1= <>
##$TPNAME2= <>
##$TPNAME3= <>
##$TPNAME4= <>
##$TPNAME5= <>
##$TPNAME6= <>
##$TPNAME7= <>
##$TPOAL= (0..7)
0.5 0.5 0.5 0.5 0.5 0.5 0.5 0.5 
##$TPOFFS= (0..7)
0 0 0 0 0 0 0 0 
##$TUNHIN= 0
##$TUNHOUT= 0
##$TUNXOUT= 0
##$USERA1= <user>
##$USERA2= <user>
##$USERA3= <user>
##$USERA4= <user>
##$USERA5= <user>
##$V9= 5
##$VALIST= <valist>
##$VCLIST= <CCCCCCCCCCCCCCC>
##$VD= 0
##$VDLIST= <DDDDDDDDDDDDDDD>
##$VPLIST= <PPPPPPPPPPPPPPP>
##$VTLIST= <TTTTTTTTTTTTTTT>
##$WBST= 1024
##$WBSW= 4
##$XGAIN= (0..3)
0 0 0 0 
##$XL= 0
##$YL= 0
##$YMAX_a= 26288
##$YMIN_a= -29374
##$ZGOPTNS= <>
##$ZL1= 120
##$ZL2= 120
##$ZL3= 120
##$ZL4= 120
##$ABSF1= 182.463
##$ABSF2= -187.1042
##$ABSG= 5
##$ABSL= 3
##$ALPHA= 0
##$AQORDER= 0
##$ASSFAC= 0
##$ASSFACI= 0
##$ASSFACX= 0
##$ASSWID= 0
##$AUNMP= <proc_1d>
##$AZFE= 0.1
##$AZFW= 0.5
##$BCFW= 0
##$BC_mod= 2
##$BYTORDP= 0
##$COROFFS= 0
##$CY= -3
##$DATMOD= 1
##$DC= 0
##$DFILT= <>
##$DTYPP= 0
##$F1P= 0
##$F2P= 0
##$FCOR= 1
##$FTSIZE= 65536
##$FT_mod= 6
##$GAMMA= 0
##$GB= 0
##$INTBC= 1
##$INTSCL= 5.30512e-09
##$ISEN= 30
##$LB= 1
##$LEV0= 0
##$LPBIN= 0
##$MAXI= 10000
##$MC2= 0
##$MEAN= 0
##$ME_mod= 0
##$MI= 50
##$NCOEF= 0
##$NC_proc= -4
##$NLEV= 6
##$NOISF1= 182.463
##$NOISF2= 159.3651
##$NSP= 0
##$NTH_PI= 0
##$NZP= 0
##$OFFSET= 182.463
##$PC= 4
##$PHC0= -1456.42
##$PHC1= 81.19894
##$PH_mod= 1
##$PKNL= yes
##$PPARMOD= 0
##$PSCAL= 0
##$PSIGN= 0
##$REVERSE= no
##$SF= 81.0140089999434
##$SI= 65536
##$SIGF1= 159.3651
##$SIGF2= -187.1042
##$SINO= 113.3802
##$SIOLD= 16384
##$SREGLST= <1H.CDCl3>
##$SSB= 0
##$STSI= 65536
##$STSR= 0
##$SW_p= 29940.119760479
##$SYMM= 0
##$S_DEV= 0
##$TDeff= 32768
##$TDoff= 0
##$TI= <>
##$TILT= no
##$TM1= 0
##$TM2= 0
##$TOPLEV= 0
##$USERP1= <user>
##$USERP2= <user>
##$USERP3= <user>
##$USERP4= <user>
##$USERP5= <user>
##$WDW= 1
##$XDIM= 65536
##$YMAX_p= 330858561
##$YMIN_p= -12975403
$$ End of Bruker specific parameters
$$ ---------------------------------
##NTUPLES= NMR SPECTRUM
##VAR_NAME=  FREQUENCY,     SPECTRUM/REAL,   SPECTRUM/IMAG
##SYMBOL=    X,             R,               I
##VAR_TYPE=  INDEPENDENT,   DEPENDENT,       DEPENDENT
##VAR_FORM=  AFFN,          ASDF,            ASDF
##VAR_DIM=   65536,         65536,           65536
##UNITS=     HZ,            ARBITRARY UNITS, ARBITRARY UNITS
##FACTOR=    0.456856943014862, 1,           1
##FIRST=     14782.0589164792, 0,            0
##LAST=      -15158.0608439998, 0,           0
##MIN=       -15158.0608439998, -12975403,   0
##MAX=       14782.0589164792, 330858561,    0
$$ Real data points
##PAGE= N=1
##DATA TABLE= (X++(R..R)), XYDATA
$$ [...]
41396g47794j39279J676P5602R7655Q6158J00469J70004J95542P9430r4438j71457
41385c46432j45012j01851m6629M4186J10447J37714K51648M63258M95534J58391
41375A021254k53318k91295L396J63880j9169k54043k38741n3917N2433J2356
41365A42836o8931j00896p8898m9238l4796L6890K44958M58121L93536K8552k78752
41354F93382k86501k12619k86196k69397J12232N09089L22432l33513o69254l02928
41344g23273K60723M08582J70075o2762j38079j42112q8552O1425K16897K37520
41334B00444J29137K6756K5890P1928n991k73510m66683k19340L45308N93315
41324D27254K45548j35596Q82K70874j4284o19826o98484j97132O5162j95912
$$ y = [-747794, -887073, -885397, -809795, -712140, -625982, -525513, -355509, -159967, -80537, -174975, -346432, -491444, -593295, -639924, -595738, -485291, -347577, -95929, 367329, 862863, 1021254, 767936, 476641, 480037, 643917, 624748, 370705, 131964, 78047, 130480, 142836, 73905, -26991, -105889, -155127, -189923, -153033, 91925, 550046, 943582, 972134, 693382, 406881, 194262, -91934, -361331, -249099, 259990, 582422, 248909, -420345, -723273, -462550, -53968, 116107, 53345, -84734, -226846, -315398, -253973, -37076, 200444, 329581, 356337, 382227, 454155, 448164, 174654, -292029, -511369, -166061, 427254, 672802, 537206, 538088, 808962, 794678, 174852, -523632, -720764, -655602, -851514]
41314h51514l04509J01301M11996J63354j43343O627K16865j1045k70595N2067
41304f28796O30652O88782K45295n3019n8272j54346l31314j56786L29235N31320
41294A042751K24059j42154j97201j04108j10535j74869j87685j44613k1928J51782
41284C35499J37028j85408m20308j07290N05029P04125L13714j47525l25204l97622
41274D12038m70980k72761K77233P25725O37301J15290m40225p38050o22247j10300
41264d86976M27647N30976K47834O9335J46939P0927l70643p38426n80794r7058
41254g80239K12753K31647J96197K35521K73374K25538O0122j92623l67067l04979
41244b09756j33056j08884j57251L7806M08047M73584J16850j53776R90K17138
$$ y = [-851514, -1156023, -1054722, -642726, -479372, -622715, -616088, -399223, -410268, -680863, -628796, 1856, 690638, 935933, 882914, 824642, 670296, 338982, 182196, 511431, 1042751, 1266810, 1124656, 927455, 823347, 712812, 537943, 350258, 205645, 183717, 335499, 472527, 287119, -133189, -240479, 264550, 968675, 1282389, 1134864, 809660, 412038, -58942, -331703, -54470, 671255, 1308556, 1423846, 983621, 245571, -376676, -486976, -59329, 471647, 719481, 788816, 935755, 1006682, 636039, -102387, -683181, -780239, -567486, -335839, -139642, 95879, 369253, 594791, 654913, 462290, 95223, -209756, -342812, -451696, -608947, -571141, -163094, 310490, 427340, 273564, 274554, 491692]
41234D91692O5761k58481l41548k23313j63985q8631J96615M97434M74535K07319
41224H57398K9231k9026j61284l14115k78423j32910j26790k13514j53232O171
41214e16494P939j16156q4327J30281K74872K80784L11235L40669J40424k48014
41204E21213m45002k56059P6373K46092K14149R6630J27K4243J76067K65616J30678
41193A050127p4118r2074R771k7930j78140j84795m7626r42l4348O1162J55373
41182F36460j29168o66482p82899k24494L90442M32243P7449j29623p8439N348
41172d69163O9998J40479K7345l27413m70856P489P14515Q66310L91480j2059
41162I38125M5151J65064n1296l55346l55042j91336k38106m23633l53280J5556
$$ y = [491692, 557453, 298972, -42576, -265889, -429874, -518505, -321890, 175544, 650079, 857398, 886629, 857603, 696319, 382204, 103781, -29129, -155919, -369433, -522665, -516494, -508555, -624711, -709038, -578757, -303885, -23101, 288134, 628803, 769227, 521213, 76211, -179848, -103475, 142617, 356766, 453396, 453523, 477766, 653833, 919449, 1050127, 976009, 883935, 893706, 865776, 687636, 502841, 455215, 454273, 419925, 481087, 636460, 507292, -159190, -942089, -1166583, -776141, -343898, -266449, -396072, -474511, -469163, -399165, -258686, -231341, -558754, -1029610, -1022121, -307606, 558704, 950184, 938125, 983276, 1148340, 1097044, 741698, 386656, 195320, -42786, -466419, -819699, -804143]
41152h04143K87023K25340M5066J721J9900p8949k04153j02664K44041N45250
41142A78432N31093K18126j64442l89707l55183j24939Q5878P7779r8454j66444
41132b07861K4424K74078K93509J01734k9627J5950Q3865O9772R7694K39801K78857
41121A242196j3914m77355o93757n08954j90468k7710M293O5133J22368K7783
41111d50385j42290q0396L11874O49018M44277k45244p70332o11178q627L30289
41101e72994J13825k06629q4671L88823O47963M21551J9591j75660j85671k30252
41091A35876k94280j85080Q4937K67343K30374J00281K3210J1564O2785J84903
41081F21913K43797O6088k03434j80847J34383K02580k47894o32447k77916M62724
$$ y = [-804143, -517120, -291780, -246714, -244993, -225093, -304042, -508195, -610859, -366818, 178432, 709525, 927651, 763209, 373502, 18319, -106620, -20742, 57037, -41417, -207861, -183437, 90641, 384150, 485884, 456257, 472207, 556072, 625844, 723538, 963339, 1242196, 1228282, 750927, 57170, -451784, -642252, -669962, -665669, -600536, -478168, -450385, -592675, -673071, -361197, 287821, 732098, 486854, -283478, -894656, -903283, -572994, -459169, -665798, -750469, -361646, 286317, 707868, 727459, 551799, 366128, 135876, -158404, -343484, -258547, 8796, 239170, 339451, 362661, 374225, 437010, 621913, 865710, 931798, 728364, 547517, 681900, 884480, 636586, 4139, -273777, 188947]
41071A88947N67999j82828q28724n48345K82918P52673N97957K18772r5821l46287
41061F07261m37477k25802Q2214R5720j59153k54113m1220J20256l5515k56185
41051e04014j88521Q3456K13279J22033M9845J39728K45453K10725J33250J88189
41041F93423K76515Q5478m12931p44643m78099J20628L42935j6565l75155k05487
41031g13901K31331L32475K9860k16947j43748M8963J16490P2913L0256K4920
41021a87388N6153J00037Q9062K5543K4952R5749N5371j33937j95739Q725J48081
41010H6609p1526l60090k97709n6038n9558j67917N7244M11098K48717l32810
41000e41980m51514J64776O39123K54194m77454o38668j88202K26621K84909J82364
$$ y = [188947, 756946, 574118, -254606, -802951, -520033, 232640, 830597, 1049369, 953548, 607261, 169784, -56018, 26196, 121916, -37237, -291350, -332570, -212314, -247829, -504014, -692535, -609079, -395800, -273767, -223922, -84194, 161259, 371984, 505234, 693423, 969938, 1055416, 642485, -102158, -580257, -459629, -116694, -133259, -508414, -713901, -482570, -150095, -120235, -337182, -480930, -431967, -315477, -242564, -212308, -187388, -131235, -31198, 57864, 83407, 108359, 204108, 259479, 125542, -70197, -61472, 86609, 15083, -345007, -642716, -698754, -758312, -926229, -868985, -457887, -209170, -541980, -993494, -828718, -189595, 64599, -412855, -1051523, -1239725, -1013104, -728195, -545831]
40990e45831J04733O9170J03084J76061J49599N8827J24792K65812Q1988l79523
40980B08712m61036N2905L93594l1432n84883l63969L16590M42693l5437k04672
40970b66935K30929N23785K04827k15194k14429l4763m2917p3794Q2130J59537
40960C53176p8276l15831j96803M5557L64j95872r2017L10690N42488L63447N3843
40949G90766l5259Q1170J30300l3720k51066k59103n8502L1480j86078m15871
40939b05883k20680L02019N49565K05113l26237m39089m2920M20074N01045J44030
40929H87037l19956m89403k89264m6099n6107j82804j04398J57407K80290J47663
40919a5634m8833j81879k78797k56490K513K85832K25437r4704j82691J07829
$$ y = [-545831, -441098, -371928, -268844, -92783, 56816, 115643, 240435, 506247, 588235, 208712, -252324, -199419, 194175, 162743, -422140, -786109, -469519, -26826, -62263, -266935, -36006, 487779, 692606, 477412, 262983, 228220, 185303, 111509, 193639, 353176, 274900, -40931, -237734, -192177, -191813, -387685, -479702, -169012, 373476, 736923, 790766, 755507, 836677, 966977, 933257, 682191, 423088, 364586, 396066, 209988, -205883, -426563, -124544, 425021, 630134, 303897, -135192, -178112, 241962, 743007, 887037, 567081, 77678, -211586, -257685, -313792, -496596, -600994, -443587, -163297, -15634, -64467, -246346, -525143, -781633, -779120, -493288, -267851, -362555, -545246, -437417]
40909d37417L72285L45846K57957K81721J90085j24294l16327j65543m987j34513
40899B64813k51745J9189M01716L40201j41011m92786m13252j06700J16829J21090
40889a41656m9957j38623J46597O23793O34146o0537p43545o35216J0820L39193
40879a4985J50894k4011L3101l6556l29664l94946l8636K83001K15743N2522J30405
40868B6868K12335m0213l81939l22906Q2508L23224K15174R8766K08549K79291
40858G01657j7523n17116p19921m27429L1721K65108K86097L29155L52925Q1322
40848C65996m30446o69337l31710J99551L69895K02254J38993L01080L59732J11540
40838F17548k40001m23027l74950j47151J48755K80626J05176j51532j56140Q707
$$ y = [-437417, -65132, 280714, 538671, 820392, 1010477, 886183, 569856, 404313, 399326, 264813, 13068, 32257, 433973, 774174, 633163, 140377, -272875, -379575, -262746, -141656, -191613, -330236, -183639, 440154, 1074300, 1013763, 270218, -364998, -354178, -14985, 135909, 111898, 144999, 108443, -221221, -616167, -654803, -371802, -156059, -103537, 26868, 239203, 198990, -182949, -505855, -423347, -100123, 115051, 213817, 422366, 701657, 684134, 167018, -552903, -980332, -948611, -683503, -397406, -68251, 284674, 365996, -64450, -733787, -1065497, -865946, -496051, -293797, -154804, 146276, 506008, 617548, 377547, -45480, -420430, -567581, -418826, -138200, -33024, -184556, -340696, -331989]
40828c31989j3620j93892j10915K80622M28836J3785m81452m26963P8757M26116
40818c30715L53067J48735J13352K04439K13908L3524k52471l86105j42415L28107
40808B83426N24358J79751l31016m36831j01508J96672J58452J098M2502K24941
40798G41845K15672j37283n82530o96024l12270K80258O13370N07327J86670n3833
40788G63202j34836j11927k8117L4431l9362j76427j01692K46402M87295K66403
40778A205372k08567m39307l39709k66400l60964l11892P9349M87098M85186J14984
40768D45150k57844m52853n22925m37211j01272L15322M43871K18484O505P3532
40758b69241J98278O6187j88931j88661O0133J37642j53752m82676m45751n4145
$$ y = [-331989, -345609, -539501, -650416, -369794, 59042, 72827, -408625, -835588, -756831, -330715, 22352, 171087, 284439, 488878, 702786, 736310, 483839, 97734, -44681, 283426, 807784, 987535, 656519, 219688, 118180, 314852, 473304, 474402, 516904, 741845, 957517, 820234, 237704, -458320, -770590, -490332, 123038, 630365, 817035, 763202, 628366, 516439, 488322, 522753, 483391, 306964, 205272, 451674, 938969, 1205372, 996805, 557498, 217789, -48611, -409575, -721467, -642118, -155020, 330166, 445150, 187306, -265547, -788472, -1225683, -1326955, -1011633, -567762, -349278, -342773, -269241, -70963, -4776, -193707, -382368, -322235, -184593, -338345, -821021, -1266772, -1320917]
40748a320917L80560O00167M90388P6592l73119m80987k23542l0655j69544k96736
40738a347793J7484N46185O57055K12968k51584k68537O4408L69527L98271J05493
40728E03477l21540m65025q3684M42174M82220J9088l31651k50587j09704k34763
40718c49995l53009j36801K05653L25272K97299L19472K28395j46369m64888l12889
40708c87860O7736J08160j66493k00770J35698L30545R6651j56912k692L29508
40698A53571L19477r0117m60166m48610j65088N2810N1383j9200K1436Q8015k1635
40687e18124k01144q3839L35107N08725J08077l69267k57757K69317M64309J36695
40677C92099j71614j44378q8630k01537j59059K12726M74128K47651j27713j33494
$$ y = [-1320917, -940357, -340190, 150198, 226790, -146329, -627316, -850858, -881513, -1051057, -1347793, -1330309, -784124, -127069, 85899, -165685, -434222, -369814, -287, 397984, 503477, 181937, -283088, -366772, 75402, 557622, 576710, 245059, -5528, -115232, -349995, -703004, -839805, -634152, -308880, -11581, 307891, 536286, 389917, -74971, -387860, -320124, -211964, -378457, -579227, -443529, -112984, -16333, -173245, -175937, 153571, 473048, 382931, -77235, -525845, -690933, -638123, -586740, -605940, -584504, -496489, -518124, -719268, -803107, -468000, 40725, 148802, -220465, -478222, -208905, 255404, 392099, 220485, 76107, -12523, -214060, -373119, -160393, 313735, 561386, 433673, 300179]
40667C00179J12232J24096j30430k48481r7628L2769k3890p5721L9419J79481
40657B12026J35389p2688k29559j50322J30459L33095J95807j60015l06951p6040
40647A1201J97247J85785M6034P5950J67996K5094k63203l40301j82695q4642
40637a61534p9849Q4883L47874K79642j76256m51864j66325K70063K73725n7061
40627A63298j93470l5361K5590j79544l42929k14402L5075J39286J07920R5053
40617c99484J35331J86578K51066K91718J89152m9495j83908l5265K20844K62999
40607H69536N3254j59954k26684k36317k55305j87272j238J31313R7885N8984
40597A44202J86342L30096K13503j14669l17517k61068j69113k18276k76392j91531
$$ y = [300179, 412411, 536507, 406077, 157596, 59968, 92737, 68847, -6874, 32545, 212026, 347415, 274727, 45168, -105154, 25305, 358400, 554207, 394192, 87241, 11201, 208448, 394233, 440267, 516217, 684213, 709307, 446104, 105803, -76892, -161534, -241383, -156500, 191374, 471016, 294760, -157104, -323429, -53366, 220359, 163298, -30172, -65533, -39943, -219487, -562416, -776818, -741743, -602457, -494537, -399484, -264153, -77575, 173491, 465209, 654361, 604866, 420958, 385693, 606537, 869536, 922790, 762836, 536152, 299835, 44530, -142742, -143980, -12667, 85218, 144202, 330544, 660640, 874143, 759474, 441957, 180889, 11776, -206500, -482892, -674423]
40587f74423o8274l6497K6533K61958M81487L78541J0621k50781k36891j39878
40577b47604j28347j14848J199J32655J81516K00606K49781K72605K17183J00846
40567H65592j02053m00350n68682l29429J31137K44910j04931k94475J02686N48841
40557I3246L18113l13692m43816M4716L40661O4691j57494J49998M43336Q3930
40547F23689n19562n04596R5484M41178J75089j87254j94541n7198r7416j91078
40537d16205q0014J56273K59585J79604N9549M539K8482R2506R8693k0102j67959
40526A94951j95564j23044n7339M8118K70248M12676J99166k17476l52192q2128
40516I7416J67282P6276j38243j57517m9183n0126j65041k49312k44834j17362
$$ y = [-674423, -742697, -779194, -752661, -490703, -9216, 369325, 379946, 129165, -107726, -247604, -375951, -490799, -489600, -356945, -175429, 25177, 274958, 547563, 764746, 865592, 763539, 363189, -205493, -534922, -403785, -158875, -263806, -558281, -455595, 93246, 411359, 97667, -346149, -301433, 39228, 103919, -53575, 96423, 539759, 623689, 104127, -400469, -304985, 136193, 311282, 124028, -70513, -127711, -225127, -416205, -496219, -339946, -80361, 99243, 158792, 163331, 191813, 284319, 383012, 362910, 194951, -613, -123657, -180996, -132878, 137370, 550046, 749212, 531736, 179544, 97416, 264698, 340974, 202731, 45214, -3969, -54095, -219136, -468448, -713282, -830644]
40506h30644J79209M82725M70768J42816p1124P7242K79173J79643r6016k41374
40496E72418k33376j53380P0657L45280K49402l10827o80827k92205M15151N78691
40486E60984J51240j89102j68355j24381j53934N9084M45767M33152j00223m90413
40476D23819k67242J68988K42601J1016j53113k00712k54872k01490R0902L96893
40466B56790L87817Q1390k56350m58825m69463k49674P4863K11466P2734q0479
40456d29731m9833L3015L2085N5868J49786J05109j38692k57357l6309K34847
40446c01212K19607O2268O3135J30197N825j97805j63198Q7371K47982K18282
40436C72452J43698P0414o6675j95106j82704q6971m0531r307N9831K9553j70066
$$ y = [-830644, -651435, -168710, 302058, 444874, 373750, 450992, 730165, 909808, 813792, 572418, 339042, 185662, 256319, 601599, 851001, 540174, -140653, -432858, -17707, 560984, 712224, 523122, 354767, 230386, 76452, 135536, 581303, 1014455, 914232, 423819, 156577, 325565, 568166, 579182, 426069, 225357, -29515, -231005, -140103, 256790, 644607, 725997, 469647, 10822, -458641, -708315, -633452, -421986, -349252, -429731, -479564, -446549, -414464, -358596, -208810, -103701, -242393, -499750, -536059, -301212, -81605, -19337, 43798, 173995, 179820, -17985, -181183, -93812, 154170, 372452, 516150, 586564, 519889, 324783, 142079, 55108, 14577, 5270, 65101, 94654, -75412]
40425g5412k72562m7556K21023N4224n09585r13069p50577j28276N61865R30068
40415i29857P71478K74779o3183N083J87076J66271R2498J88968K34491m0738
40405H86866l53450k70642L1832P1047r1969k7790J89016Q3705k96017l89815
40395a67217r5876R2282O315M308J10925j14162n81131n13466K69468Q38778N13352
40384C63576j17996k24581J0732k079r7210K05044N88717L52140l23314n49732
40374B05297j08101L01603K28169K990m2941q2459k49197k84905n8452J21264
40364C3268L6929o5929M4824J62129K5417k14278k52718r6441K9358L0799m1782
40353c08424j36975j49178O6472M10234M88575J05888l80720m81132k01306N6062
$$ y = [-75412, -347974, -395530, -174507, -120283, -629868, -1542937, -2293514, -2421790, -1859925, -929857, -158379, 116400, 53217, 58300, 245376, 411647, 504145, 693113, 927604, 886866, 533416, 262774, 294606, 365653, 273684, 245894, 434910, 518615, 222598, -167217, -263093, -170811, -164496, -160188, -49263, -163425, -744556, -1258022, -988554, -149776, 363576, 245580, 20999, 31731, 29652, -67558, 137486, 726203, 1078343, 755029, 205297, 97196, 398799, 626968, 629958, 587017, 504558, 255361, -29544, -87996, 33268, 70197, 4268, 49092, 211221, 236638, 22360, -230358, -326799, -297441, -266642, -308424, -445399, -594577, -528105, -117871, 370704, 476592, 95872, -385260, -586566, -530504]
40343e30504J21112K22362M92146O58814M25714n7541l56005l06526j65546j71038
40333C32988k03313m7112J89869K03117j4952j32919j1537M9023j95413m67116
40323b97365l32217J22064L64178J54357j68570k26117r0814l8032n6315R3556
40313d75275M04194N01890J15840m86604p23164l62448J94987M02453J95846n6584
40303b88865j26209j25317j25329K8299L31636M20717Q3919k97463k20172K11381
40293a07403M53019L04546P7380L0085R9687K06067L53267L64881M022n19546
40283A266005o58645l30891r8383k79835m27857j07158L15776K49156j30949j62317
40273c65098K15369L83244N8235k96558k36061P0710K54796K79698K65537J68258
$$ y = [-530504, -409392, -187030, 305116, 963930, 1389644, 1332103, 976098, 669572, 504026, 332988, 129675, 82563, 272432, 475549, 460597, 327678, 316141, 365164, 169751, -297365, -629582, -507518, -143340, 11017, -157553, -383670, -474484, -512516, -568831, -475275, -71081, 430809, 546649, 60045, -663119, -1025567, -830580, -428127, -232281, -288865, -415074, -540391, -665720, -637421, -305785, 114932, 198851, -98612, -318784, -107403, 345616, 650162, 727542, 757627, 857314, 1063381, 1416648, 1781529, 1785551, 1266005, 607360, 276469, 178086, -101749, -529606, -636764, -320988, -71832, -202781, -365098, -149729, 233515, 291750, -4808, -240869, -170159, 84637, 364335, 629872, 798130]
40263G98130m1489j65554n0901J34380J42675l5264k87867n63234p16055m79941
40253a265120J02172N06025L60100R311K0662L38006M36020J84399j4566N4828
40243G31837J39545N8426j8289j3699j49568m35712m35257Q0830O22214N56419
40233A136746m9755n69693o16308l25130J7995K51007K93922J48717n6475j99688
40223C1338k69755k32532j730K99165L30242K4007k31069j76166p7683j64076
40213d68259j08494L64442P59199M48103k35809m09209k8046Q4858l26871n00850
40203d20936L2939O20088N09153m0208l22336k69692k73391l46958j82670J93079
40193e00932M29579L77472J47019j72323m41253l74564L5525K69373m1635m40150
$$ y = [798130, 756641, 591087, 540186, 674566, 817241, 781977, 494110, -69124, -785179, -1265120, -1162948, -656923, -296823, -287512, -266850, 71156, 507176, 691575, 677009, 731837, 871382, 929808, 911519, 897820, 748252, 312540, -122717, -41887, 580327, 1136746, 1086991, 517298, -99010, -424140, -406145, -155138, 138784, 287501, 231026, 31338, -238417, -470949, -472679, -173514, 156728, 180735, -50334, -226500, -304183, -468259, -576753, -212311, 546888, 994991, 759182, 349973, 321927, 406785, 79914, -420936, -387997, 232091, 741244, 701036, 378700, 109008, -164383, -511341, -694011, -500932, -71353, 306119, 453138, 280815, -160438, -535002, -499477, -230104, -271739, -711889]
40183g11889k26135M65027P98941M02160k19483m71752l42263j52105p6958q9441
40173f23898q9210J8976J83483J68439j17576l57229j88566K58724N20016M11818
40163A84977J57000k9227j29460j57217j32238j65127k72170k27483Q4303L51340
40153c35302K53778r410o7124j9601j72961l39084r3044L73604M20885N119k21949
40142b05089J2788K10126K0684j88781m1422K48680L82856M72218N86397L83459
40132A881916k96840r41815r84193n36317o9817K33197L68349J93117k48670m71024
40122h72097j67321K48210K61904O2904J12778K68785Q1729k73785k02464K46484
40112b32873L61208p6059m04312j27455L36541L48056l4179k88748k39039j56245
$$ y = [-711889, -938024, -472997, 325944, 728104, 508621, 36869, -305394, -457499, -534457, -623898, -713108, -694132, -510649, -342210, -459786, -817015, -1005581, -746857, -226841, 184977, 341977, 312750, 183290, 26073, -106165, -271292, -543462, -770945, -686642, -335302, -81524, -90934, -158058, -177659, -350620, -689704, -782748, -409144, 11741, 16860, -205089, -192301, 17825, 38509, -150272, -191694, 56986, 439842, 912060, 1498457, 1881916, 1585076, 643261, -340932, -877249, -947066, -713869, -345520, -152403, -401073, -872097, -1039418, -791208, -529304, -466400, -353622, -84837, -3108, -276893, -479357, -232873, 128335, 52276, -352036, -479491, -142950, 205106, 170927, -117821, -356860, -513105]
40102e13105k27060l19759k51583k6009K10100L09933K48792J75291K70246M94545
40092C71391N83649L72709J3484k40122l55107m70431n82154m85212j00291L05657
40082e86427M01659K31994J49683K75028K80826j04495o02545o94741l12849J10498
40072h51369K41481J57997O0048K2106R0122K79367L98523K22604r1066j55631
40062C74182K867m6562l35636l02278K58487O51856K46922m89296o09393m7810
40052b96661L64298J41284k95168l55540n336L92198N17885K54434k43855n53056
40042g9517l66580P1166K19111n7743l54935l03884M7841M42727O63533N55669
40032H37388J38205k65545l18531j06981K2439K0542J28280L22050K61691r2222
$$ y = [-513105, -740165, -1059924, -1311507, -1337516, -1127416, -817483, -568691, -393400, -123154, 371391, 955040, 1327749, 1341233, 1101111, 746004, 275573, -306581, -791793, -892084, -586427, -184768, 47226, 196909, 471937, 752763, 648268, 45723, -649018, -961867, -851369, -609888, -451891, -391843, -369737, -279615, -248, 398275, 620879, 529813, 374182, 377049, 330487, -5149, -307427, -48940, 602916, 849838, 360542, -248851, -296661, 67637, 208921, -86247, -441787, -447123, -54925, 462960, 717394, 473539, -79517, -446097, -374931, -155820, -213563, -568498, -872382, -824541, -381814, 281719, 837388, 975593, 710048, 391517, 284536, 306975, 327517, 455797, 777847, 1039538, 947316]
40022I47316l00129j10158J27947J8645k65488k91029l7339J26861K2067j43260
40012I5433j45732l5719K4920L0859J03879K44794K52099j6212l59713m00292
40002b05684p9033K23428K01730M2228R1550K98298L13151N8987j39920j8335
39992G86400K97989M63312K58565k06156n25449l68786N6358J59745k07214m36621
39982B78143n0505M69562L25030l78184p59962m37814O1379K17700J30913M1208
39972a02530r2093k52103j83207J26253K66304K3658k62420k57326j11180p4921
39962i19565n8735Q2437J92360R1604r0014j52954j13431k1176J76126L77756
39952d35592L26049P8248M5348L06038L73021k5328m38390l89991j05083n0783
$$ y = [947316, 647187, 537029, 664976, 683621, 418133, 127104, 89765, 216626, 238693, 95433, -50299, -86018, -61098, -30239, 73640, 318434, 570533, 554321, 194608, -205684, -284717, -61289, 140441, 182669, 274219, 572517, 885668, 944655, 804735, 786400, 1084389, 1547701, 1806266, 1600110, 1074661, 705875, 762233, 921978, 714764, 278143, 227638, 697200, 1022230, 644046, -115916, -553730, -492351, -274651, -143738, -102530, -194623, -446726, -629933, -503680, -237376, -213718, -476138, -733464, -844644, -919565, -978300, -895863, -703503, -611899, -701913, -854867, -968298, -989474, -813348, -435592, -109543, -31295, 14053, 320091, 693112, 667784, 229394, -160597, -265680, -316463]
39942c16463j79279j68887n7240o8748j02978N3593K53172K41203J36932J56906
39932e1789J35860j36759l86435k58403M990n5959k75706j11389L96584O43508
39922i5498M06690P4840q0945j81343k31777l1877K80386K51522j34850l38261
39912h1113j09910J24555n117k49814k34101m4826L2060m393P668O3500P1280
39901d30211M6055K4008j2397q199J21865K62023K08972N6090Q9207K48730J51726
39890G57869k32954m28805j77010J60004J82352q240j44309k30722l14172k28509
39880f64496N7923K15293N3952j08851K0157J90892Q4273n7060J66684N49765
39870E08532N35594Q3803l04044l46812k17065n9338J61517L12479J45057k14417
$$ y = [-316463, -495742, -664629, -721869, -790617, -893595, -840002, -586830, -345627, -208695, -51789, 84071, -52688, -439123, -697526, -692536, -748495, -1024201, -1135590, -739006, -95498, 311192, 386032, 305087, 123744, -108033, -139910, 140476, 391998, 257148, -81113, -191023, -66468, -71585, -321399, -555500, -600326, -568266, -572659, -564991, -501491, -430211, -384156, -360148, -372545, -380744, -258879, 3144, 212116, 268206, 357413, 606143, 757869, 524915, 96110, -80900, 79104, 261456, 253216, 108907, -121815, -435987, -664496, -606573, -391280, -337328, -446179, -426022, -235130, -150857, -207917, -41233, 508532, 1044126, 1127929, 823885, 477073, 260008, 200670, 362187, 674666, 819723, 605306]
39860F05306l29526j20318K1490q6525j37368N4728J80721N22j73946J6653L41258
39849C72995L25349N39j94833j37381j27656k81376l06239k7139K63306K09035
39839I6600j14884l38040k56637K5942K84300L30945J12819j90740k72583m9047
39829c71325K10196K55819K00426K56317K96827M2558l66783m23168N437L81657
39819D87961K11367k59245m16974j57942L8601j16996l11558j52299K17010L18602
39809a41473K8271k51337j49342J89181L48758K24457R4828J33714J60089J0427
39799F47573j34358o9714J7864j54701m03137k88373J30512K91808m891k71923
39789b39340j14682J78525J93317P2226J62663L44818K53735p0818k90320l41377
$$ y = [605306, 275780, 155462, 176952, 90427, -46941, 7787, 188508, 189030, 15084, 31737, 372995, 698344, 698883, 504050, 366669, 239013, -42363, -348602, -375741, -112435, 96600, -18284, -356324, -612961, -587019, -302719, 28226, 141045, -49695, -322278, -371325, -161129, 94690, 295116, 551433, 848260, 890818, 524035, 100867, 106304, 487961, 699328, 440083, 23109, -134833, -96232, -213228, -524786, -677085, -460075, -141473, -113202, -364539, -513881, -324700, 24058, 248515, 343343, 477057, 637146, 647573, 513215, 443501, 461365, 306664, -96473, -384846, -254334, 37474, 32583, -239340, -354022, -175497, 17820, 90046, 252709, 597527, 851262, 780444, 490124, 148747]
39779A48747l80644l20628J2568L63595K88718j14907l13820j87241j47295l18468
39769i69375k61187K34577O75620N59819R1456j93258j69358r7370j08841j04382
39759c42299l0719M5765P7037N6502j8557r3293p0542M8345J57465J95422J49586
39748A74712l5394l25180m54681k32506R7990J88411J73689M12791P01766M28767
39738A130365l68521q32717m78159J25840K76028R7415N2128P0069j52179m09831
39728d89562k79951R9856K31593Q1585O2190K77060L95342K64237R2721p907j70704
39717E56460l97166m68568l15749j26274l6500k3047q5869k13490k04230J15417
39707a199016N11897N57839K32596n9510r4639o9101j61066k29895j09473Q8059
$$ y = [148747, -231897, -552525, -539957, -176362, 112356, -2551, -316371, -503612, -650907, -969375, -1230562, -995985, -320365, 239454, 330910, 137652, -31706, -129076, -237917, -342299, -373018, -327253, -250216, -193714, -212271, -305564, -376106, -327761, -170296, 25126, 174712, 139318, -185862, -640543, -873049, -775059, -586648, -412959, -168, 701598, 1130365, 761844, -70873, -549032, -423192, -147164, -49749, 2379, 72448, -79731, -489562, -769513, -669657, -438064, -356479, -294289, -17229, 378113, 642350, 735071, 727164, 556460, 159294, -309274, -625023, -751297, -787797, -810844, -896713, -1110203, -1314433, -1199016, -687119, -129280, 103316, 43806, -50833, -119934, -281000, -510895, -620368, -532309]
39697e32309J42878K0286j39711k03618j38053q750Q6331J29062J75267K03144
39687b65473J12760n3780j02649j1305L606j02810o1769J94621K64554r1197m08954
39676e22396j32926M86832O80287K08783m08646o37526l94289J40058O48464O84615
39666G53256R5358n76572o26634j09061K89041K47378R8717J12391J34917N9671
39656D78462M7560J01956k5883l14927l73837o3625K56699K90676J49525j2047
39646E34559k11824l41083j76567J31096J23770k11209l23227L1123L89259L43837
39636B89734J12036M313q6365k59627k34328J30682M29216K88965p6100l11844
39626B86682m46025n34187l16415K48770O14064L88793r050m1346R0390n9287
$$ y = [-532309, -389431, -369145, -508856, -712474, -850527, -859277, -772946, -643884, -468617, -265473, -152713, -206493, -309142, -320447, -316841, -419651, -481420, -286799, -22245, -113442, -522396, -655322, -168490, 511797, 720580, 311934, -325592, -719881, -579823, 68641, 753256, 848614, 272042, -354592, -463653, -174612, 72766, 171483, 283874, 418791, 478462, 526022, 627978, 602095, 287168, -86669, -150294, 106405, 397081, 546606, 534559, 322735, -18348, -194915, -63819, 59951, -151258, -474485, -443362, -54103, 289734, 401770, 406083, 319718, 60091, -174237, -43555, 385661, 674626, 598526, 286682, -159343, -693530, -1009945, -761175, -147111, 241682, 232632, 191286, 281676, 222389]
39616B22389l03279k25065n0726k37770m89166j29254O77507J034789O38255R6051
39606A233731j40043k75959m43890l48945L3732J82674j35005l98187j52627K49769
39596a94750K28584j29827k69196J0715L82744N01412L26713K3311k05030k33080
39586D41596j23033n6669r5784j21981l5577J38027L29473M25160K42035k26599
39576I16648n82433l83509K35968O44642M73229k1672l96144m72659k94518m188
39566A15364J25284r9610m34975m19945o8931Q1220k02812m32348j10126N20082
39556i26797Q18084N77058J34975j60339k40309j67712r288J47392K21728J73028
39546E67820l2736l61670n98905n15548j99302L5335J15838K65911N09808N29871
$$ y = [222389, -80890, -305955, -356681, -594451, -1083617, -1212871, -535364, 499425, 1137680, 1233731, 1093688, 817729, 373839, 24894, 58626, 241300, 106295, -291892, -444519, -194750, 33834, -95993, -365189, -354474, 28270, 529682, 856395, 879706, 674676, 441596, 318563, 261894, 166110, 44129, 8552, 146579, 476052, 901212, 1143247, 916648, 334215, -49294, 186674, 831316, 1304545, 1282873, 886729, 414070, 119552, 115364, 240648, 141038, -293937, -713882, -782813, -701593, -904405, -1336753, -1446879, -926797, -108713, 468345, 603320, 442981, 202672, 34960, 25672, 173064, 394792, 567820, 535084, 173414, -425491, -941039, -1140341, -1105006, -989168, -723257, -213449, 316422]
39536C16422K08170r9519j02738k630n5581j00969N5411J38499j80953o01618
39526d25506n12770P6326M90637L25893n3806j01359K02450M22826K39854k11007
39516D53538m79718k62362K15181L86973M5075l52372l03394L8373J56693j3020
39506a15033n2814J92710L59391J68816j51979k51906j11575Q0392K09111J91821
39496E18934p0698m74890o69236m52745m1262K53176M10475N52273O03106L98892
39486A028025L2929k01017j98730j38669j66233j99798j21234R170M9277M639
39476I8359L2729K04053L47330K25132j35810l99757k93036N7010K82050K21209
39466F39269M3040o6285j27212k11194k52214j55992J3460R7696M8131k7498L441
$$ y = [316422, 524592, 425073, 322335, 319705, 264124, 163155, 218566, 357065, 176112, -425506, -938276, -861950, -371313, -45420, -99226, -200585, 1865, 424691, 664545, 453538, -26180, -288542, -73361, 313612, 358687, 6315, -297079, -258706, -102013, -115033, -167847, 24863, 384254, 553070, 401091, 149185, 37610, 118002, 327113, 518934, 448236, -26654, -695890, -1148635, -1189897, -936721, -526246, 26027, 629133, 1028025, 1060954, 859937, 661207, 522538, 356305, 156507, 35273, 44443, 93720, 98359, 131088, 335141, 682471, 907603, 771793, 372036, 79000, 136010, 418060, 639269, 682309, 616024, 488812, 277618, 25404, -130588, -117128, -19432, 28699, 1201, 4642]
39455D642J61945L11187K52203m0560k97584k30955N0347J14641k19420o09691
39445e03245o42505l45961l7336J57831L42836N04608M55359J48312j91490l17603
39435d29194j90341N6214K25839J61827q6155k25856n3926K15729K08033n3003
39425a70833j65519K3777J90164Q3413o6665K3346J77284N8858k22917k49123
39415c18215M0384K44748J13632j12876j00156J36409L35225L22329J03804j99083
39405E66201l85780l04844n6933P2885k8464j72624j76350r6897l7563O7499K80327
39394b72543M43916L73372J51423M734l5313j16172k54752k84310j27405P3244
39384d3806J40825M9087r5323j48639k9731J69189K33485J15657O1780K44557
$$ y = [4642, 166587, 477774, 729977, 689417, 391833, 160878, 211225, 325866, 106446, -503245, -1145750, -1491711, -1529047, -1371216, -1028380, -523772, -68413, 79899, -111591, -429194, -619535, -563321, -337482, -175655, -261810, -487666, -541592, -325863, -117830, -170833, -336352, -312575, -122411, -38998, -105663, -82317, 94967, 153825, -69092, -318215, -277831, -33083, 80549, -32327, -132483, 3926, 339151, 661480, 765284, 566201, 180421, -124423, -181356, -108471, -136935, -309559, -485909, -582806, -620369, -552870, -272543, 171373, 544745, 696168, 700902, 665589, 549417, 294665, 10355, -117050, -43806, 97019, 146106, 50783, -97856, -127587, 41602, 275087, 390744, 452524, 697081]
39374F97081L98676J51347l35506m78207j19806J82264k2982l74091k46109K55770
39364A08437M09952m8218n23066m11244R0150L51409J84071m9840n5401P5414
39354A31664J52348J30849q230k97922n68829m97294p5368K41541J33407q1905
39344g39739Q2002M83929N11866J6037m26019l27973O7767K31214O7194j26890
39334a60612j68070j13128m1114o188p5014j66451k6532L75287O32209M06167
39324F56554m8384k40974j41952q4365j26324l9010J39479J18787m2782N1087
39314B42116L90778M28033o1939n41559m81428r0059J24486R9063P2298N6313
39304B38102n0532r1774J03782L09690K25815M2185J57797M55661M19083m8641
$$ y = [697081, 1095757, 1247104, 911598, 433391, 313585, 495849, 472867, 98776, -147333, 108437, 518389, 470171, -52895, -464139, -373989, -22580, 161491, 111651, 56250, 131664, 284012, 414861, 406631, 108709, -460120, -957414, -1032782, -791241, -657834, -739739, -657737, -173808, 338058, 354095, -71924, -399897, -332130, -100916, -33722, -160612, -328682, -441810, -482924, -489112, -564126, -730577, -757109, -381822, 250387, 656554, 608170, 367196, 225244, 140879, 14555, -24455, 115024, 233811, 191029, 242116, 632894, 1060927, 998988, 457429, -23999, -114058, 10428, 109491, 181789, 238102, 187570, 95796, 199578, 509268, 735083, 777268, 935065, 1390726, 1809809, 1761168]
39294A761168m73583n47982m88888n05989m10409l5470L32445K97160p5277l30529
39284d77354j90311J58373L05057M8750l74765m93205j16369L90369N15820K30102
39274c533m3320n4368M298p6324j76681j18038J0235M1489M3664J75538L65359
39263A68319L88582J98373l3410j65289k05380k16041k38547k75129k40490p796
39253f26808L78599O34602N35402K01247q0375k30643l66590m71816l54173J0486
39243c70069L26859L14271N9963r9766J2289K33639K69736J7784l15096m09758
39233C9852j82168Q8288O2985k26863l88433j63114K27399L70325K01369M8950
39223G8590J36400K62305J14126k35520l59808j9950M86385O23863K10041l87324
$$ y = [1761168, 1287585, 739603, 250715, -255274, -665683, -701153, -368708, -71548, -146825, -477354, -667665, -509292, -204235, -155485, -530250, -1023455, -1139824, -749455, -233635, -3533, -46853, -101221, -96923, -173247, -349928, -467966, -457731, -416242, -372578, -197040, 168319, 556901, 755274, 721864, 556575, 351195, 135154, -103393, -378522, -619012, -626808, -248209, 386393, 921795, 1123042, 1042667, 812024, 445434, -26382, -380555, -370069, -43210, 271061, 331024, 231258, 243547, 477186, 746922, 764706, 449610, 39852, -142316, -54028, 8957, -217906, -606339, -769453, -542054, -171729, 29640, 78590, 214990, 477295, 591421, 355901, -3907, -23857, 462528, 1086391, 1296432, 909108]
39213I09108o42410l90609P2015L47636L09319J11088o4398j57210j66043q6276
39203B42220K5263L7584r8236k50051k68450j89605j49907j48359n7314J32386
39193g24469K49759J82290L9435L813J19122K84971L66181K59709k6460k87543
39183D66808k43875J26658M65724L90952n3547m32823m19171j46462n199j43192
39173E873k88746j31736K19511L55270J49657l5837J01028L14489J90032j72247
39163G07294k96812r9505p031k16329l53652j27109J38535N698l62917m27574
39153a039402k6598M69698O47570L97981q9462m15929k33018L06278N61882J84649
39143G63649l58620m17760o0731J49019O4715L4986J53610R8353j90925k97066
$$ y = [909108, 266698, -123911, -51896, 295740, 605059, 716147, 651749, 494539, 328496, 242220, 267483, 305067, 206831, -43220, -311670, -501275, -651182, -799541, -856855, -724469, -474710, -292420, -252985, -249172, -130050, 154921, 521102, 780811, 754351, 466808, 222933, 349591, 815315, 1206267, 1152720, 719897, 300726, 154264, 149065, 5873, -282873, -414609, -195098, 160172, 309829, 273992, 375020, 689509, 879541, 707294, 410482, 310977, 303946, 87617, -266035, -393144, -254609, -248911, -611828, -1039402, -1066000, -596302, 51268, 449249, 359787, -56142, -289160, 17118, 579000, 763649, 405029, -12731, -73462, 75557, 140272, 175258, 328868, 427221, 236296, -60770]
39133f0770j2173K76809J71114j78309l73405k99894r4297J28616K64709J85778
39123H178n2732j78663o6188P2159J6373j49984k13437j17336N5556K03122K26019
39112a96933J26164R6842K58293L49737P0294l08748k10789K94279M47565m7503
39102H79201n00839k89506J85207J91004j87498l13330p4713P1412k6647m8668
39092a14377J01639J23852n4947q9958J63867L52440J73809j70375l12671k00685
39082b7406k2239J04950J63935J31892J2040j26938k29990k93063l07958k64012
39072h58789j74239q889K92004O09487O23235K24884k14409k79965o8698K3338
39062A67959q0607j39146j00772j29126j52850Q4473M60099M94256J02333j90122
$$ y = [-60770, -72943, 203866, 374980, 196671, -176734, -476628, -570925, -442309, -177600, 8178, -44554, -223217, -289405, -217246, -200873, -350857, -564294, -681630, -626074, -422952, -196933, -70769, 26073, 284366, 634103, 704397, 395649, 184860, 479139, 926704, 879201, 378362, 88856, 274063, 465067, 277569, -35761, -110474, -39062, -65709, -114377, -12738, 111114, 56167, -33791, 130076, 482516, 656325, 485950, 173279, -27406, -49645, 55305, 219240, 351132, 363172, 236234, 6244, -286819, -594777, -858789, -1033028, -1041917, -749913, -140426, 482809, 707693, 493284, 213319, 144621, 167959, 87352, -51794, -152566, -281692, -434542, -350069, 110030, 604286, 706619, 516497]
39052E16497m1240J80307K1747l12021l07332L6310K32353M7525k33346k85924
39042a45124j14642J28396L79924N75576N40517J73456l22318n48760l04877J69228
39032E31376L87058Q1241n27280r35677q23821l13233J87038L56391K21378P4012
39022g61517J17125K29307J74592j9056j06661m8712q1893k65581l06137n6165
39012a124698J57366L8766j53844k1541K97725L77585K41425K66168M43350L73965
39002H96267J9824j89043j17550j51438m41185n48550j83191K67004L51115K16416
38992A19669K00877J95884n6770l59896l20263j8154J15236j5302r3108L4405
38982a97422J45171N3100j13003j20201R3814L83112M93000K60423j53907l61546
$$ y = [516497, 475257, 655564, 677311, 365290, 57958, 94268, 326621, 374146, 140800, -145124, -259766, -131370, 248554, 824130, 1364647, 1538103, 1215785, 667025, 362148, 531376, 918434, 999675, 472395, -463282, -1287103, -1600336, -1413298, -1056907, -835529, -761517, -644392, -415085, -240493, -259549, -366210, -414922, -496815, -762396, -1068533, -1124698, -967332, -928566, -1082410, -1103951, -806226, -428641, -187216, 78952, 522302, 896267, 916091, 727048, 609498, 458060, 16875, -531675, -714866, -447862, -96747, 119669, 320546, 516430, 459660, 99764, -220499, -238653, -123417, -138719, -231827, -197422, -52251, 849, -112154, -232355, -138541, 244571, 737571, 997994, 844087, 482541]
38972D82541k19888l0362q7426k58240k58942j19473n3391m5297Q0930K97909
38962b11639M06640L51394K25100O3144j08427j57096m5858J5478r6871j53924
38952B87941K1827J44514r2720l96522k54547K06283L65367P5759j59350m8779
38942A49773Q7754k9749j75089p3727J57862L12678M02862L99852J01364m24910
38932I08670o75732l66151R1524J48478j36019l08561k20450p8678J7254J46931
38922d72734K66390K25849O0857m6029n9903q4952j24994j12000r5441j38022
38912e80979j14044R5714K97447K09185o0408j27229P1680J88160M8605o5719
38902c7588R1777L08872K60335L3894k1860J45374K23226K9192k15975k23452
$$ y = [482541, 262653, 232291, 144865, -113375, -372317, -491790, -545181, -590478, -509548, -211639, 195001, 546395, 771495, 834639, 726212, 569116, 523258, 538736, 441865, 287941, 309768, 454282, 361562, -34960, -289507, -83224, 282143, 357902, 198552, 149773, 237527, 207778, 32689, -41038, 116824, 429502, 832364, 1232216, 1333580, 908670, 232938, -133213, -41689, 106789, -29230, -337791, -558241, -636919, -619665, -472734, -206344, 19505, 80362, 34333, -25570, -110522, -235516, -347516, -442957, -580979, -695023, -599309, -301862, -92677, -153085, -280314, -208634, -20474, 28131, -37588, 54189, 363061, 623396, 657290, 635430, 780804, 1004030, 1033222, 817247, 593795]
38892E93795n0832n511k06045m13474l39557j4861K45522K20378L7983J1947K58809
38881C38154N40964N23898J71078j91779k68518j79033k85594o14811o95024j63584
38871h24249O35155R59503N40114j49841n13659m24751j29184J29011K12166P7666
38861E11931j20493j10229J24978K50193O1000j72294j23609M6720n0789l70315
38851D7093m60975j52134K06461K73420J26940J5147j472L893m336n8330j88739
38840a93032k71031q8482L17943N84256M66059J44103o9240j16907j12583r0462
38830E70624o2366j26493k71200k53006N3423L52140K88910k0987j78609j06626
38820B45810o6731j22978m5807J84650K33883m5077l06138j95408J50414L50751
$$ y = [593795, 542963, 537452, 331407, -82067, -421624, -436485, -190963, 29415, 67398, 79345, 338154, 879118, 1403016, 1574094, 1382315, 1113797, 934764, 649170, 34359, -660665, -824249, -189094, 770409, 1310523, 1160682, 647023, 222272, 93088, 222099, 434265, 511931, 391438, 281209, 406187, 656380, 717380, 545086, 421477, 468197, 417408, 47093, -413882, -566016, -359555, -86135, 40805, 55952, 54480, 58373, 54037, -4293, -193032, -464063, -552545, -234602, 349654, 815713, 959816, 890576, 773669, 661086, 570624, 508258, 381765, 110565, -142441, -89018, 263122, 552032, 531045, 352436, 245810, 179079, 56101, 10294, 194944, 428827, 383750, 77612, -117796, 32618, 383369]
38810C83369K95610J57757P5635O7464J13713J16814o9949l84593n07993k76383
38800b8556N6153J86066J56245J22854J2159k16155k40415J82198O40904N34557
38790A406010J7201j86930O4736J15862l41566o69115k89882L46173M36973K1160
38780I20622k05912k003K18854K01572J74267K79833K80985L0871k13693j76942
38770A508454N7879K33196K15326j5665m00604p00860o33460k50136N4160L7216
38760A05506j15443j18176O3689L05241M89847M48732M0704n06814o45958j81529
38750a14201L60118L63555p6747l49200j65115J91337L77458L43146J57072j16865
38740I70558k77804r2233K98535L98933K458m63361m98626j97853j9611o3648
$$ y = [383369, 678979, 836736, 912371, 979835, 1093548, 1210362, 1140413, 755820, 247827, -28556, 27597, 213663, 369908, 492762, 504921, 288766, 48351, 230549, 871453, 1406010, 1423211, 1236281, 1301017, 1416879, 1075313, 406198, 116316, 462489, 899462, 920622, 714710, 712707, 931561, 1133133, 1307400, 1587233, 1868218, 1899089, 1685396, 1508454, 1566333, 1799529, 2014855, 1999190, 1598586, 897726, 264266, 14130, 68290, 105506, -9937, -128113, -64424, 240817, 730664, 1179396, 1220100, 713286, 67328, -114201, 245917, 609472, 532725, 183525, 18410, 209747, 587205, 930351, 1087423, 970558, 692754, 600521, 899056, 1297989, 1300447, 837086, 338460, 140607, 120996, 57348]
38730E7348q112K55160L81691J39352j57915p9991K82660M49685K16452j34740
38720A401590k73898j83623m2739k013j32013l63654m31034j28165L11752L91058
38710E47261K1254l02865j94678R6960J39172k4664n8412O6749J13786O8583J04926
38699E78072J40479p0537m01262m11289k2120L35000L67109K61908K25263J35821
38689A138444j03454k81384k29159j11292r5656o2032Q5169J49304J29j18841
38679C71228P629J49441N062k58017k56838M86J79002J50388O6385Q883n6909
38668C66740p3631R402L0612j37287k54166j8794L84095M62426J06282k93874
38658E81805l99672k31026M2476K43711J68523j82943m04533j30874L71277N23517
$$ y = [57348, 49236, 304396, 686087, 825439, 667524, 587533, 870193, 1319878, 1536330, 1401590, 1127692, 944069, 901330, 899317, 767304, 403650, -27384, -155549, 156203, 547261, 568515, 265650, 70972, 167932, 307104, 282440, 224028, 290777, 404563, 473146, 578072, 718551, 648014, 246752, -164537, -186657, 148343, 515452, 777360, 1002623, 1138444, 1034990, 753606, 524447, 413155, 317499, 255467, 340636, 489940, 490069, 371228, 378857, 528298, 533360, 275343, 18505, 18991, 197993, 348381, 414766, 423649, 366740, 293109, 302511, 333123, 195836, -58330, -77124, 306971, 769397, 875679, 581805, 182133, -48893, -6417, 237294, 405817, 222874, -181659, -312533, 58744, 582261]
38648E82261K89136J51710K46417J67408k21946m66115k99893j29528l11945m88758
38638d81253j65895M35635O76619M15262J04190R4043K84710M15024L47152J04807
38628B230294j04446O305M29363P20206N04714K4249j00016M10920J208969J666366
38618F996924J353899L42510p73124j315336j170939q23636o38817m69661j78636
38609C323184p1105l75142p01331n87162k61953k32222l65467j39362L31211L56760
38599A277411j78058n47550k86834J80662L31784K78649L07725K89277M7784j52463
38589A548387j1092K76110L56229K65053J90419K7838l33064n72831l31063J74129
38579A590115M20517K98505P4578j56487m43238n70505k76075K07340M05478L43295
$$ y = [582261, 871397, 1023107, 1269524, 1436932, 1214986, 748871, 448978, 319450, 7505, -481253, -647148, -211513, 465106, 880368, 984558, 1078601, 1363311, 1778335, 2125487, 2230294, 2125848, 2132153, 2561516, 3281722, 3786436, 3810685, 3710669, 4121589, 5330558, 6996924, 8350823, 8693333, 7920209, 6604873, 5433934, 4610298, 3971481, 3501820, 3323184, 3252079, 2876937, 2175606, 1588444, 1326491, 1094269, 728802, 589440, 920651, 1277411, 1099353, 551803, 264969, 445631, 777415, 1056064, 1363789, 1653066, 1700850, 1548387, 1537295, 1813405, 2169634, 2434687, 2625106, 2652944, 2319880, 1747049, 1415986, 1590115, 2010632, 2309137, 2383715, 2227228, 1783990, 1213485, 937410, 1144750, 1550228, 1893523]
38569A893523M38987O91938O35588J63107k66638l90620m50942n46131l65387
38560A803425J14168L40494L3204k94385j72289M5506j34071l90647j02521N28593
38550A771477P14244L02029o5428l2838J0892k66878n74409n35028k72788j24496
38540I26777j40543j61581j04774M8892K96751M83449L98113J30595K6844J60762
38530B065285J93125p9052l89554m28555k58342p2344J15632K74109J95333j36460
38520A479177l33280j30296J54883R4434j68868j75016J02978K65610J58654M0289
38510A488565O8986Q2522l0181j27477j02204n1515m7037j0448Q0413J12334N7453
38499A521411L9933R8538J16235P5377J36650L27466L73619M1429m76551p15260
$$ y = [1893523, 2332510, 3024448, 3660036, 3823143, 3556505, 3165885, 2714943, 2168812, 1803425, 1917593, 2258087, 2291291, 1996906, 1824617, 1870123, 1736052, 1345405, 1242884, 1771477, 2485721, 2787750, 2722322, 2689484, 2700376, 2433498, 1859089, 1324061, 1051273, 926777, 786234, 624653, 519879, 568771, 865522, 1348971, 1747084, 1877679, 1904523, 2065285, 2258410, 2179358, 1789804, 1361249, 1102907, 1030563, 1146195, 1420304, 1615637, 1479177, 1145897, 1015601, 1170484, 1264918, 1096050, 921034, 1024012, 1289622, 1448276, 1488565, 1557551, 1640073, 1609892, 1482415, 1380211, 1328696, 1281659, 1271211, 1351624, 1463958, 1521411, 1561344, 1659882, 1776117, 1851494, 1988144, 2315610, 2689229, 2730658, 2254107, 1538847]
38489A538847m58214K2408K82080J96552M4495P1438J33683j2076j96511k9585
38479A593117L73446M02822p3207l39201R0674N87446L20447l74248m75188Q0534
38469B186642L09637j78450n57250j86776L59031L09540o4097k9158L58663M46202
38459B953984R6813j95951j57177Q280J36850K77096L60281K35853M0432O9935
38449C826396K91666L97795L01313J72066N7295r6406j33323J07957L47964J68154
38439E440877k50711k79511J93154N49516L83244P4460J27706M38189O04336N82221
38429G863481N96182O54972N86850M39309M85337Q39902J290101J511352J359619
38420A5627105J011997Q59349J132024J606756J868032J881142K049770K634755
$$ y = [1538847, 1080633, 1103041, 1385121, 1581673, 1626168, 1697606, 1831289, 1819213, 1622702, 1593117, 1966563, 2369385, 2296178, 1956977, 2047651, 2635097, 2955544, 2581296, 2106108, 2186642, 2496279, 2317829, 1760579, 1573803, 1932834, 2242374, 2178277, 2149119, 2507782, 2953984, 3050797, 2854846, 2697669, 2705949, 2842799, 3119895, 3480176, 3716029, 3756461, 3826396, 4118062, 4515857, 4817170, 4989236, 5046531, 4950125, 4816802, 4924759, 5272723, 5440877, 5190166, 4910655, 5103809, 5653325, 6036569, 6111029, 6238735, 6676924, 7281260, 7863481, 8459663, 9114635, 9701485, 10140794, 10626131, 11466033, 12756134, 14267486, 15627105, 16639102, 17498451, 18630475, 20237231, 22105263, 23986405, 26036175, 28670930]
38412B8670930L411603M057670M616780N388342O566044Q167664J0140295J2382983
38404H3402311J4855858J7814791K1748496K6898234L2806820L8035675L9876062
38397B75438247L4782365K0637949l03620k1315936l5354120l9829244l7248105
38390A96807536l1796474k6186551k1359000j7494354j4350636j1391448q549573
38383F5679500o610076o200372o668708o637535n557856m105568l081558k550408
38375B4267419k182216j862909j657934j534589j419459j316557j179186q91519
38367A2223050n41701m43982o70619q24519n62015j24143j5930l14466o52002
38358H073673p80913p69647o76482m35007j19381M4532L4369O5863J64026N7200
$$ y = [28670930, 32082533, 36140203, 40756983, 46145325, 52711369, 60879033, 71019328, 83402311, 98258169, 116072960, 137821456, 164719690, 197526510, 235562185, 275438247, 310220612, 330858561, 330554941, 309239005, 273884885, 234055641, 196807536, 165011062, 138824511, 117465511, 99971157, 85620521, 74229073, 65679500, 59069424, 52869052, 46200344, 39562809, 34004953, 29899385, 26817827, 24267419, 22085203, 20222294, 18564360, 17029771, 15610312, 14293755, 13114569, 12223050, 11681349, 11237367, 10566748, 9742229, 9180214, 9056071, 9040141, 8725675, 8073673, 7292760, 6523113, 5846631, 5411624, 5292243, 5336775, 5371144, 5437007, 5601033, 5658233]
38348E658233l21739n78965l82661K0996J29866j40123l94595k87474J09503L99452
38338D212493K09778m07620q58593n66524K30529O32614K62185j81455K4774N13031
38328D071212M38019j52108m27078j38474O7411j69548l46620n7049K89690K23056
38318C798511L519M4113J13383j69070m83695k61257K87075M23269O6698j02133
38308C720413K14937M85538K85981j7640P0103L79838M31215K05700O3396J18352
38298E957833J77367J82896K69939M11881M20713L46239M99088R49652J324169
38289A0539777J292391J011939Q65234R53541J114059J284008J519241J710063
38281B0290253J629447J304554J012815Q18455M53952j75361p26654r33045j055138
$$ y = [5658233, 5336494, 4757529, 4374868, 4395864, 4525730, 4385607, 3991012, 3703538, 3813041, 4212493, 4422271, 4014651, 3156058, 2589534, 2820063, 3452677, 3714862, 3533407, 3558181, 4071212, 4509231, 4357123, 3930045, 3791571, 3858982, 3689434, 3342814, 3285765, 3575455, 3798511, 3802030, 3846143, 3959526, 3790456, 3306761, 3045504, 3332579, 3755848, 3822546, 3720413, 3935350, 4420888, 4706869, 4689229, 4759332, 5139170, 5570385, 5776085, 5839481, 5957833, 6135200, 6318096, 6588035, 6999916, 7420629, 7766868, 8265956, 9215608, 10539777, 11832168, 12844107, 13709341, 14662882, 15776941, 17060949, 18580190, 20290253, 21919700, 23224254, 24237069, 25055524, 25509476, 25334115, 24607461, 23674416, 22619278]
38272B2619278j436863j869769j884106j531683j343715j513297j638855j386321
38264A0014669r44140o50416n59379n58560n74091n03489k79054j18046l27222
38255E500272p41715q20060m64848k13224l48535m16134m0203L55230K16166k28366
38245B798583l83236k38698j97560k56647j28672L4104j40537m12249j79650M14916
38235A310354N13137j41965p36808n49565J26253N85507O13963L91387N1829k27676
38225A936416j65748J83974L34179M8098l04567l87987l81316m39244k51723L20263
38215H92345P00413L51826l38163o21201m74363l73881l11621O8530N25424L95850
38205H15159k32698m78541k3222L85742J70892j76149j622M06374L53558j00833
$$ y = [22619278, 21182415, 19312646, 17428540, 15896857, 14553142, 13039845, 11400990, 10014669, 9070529, 8420113, 7860734, 7302174, 6728083, 6224594, 5945540, 5827494, 5500272, 4758557, 3938497, 3473649, 3260425, 2911890, 2495756, 2455553, 2810783, 3026949, 2798583, 2415347, 2176649, 1979089, 1722442, 1593770, 1627874, 1487337, 1075088, 895438, 1310354, 1823491, 1681526, 944718, 395153, 521406, 1106913, 1720876, 2112263, 2164092, 1936416, 1770668, 1954642, 2288821, 2336919, 2032352, 1644365, 1263049, 823805, 572082, 892345, 1592758, 1944584, 1606421, 985220, 510857, 136976, -174645, -106115, 419309, 815159, 582461, 103920, 80698, 466440, 637332, 461183, 459561, 865935, 1219493, 1118660]
38195A118660l13745j28763L315r7840q2267J99476L46190N8633l32937l40861
38185D29861j5239J80476J8907k79651m15990l28810j32490O5685K17373K99793
38175C9915K99060K20218J06798K8122k675p4706k43306l59096j99052J77107
38165g615L94226K21032j11787k40915j51711o8897p937J94893M38062L65450
38155A024801o5082m13097l65214j73794k07388l58507k64626Q0361L40263L70743
38145c1540L49204L76606L04761L8463k54861l38131j54183J46828L15828J94983
38135I47958p2299j41246O5420J83755n7065l73138l61082j54036j52838k88961
38125d03532j63037J66489K21131l3314q6640J94365K95786k470j70061J46773
$$ y = [1118660, 804915, 676152, 679467, 581627, 499360, 698836, 1045026, 1103659, 770722, 429861, 414622, 595098, 614005, 334354, -81636, -410446, -542936, -477251, -259878, 39915, 338975, 559193, 665991, 694113, 691438, 616732, 373426, 14330, -184722, -7615, 386611, 607643, 495856, 254941, 103230, 34333, 26396, 221289, 659351, 1024801, 959719, 546622, 181408, 7614, -199774, -558281, -822907, -742546, -402283, -31540, 317664, 694270, 999031, 1037494, 782633, 444502, 290319, 437147, 752975, 947958, 875659, 734413, 799833, 983588, 926523, 553385, 192303, 38267, -114571, -403532, -566569, -400080, -178949, -212263, -298903, -104538, 191248, 188778, 18717, 165490]
38115A65490M47668K10132k16838k40084l0382j22280l87381k54661K50852N18404
38105C40920L33119Q8960K0539n8848j87518j11690J44070J79590j16471l42135
38095B90536k22002N115L6610p5747j37791q1593R3735L06100K91683p4874m00718
38084C1054k32742J51634Q1494l49285k88251M74639R87229N04933l90317o94021
38074B76367l75266j13345j12878j5153K69880M35921L82665K74286P0411l68569
38064G24319p52211n77038P0223M96249L02430j69883l93640k25862J57746M82636
38054A14969M54257K3933l61349k02976K94185M01739p2539m53115j94001L11185
38044C16288L44325r8440m03801k71179j4308M4828J6692J35377L25212L06710
$$ y = [165490, 613158, 823290, 606452, 366368, 335986, 213706, -173675, -428336, -177484, 340920, 674039, 762999, 783538, 724690, 537172, 425482, 569552, 749142, 632671, 290536, 68534, 73649, 110259, 34512, -103279, -184872, -91137, 214963, 506646, 431772, 31054, -201688, -50054, 31440, -317845, -606096, -131457, 855772, 1360705, 970388, 276367, -98899, -212244, -325122, -340275, -70395, 365526, 748191, 1022477, 1092888, 724319, -27892, -604930, -534707, -38458, 263972, 94089, -299551, -525413, -367667, 114969, 569226, 593159, 231810, 28834, 323019, 724758, 652219, 199104, 5103, 316288, 660613, 562173, 158372, -112807, -127115, -82287, -65595, 69782, 394994, 701704]
38034G01704J5592k77989k85508l3823J87736J81788L7401o6238j15371j85201
38024A60091k10277m8731K30491L39682J26216k09841l31127j13196K51733M33470
38014F28511K67645l9887r0937J99188M09609J55731l13522m20349j11396M5882
38004G30475k75057o59270n74202j21636J92251J78673O0814K74o1644j22839
37994f52161m6048J70092L11395K28409K0622j19214j09988J822J17165J54713
37984G6807J24822J15499J49027J38881O9171O6714J43979N1525l56351p51361
37974a71287o67178j49185K94872L95343L72188M06839L07377n9712l82110l06836
37964D0311N961J13163o3415j88787o0586J40851J66933j5474k87227m81038m05108
$$ y = [701704, 717296, 439307, 153799, 119976, 307712, 489500, 526901, 460663, 345292, 160091, -50186, -98917, 131574, 471256, 597472, 387631, 56504, -56692, 195041, 628511, 896156, 856269, 765332, 964520, 1374129, 1529860, 1216338, 795989, 684593, 730475, 455418, -203852, -778054, -899690, -707439, -528766, -467952, -467678, -529322, -652161, -698209, -528117, -216722, 11687, 32309, -86905, -196893, -195071, -77906, 76807, 201629, 317128, 466155, 605036, 674207, 740921, 884900, 936425, 580074, -171287, -838465, -987650, -692778, -297435, 74753, 481592, 788969, 729257, 347147, 40311, 46272, 159435, 96020, -92767, -153353, -12502, 154431, 138957, -148270, -629308, -1034416]
37953a034416j8897L79450M08147J09451o9268J06577L55895L49126J72327Q0165
37943H38557N8034l0693n5139K11028N98946O62345L52504J77283N06017J041337
37933D360219J248712J070223Q60060P17300K98728n72183j417126j538073q85642
37924D142218j99420j59389o06719q43664n83167k38908k21377l54848k70311
37915F64415n9025r3075l40723l59718k890L34762L20156J25012M2228J5584j46551
37904E00175l50147l35874o4090K88916N78535P02881N37285J21277k40310l24064
37894A414584k80230l23055l42172j59694L9085l2170k20947j52263J02714J17905
37884A63757j39051k35474l7109O5982j05883j71769R9518L01497P0333k32597
$$ y = [-1034416, -1053313, -673863, -265716, -156265, -225533, -118956, 236939, 586065, 758392, 838557, 896591, 865898, 810759, 1021787, 1620733, 2283078, 2635582, 2812865, 3318882, 4360219, 5608931, 6679154, 7539214, 8256514, 8555242, 7983059, 6565933, 5027860, 4142218, 3942798, 3783409, 3176690, 2333026, 1749859, 1510951, 1289574, 934726, 664415, 605390, 512315, 171592, -188126, -191016, 143746, 463902, 588914, 631142, 646726, 500175, 150028, -185846, -249936, 38980, 617515, 1320396, 1857681, 1978958, 1738648, 1414584, 1134354, 811299, 469127, 309433, 348518, 316348, 95401, -56862, 45852, 163757, 24706, -210768, -247877, -181895, -287778, -459547, -360029, -58532, 11801, -220796]
37874b20796q7376K88898K50288k60903o34070m91147j07593J32819K30177L69840
37864e29863N68370O65378M89835L0157m06630l66741J42066M44461M6850n18996
37854E64887l41460M60793P72269R6868o82853o06376K8096K95228P0993k695
37844F55750K92102M71903K77924J08971L21400O94191Q69152Q63478Q53171Q18407
37834F226449P02381O19317O05193M16649j07386o78495q72173o84324m87237
37825E740374n17872o75955p71776p25090n43429l12938j88998k25409k72792
37816A506115k16879j99245l55726m60689j91746K84256M08001J0706l95753l18801
37806G0239O5715K50839J11209p7477j51825j95398k24189j28499L4649M3058
$$ y = [-220796, -308172, -19274, 231014, -29889, -663959, -1155106, -1262699, -1129880, -899703, -529863, 38507, 703885, 1193720, 1223877, 817247, 450506, 592572, 1037033, 1083883, 564887, 223427, 684220, 1456489, 1553357, 870504, 264128, 292224, 587452, 658445, 655750, 947852, 1419755, 1697679, 1806650, 2128050, 2822241, 3691393, 4554871, 5408042, 6226449, 6928830, 7548147, 8153340, 8569989, 8462603, 7784108, 6911935, 6227611, 5740374, 5222502, 4546547, 3774771, 3049681, 2506252, 2193314, 2004316, 1778907, 1506115, 1289236, 1089991, 734265, 273576, 81830, 366086, 774087, 784793, 389040, 70239, 135954, 386793, 498002, 420525, 268700, 73302, -150887, -279386, -244737, -201679]
37796b01679r5025p4159K01556L42377l271n37595n99492n0812M71650L38586
37786b07864k75687o14439k55339M40530Q14385O29256J90724r9326j21083p548
37776D93609P8672P3046Q048m5826o5007j04440j94546k26331m6682L01519N38327
37765H10389M19423P70m13674n45137l43618R401K63759L16321K76283K66781
37755A060698K11178m6921m33281o47429n22539j98279J17229L43223M09285K18970
37745E12134r5914j54406J74590M72196K92371j82303l88005j91671k7810j90812
37735B20370m02522k57092J95432N26235M32908Q884l92733m58118j51179K64884
37725a2931M62400L11224p8430m52123n11023j35562L46757L76189j13605m70128
$$ y = [-201679, -296704, -370863, -169307, 173070, 169799, -367796, -967288, -1018100, -546450, -207864, -483551, -1097990, -1353329, -912799, -98414, 530842, 721566, 622240, 501157, 493609, 572281, 645327, 653375, 607549, 542542, 438102, 243556, 17225, -29457, 272062, 810389, 1229812, 1230582, 816908, 271771, -71847, -62446, 201313, 517634, 793917, 1060698, 1271876, 1224955, 791674, 144245, -378294, -576573, -459344, -116121, 293164, 512134, 416220, 261814, 436404, 908600, 1200971, 1018668, 630663, 438992, 411182, 220370, -182152, -439244, -243812, 282423, 715331, 724215, 331482, -126636, -277815, -12931, 449469, 760693, 682263, 230140, -280883, -416445, -69688, 306501, 192896, -277232]
37715b77232j78259L59324M17192P0656J7086L61367M12310j38795o42246m77496
37705g6093N5625L16577K36905J17822j4234k58635l98697j96853J17420J77102
37695G6939N5978K2561j0129k38480m30045k48196Q2685R0875j07048J2369M23266
37684b69225N25705J49220j55664l4460J36308m9930l62111l64169r4867R1264
37674d27929P8333K4797K7593L8082Q948n4608j11891q8360L3850J47421J92705
37663a31059K93623M83254M63432K1552m58339m09827N0640K48796l0496k74942
37653B56634j22939J30511J50992Q2155J13001P2531j53533k73025o2443K11942
37643D05826K28839Q4945j4648j21032k33697r3110K85390L49413j82630o86790
$$ y = [-277232, -455491, -96167, 321025, 391681, 408767, 770134, 1182444, 1043649, 401403, -76093, -20468, 296109, 533014, 650836, 636602, 377967, -20730, -217583, -100163, 76939, 132917, 155478, 145349, -93131, -523176, -771372, -688687, -597812, -704860, -692491, -269225, 256480, 405700, 250036, 215576, 351884, 301954, -60157, -424326, -519193, -427929, -349596, -324799, -297206, -259124, -250176, -304784, -416675, -505035, -471185, -323764, -131059, 162564, 645818, 1109250, 1130802, 672463, 262636, 313276, 562072, 531576, 256634, 133695, 264206, 415198, 497353, 610354, 682885, 529352, 256327, 193884, 405826, 634665, 719610, 704962, 583930, 350233, 257123, 542513, 891926, 709296, 22506]
37633B2506m34640L12226O78968M02836k574j52332j69201j96128j66622j19625
37623A75414k15101l57924k46635J36004M46191M20714R9306l25451n73777l47527
37613g88786K80813P03538M38077j85215m47130k01303Q7061J16686m601j95903
37603a96763m74814o11925l17013J91211L67261J34960n0971L4047J54755J99452
37593e69800L56058N77898M98955P3466k65756k68271j39667j9047K02797L76419
37583H23052R0849n44128p84381k93336L04648L19868r6996l58486k51316N7908
37573g32318L63140M09620K7563m17198k80242L33267N01006j18686o20404k29835
37563g64087M35170L54067k93230n42562k14907K9057l9421J5421L05087M07541
$$ y = [22506, -412134, -99908, 579060, 981896, 979322, 826990, 657789, 461661, 295039, 175414, -39687, -397611, -644246, -508242, -62051, 358663, 457969, 132518, -441259, -788786, -507973, 195565, 633642, 448427, 1297, -200006, -112945, 3741, -860, -196763, -671577, -1283502, -1600515, -1409304, -1042043, -907083, -958054, -924007, -769252, -569800, -213742, 364156, 863111, 936577, 670821, 402550, 262883, 243836, 446633, 823052, 913901, 369773, -414608, -707944, -403296, -83428, -180424, -538910, -790226, -732318, -369178, 40442, 68005, -349193, -629435, -296168, 204838, 86152, -534252, -764087, -328917, 25150, -268080, -810642, -1025549, -996492, -1035913, -1020492, -715405, -307864]
37553c07864K26598J60504K83441J93609j51729k46483Q2932L34466J52341j54815
37543E73000k17291j44606j51983j58082n8936L4420P8195J95136L02995J11223
37533E64071l09860m57478j50860J28159m6724m31336n45743l32149m3209J81985
37523a443144L02903K36972L1867q0038k4860K981m9038N3290L45888M61318K11921
37512E0060l5781N8543K35514Q2965k55613l10017k2179K18207J79002J5777p1265
37501A45213q0414r3051j25287j03953P2164L43202L81162m2686n63874n27482
37491e95006Q1738N11675K97634r6966q9277J17775J4727k70261k16312J53576
37481i0697K98687L2695k66305k97318j35171R4222L21203L41812L0743k82940
$$ y = [-307864, -81266, 79238, 362679, 556288, 404559, 158076, 241008, 575474, 727815, 573000, 355709, 211103, 59120, -98962, -157898, -123478, -45283, 149853, 452848, 564071, 254211, -203267, -354127, -225968, -272692, -704028, -1249771, -1581920, -1625129, -1443144, -1140241, -903269, -871402, -951440, -976300, -973319, -1022357, -969067, -623179, -161861, 50060, 14279, 72822, 308336, 391301, 135688, -174329, -196508, 21699, 200701, 216478, 145213, 64799, -28252, -153539, -257492, -185328, 157874, 539036, 496350, -67524, -595006, -513268, -1593, 296041, 199075, 109798, 227573, 242300, -27961, -244273, -90697, 207990, 240685, -25620, -322938, -458109, -363887, -42684, 299128, 329871, 46931]
37471D6931j68957K09120L01254M4994q6575N6003P4736j82180k87586L385K69671
37460B80796J05468k10288j78806J52799L40453K05004n0540k10410k18486j26661
37450H9329r4072k63769m84457m13091m9296J81807R8335R2450M40520P01885
37440B99641L34637l71369n97186j41529L27157K29953k18341m37830k29806J34373
37430f70300L25541K45129K9407r3269j5400J28446J24136m4562j86073j52965
37420c09910J5792J91072K73063K30298J29671R7162J44521J04216j22325l36689
37410D16871k70192K371J19292o3299k56530j38714K06407M06982K64007o2442
37400F24753l03775l69906l23778j78614J12905M45886N26897K16444k03517l32915
$$ y = [46931, -122026, 87094, 388348, 433342, 346767, 402770, 477506, 295326, 7740, 11125, 280796, 386264, 175976, -2830, 149969, 490422, 695426, 644886, 434476, 215990, 89329, -4743, -268512, -752969, -1166060, -1215356, -1033549, -935214, -842764, -402244, 299641, 634278, 262909, -334277, -475806, -148649, 81304, -137037, -574867, -804673, -670300, -344759, -99630, -70223, -163492, -178892, -50446, 73690, 29128, -156945, -309910, -294118, -103046, 170017, 400315, 529986, 627148, 771669, 875885, 753560, 416871, 146679, 149050, 268342, 205043, -51487, -190201, 16206, 423188, 687195, 624753, 320978, -48928, -372706, -551320, -438415, 7471, 534368, 750812, 547295, 214380]
37390B14380j75512q8475k11343k76509q6756J62672K34888K11261K39977K03954
37380D28537m0665l15507l48238j73971J0328J91674L86487L69563R632l17014
37370B00826j83208J51199O8655l87555n14359o6582L33490J67002k42387l36235
37360h09154j18723R3475K52549M23145M16378Q2348l03921l96413k66606j37717
37350g64639N7459L92106N40544K14178k51659l37532j52931j74230l53759k24150
37340a054613J77823K80109m9365k56247k3818K64160K51736J33248J17842J4348
37330a44777k44274k71803Q7447L05208k8782m46124k98404J91317L19305N9655
37320d71232J5051L15804M02839J9445l30867k05660Q7002J4753l56430m90885
$$ y = [214380, 38868, -49607, -260950, -537459, -624215, -461543, -226655, -15394, 224583, 428537, 387872, 72365, -275873, -449844, -439516, -247842, 138645, 508208, 517840, 200826, 17618, 168817, 237472, -150083, -664442, -731024, -397534, -230532, -472919, -809154, -927877, -834402, -581853, -158708, 257670, 340018, 36097, -360316, -626922, -764639, -707180, -315074, 225470, 439648, 187989, -149543, -302474, -476704, -830463, -1054613, -876790, -596681, -646046, -902293, -926111, -661951, -410215, -276967, -159125, -144777, -389051, -660854, -573407, -268199, -296981, -743105, -1041509, -850192, -530887, -471232, -456181, -140377, 262462, 281907, -48960, -254620, -167618, -152865, -509295, -1000180]
37310a000180j59601K62702K85762q8442l42526o7373M57708N47059M1283m06254
37300d69862k45347J62091J36066k40812l14304K9935K36149R8634Q4609L91446
37290a31395M79014r30m83009k97835K89554M95581J36390k95205m38127l51252
37280e97214j51386P2092Q9516j89877l70729m8355M55156M43708p2140l18327
37270f87556P9631N37366M17764p3962l25401k09009m4528L8331J74178L24228
37260B31042K47237p6096l58234m00585k86842j34683N8603K29344J87001p4509
37250c77722k14801N2888N06237O29755K78083j40942k23460n8399J3271q1235
37240C83675j34282n0706M8080P9598O4012o2067l61364n85641l46986K50455
$$ y = [-1000180, -1159781, -897079, -611317, -699759, -1042285, -1109658, -651950, -104891, -63608, -469862, -715209, -553118, -417052, -657864, -972168, -942233, -706084, -607450, -522841, -131395, 347619, 346689, -136320, -434155, -144601, 350980, 487370, 192165, -245962, -597214, -748600, -676508, -586992, -776869, -1147598, -1195953, -740797, -297089, -369229, -687556, -607925, -70559, 347205, 273243, -52158, -261167, -305695, -267364, -93186, 231042, 478279, 402183, 43949, -356636, -643478, -778161, -719558, -490214, -303213, -377722, -592523, -539635, -33398, 596357, 874440, 733498, 510038, 451639, 464910, 383675, 249393, 198687, 246767, 326365, 390377, 328310, -33054, -618695, -965681, -715226]
37230g15226N57434K23692k78538l31012k8449J08336J5186Q6963L82159M45884
37220D66429N2573l82397l72508P049K98129K41552j7793j63633k7632K27121
37210C28890K45103n9385k78651j5340M84646N80717J08080m17488n34246l53248
37200H9078k03846j63303j47986j38956r9476N7829K52655K62929R6146J1876
37190A6946N8058j7299k36070k39314Q4745L07111J35071r0955n038J39483k9568
37179A23170k59395p9494L25133L55807k0739k43831r8928L740j83096k99985
37169c77618J0557N12610O99988M28844o807k50348j90548k2382m3923k90115
37159D70258m53752l19739q2698K2039J38737M32684N69467J35690n57309p54290
$$ y = [-715226, -157792, 65900, -212638, -543650, -572099, -463763, -448577, -361614, 20545, 466429, 519002, 136605, -235903, -228854, 69275, 310827, 293034, 129401, 101769, 328890, 573993, 514608, 235957, 220617, 705263, 1285980, 1394060, 976572, 442326, 89078, -114768, -278071, -426057, -565013, -664489, -606660, -354005, -91076, 5070, 16946, 75004, 57705, -178365, -417679, -332934, -25823, 109248, 18293, 13255, 152738, 123170, -136225, -215719, 109414, 465221, 444482, 200651, 101723, 105463, -77633, -377618, -367061, 145549, 845537, 1274381, 1267574, 1017226, 826678, 804296, 760373, 470258, 16506, -303233, -385931, -363892, -225155, 207529, 776996, 912686, 355377, -398913]
37149c98913l30693R1669J61808J90931L49572K75441j34578k93547J48768N77729
37139F38187L03947l05730l81044P7623K41770k00639n82070l15858K65337M74868
37129B16391K07131q9748j14183q728k7453j72429k21500k9173K58717L35550
37119C54575J00242j92647k38347n6510P4381P386j07128n9156J38108K55006
37109B75910J00841k41506m57977l39906n0289P3476k5319o0884J43293L65647
37099b16714L02232k639k33519k07325k9322Q7803L3387j12616j27536J15138
37089c91111M09316L96174N8380j95716q5991J47143J24349j18654k42173j11315
37079i598J10317K82208M03222M38787K94482j7511l55480n76281n72660k88676
$$ y = [-398913, -729606, -637937, -476129, -285198, 64374, 339815, 205237, -88310, 60458, 638187, 942134, 636404, 255360, 332983, 574753, 374114, -207956, -523814, -258477, 216391, 423522, 333774, 219591, 210863, 183410, 10981, -210519, -239692, 19025, 354575, 454817, 262170, 23823, -32687, 41694, 49080, -58048, -117204, 20904, 275910, 376751, 135245, -322732, -662638, -712927, -639451, -664770, -725654, -582361, -216714, 85518, 82879, -150640, -357965, -387287, -299484, -266097, -378713, -506249, -391111, 18205, 414379, 472759, 277043, 191052, 338195, 462544, 343890, 101717, -9598, 100719, 382927, 786149, 1224936, 1519418, 1501907, 1146427, 570146, -2514, -291190]
37069b91190J41324L90032K69876k7294j93134j74264j02190k9259K9366l7025
37059b3758k51237l88462k85072j37665j76458k28741M22L71496M85339L08598
37049c25538J46995O7509j23046l31069j86068K90853N69828L53129m0343k27628
37039A94622k34354j89194j5031K73662L79116J64350n9124j7293P9654p9341
37029D97067l74822m70706l11134o6809J71853L20918J85624k17840m66090k40629
37019i72568J82204L38309K37161J83937J76822M247k15320j55297J21302K31742
37009A32539J18963P8190J32394k0477l42074l57508N9473L90942K73323M9370
36999E15135J24245K65400O1334l06201l48295r0585Q048j50015k03028l7801
$$ y = [-291190, -149866, 240166, 510042, 482748, 289614, 115350, 13160, -16099, 13267, -23758, -274995, -663457, -948529, -1086194, -1262652, -1491393, -1490971, -1119475, -634136, -325538, -178543, -111034, -234080, -565149, -751217, -460364, 109464, 462593, 422250, 194622, -39732, -228926, -243957, 29705, 408821, 573171, 514047, 496754, 576408, 497067, 122245, -348461, -659595, -726404, -554551, -233633, -48009, -265849, -731939, -972568, -790364, -452055, -214894, -30957, 145865, 150112, -65208, -220505, -99203, 132539, 251502, 329692, 462086, 441609, 99535, -257973, -198500, 192442, 465765, 515135, 639380, 904780, 966114, 659913, 311618, 221033, 229081, 79066, -123962, -161763]
36989a61763P625k05761l18932r3540J46195N9882j03870Q3350M67624M98330
36979C79140R3709k22376j29364M5592q0759l29435k85304L7529K61586K34986
36969E304J55073J47474J03160k3717r7198p4004r7694j99759j88703J3281J92721
36958f4062J87604J46549K14876K10761p6388m42102m73858j27552K21442K79223
36948G6493J08790p6266j24081L9049L30390M41835J31964l78931n89128l48091
36938c87976k1533N4916k3282j5084P9349J22739Q8719n871j94109l70553k58465
36927i31150J54867L94405Q8592l95332l77036J40254M31179J08856l08293j91590
36917h85248K70239M14333J35911Q448L46781O71086L79452l67802q20650o02861
$$ y = [-161763, -154138, -359899, -678831, -772371, -626176, -566294, -670164, -586814, -119190, 379140, 472849, 250473, 121109, 166701, 85942, -243493, -528797, -491268, -229682, 5304, 160377, 307851, 411011, 387294, 290096, 216092, 118398, -81361, -270064, -256783, -64062, 123542, 270091, 484967, 695728, 619340, 177238, -296620, -424172, -202730, 76493, 185283, 109017, -15064, 23985, 354375, 796210, 928174, 549243, -39885, -387976, -409509, -354593, -377875, -392959, -313610, -190871, -102152, -108023, -302132, -672685, -931150, -776283, -381878, -293286, -688618, -1065654, -925400, -494221, -385365, -693658, -885248, -615009, -200676, -64765, -56317, 290464, 961550, 1341002, 973200, 152550, -450311]
36907d50311j34245L723j70774j76755J59261M30358K64922q3211p8226K90437
36897E5179M55844J06335l33592l20405K8464J74575j1524j48536l2431R1250
36887F5159M5744Q209N7147p4575m49376n85654j57608L40253K47649j91122j41876
36876h36050N01345Q98973N26145q4787k13612M4610J20315j34255m03321m66507
36866d7144l29384j8098L29287L68022l4426m57804m19395m0582J90971J43157
36856c15396M8352m7939k81246m69799k28027L39531O11627K91158j92649l14470
36846e58858p1748K21424L68414L04015L2897k26036j63300J52479K71462K5136
36836C55885j98249r1397Q3088o448j74703r2905Q5938K0407j34222N1734M66673
$$ y = [-450311, -584556, -580833, -751607, -928362, -769101, -338743, -73821, -157032, -235258, 55179, 511023, 617358, 283766, -36639, -8175, 166400, 154876, 6340, -26091, 65159, 110903, 119112, 176259, 101684, -347692, -933346, -1090954, -750701, -503052, -694174, -836050, -334705, 564268, 1090413, 1005626, 792014, 836624, 956939, 822684, 419363, -47144, -376528, -394626, -65339, 302683, 268257, -189547, -608942, -649524, -458553, -315396, -267044, -314983, -596229, -1066028, -1294055, -954524, -342897, -51739, -244388, -558858, -630606, -409182, -40768, 263247, 296144, 70108, -93192, 59287, 330749, 355885, 157636, 66239, 149327, 142879, -31824, -124729, -38791, -18384, -152606, -100872, 365801]
36825C65801N03206Q74m41290l26617M0970O4759k65125m13523r8702L26574L53826
36814A10753n2439m41300m11096k9975L11422L75325K72442J86872R6078r8301
36804C19781k95951k78143m3237J50367J37748P1924J70060L43417K68016j48146
36794F95836n31121m37152N9627L90823J91179k39115l68479j45873M4181L6625
36784c03469O7984K54389L39814J71382K6642J47638K65008r453n09250o61039
36774b10354k54234K94148M65270J74692k33496l50390q4474K03675O8967m02299
36764c28495n92107j82570L29860L31748R261K1067M28178O06961K48918k06156
36754F66665l18688k46166k89357l28473j08646K42567L79671K30696J6538p9635
$$ y = [365801, 869007, 869881, 428591, 101974, 142944, 207703, -57422, -470945, -569647, -243073, 110753, 58314, -382986, -794082, -824057, -512635, -137310, 135132, 322004, 418082, 319781, 23830, -254313, -297550, -147183, -9435, 62489, 232549, 575966, 843982, 695836, 164715, -272437, -212810, 178013, 369192, 130077, -238402, -384275, -340094, -303469, -235485, 18904, 358718, 530100, 556742, 704380, 969388, 959935, 450685, -210354, -464588, -170440, 294830, 469522, 236026, -114364, -198838, 4837, 73804, -328495, -920602, -1103172, -773312, -441564, -432303, -411236, 16942, 623903, 872821, 666665, 347977, 101811, -187546, -516019, -624665, -382098, -2427, 228269, 244807, 165172]
36744A65172l5796P4217J04458l6979j78289n0476K30032K04062k06893m37831
36734a68323q5176M16920M07495j5300k10195l0303K2238k83705m83277j66106
36724e95732L47489M55443R5169k60695k69171l7227J68512K35955J83324L3506
36714C56573j68126l02973k64421r6508K7396J4021n635J62606M66582N91486
36704G81001L41886o5177k37668r3835N9195m5114k84604l32116r5969J66806
36694A94405J89153K5961n1896N3573J36408j675k49213l32975j83580J7485J15612
36683h6742J20845P0560n0199k06677k94339k65583j45952O3461L21482M21043
36673e2101J89958j76026k88377j22261m8302k12239k90904o0786K15679K72084
$$ y = [165172, 129376, 203593, 308051, 271072, 92783, 42307, 272339, 476401, 269508, -168323, -253499, 163421, 570916, 555616, 345421, 315118, 337356, 53651, -429626, -595732, -248243, 207200, 302369, 41674, -227497, -264724, -96212, 139743, 323067, 356573, 188447, -114526, -378947, -475455, -448059, -434038, -439673, -277067, 189515, 781001, 1122887, 1057710, 820042, 726207, 785402, 740288, 455684, 123568, 27599, 194405, 383558, 409519, 357623, 411196, 547604, 545929, 296716, -36259, -219839, -202354, -86742, 34103, 104663, 54464, -152213, -446552, -712135, -858087, -794626, -473144, -52101, 137857, -38169, -326546, -448807, -497109, -709348, -1000252, -1061038, -845359, -573275]
36663e73275K95647M94952N77288J85954l90297n30916j90047Q3242K602j38659
36653a83509o9230O9768Q5736L7870r84j04420k32777j61113J34520L22000J54787
36642E2648j73511l05917j57217Q1788K11271J80584J06634J61795L10583K44684
36632G13342j86958o18320n89689k08765N6036J24482K68480L93202R7599m41435
36622c92026m65450J79404O56264L96672l6794L5581K83037P4308l03213j34582
36612B93201M07663N01790M8350k42765j11340o6131l22318m10923j21771P8579
36602E4335n0754n5945K97889M37756o9484o45007n03076J56354N07986L11547
36592D41601J4369j33309l04698m93250l87511M5917M02577M01552J79427o6417
$$ y = [-573275, -277628, 217324, 794612, 980566, 590269, 59353, -130694, -47452, -44850, -183509, -252739, -182971, -97235, -59365, -60349, -164769, -397546, -558659, -424139, -102139, 52648, -120863, -426780, -583997, -502209, -290938, -110354, -3720, 158075, 468658, 713342, 526384, -91936, -681625, -890390, -834354, -709872, -441392, -48190, 49409, -392026, -857476, -678072, -21808, 374864, 338070, 373651, 656688, 730996, 427783, 293201, 700864, 1202654, 1251004, 1008239, 896899, 830768, 508450, 97527, -24244, 54335, 3581, -52364, 245525, 683281, 613797, -31210, -534286, -377932, 130054, 441601, 455970, 322661, 17963, -475287, -862798, -816881, -414304, -12752, 166675, 100258]
36582A00258l01573m13304j87661K71452M82919K10398j63366j81160K3530k1915
36572a80422l54370m87860j55270K50913K14139j73690l45381m6516L61386M56237
36562d60834K80218J07627k3182k13007l23904j17542K73754M31165K51240O5969
36552B71504O4556J2176k61678m84445l36122P2635M02310N10460M14326J09101
36542G74823k66989l55706k4916L34451L15355O3729m8060n0272j79735k78774
36532B83906q140M29445M37385m7464m03848k63177r091p8739k88040k20760R4161
36521g4362K84582J79569o2487k13907j57163M6618J56740J3211j75803j13487
36511a16489K2711k19442p08635o92980O6103P44592N63077p1656k00546K75874
$$ y = [100258, -201315, -614619, -802280, -530828, -47909, 162489, -877, -182037, -158507, -180422, -534792, -1022652, -1177922, -927009, -712870, -886560, -1231941, -1278457, -917071, -460834, -180616, -72989, -96171, -309178, -633082, -750624, -476870, -45705, 205535, 271504, 336060, 348236, 86558, -397887, -734009, -661374, -259064, 251396, 665722, 774823, 507834, 152128, 127212, 461663, 777018, 840747, 792687, 742415, 562680, 283906, 275766, 705211, 1142596, 1095132, 691284, 428107, 419016, 340277, 52237, -168523, -74362, 210220, 389789, 327302, 113395, -43768, 2850, 159590, 172801, -3002, -116489, -93778, -313220, -1021855, -1714835, -1648732, -904140, -341063, -412719, -613265, -337391]
36501c37391N80332K84227k13699m49397m52411m06850l17851j98229j38349m6743
36491a696361K56171N74985M43385j30837m94866j93702M08334O41898L37568
36482A46575j71060n34745n60650j82178L73488N94177K38553k48212k35082K62844
36472c16290O14435M19666k5703k02357k7350J35430m113l06102l91580j21325
36462b25289K18562K79686J03922K0692J24275J38983j02505l46968l02335q8940
36452a79917j9837r7708o2796J35637K55322J63631K8638L2824J28767J73757
36442E58318J24341L058j73620l33234l38091j49045P7284J48054N1693m4412
36432g5654J1517J95514L23339K24475o6819l07305k83148m6671J42398J14582
$$ y = [-337391, 242941, 527168, 313469, -135928, -588339, -995189, -1313040, -1511269, -1649618, -1696361, -1440190, -865205, -421820, -552657, -1047523, -1241225, -832891, -190993, 146575, -24485, -559230, -1119880, -1302058, -928570, -334393, -95840, -344052, -579134, -316290, 298145, 717811, 692108, 489751, 462401, 597831, 593718, 287616, -103964, -225289, -6727, 272959, 376881, 397573, 521848, 660831, 558326, 211358, -90977, -179917, -199754, -297462, -360258, -224621, 30701, 194332, 222970, 255794, 384561, 558318, 682659, 685717, 512097, 178863, -159228, -308273, -230989, -82935, -31242, -75654, -64137, 131377, 454716, 679191, 612372, 305067, 21919, -24752, 117646, 232228]
36422B32228l2873q2424L1856J58501J31503l3022k05219l43340m74807m80646
36412a098243j48781M16924P05883M15137n0557j00101J64655J26171l17142n51718
36402d37772k58875O0947l1957j47832K21588P24513O30403j2612m78523m62361
36392a92481l04583j90342N7581L27948J97147k35263k84624K19003N36304J79316
36382C10006k63631r2514L34401J99570m07455o17199j46494L16011K07068j44939
36372c05176j45703J90381L78927J96460r2027j50463M3909K65277L43750K99328
36362A024663J90584k0866l15844m43969j81138K50084L50557J8575k95265k52383
36352C24998o4871m2356r9987n8683p2948l24131n68832m63522j27113Q3370J57743
$$ y = [232228, 199355, 116931, 148787, 307288, 438791, 405769, 200550, -142790, -617597, -1098243, -1247024, -830100, -124217, 290920, 240363, 140262, 304917, 431088, 113946, -437772, -696647, -635700, -667657, -815489, -593901, 130612, 761015, 748403, 269880, -192481, -497064, -687406, -629825, -301877, -104730, -339993, -624617, -405614, 130690, 310006, 46375, -46139, 288262, 487832, 80377, -536822, -683316, -367305, -160237, -305176, -450879, -260498, 118429, 314889, 222862, 72399, 116308, 381585, 725335, 1024663, 1215247, 1194381, 878537, 434568, 253430, 503514, 854071, 872646, 577381, 324998, 260127, 217771, 117784, 59101, -13847, -337978, -906810, -1370332, -1497445, -1414075, -1256332]
36341a256332L03019M21971K75528K7149L3933J84127P1750k12657j61916K25884
36331h7544L44037j7789k88315m4938L36770L66420J71397P4130k1929k74591
36321E57648l93345j05437K24599R3893k79531k79541Q3500J93260j35044l57489
36311c97487j17617J76374L4104l27775l23151J28581N01818L87826j9271k36628
36301a93226q4328J78893K39426R6413j4349K8775R8084L2914j45237k87253k85715
36290c35603j42343M2297J19745L7525o4822l7204K9118o1112k26092j50247K22575
36279e66163N43149N29851K86859M169l11587n85267n25850p4585L08066K08254
36269a83104j30157j89720L3950J20301l3124r1860R8221K77850K44469J23760
$$ y = [-1256332, -953313, -531342, -255814, -228665, -194732, -10605, 61145, -151512, -313428, -87544, 256493, 238704, -49611, -94549, 242221, 608641, 780038, 854168, 832239, 557648, 164303, 58866, 283465, 377358, 97827, -181714, -98214, 95046, -39998, -397487, -515104, -338730, -304626, -632401, -955552, -826971, -325153, 62673, 43402, -193226, -277554, -98661, 140765, 237178, 222829, 251604, 349688, 382602, 237365, -49888, -335603, -477946, -435649, -315904, -278379, -343201, -380405, -351287, -412399, -638491, -788738, -566163, -23014, 506837, 793696, 797865, 486278, -98989, -624839, -699424, -391358, -183104, -313261, -502981, -469031, -348730, -381854, -473714, -375493, -97643, 146826, 270586]
36259B70586M6098p3346k76353l93955l00860j01189O5893J98663L12330L36091
36249H3958K19740O990k16734l25549j80468J53411L39287J85478j0119J15863
36239C71857L64709K43687k07643m25219k13609l2703j87957l04619L7376N89469
36229B35348P65883L93299k13426o66497p03188k54904L55672N42394J14814m11630
36219A57765m67563j36655J28766K19430L43670M74098L26882j27146n49975o79969
36209c10697n75447l89052j73820M8142K34502L64003M03663L08620J73473K10412
36199B93799L98921L90811K8476l00814j98346R6459O9306k23565k50315R0802
36189C95534K78440J5099k97953k03345J41148K70694Q2964j31690j35458N0456
$$ y = [270586, 316684, 243338, -33015, -426970, -727830, -829019, -763126, -564463, -252133, 83958, 303698, 310688, 93954, -231595, -412063, -258652, 80635, 266113, 255994, 371857, 736566, 980253, 772610, 347391, 133782, 101079, -86878, -391497, -354121, 235348, 1001231, 1394530, 1181104, 514607, -188581, -443485, -87813, 454581, 569395, 157765, -309798, -446453, -317687, -98257, 245413, 719511, 1046393, 919247, 369272, -310697, -886144, -1275196, -1449016, -1400874, -1166372, -802369, -398706, -90086, 83387, 293799, 692720, 1083531, 1112007, 811193, 612847, 709306, 778612, 555047, 304732, 395534, 673974, 689073, 391120, 187775, 328923, 599617, 682581, 550891, 415433, 465889]
36179D65889K53013K74734M5742k24669k17930O0365K23725J1760l65440n38141
36169a0952m10022j23135J70554L16550J82862j01169j71586O4091K13100j0323
36159A19970k70173j15069K37163J86537k61448m28736n330M39035K88559k45981
36149e5473n01209k78526O8648K58668L10726K29815n6087l82527l86613j3504
36139h06082L35532L37502J52456R0632J36926Q7084l4295k9118Q6919Q8704o4307
36128C81953j49601o6330j5519j57674l20469k42491L8172K42817K26344J07391
36118D4593M4482M4657L2210j139J4742J20611K55118L01631K01413R002j62453
36107I04867k28037j73672p0966n1247j72874k97116k28558j8908N9116o5794
$$ y = [465889, 718902, 993636, 1039378, 814709, 596779, 657144, 880869, 892629, 527189, -10952, -420974, -544109, -373555, -57005, 125857, 24688, -146898, -82807, 130293, 119970, -150203, -265272, -28109, 158428, -103020, -531756, -537086, -98051, 190508, -55473, -556682, -835208, -766560, -507892, -197166, 32649, -23438, -405965, -792578, -806082, -470550, -133048, 19408, 110040, 246966, 334050, 299755, 270637, 357556, 446260, 381953, 232352, 166022, 150503, -7171, -327640, -570131, -531959, -289142, -62798, 44593, 89075, 133732, 165942, 164803, 179545, 300156, 555274, 856905, 1058318, 1067320, 904867, 676830, 503158, 432192, 380945, 208071, -89045, -317603, -336511, -277395, -343189]
36097c43189j16632O9060K14869O3308j16852M9006L14827J19643m34849o07834
36087g88643j48848K94648J89043j27160j27207N9565M8628m8226O9909J99582
36077c78709m1886m26705l73835J05410M10453K93960J44192K40206L29497J32898
36067D35481k08897l93811l14635m0728K49474K91287J6502k26345j11384J07067
36057a95989k9690l49951k38168L19662N95612K14611k99415l76397j61877l4206
36047e55808N5890K71996L93879J77860j22894j17722Q9539J04330j14401k58807
36037g6138j92257p4871m6965r2591j52280j55198l5265J44067K38904K76925
36027a65669L95065M61940J70635l42233m69156j2595M02519J98505l23108m94685
$$ y = [-343189, -459821, -390761, -175892, -112584, -229436, -180430, 134397, 254040, -180809, -788643, -937491, -642843, -453800, -580960, -708167, -648602, -599974, -648200, -578291, -378709, -420595, -847300, -1221135, -1115725, -705272, -411312, -267120, -26914, 302583, 435481, 226584, -167227, -481862, -522590, -273116, 18171, 34673, -191672, -303056, -195989, -225679, -575630, -813798, -494136, 101476, 316087, 16672, -359725, -521602, -555808, -499918, -227922, 165957, 343817, 220923, 103201, 192740, 297070, 182669, -76138, -268395, -343266, -390231, -482822, -635102, -790300, -825565, -681498, -442594, -165669, 229396, 691336, 861971, 519738, 50582, 37987, 440506, 639011, 315903, -178782]
36017a78782k32444N6797J91247K74405K83015J37380J021L5500O3974p6436j36549
36006D19128P6624J65423k75737q13696o68076Q7459N90299M35627J02098N1794
35996A70943J27745M5937j24983k23795k64007k43699q2516J31403K01851J75171
35986h5950K43144L19001J58242j40933k59073k21533k87103l45134q3434K77602
35976d25171J81328k73992l58336J07054M33233K08272r3698m9091N204k56041
35966e21238m21855o7670M03411L60576o4797k70320j07073J16757K53614L48077
35956B9482L02219L7814k29308l07496l40646m21051k88365J45704M33016K78987
35946c59644J13452L44909N38340J13194n55114o28919j27460J85568P7746M4077
$$ y = [-178782, -411226, -354429, -163182, 111223, 394238, 531618, 532639, 568139, 632113, 555677, 419128, 495752, 661175, 385438, -428258, -1096334, -1008875, -418576, 17051, 119149, 170943, 298688, 344625, 219642, -4153, -268160, -511859, -594375, -462972, -261121, -85950, 157194, 476195, 634437, 493504, 234431, 12898, -274205, -619339, -702773, -425171, -243843, -517835, -876171, -769117, -335884, -127612, -221310, -270401, -265197, -521238, -943093, -1010763, -607352, -246776, -311573, -581893, -688966, -572209, -318595, 29482, 331701, 369515, 140207, -167289, -507935, -928986, -1217351, -1071647, -638631, -359644, -246192, 98717, 637057, 750251, 195137, -433782, -561242, -375674, -297928, -253851]
35936b53851K50347K57517m7320j42929K19028N52283M05341k5262l33081l99113
35926D82960k26205J63300M52234K30217l02894m32321J8301L57888P8881l98202
35916D24159m60741j97602l8685m559J04653J67952o386j79936k2217K55202J68355
35905B10195k61112n21884l47949K2122K88563L81241L21279J58857M4809N7488
35895C53609J3709k32706m08462j44707L65085N02426R6171k92516j47790L13137
35885D17956N02706K47282j05531k26232j47952q4801j37670k50571l31998l32277
35875d49088k42462q5200P7571J60417J19877O163q7983j30883j47899j11866
35865h91353N7710L23500M63837L10780J1341j04922N2158J85405j0980m07001
$$ y = [-253851, -3504, 254013, 206693, 63764, 282792, 835075, 1240416, 1215154, 882073, 482960, 256755, 420055, 872289, 1102506, 799612, 367291, 385592, 743480, 822361, 424159, -36582, -234184, -272869, -277428, -172775, -4823, -11209, -191145, -213362, 41840, 210195, -50917, -572801, -920750, -898628, -610065, -228824, 92455, 251312, 296121, 353609, 367318, 134612, -273850, -418557, -53472, 448954, 545125, 252609, 104819, 417956, 920662, 1167944, 1062413, 836181, 688229, 603428, 465758, 215187, -116811, -449088, -691550, -776750, -699179, -538762, -418885, -412722, -500705, -631588, -779487, -891353, -833643, -510143, -46306, 264474, 275815, 170893, 223051, 408456, 397476, -9525]
35855i525n36007j74616L23195M19010N5509k76430j84052J29144J82917j12554
35845a83409l66137k49934J23272M29339N22279M63521L15238Q7800j46364k42724
35835G52881j43651J7570M4864q6445j99575j76597j55155l11626n09895m21353
35825a188982k7638K94560L11835K35985K83826K85102N6514j62087q6846O6581
35815F8850n9139k90432k26483l8106k06747n21776k33708O19744R75248K67782
35805C55233o41628o81342j8368M35099L90341K28387J05901q9122j53297J57057
35795H8261M14385Q06p38816p83284R062N98832L19586j99645j63559J79684J65271
35784a09417j02309m5576K86461K95365j17084l80320j96484M1272l7253k21633
$$ y = [-9525, -545532, -720148, -396953, 22057, 77566, -198864, -382916, -253772, -70855, -183409, -549546, -799480, -676208, -246869, 275410, 738931, 1054169, 1141969, 995605, 752881, 609230, 626800, 671664, 585219, 385644, 209047, 53892, -257734, -767629, -1188982, -1216620, -922060, -610225, -374240, -90414, 194688, 251202, 89115, 2269, 68850, 9711, -280721, -507204, -545310, -752057, -1273833, -1507541, -887797, 87451, 355233, -286395, -967737, -986105, -551006, -160665, 67722, 173623, 84501, -68796, 88261, 502646, 503452, -235364, -1018648, -1009586, -410754, -91168, -290813, -454372, -274688, -109417, -211726, -257302, 29159, 324524, 207440, -172880, -369364, -328092, -365345, -586978]
35774e86978j71804J0760K4963j00181r4746P1174J47219L5775k3815J89959N14418
35763A6744N48501J31294m38976p00828m87934m1035K92694L70243K55978N5002
35753A683j38549k04502q1237R1263O4151k02052m23241l15010L8874K82314K21012
35742f65294N7j59589k06212j57205L6445L34604M72897K53212j00120j77090
35732c68295K4048P9429j87006l76945j09027L61323M71046J23909k57934l83580
35722f23032l71451l27359p3333M64963Q95820P33202N4673m98040m33268M9086
35712a28739L32660J11697k99459m06335j42493J20933J21069J1321K8692R8905
35702a51749J4049j49876j13029J38257K78966J16929j35303j96050j00696o7992
$$ y = [-586978, -758782, -748022, -723059, -823240, -917986, -846812, -699593, -663818, -687633, -497674, 16744, 565245, 696539, 257563, -443265, -931199, -972234, -679540, -309297, -53319, 1683, -136866, -341368, -422605, -331342, -267191, -469243, -892484, -1207494, -1168620, -886306, -665294, -665237, -824826, -1031038, -1188243, -1151798, -817194, -344297, -91085, -191205, -368295, -344247, -264818, -451824, -828769, -937796, -576473, -105427, 18482, -239452, -623032, -994483, -1321842, -1395175, -930212, -34392, 698810, 753483, 255443, -177825, -128739, 203921, 315618, 16159, -390176, -532669, -411736, -290667, -279346, -250654, -151749, -137700, -287576, -400605, -262348, 16618, 133547, -1756, -197806, -298502, -366494]
35692c66494j32295j21256N5632K71381L37910J89846q5966l13935l19899n8138
35682e43214K89448L99272J08812l31508m32482k6295M41242M09675l9979k65729
35672I242J8098L32042K14027l4173R8482L67949J09415n58289p16843m4446N86653
35661C82157L70154k72759m54597k04107k32372n99328n75856R9220P01134N89810
35651a96544J15792j8609J87821J86038j93303n34989n07080k50216k2285J65552
35641a067823L81671N00920L44944J0836j52419N3120M00404M60161Q5723m09077
35631F08460n96966l90367o8239Q7951N4210k5400m2006M120K9054n4713j82450
35620e76346r7188L34032P60361O04249j72113q44515p44666q8788L52996K64645
$$ y = [-366494, -498789, -620045, -564413, -293032, 44878, 234724, 148758, -165177, -485076, -543214, -253766, 145506, 254318, -77190, -509672, -535967, -94725, 314950, 274971, 9242, 27340, 359382, 573409, 539236, 637718, 1005667, 1115082, 556793, -160050, -204496, 382157, 752311, 479552, 24955, -179152, -411524, -1010852, -1586708, -1487488, -786354, -196544, -80752, -99361, 88460, 274498, 81195, -453794, -960874, -1211090, -1233375, -1067823, -686152, -185232, 159712, 170548, 18129, 71249, 471653, 931814, 1017537, 608460, 11494, -378873, -447112, -359161, -304951, -330351, -372357, -368237, -339183, -393896, -576346, -673534, -339502, 420859, 1025108, 852995, 8480, -736186, -824974, -471978, -207333]
35610b07333L0418N976M2176r0513k27104q4313K40358L80544J86294j63815m20933
35599c08245m03552l0054M92643O50251J64598n01871n96235n5978L97414K70716
35589G9687n5184J8656L96076M76277O1899l96221m53585j83096N9519R2573q576
35578H8025j02905j23054j05330j37613k17516j89825M9798L19877L10270M803
35568a03470k45226j56638J40353L13681K50699J03982l248j14159k53850k84283
35558c52159q3661J91625K02244j45431m99025m51711p3728J71123O8565n6393
35548a028551J41170M60996M27722J8165k55704n1578L42705M36222J91045j0744
35538F71448L9998J01872j27870n35477o85824l71772J05741L06919J84071N6624
$$ y = [-207333, -176915, -170939, -128763, -219276, -446380, -530693, -290335, 90209, 276503, 112688, -308245, -711797, -741851, -249208, 401043, 565641, 63770, -532465, -588443, -191029, 79687, 24503, 43159, 439235, 915512, 977411, 581190, 127605, -55491, 4028, 96601, 88025, -14880, -137934, -243264, -380877, -598393, -788218, -738420, -418543, -108273, -103470, -348696, -505334, -364981, -51300, 199399, 303381, 300133, 185974, -67876, -352159, -435820, -244195, -41951, -187382, -686407, -1138118, -1211846, -1040723, -972158, -1028551, -887381, -426385, 1337, 19502, -236202, -287780, 54925, 491147, 682192, 671448, 711446, 813318, 685448, 149971, -535853, -907625, -801884, -494965, -310894, -254270]
35528b54270J02615J41726R326j28421n4716J03694O5060j23167j19519J79877
35518g7795M45588L55517J8788j74530j7055K96029L71539L6226m28761n66008
35508B59538l09656p8699j52421k29591N9375M53553L91411o9957k77595J3466
35498E9424K89279J43875j21726j35011j12984l53551n28244j65782M24929M60970
35488c8821j29040n26682j69971N10894P48711L61274k71107p58045q79803n16139
35478a668729J86671P15792O44717J66294j25925K0273K92351L58682K86018K44951
35468A121095J24402k24047n44750m11182J07851M42987L08137P2531J02819J47617
35458A247460j85857o47102o22034q8189L24806K73295Q8782O6573r214k93043
$$ y = [-254270, -151655, -9929, -603, -129024, -183740, -80046, -14986, -138153, -257672, -77795, 367793, 723310, 742098, 567568, 550513, 846542, 1218081, 1254307, 825546, 259538, -50118, -128817, -281238, -510829, -451454, 2099, 393510, 323553, 45958, 59424, 348703, 492578, 370852, 235841, 122857, -230694, -758938, -924720, -499791, -38821, -167861, -694543, -864514, -353620, 395091, 756365, 485258, -272787, -1152590, -1668729, -1482058, -766266, -121549, 44745, -81180, -60907, 231444, 590126, 876144, 1121095, 1245497, 1021450, 476700, 65518, 173369, 616356, 924493, 997024, 1099843, 1247460, 1061603, 414501, -207533, -295722, 29084, 302379, 391161, 457734, 448520, 155477]
35448A55477m00679j5485M50475L98670k8254j97673j2672O382l08013m21207
35438c72979J9855N31066M60072n7360l17989o5753K24903J15560k01968k97176
35428C8231j50271n4540n3999P0742K62803J41939l02708m68591L64N29067L86784
35417C99821j49208j84793L37333M93628j22751o86625m06692K85825M95378J91433
35407F53349k0999k1365j80152m62534l96822O7108M09989L37921J09916j2696
$$ y = [155477, -245202, -260687, 189788, 588458, 560204, 362531, 349859, 356241, 48228, -372979, -353124, 177942, 638014, 580654, 262665, 196912, 421815, 537375, 335407, 38231, -112040, -166580, -220579, -149837, 112966, 254905, -47803, -516394, -516030, 13037, 399821, 250613, 65820, 403153, 896781, 774030, 87405, -319287, -33462, 461916, 653349, 632350, 610985, 430833, -31701, -428523, -361415, 48574, 386495, 496411, 483715]
$$ [...]
##END NTUPLES=NMR SPECTRUM
##END=
