##TITLE=31Pdec_IVDM0104S
 CDCl3, 24 sc
 2.4.2019
##JCAMPDX= 6.0         $$ Bruker NMR JCAMP-DX V2.0
##DATA TYPE= NMR SPECTRUM
##DATA CLASS= NTUPLES
##ORIGIN= UXNMR, Bruker Analytische Messtechnik GmbH
##OWNER= root
$$ XWIN-NMR		Version 3.5
$$ Tue Apr  2 14:27:19 2019 Russian Standard Time (UT+4h)  she@DPX200
##.OBSERVE FREQUENCY= 81.013821
##.OBSERVE NUCLEUS= ^31P
##.ACQUISITION MODE= SIMULTANEOUS
##.ACQUISITION SCHEME= undefined
##.AVERAGES= 24
##.DIGITISER RES= 17
##SPECTROMETER/DATA SYSTEM= spect
##.PULSE SEQUENCE= zgpg30
##.SOLVENT NAME= CDCl3
##.SHIFT REFERENCE= (INTERNAL, CDCl3, 0, 182.463)
##AUDIT TRAIL= $$ (NUMBER, WHEN, WHO, WHERE, WHAT)
$$ ##TITLE= Audit trail, XWIN-NMR		Version 3.5
$$ ##JCAMPDX= 5.01
$$ ##ORIGIN= Bruker BioSpin GmbH
$$ ##OWNER= she
$$ F:/spectra/data/she/nmr/P31/1/pdata/1/auditp.txt
$$ ##AUDIT TRAIL=  $$ (NUMBER, WHEN, WHO, WHERE, WHAT)
(   1,<2019-04-02 14:26:13.84 +0400>,<she>,<DPX200>,
      <created by zg, POWCHK disabled, PULCHK disabled
       configuration hash MD5:
       00 E9 B6 7A A2 85 ED C7 34 08 36 98 17 FE 4E 26
       data hash MD5: 32K
       C1 5F 20 64 29 08 D7 4D 1B 45 51 E4 F9 5F 3E B7>)
(   2,<2019-04-02 14:26:19.31 +0400>,<she>,<DPX200>,
      <Start of raw data processing
       efp BC_mod = 2 LB = 1 FT_mod = 6 PKNL = 1 PHC0 = -1792.971 PHC1 = 40.39897 SI = 64K 
       data hash MD5: 64K
       DC E8 7E 30 75 08 BB 4A E9 09 6A 21 0D E6 A2 9C>)
(   3,<2019-04-02 14:26:38.20 +0400>,<she>,<DPX200>,
      <pk PHC0 = 0.1386745 PHC1 = 0 
       data hash MD5: 64K
       69 84 E3 68 E1 BF 92 67 1D 31 6F 75 8C 1D 1C 43>)
(   4,<2019-04-02 14:26:41.14 +0400>,<she>,<DPX200>,
      <abs ABSG = 5 
       data hash MD5: 64K
       F5 DB 6A E1 58 6B F2 F6 20 D6 50 A0 41 74 C6 89>)
$$ ##END=
$$ 
$$ hash MD5
$$ C1 8F A7 E2 3C FC 10 79 A6 AA 81 34 0D 59 5B 9F
##$RELAX= 
##$RELAX= 
##$RELAX= 
##$RELAX= 
##$RELAX= 
##$RELAX= 
##$RELAX= 
##$RELAX= 
$$ Bruker specific parameters
$$ --------------------------
##$DU= <F:/spectra>
##$EXPNO= 1
##$NAME= <P31>
##$PROCNO= 1
##$TYPE= <nmr>
##$USER= <she>
##$AMP= (0..31)
100 100 100 100 100 100 100 100 100 100 100 100 100 100 100 100 100 100 
100 100 100 100 100 100 100 100 100 100 100 100 100 100 
##$AQSEQ= 0
##$AQ_mod= 1
##$AUNM= <au_zg>
##$AUTOPOS= <>
##$BF1= 81.014009
##$BF2= 200.13
##$BF3= 200.13
##$BF4= 200.13
##$BF5= 200.13
##$BF6= 200.13
##$BF7= 200.13
##$BF8= 200.13
##$BYTORDA= 1
##$CFDGTYP= 0
##$CFRGTYP= 5
##$CHEMSTR= <none>
##$CNST= (0..31)
1 1 145 1 1 1 1 1 1 1 1 1 1 1 1 1 1 1 1 1 1 1 1 1 1 1 1 1 1 1 1 1 
##$CPDPRG= <waltz16>
##$CPDPRG1= <>
##$CPDPRG2= <waltz16>
##$CPDPRG3= <>
##$CPDPRG4= <mlev>
##$CPDPRG5= <mlev>
##$CPDPRG6= <mlev>
##$CPDPRG7= <mlev>
##$CPDPRG8= <mlev>
##$CPDPRGB= <>
##$CPDPRGT= <>
##$D= (0..31)
0 1 0 0 0 0 0 0 0 0 0 0.03 2e-05 3e-06 0 0 0 0 0 0 0 0 0 0 0 0 0 0 0 0 
0 0 
##$DATE= 1554200773
##$DBL= (0..7)
120 120 120 11 120 120 24 19 
##$DBP= (0..7)
150 150 150 150 150 150 150 150 
##$DBP07= 0
##$DBPNAM0= <>
##$DBPNAM1= <>
##$DBPNAM2= <>
$$ [...]
##$SUBNAM3= <"">
##$SUBNAM4= <"">
##$SUBNAM5= <"">
##$SUBNAM6= <"">
##$SUBNAM7= <"">
##$SUBNAM8= <"">
##$SUBNAM9= <"">
##$SW= 369.568048894756
##$SWIBOX= (0..15)
0 1 3 0 0 0 0 0 0 0 0 0 0 0 0 0 
##$SW_h= 29940.119760479
##$TD= 32768
##$TD0= 1
##$TE= 0
##$TE2= 300
##$TE3= 300
##$TEG= 300
##$TL= (0..7)
0 120 53 12 22 120 120 120 
##$TP= (0..7)
150 150 150 150 150 150 150 150 
##$TP07= 0
##$TPNAME0= <>
##$TPNAME1= <>
##$TPNAME2= <>
##$TPNAME3= <>
##$TPNAME4= <>
##$TPNAME5= <>
##$TPNAME6= <>
##$TPNAME7= <>
##$TPOAL= (0..7)
0.5 0.5 0.5 0.5 0.5 0.5 0.5 0.5 
##$TPOFFS= (0..7)
0 0 0 0 0 0 0 0 
##$TUNHIN= 0
##$TUNHOUT= 0
##$TUNXOUT= 0
##$USERA1= <user>
##$USERA2= <user>
##$USERA3= <user>
##$USERA4= <user>
##$USERA5= <user>
##$V9= 5
##$VALIST= <valist>
##$VCLIST= <CCCCCCCCCCCCCCC>
##$VD= 0
##$VDLIST= <DDDDDDDDDDDDDDD>
##$VPLIST= <PPPPPPPPPPPPPPP>
##$VTLIST= <TTTTTTTTTTTTTTT>
##$WBST= 1024
##$WBSW= 4
##$XGAIN= (0..3)
0 0 0 0 
##$XL= 0
##$YL= 0
##$YMAX_a= 38782
##$YMIN_a= -41595
##$ZGOPTNS= <>
##$ZL1= 120
##$ZL2= 120
##$ZL3= 120
##$ZL4= 120
##$ABSF1= 182.463
##$ABSF2= -187.1042
##$ABSG= 5
##$ABSL= 3
##$ALPHA= 0
##$AQORDER= 0
##$ASSFAC= 0
##$ASSFACI= 0
##$ASSFACX= 0
##$ASSWID= 0
##$AUNMP= <proc_1d>
##$AZFE= 0.1
##$AZFW= 0.5
##$BCFW= 0
##$BC_mod= 2
##$BYTORDP= 0
##$COROFFS= 0
##$CY= -3
##$DATMOD= 1
##$DC= 0
##$DFILT= <>
##$DTYPP= 0
##$F1P= 0
##$F2P= 0
##$FCOR= 1
##$FTSIZE= 65536
##$FT_mod= 6
##$GAMMA= 0
##$GB= 0
##$INTBC= 1
##$INTSCL= 5.30512e-09
##$ISEN= 30
##$LB= 1
##$LEV0= 0
##$LPBIN= 0
##$MAXI= 10000
##$MC2= 0
##$MEAN= 0
##$ME_mod= 0
##$MI= 50
##$NCOEF= 0
##$NC_proc= -3
##$NLEV= 6
##$NOISF1= 182.463
##$NOISF2= 159.3651
##$NSP= 0
##$NTH_PI= 0
##$NZP= 0
##$OFFSET= 182.463
##$PC= 4
##$PHC0= -1792.832
##$PHC1= 40.39897
##$PH_mod= 1
##$PKNL= yes
##$PPARMOD= 0
##$PSCAL= 0
##$PSIGN= 0
##$REVERSE= no
##$SF= 81.0140089999434
##$SI= 65536
##$SIGF1= 159.3651
##$SIGF2= -187.1042
##$SINO= 113.3802
##$SIOLD= 16384
##$SREGLST= <1H.CDCl3>
##$SSB= 0
##$STSI= 65536
##$STSR= 0
##$SW_p= 29940.119760479
##$SYMM= 0
##$S_DEV= 0
##$TDeff= 32768
##$TDoff= 0
##$TI= <>
##$TILT= no
##$TM1= 0
##$TM2= 0
##$TOPLEV= 0
##$USERP1= <user>
##$USERP2= <user>
##$USERP3= <user>
##$USERP4= <user>
##$USERP5= <user>
##$WDW= 1
##$XDIM= 65536
##$YMAX_p= 297953976
##$YMIN_p= -6184608
$$ End of Bruker specific parameters
$$ ---------------------------------
##NTUPLES= NMR SPECTRUM
##VAR_NAME=  FREQUENCY,     SPECTRUM/REAL,   SPECTRUM/IMAG
##SYMBOL=    X,             R,               I
##VAR_TYPE=  INDEPENDENT,   DEPENDENT,       DEPENDENT
##VAR_FORM=  AFFN,          ASDF,            ASDF
##VAR_DIM=   65536,         65536,           65536
##UNITS=     HZ,            ARBITRARY UNITS, ARBITRARY UNITS
##FACTOR=    0.456856943014862, 1,           1
##FIRST=     14782.0589164792, 0,            0
##LAST=      -15158.0608439998, 0,           0
##MIN=       -15158.0608439998, -6184608,    0
##MAX=       14782.0589164792, 297953976,    0
$$ Real data points
##PAGE= N=1
##DATA TABLE= (X++(R..R)), XYDATA
$$ [...]
41520d31998j42924J06452K11930R0730o0916j8937J29141J17124o0737j31944
$$ -431998 -574922 -468470 -256540 -165810 -226726 -245663 -116522 602 -60135 -192079
41510a92079M829J25304O7003l1059j3253M6142M2640L6243P9795Q6632K5511
$$ -192079 -187250 -61946 5057 -26002 -39255 6887 49527 85770 165565 252197 277708
41499B77708R577M6641k7557k09457k36504l9357O2653j07245k17977L1859L45479
$$ 277708 287285 333926 306369 96912 -139592 -178949 -116296 -223541 -441518 -409659 -64180
41488f4180K70410m7631j01632J35964J99378o2988k51182j01628J02665L1131
$$ -64180 206230 158599 56967 192931 392309 329321 78139 -23489 79176 110307
41478A10307j87935k25723l5664J70091K32102J32945o9847k38362k10535Q916
$$ 110307 -77628 -303351 -339015 -168924 63178 196123 126276 -112086 -322621 -313705
41468c13705K18415K61072J82252R6625L9837P223m171m6486j73687l01025k62478
$$ -313705 -95290 165782 348034 444659 484496 491719 487548 441062 267375 -33650 -296128
41457b96128n3301J36219J73158J16060N8675M415m8432n1100J207M1888L7237
$$ -296128 -349429 -213210 -40052 76008 134683 139098 90666 39566 40773 82661 119898
41446A19898P983m5813j10022q8675N7119J60860O0756j04319q3045N6167K2315
$$ 119898 127881 82068 -27954 -116629 -59510 101350 162106 57787 -25258 30909 53224
41435E3224j77730k13198J0436J82346J14662K3241Q1564J06188m5563j52819
$$ 53224 -124506 -337704 -327268 -144922 -30260 -7019 74545 180733 135170 -17649
41425a7649l2057R3934j248j04086N3027K51094J20245j99603k62141m5147O3571
$$ -17649 -49706 44228 42980 -61106 -8079 243015 363260 163657 -98484 -143631 -80060
41414h0060m7505q6612N6145J20471k3925j58012j31924p6537n1899R1380L21087
$$ -80060 -127565 -214177 -158032 -37561 -61486 -219498 -351422 -427959 -479858 -388478 -67391
41403f7391L19154O817k23763r2865J16888L9255j69174j15550J68512L02781
$$ -67391 251763 258580 34817 -58048 58840 98095 -71079 -186629 -18117 284664
41393B84664J73530L9398N2560O5206m3813j74189k13684j87889j29768j7658
$$ 284664 458194 497592 550152 615358 571545 397356 183672 -4217 -133985 -151643
41383a51643R4090Q4179l1573q8356k4475L2005q327o0248l8859m158k9880o9156
$$ -151643 -57553 26626 -4947 -93303 -117778 -85773 -94100 -154348 -193207 -197365 -227245 -296401
41371b96401n5205j4824J6198P4630J66968J97631J08173j3198o8162r0975j39611
$$ -296401 -351606 -366430 -350232 -275602 -108634 88997 197170 183972 115810 24835 -114776
41360a14776j55019p2137K7276L9965L8235J50442K98449K68874L8442j80368
$$ -114776 -269795 -341932 -314656 -274691 -236456 -86014 212435 481309 519751 339383
41350C39383k37729j87041r8055M2552J70392J21569r1795j95732k2673K14190
$$ 339383 101654 -85387 -183442 -140890 29502 151071 59276 -136456 -159129 55061
41340E5061K20278L6901p8924o1804m4574m0046O8029K25905K19391L8800o2093
$$ 55061 275339 312240 233316 171512 126938 86892 154921 380826 600217 639017 576924
41329E76924K7016Q7536n8112k47856k49753j19449n8580p7507m6387K5845J4026
$$ 576924 603940 691476 633364 385508 135755 16306 -42274 -119781 -166168 -140323 -126297
41318a26297p3472r2525J787R9031J04138J8922j16174k21949j74653M2489K36123
$$ -126297 -199769 -292294 -290507 -191476 -87338 -68416 -184590 -406539 -581192 -538703 -302580
41307c02580K19175P2502Q214M3433L6585r619M0361J48238J07639r1658k00284
$$ -302580 -83405 -10903 -2689 40744 77329 67710 108071 256309 363948 272290 72006
41296G2006j04873J42l2701o5319K5984Q6909l1596j58859o9773J09720R0350
$$ 72006 -32867 -32725 -65426 -130745 -104761 -17852 -49448 -208307 -278080 -168360 -78010
41285g8010r7665j56521j7209O5631m2828j44244n5559R9129J16732L6203L3391
$$ -78010 -175675 -332196 -349405 -283774 -326602 -470846 -526405 -427276 -310544 -274341 -240950
41274b40950J18539J38407L2085q4838r6231k0275O2049J22125J70984J80554
$$ -240950 -122411 15996 48081 -36757 -132988 -153263 -91214 30911 201895 382449
41264C82449R4711o7781j81915j45797j3659P3494P4394O4961P0392K2133p1983
$$ 382449 477160 409379 227464 81667 68008 141502 215896 280857 351249 373382 301399
41253C01399q0610K5409O8897n4629j59681n6022R3554J398k43881k66708r89
$$ 301399 220789 246198 315095 260466 100785 44763 138317 139715 -104166 -370874 -371863
41242c71863J90156R3626m1821K6881J22710Q397j41122k4968K23094K10988n7407
$$ -371863 -181707 -88081 -129902 -103021 19689 28086 -113036 -138004 85090 296078 238671
41231B38671j71129J1338J31283o7047l05440k15260Q4800J90705K2602j14763
$$ 238671 67542 78880 210163 143116 -162324 -377584 -292784 -102079 -79477 -194240
41221a94240k9850J12254R3130n4257j48334j09147N233J16173J76869J60004
$$ -194240 -224090 -111836 -18706 -72963 -221297 -330444 -325211 -209038 -32169 127835
41211A27835P8859J965j3165N972j5983r2484j45744j04912j483O7040N2529q133
$$ 127835 206694 208659 195494 201466 185483 92999 -52745 -157657 -159140 -92100 -39571 -47704
41199d7704o4014r0940n1321Q9788K50514K43813K6104j57609o3335J67310J58398
$$ -47704 -111718 -202658 -253979 -164191 86323 330136 356240 198631 135296 302606 461004
41188D61004j38332l18988j05079K23880K29226n0969j98785o1501P1898j9880
$$ 461004 322672 3684 -101395 122485 351711 300742 101957 40456 112354 92474
41178I2474j55649q9829Q2529R6975n6555j29233J3205K15159K50959Q7365j13322
$$ 92474 -63175 -153004 -70475 26500 -30055 -159288 -146083 69076 320035 407400 294078
41167B94078j81252j00290n406j8229r3263q4781K8487Q6674k9301k16175k77063
$$ 294078 112826 12536 7130 -11099 -104362 -189143 -160656 -73982 -103283 -319458 -596521
41156e96521j59539K8001J72753K23491J53711j2955j54094j41220L589J26112
$$ -596521 -756060 -728059 -555306 -331815 -178104 -191059 -345153 -486373 -482784 -356672
41146c56672J25477N2959J7701N2903R0607M2650q6423j65913p6595J04026J57374
$$ -356672 -231195 -178236 -160535 -107632 -17025 25625 -60798 -226711 -303306 -199280 -41906
41135d1906J7136j21478q5579K3573K3000l9067J0088J35513J45877N2318P0980
$$ -41906 -24770 -146248 -231827 -208254 -185254 -224321 -214233 -78720 67157 119475 190455
41124A90455K17439K11080p7291l58671l14017m1413J16581M2064r9410j63263
$$ 190455 407894 618974 541683 183012 -131005 -172418 -55837 -13773 -113183 -276446
41114b76446j48131p1015N3575J28940O7252m0414j9460J28501K27443J81981
$$ -276446 -424577 -495592 -442017 -313077 -245825 -286239 -305699 -177198 50245 232226
41104B32226O2668n7775j69141k09700q4564J42826K49287J23923r2020k03000
$$ 232226 294894 237119 67978 -141722 -226286 -83460 165827 289750 197730 -5270
41094e270j67449n0508Q6286J68352J19019j6793p9281j4299L8537k4940r8763
$$ -5270 -172719 -223227 -136941 31411 150430 133637 54356 40057 78594 53654 -45109
41083d5109n4269L4545K7296k8079J8476J42224J71379P4364R35J0397k5613j68713
$$ -45109 -99378 -64833 -37537 -65616 -47140 95084 266463 340827 341762 352159 326546 157833
41071A57833k55043j29064R7050J80444P5697l4358k0396L2559o162r8701r8335
$$ 157833 -97210 -226274 -129224 51220 126917 92559 72163 104722 98560 -141 -98476
41060i8476J5682Q3037j1245j42481q9100J50623L18201K21363j7639j40292q6824
$$ -98476 -82794 243 -11002 -153483 -242583 -91960 226241 447604 429965 289673 202849
41049B02849j3684k8470p3291p5619n4114k7060M4054J44828J59901L0854j23830
$$ 202849 189165 160695 87404 11785 -42329 -69389 -25335 119493 279394 310248 186418
41038A86418j47721m7823L5460J8656m8945p4157j7550P8552J18539M6282o3692
$$ 186418 38697 -9126 26334 44990 -3955 -78112 -95662 -17110 101429 147711 84019
41027H4019p7593l78O071j20225j93777l4961K28315L06367J50803L07J4478P5381
$$ 84019 6426 6048 12119 -108106 -301883 -336844 -108529 197838 348641 348948 363426 438807
41015D38807K1397j10910j89205j82955j35479n3385N0543R7240M8646m459J8341
$$ 438807 460204 349294 160089 -22866 -158345 -211730 -161187 -63947 -15301 -19760 -1419
41004a419M5899r737o7891q413P9319K41k03142k56800o5934J19713Q2031l9306
$$ -1419 44480 34743 -33148 -41561 37758 37999 -165143 -421943 -487877 -368164 -286133 -325439
40992c25439j61J31930Q7184j44840k55209o5595K08495K61833Q4221r9878j38765
$$ -325439 -325600 -193670 -106486 -251326 -506535 -572130 -363635 -101802 -17581 -117459 -256224
40981b56224m7918R8661K08442J73216q093j62569j49282o1904m8256k1184J81888
$$ -256224 -304142 -205481 2961 176177 168084 5515 -143767 -205671 -253927 -275111 -93223
40970i3223M00156K73195j63030l92468j38949J89117R8576k44755l09383l7181
$$ -93223 306933 580128 417098 24630 -114319 74798 173374 -71381 -380764 -417945
40960d17945J32769K3163n1902Q9454J74778R225j36733o734J55287J0611k65720
$$ -417945 -285176 -262013 -313915 -224461 -49683 -40458 -177191 -183925 -28638 -18027 -283747
40949b83747k47692M1627J78525K7078r7208L911J21701O0460k9324M8705J90004
$$ -283747 -531439 -489812 -311287 -284209 -381417 -377506 -255805 -195345 -224669 -175964 14040
40938A4040J88290Q2223N4052J05233P3415p2614j61334o9601Q7226Q2830j38773
$$ 14040 202330 284553 338605 443838 517253 444639 283305 213704 300930 383760 244987
40927B44987l59939l11821n382K49133K25225P1311O6366J83844J43566j22335
$$ 244987 -114952 -426773 -432155 -183022 42203 113514 179880 363724 507290 384955
40917C84955l35377k73062n2458J05125J65343J87837J45561J9365q2532p4078
$$ 384955 49578 -223484 -275942 -170817 -5474 182363 327924 347289 264757 190679
40907A90679k9000k2043R108Q2185M0436j75279l06885j19536J73345J62531j42743
$$ 190679 161679 139636 148744 230929 271365 96086 -210799 -330335 -156990 5541 -137202
40896a37202l12671j29064J32621J60529L6378K3912J48368K03621P0323j43829
$$ -137202 -449873 -578937 -446316 -285787 -249409 -225497 -77129 126492 196815 52986
40886E2986k39475j15193J28182K41398P5569k05962k92193j19944O4914Q6339
$$ 52986 -186489 -301682 -173500 67898 143467 -62495 -354688 -474632 -409718 -323379
40876c23379O3345J39502K02996Q1421j33825j99138p9304L7169N2094N6202R8868
$$ -323379 -260034 -120532 82464 163885 30060 -169078 -248382 -211213 -159119 -102917 -4049
40865d049Q3470l4767j33399j11659m9118n5316q0625k0519P7037P4780j8647
$$ -4049 79421 44654 -88745 -200404 -249522 -304838 -385463 -405982 -328945 -254165 -272812
40854b72812m7341M1380J04959K9634q7072q5228J6214N6803k4737j10374o6543
$$ -272812 -320153 -278773 -173814 -144180 -231252 -316480 -300266 -243463 -268200 -378574 -445117
40843d45117J01968K67601K82232Q5250k03028l24621j41974J56377K47189P5438
$$ -445117 -343149 -75548 206684 291934 88906 -235715 -377689 -221312 25877 101315
40833A01315r9146q8511p031k1585p5171k7501Q4896J25105Q1645K8507l6697
$$ 101315 2169 -86342 -93373 -114958 -190129 -217630 -132734 -7629 74016 102523 65826
40822F5826j15419q1619J23978K69611J01398k11660k42463O1067K68278R9418
$$ 65826 -49593 -131212 -7234 262377 363775 152115 -90348 -29281 238997 338415
40812C38415j83392k14470m8511K3298m6576p3916j247N1040K9808m972m0898
$$ 338415 155023 -59447 -107958 -84660 -131236 -205152 -206399 -155359 -125551 -130523 -171421
40801a71421j01333j11660Q741J52151J37478J634m7050L4607P1588j3756p6966
$$ -171421 -272754 -384414 -375673 -223522 -86044 -84410 -131460 -96853 -25265 -39021 -115987
40790a15987k2608K8229l3515j05460o0266K5929J0156o8568o8596m19k229q2924
$$ -115987 -138595 -110366 -143881 -249341 -309607 -283678 -273522 -342090 -410686 -411105 -413334 -496258
40778d96258q3686O7608K24383K21837R7790J6187L2951M3264m2459j55765j52436
$$ -496258 -579944 -512336 -287953 -66116 31674 47861 80812 124076 81617 -74148 -226584
40767b26584p356J37672J47781O4431K7069M9932j092j67934k74832j69602J2168
$$ -226584 -233940 -96268 51513 115944 143013 192945 191853 23919 -250913 -420515 -408347
40756d08347J7631j25456j20398J32396L29257J91913r4170j27229J25976K87996
$$ -408347 -390716 -516172 -636570 -504174 -174917 16996 -77174 -204403 -78427 209569
40746B09569J20992j61418k29627n9060J29159J80828J02567l5254j32603q6573
$$ 209569 330561 169143 -60484 -119544 9615 190443 293010 257756 125153 38580
40736C8580P3425J56848M9534j09581j29355m1112l69j4251J7060N8418q943j19173
$$ 38580 112005 268853 318387 208806 79451 38339 37970 23719 40779 99197 90254 -28919
40724b8919p4308J07342J64559o417j80931j59191n4565n7550j11267m0850J24528
$$ -28919 -103227 4115 168674 162257 -18674 -177865 -232430 -289980 -401247 -442097 -317569
40713c17569J90098J02222J6651N9332J64421J75753K9808j70792k35285p5958
$$ -317569 -127471 -25249 -8598 50734 215155 390908 420716 249924 14639 -61319
40703f1319J55805K05531K4504j64948j71388p0723l9510p8945n5608O0081J53346
$$ -61319 94486 300017 324521 159573 -11815 -82538 -122048 -200993 -256601 -196520 -43174
40692d3174J36415M0446m9816o9985j2132M9825J7508r6480j60076r9708Q370
$$ -43174 93241 133687 83871 13886 1754 51579 69087 -27393 -187469 -287177 -278807
40681b78807Q1379J37302J76395J06600q3977k22883j79640o5649l4480k0754
$$ -278807 -197428 -60126 116269 222869 138892 -83991 -263631 -329280 -363760 -384514
40671c84514J02509K28220J51505o0533j28590P356J01186M467j04876j6790J89166
$$ -384514 -282005 -53785 97720 37187 -91403 -84047 17139 21606 -83270 -100060 89106
40660H9106K63380J05980j50758l01243k31856k34J93353J77083j1186j66335
$$ 89106 352486 458466 307708 6465 -225391 -225625 -32272 144811 133625 -32710
40650c2710j48143p027J16916J40541P8016K054k8521l1762n5911n8681N1611
$$ -32710 -180853 -187880 -70964 69577 147593 149647 121126 89364 33453 -25228 26383
40639B6383K03537J65649j05362l01195j53400J66139K88267J59226J6261m2719
$$ 26383 229920 395569 290207 -10988 -164388 1751 290018 449244 465505 422786
40629D22786j17988j88402j10684M7537M9231q1734n2363J78127K63044K5127
$$ 422786 304798 116396 5712 53249 102480 20746 -31617 146510 409554 434681
40619D34681k26031j74318K9732O2683o7053j20299m4008J7143L373k6892n3353
$$ 434681 208650 34332 64064 126747 59694 -60605 -104613 -87470 -84097 -110989 -164342
40608a64342p0652q753J35546K02574Q8247o5433p9006J90K8357J0854J1342l2793
$$ -164342 -234994 -243747 -108201 94373 182620 117187 38181 38371 66728 77582 88924 56131
40596E6131j69184k39669q5354J62788K49078J56477N8541L676q4579j66193j25384
$$ 56131 -113053 -352722 -438076 -275288 -26210 130267 188808 192484 107905 -58288 -183672
40585a83672j4682Q511l5022J3659J44145J73090N8916l1164j396N1487L7608
$$ -183672 -198354 -189843 -224865 -211206 -67061 106029 164945 133781 132385 183872 221480
40574B21480p824m3507p9628r1176l8156K2267L284m9745l1633K6990J9621l2900
$$ 221480 213656 170149 90521 -655 -38811 -16544 -13260 -63005 -94638 -67648 -48027 -80927
40562h0927m0652l7088q2763o3350J31786L10148K02895n4633p3898J41574J55300
$$ -80927 -121579 -158667 -241430 -304780 -172994 137154 340049 285416 211518 353092 508392
40551E08392j88443m71604l39743j6501J10836O4360Q6306J59572J04329l0546
$$ 508392 319949 -151655 -491398 -507899 -397063 -332703 -246397 -86825 17504 -13042
40541a3042m4602N5891J00604O8956O3808N0546q2125k54453k71584j33760j1091
$$ -13042 -57644 -1753 98851 167807 231615 282161 200036 -54417 -326001 -459761 -470852
40530d70852M8893J19889J49181J9323j49870r4098J47621K12331m1795k88146
$$ -470852 -421959 -302070 -152889 -133566 -283436 -377534 -229913 -17582 -59377 -347523
40520c47523k15301K4892J07040M4560Q8125K36195K11567n5294k47996j07368
$$ -347523 -562824 -537932 -430892 -386332 -298207 -62012 149555 94261 -153735 -261103
40510b61103J82855K53691N4112j31233j17214l2173m4224q5362q12J56281J82015
$$ -261103 -78248 175443 229555 98322 -18892 -51065 -95289 -180651 -181463 -25182 156833
40499A56833M1246o7184o141J07258R6953j6649q7542q3849r9076j49263j18641
$$ 156833 198079 130895 124754 232012 328965 312316 224774 140925 41849 -107414 -226055
40488b26055M8698K22990K38782J05224k3056n5833n0687p5106q7393k9211L2505
$$ -226055 -177357 45633 284415 389639 366583 310750 260063 184957 97564 68353 100858
40477A00858k1682j57543j87137k3755J80167K33988J46943N4978o61p2940j41013
$$ 100858 79176 -78367 -265504 -289259 -109092 124896 271839 326817 326156 253216 112203
40466A12203j14042j107P5812N8114P613k7442o6945j00167p6481k3829k8114
$$ 112203 -1839 -2946 72866 130980 138593 111151 44206 -55961 -132442 -156271 -184385
40455a84385o0999L220J45591J66889p978j72610j22385O6213J96301K36744K52128
$$ -184385 -245384 -242164 -96573 70316 62338 -110272 -232657 -166444 29857 266601 518729
40444E18729J80497o6412l41508l67915j29057P8099M9275o7023l0235J29582
$$ 518729 699226 632814 291306 -76609 -205666 -127567 -78292 -145315 -175550 -45968
40434d5968J76086K1577j53690j55052j7737Q0485P9536Q8316J67557J94087M5654
$$ -45968 130118 151695 -1995 -157047 -174784 -94299 -14763 73553 241110 435197 480851
40423D80851j64438k01846m8296N5785l9899j76211j30318N7110J62521J05395
$$ 480851 316413 114567 66271 122056 82157 -94054 -224372 -167262 -4741 100654
40413A00654J4704p039j3238p2032j34197j19472n1807j8923k7694J2122J35853
$$ 100654 115358 108319 95081 23049 -111148 -230620 -282427 -301350 -329044 -316922 -181069
40402a81069K23041J27477j07249k64829k23087r1049n981O7770J89044K27754
$$ -181069 41972 169449 62200 -202629 -425716 -516765 -522746 -454976 -265932 -38178
40392c8178M9182j68124j13235J50953K11185o4079k75374q9353K35553K37926
$$ -38178 11004 -157120 -270355 -119402 91783 27704 -247670 -337023 -101470 136456
40382A36456o1258k33821q7573J33487J70784N1276p2150j22979q7257N041M5869
$$ 136456 75198 -158623 -246196 -112709 58075 109351 37201 -85778 -173035 -167994 -122125
40371a22125l9151j39286q6138P9748J54601P4765k2573m4805m7138o9574o6581
$$ -122125 -161276 -300562 -386700 -306952 -152351 -77586 -100159 -144964 -192102 -261676 -328257
40360c28257l3154k4049k4216K7012P9618L4564m2640K260J13991O9273j36583
$$ -328257 -361411 -385460 -409676 -382664 -303046 -268482 -311122 -308862 -194871 -125598 -262181
40349b62181k28521p3581J17935J49529J15734J36934R3006j16854k72996j15695
$$ -262181 -490702 -564283 -446348 -296819 -181085 -44151 48855 -67999 -340995 -456690
40339d56690K07361L05075R9570r7092o9790L8324L2723k9734m452N9358P251
$$ -456690 -249329 55746 155316 58224 -11566 26758 59481 29747 25295 84653 91904
40328I1904j31759j53738J728J13121l2779l06814l54629n0424L23740M26342
$$ 91904 -39855 -193593 -191865 -78744 -111523 -418337 -772966 -823390 -499650 -73308
40318g3308K49378M1319m4035m1301P505J01930J54752L6470k01274l34698k60422
$$ -73308 176070 217389 173354 132053 139558 241488 396240 432710 231436 -103262 -363684
40307c63684j06428M22Q2316J52144J21112j3147p9941J6934J37763J41739J03355
$$ -363684 -470112 -469690 -387374 -235230 -114118 -127265 -207206 -190272 -52509 89230 192585
40296A92585J20455R3333p7874k35127j74224o682j5770k02464k75064r9886J23930
$$ 192585 313040 406373 328499 93372 -80852 -87534 -103304 -305768 -580832 -680718 -556788
40285e56788J98136J71990J52868J01424l3908j49381j22481j0889L6248m934
$$ -556788 -358652 -186662 -33794 67630 33722 -115659 -238140 -249029 -212781 -217715
40275b17715m3616n1749q4733j31461q6710P4007K01152J54165K1428K2008J78178
$$ -217715 -261331 -313080 -397813 -529274 -615984 -541977 -340825 -186660 -165232 -143224 34954
40264C4954K42881N3206j84117j53306R9293K09729K8233j72815j37663o133m0069
$$ 34954 277835 331041 146924 -6382 92911 302640 330873 158058 20395 14262 -25807
40253b5807j80456j63234L7895J84314J54383P5488N6796M1870j3564l4870J4460
$$ -25807 -206263 -369497 -331602 -147288 7095 82583 139379 181249 167685 132815 147275
40242A47275M2590j6219r6109j20649j03816p1390n899P4787J03206P2669M3247
$$ 147275 189865 173646 77537 -43112 -146928 -218318 -224217 -149430 -46224 26445 69692
40231F9692J2758o9491j34909l6064J75212K22783r556k61580k40790k3045R8765
$$ 69692 82450 12959 -121950 -158014 17198 239981 230425 -31155 -271945 -294990 -196225
40220a96225M1651l2373l6279n2658j06134q2320O1202J94387K12576J79372J72488
$$ -196225 -154574 -186947 -223226 -275884 -382018 -464338 -403136 -208749 3827 183199 355687
40209C55687J24839m5435k38428k63252j00844O1677P6687q28m6396n9046j14643
$$ 355687 480526 435091 196663 -66589 -167433 -105756 -29069 -29897 -76293 -135339 -249982
40198b49982j76890j01128J33258L19844K63711N0144o6683j7475J0943j01283
$$ -249982 -426872 -528000 -394742 -74898 188813 238957 172274 154799 165742 64459
40188F4459j93121o5293J87155K72038R2387j38853j96307r5225J3263O1420P4256
$$ 64459 -128662 -193955 -6800 265238 357625 218772 22465 -72760 -59497 1923 76179
40177G6179N1888k8342j22285j43000q0512j5521P6K676L0485M6227P25o7398
$$ 76179 128067 99725 -22560 -165560 -246072 -261593 -261517 -258841 -228356 -182129 -181404 -248802
40165b48802o4848K5725J08991R9706M1789N1492J48025K04515J08388p2802j60515
$$ -248802 -313650 -287925 -178934 -79228 -37439 14053 162078 366593 474981 402179 241664
40154B41664r4828o045k0742q8437q8866l7096l8373o3570M3914K75521L56095
$$ 241664 146836 140791 120049 31612 -57254 -94350 -132723 -196293 -152379 123142 479237
40143D79237R2903k95340m10176j90733L1375K2510n3682M1658K14825J92700
$$ 479237 572140 276800 -133376 -324109 -292734 -270224 -323906 -282248 -67423 125277
40133A25277k4737j50498o2353R072j29329k84624j51287J94575L60339J89196
$$ 125277 100540 -49958 -112311 -103239 -232568 -517192 -668479 -473904 -113565 75631
40123G5631l9411n9330J792r6936k56765j83722J00277K46317J14829k3584M2770
$$ 75631 36220 -23110 -21318 -118254 -375019 -558741 -458464 -212147 -97318 -120902 -78132
40112g8132J26273N705j50230o1769J52222J43377p3595j25708R5926K41370O4360
$$ -78132 48141 53846 -96384 -158153 -5931 137446 63851 -61857 34069 275439 339799
40101C39799j97883k26987r3628m7862p7901K173J68196K08529P5643n3853n5049
$$ 339799 141916 -85071 -178699 -226561 -304462 -302289 -134093 74436 150079 96226 41177
40090D1177K6355J13077J58681R6666p7808k01290j20407M5096M0878j25473j80641
$$ 41177 67532 180609 339290 435956 358148 156858 36451 81547 122425 -3048 -183689
40079a83689k2437J08592J4348j45222j10738P9277J78318J20337P6770J38492
$$ -183689 -206126 -97534 -83186 -228408 -339146 -259869 -81551 38786 115556 254048
40069B54048J65181K5501j76133k39739j49360o7881p1694m3741J06453K43818
$$ 254048 419229 444730 268597 28858 -120502 -188383 -260077 -303818 -197365 46453
40059D6453J68734p7806k34730j60359K665N6409o9l7167L608Q1541J42144J34857
$$ 46453 215187 137381 -97349 -257708 -255043 -198634 -198703 -235870 -232262 -150721 -8577 126280
40047A26280L1228q9612q1174N1405J08469n259j01412p589J22081N2017j14191
$$ 126280 157508 67896 -13278 38127 146596 141337 39925 32336 154417 206434 92243
40036I2243q4982J13250J54038m0666j57229k1873R3375p1142l03024k38746N0061
$$ 92243 7261 120511 274549 233883 76654 54781 148156 77014 -226010 -464756 -414695
40025d14695J55804m5375k25696j10574J46177K41727J67820J54903K65605K90411
$$ -414695 -258891 -304266 -529962 -640536 -494359 -252632 -84812 70091 335696 626107
40015F26107R4537j35674j46869P03K0836j58373k83273j68787L1577R5424O3527
$$ 626107 720644 584970 438101 438804 459640 301267 17994 -150793 -119216 -23792 39735
40004C9735R2839J44764Q0580m3413n8250N234k4521j24009j03416L1483O9599
$$ 39735 132574 277338 357918 314505 256255 261489 236968 112959 9543 41026 110625
39993A10625j5260k874J54814J98292j21j83427j11119O2489O1362q4325j50205
$$ 110625 95365 92491 247305 445597 445476 262049 150930 213419 274781 190456 40251
39982D0251q8675k7455k1353l7901q3364j38585q8289Q5633J79733O1008o6201
$$ 40251 -48424 -75879 -97232 -135133 -218497 -357082 -445371 -359738 -180005 -118997 -185198
39971a85198M5992K61269K47895J4936j01122J5224R4731l7327j62051m2755J63848
$$ -185198 -139206 122063 369958 384894 283772 298996 393727 356400 194349 151594 315442
39960C15442J40557r0784j92005j6946J60476L6199k73296l63830r1874K17503
$$ 315442 455999 365215 173210 156264 316740 352939 79643 -284187 -376061 -158558
39950a58558K02063o2062j99287n9657J28897J32477j724j02662j16418q1446
$$ -158558 43505 -18557 -217844 -277501 -148604 -16127 -17851 -120513 -236931 -318377
39940c18377k4310J4194j3874n3271K865R4255L5344j41809j46079J22326L50264
$$ -318377 -342687 -328493 -342367 -395638 -392773 -298518 -263174 -404983 -551062 -428736 -78472
39929g8472K59079K3721k9244P5524Q3830l1754r2906q7649j57435k53720j59034
$$ -78472 180607 204328 175084 250608 334438 302684 209778 122129 -35306 -289026 -448060
39918d48060J25461L16002K28841n436j54404j24177K4410J39822Q7539o5981
$$ -448060 -322599 -6597 222244 216808 62404 -61773 -37363 102459 189998 124017
39908A24017p3729J24838K28058Q909k68684k17804N3257J21176n8578j26791
$$ 124017 50288 175126 403184 412093 143409 -74395 -21138 100038 41460 -85331
39898h5331L2744J34621M1897l1104R512m0423k07555j78288J35308L26996J11941
$$ -85331 -52587 82034 123931 92827 102339 61916 -145639 -323927 -188619 138377 250318
39887B50318j97781j92765J8326Q7678J3618J9485R0456P0092L8796J62246K94188
$$ 250318 52537 -140228 -121902 -34224 -20606 -1121 89335 159427 198223 360469 654657
39876F54657J59842j49699k85629j95652j50322k16059j32107J90548M26664K75013
$$ 654657 814499 664800 379171 183519 33197 -182862 -314969 -124421 302243 577256
39866E77256j20437l67956k83879j9407J53153R5164p7462j09054P8631K36238
$$ 577256 456819 88863 -195016 -214423 -61270 33894 -43568 -152622 -73991 162247
39856A62247R9734k11314l22042j06708J74636K65394J90649P8584m8530j72570
$$ 162247 261981 50667 -271375 -378083 -203447 61947 252596 331180 282650 110080
39846A10080j74039p051J50218R3279j31401k85788k28962l3737J44040K08283
$$ 110080 -63959 -71010 79208 172487 41086 -244702 -473664 -507401 -363361 -155078
39836a55078J57004O2138J2484K6718M0885J4108m047L4649P6627M4909k1721
$$ -155078 1926 64064 76548 103266 144151 158259 154212 188861 265488 310397 288676
39825B88676k1660K1228m3528k46228l69704j98732J57955L49475K01566q3514
$$ 288676 267016 288244 244716 -1512 -371216 -569948 -411993 -62518 139048 55534
39815E5534j98203p7101J08881J94676J43776J2325q5868m3038R6130J27512l9887
$$ 55534 -142669 -219770 -110889 83787 227563 239888 154020 110982 207112 334624 294737
39804B94737j99048j14580J08574J62833j798j28128o9211L3060M5817L5374N7253
$$ 294737 95689 -18891 89683 252516 250718 122590 53379 86439 132256 167630 224883
39793B24883L1973l7909J62J41567J34875r3711k18819k921K58098J40185k46371
$$ 224883 256856 218947 219109 360676 495551 401840 183021 180100 438198 578383 332012
39782C32012m09511j94220O7477J11106M0083O729l4887j16292j00244P5458K21691
$$ 332012 -77499 -271719 -204242 -93136 -53053 -46324 -81211 -197503 -297747 -222289 -598
39771e98J49437o0148j92006j71724o7608N7526J54702J49767L8983m9538k0150
$$ -598 148839 88691 -103315 -275039 -342647 -285121 -130419 19348 58331 8793 -11357
39760a1357L0680m1150j72293j48108P6519K73832K34222L7389q4542p1188n6565
$$ -11357 19323 -21827 -194120 -342228 -265709 8123 242345 279734 195192 124004 67439
39749F7439r1496n3294Q7588J15891j24729m14808l96226o8092K18455K53539
$$ 67439 -24057 -77351 10237 126128 1399 -413409 -809635 -877727 -659272 -405733
39739d05733J74165J33722P3327n0394r5632J3060R8896J7182p5635K3139K06600
$$ -405733 -231568 -97846 -24519 -74913 -170545 -157485 -58589 -41407 -117042 -93903 112697
39728A12697K16894L8826j18359j47476j16152p4903n463P8183J39184J71866
$$ 112697 329591 368417 250058 102582 -13570 -88473 -93936 -15753 123431 295297
39718B95297J36449l0628k25013j94539P9864K61450J39441l5439P875P9843j00936
$$ 295297 431746 401118 176105 -18434 61430 322880 462321 426882 434757 514600 413664
39707D13664l23258j90670J57524K17428n2586j82299J196J24778l7052k01541
$$ 413664 90406 -100264 57260 274688 222102 39803 40999 165777 128725 -72816
39697g2816j31978k6276p3225r0573P5073K03388J02641o751J22079L05351K36441
$$ -72816 -204794 -231070 -304295 -394868 -319795 -116407 -13766 -20517 101562 406913 643354
39686F43354q459j50417j74656k36427k76125j19214J42384K26669P5419r6452
$$ 643354 634895 484478 309822 73395 -202730 -321944 -179560 47109 122528 26076
39676B6076j27076m3740P7607J75662J78615R1864L6546N5316Q239j74285k97777
$$ 26076 -101000 -144740 -67133 108529 287144 379008 415554 470870 479109 304824 7047
39665G047j73014O9139J61211O9321m7126j20220j81638j97502j30160o7533p6998
$$ 7047 -165967 -96828 64383 133704 86578 -33642 -215280 -412782 -542942 -610475 -687473
39654f87473m5684J17762K60334K06788O6237M9222J08719N5198q3107j24917
$$ -687473 -733157 -615395 -355061 -148273 -82036 -32814 75905 131103 47996 -76921
39644g6921p2764p0971r9160k7269Q1958N5078m8343j1233J43703J75552M2089
$$ -76921 -149685 -220656 -319816 -347085 -265127 -210049 -258392 -269625 -125922 49630 91719
39633I1719n2162l7265m6095o8271P3348L12255L03907l3688l06933j94525R5281
$$ 91719 39557 2292 -43803 -112074 -38726 273529 577436 543748 236815 42290 137571
39622A37571J62979l0749k10069j98751m6165J30913K22925J47940l1097j11073
$$ 137571 300550 269801 59732 -139019 -185184 -54271 168654 316594 285497 174424
39612A74424j2641Q5208J9735r3919o5149L5938j8223k31118l45002k07703K0606
$$ 174424 161783 246991 266726 172807 107658 143596 125373 -105745 -450747 -658450 -637844
39601f37844J03441L2495j4319N0366J20080Q8337K9750P4838J59844Q2028j58206
$$ -637844 -534403 -501908 -516227 -465861 -345781 -257444 -227694 -152856 6988 89016 -69190
39590f9190k71980p0657K36691L28773K06029R4147L7933r5231k62012k44231
$$ -69190 -341170 -411827 -175136 153637 359666 453813 491746 396515 134503 -109728
39580a09728l7717Q9484J3442p2548r854R3104J16347J29230J65420P3224j94580
$$ -109728 -147445 -57961 -44519 -117067 -126921 -33817 82530 211760 377180 450404 255824
39569B55824l83420k73523j8776R2704M4171J1692L9704N7987R1416J79764J88854
$$ 255824 -127596 -401119 -419895 -327191 -283020 -271328 -231624 -173637 -82221 97543 286397
39558B86397j8253k84354l07319o4833J55753J49976K008j03439p9928M8915J64550
$$ 286397 268144 -16210 -323529 -388362 -232609 -82633 -80625 -184064 -263992 -215077 -50527
39547e0527J05219j26115k61309q0699K33022L06107R9343p2652n1146k4441j20833
$$ -50527 54692 -71423 -332732 -413431 -180409 125698 225041 152389 101243 76802 -44031
39536d4031j52005M2155K67681K52190N9859l6779J7205K9429r2128k10928j98479
$$ -44031 -196036 -153881 113800 365990 425849 389070 406275 435704 343576 132648 -65831
39525f5831j00262j5612L9021Q5963J10063Q5277J7065o8821j32388j18753j5742
$$ -65831 -166093 -181705 -142684 -56721 53342 138619 155684 86863 -45525 -164278 -180020
39514a80020R7335J32331J09366J02755Q9460k1318j95240k60492j52965l1183
$$ -180020 -82685 49646 159012 261767 351227 329909 134669 -125823 -278788 -309971
39504c09971l8514p6673K7549K16283K56752Q6546q7066p2421P8592J89106J70846
$$ -309971 -348485 -425158 -397609 -181326 75426 161972 74906 2485 81077 270183 441029
39493D41029M8300j12069k15493j82584n6101K9324L9808P6874J54583J22549
$$ 441029 489329 377260 161767 -20817 -76918 -47594 -7786 69088 223671 346220
39483C46220n6824j49443J4930K10673J08756j99625l10140j12760P4180M2562
$$ 346220 289396 139953 154883 365556 474312 274687 -35453 -148213 -74033 -31471
39473c1471o956J22015K46775J19561j26437j69024O067J23695P0144J2379N9091
$$ -31471 -38427 83588 330363 449924 323487 154463 160530 284225 354369 366748 425839
39462D25839Q9119l607j19397j19980l0155L3774K5398k7524q6944j02308l2688
$$ 425839 514958 511351 391954 271974 241819 275593 300991 273467 186523 84215 51527
39451E1527O5478O3835n8074j56174j28032p0700j10022j64063n6294J66275K36648
$$ 51527 117005 180840 122766 -33408 -161440 -232140 -342162 -506225 -562519 -396244 -159596
39440a59596M5687j70719j48070M7123J49805R3612N2277J05825J15843O948o0703
$$ -159596 -113909 -284628 -432698 -385575 -235770 -142158 -89881 15944 131787 138735 78032
39429G8032M2645J61173P8213j23091j69600j6706R9514M2261m4217j0852O2461
$$ 78032 120677 281850 360063 236972 67372 50666 150180 192441 148224 137372 199833
39418A99833M5869p10N8672J86750K15776J00356k6228n7220n6583j48674l19641
$$ 199833 245702 244992 303664 490414 706190 806546 780318 723098 666515 517841 198200
39407A98200l91949k23364Q6530K60675J64414j6267k3342J12002J26890o8867
$$ 198200 -193749 -417113 -330583 -69908 94506 78239 54897 166899 293789 224922
39397B24922k52896k15585l2097J04223J54712J86672J75937M4950j53940k57821
$$ 224922 -27974 -243559 -275656 -171433 -16721 169951 345888 390838 236898 -20923
39387b0923j89874k2651J39815K38379K32436J10605n2202j31685q2883J1166
$$ -20923 -210797 -233448 -93633 144746 377182 487787 435585 303900 221017 232183
39377B32183L9162j9202q9466j00386o1012k6787j2421P684J8292k1414n4677
$$ 232183 271345 252143 162677 62291 1279 -25508 -37929 -30245 -11953 -33367 -88044
39366h8044M2008K19544K16703o6367l10380j52499K77343N00256L28918L7946
$$ -88044 -46036 173508 390211 323844 13464 -139035 138308 638564 967482 1005428
39356A005428j09979j51385j69120j16223k2909m2193j38486o7964J65453K06803
$$ 1005428 895449 744064 574944 458721 435812 393619 255133 187169 352622 559425
39346E59425p4962k96681j43810J29698J48531J0632P36K9744j23360k60992m2392
$$ 559425 484463 187782 43972 173670 322201 332833 333569 363313 239953 -21039 -63431
39335f3431L38929L58244q713k48474j28095K7538k9094j12820n5039p79l8829
$$ -63431 275498 633742 625029 376555 248460 275998 246904 134084 79045 78266 39437
39324C9437J0688J95719K34588j2577k47933j94134r862M2910K3955Q5207J07945
$$ 39437 50125 245844 480432 467855 219922 25788 15926 58836 82791 167998 275943
39313B75943o6517k66062k17355R161J28511R5742R7098J67685J45935q251j34892
$$ 275943 209426 -56636 -273991 -264830 -136319 -40577 56521 224206 370141 361890 226998
39302B26998j38220j06549j29089j59250j03409N2332K15769K45449Q6957j10538
$$ 226998 88778 -17771 -146860 -306110 -409519 -357187 -141418 104031 190988 80450
39292H0450j16616R0755K86612L00195J84905K6373j86026l72004l08106K2035
$$ 80450 -36166 54589 341201 641396 826301 852674 666648 294644 -13462 8573
39282H573K57747J17426j61355j55826J03699J94500m2252k75224j83411J17030
$$ 8573 266320 383746 222391 66565 170264 364764 322512 47288 -136123 -19093
39272a9093K82952J79059m2250j75457j49085k9693O9931P7773j4300j71582l06104
$$ -19093 263859 442918 400668 225211 76126 46433 116364 194137 179837 8255 -297849
39261b97849k76820k5534K69317L26701J13218r2932p0205P7478J28866N3622
$$ -297849 -574669 -600203 -330886 -4185 109033 16101 -54104 23374 152240 205862
39251B05862l0729o2178m2289L0033R7438N6264m8584j8088J74091K65353R6253
$$ 205862 175133 112955 70666 100699 198137 254401 205817 187729 361820 627173 723426
39240G23426j13500j10969L082J0033l6873P124K1488j62404l53965k45797M9543
$$ 723426 609926 498957 502039 512072 475199 482323 503811 341407 -12558 -258355 -208812
39229b08812J53134L4268N79J10781J04220n1193o0725J37815K19514M6802q4230
$$ -208812 -55678 -21410 -20831 89950 194170 142977 82252 220067 439581 486383 402153
39218D02153M959M5684j61869l32427j65411J21356J40414m8208r6525L7010Q1218
$$ 402153 407112 452796 290927 -41500 -206911 -85555 54859 6651 -89874 -52864 28354
39207B8354m8008j34894m5464R5674J42090R7047J4016q7729j75669j99254j44295
$$ 28354 -19654 -154548 -200012 -104338 37752 134799 148815 61086 -114583 -313837 -458132
39196d58132k7224J13413J76189P3516q0814l4803K35607M17822K81075N191j11689
$$ -458132 -485356 -371943 -195754 -122238 -203052 -237855 -2248 415574 696649 701840 590151
39185E90151p6692p9445j22444q1419j0863n6987j34686l2097J77668J71088j26929
$$ 590151 513459 434014 311570 230151 219288 162301 27615 -4482 173186 344274 217345
39174B17345l84904l09212p34K45553K93357J99710O1829m8947j01933j27762
$$ 217345 -167559 -476771 -477505 -231952 61405 261115 322944 273997 172064 44302
39164D4302j48567r3493Q6114K39719J50425j32902l05799k13835m2197l769m0956
$$ 44302 -104265 -197758 -111644 128075 278500 145598 -160201 -374036 -416233 -420002 -460958
39153d60958J1260J28043J49598M4542n5426m9642L2054J01609Q6471l9500k06623
$$ -460958 -449698 -321655 -172057 -127515 -182941 -232583 -200529 -98920 -12449 -51949 -258572
39142b58572k58023j03596J40234K47014J27842p6264j61215p1227P5788J39076
$$ -258572 -516595 -620191 -479957 -232943 -105101 -181365 -342580 -413807 -338019 -198943
39132a98943R7610M3213N5475J08948J12023K1573r7240j27245k2342J18118J29133
$$ -198943 -101333 -58120 -2645 106303 218326 239899 142659 15414 -6928 111190 240323
39121B40323k6047j77229j38199N0150J74688J35948L8527j5794m7273n4612M4412
$$ 240323 214276 37047 -101152 -51002 123686 259634 298161 282367 235094 180482 224894
39110B24894K10942K24146l028k23742j83967N660O5654k5483q2344p6990j26958
$$ 224894 435836 659982 656954 433212 249245 254905 320559 295076 212732 135742 8784
39099H784j83879q3474J04801J29667j4861o8987L4111O4988m8531n9425J37663
$$ 8784 -175095 -258569 -153768 -24101 -38962 -107949 -73838 -8850 -57381 -116806 20857
39088B0857K65298J17106r1528j00761k2263p0395j59259j09572j3828l2841m5138
$$ 20857 286155 403261 311733 210972 188709 118314 -40945 -150517 -164345 -197186 -242324
39077b42324J12018K46503Q8872j83692j72789P8979J50114m9332j43914N0926
$$ -242324 -130306 116197 205069 21377 -151412 -72433 77681 28349 -115565 -64639
39067f4639K32895J42686m4214p6911j0867J3281N2701J64599J97004L9895j42067
$$ -64639 168256 310942 266728 189817 178950 192231 244932 409531 606535 646430 504363
39056E04363j70399j26585j27746o6341J43496K80071J12591j74057k11608p286
$$ 504363 333964 207379 79633 13292 156788 436859 549450 375393 163785 156499
39046A56499R4412k6259j02998O5974L15251L67792J73664j04510k82190k61766
$$ 156499 250911 224652 121654 187628 502879 870671 1044335 939825 657635 395869
39036C95869q8741N7076M1874n0567n3296K0044K6870k4410K0496J63178K05861
$$ 395869 307128 364204 406078 355511 302215 322259 349129 324719 345215 508393 714254
39025G14254O4731j03325j70401j99337k26849j35070Q9195J99424K9811j88038
$$ 714254 778985 675660 505259 305922 79073 -55997 33198 232622 262433 74395
39015G4395j23855J55766K89804J61345J3135O773n074j45819k45651j22121P5824
$$ 74395 -49460 106306 396110 557455 570590 577363 572289 426470 180819 58698 134522
39004A34522P6232p3140o6747J64836L17701J66109j01303j74750o3599l329l6359
$$ 134522 210754 137614 70867 235703 553404 719513 618210 443460 379861 376532 340173
38993C40173K2631K07571K80461R4027j61979k38440j68743j38211j51076o5269
$$ 340173 362804 570375 850836 944863 782884 544444 375701 237490 86414 21145
38983B1145J03944J58868J6927j59312j81316m7229J03539J37160J1199j74271
$$ 21145 125089 283957 300884 141572 -39744 -86973 16566 153726 164925 -9346
38973i346k13714j5968K18585K02533m6311k09388j12428M8350L8341o1556k4656
$$ -9346 -223060 -239028 -20443 182090 135779 -73609 -186037 -137687 -99346 -160902 -185558
38962a85558J36192J87488M0888j12222p3245J02561J92868Q4103j06664j72715
$$ -185558 -49366 138122 179010 66788 -6457 96104 288972 373075 266411 93696
38952I3696m6485J33503J89947J02442j4024q5592j32047j51261q6458M3627J05538
$$ 93696 47211 180714 370661 473103 459079 373487 241440 90179 3721 47348 152886
38941A52886K6286q2919o9619N6991J49338J03195m6379j71842j60049k5135P1141
$$ 152886 179172 96253 26634 83625 232963 336158 289779 117937 -42112 -67247 3894
38930C894n157j58783j66429o74J19398O8551N515Q4035J65981M2142j85766j99323
$$ 3894 -1263 -160046 -326475 -327149 -207751 -139200 -133685 -49650 116331 158473 -27293 -226616
38918b26616R3644M29345N11838K97200n0587l26291l85009k22035K923J10742
$$ -226616 -132972 296373 808211 1105411 1054824 728533 343524 121489 124412 235154
38908B35154Q5628M0938L0994M50r1438j94091k15241r4561J30543K89930K13711
$$ 235154 320782 361720 392714 393164 301726 107635 -107606 -202167 -71624 218306 432017
38897D32017k0989j13739N9264K24129Q1683k43148l80863k43586p4195k0990
$$ 432017 411028 297289 356553 580682 662365 419217 38354 -205232 -279427 -300417
38887c00417J3484Q6926J00534L5997K1679P4184M3193q9147j24049K0325J54902
$$ -300417 -286933 -200007 -99473 -63476 -41797 32387 75580 -13567 -137616 -117291 37611
38876C7611J33985O0812L1468m3991j73949j33115J58677L69699J94365j48171
$$ 37611 171596 232408 263876 219885 45936 -87179 71498 441197 635562 487391
38866D87391k17448n493J09487j2820j16446l6419N6092R802m9425N496M4246
$$ 487391 269943 264450 373937 361117 244671 208252 264344 274146 224721 230217 274463
38855B74463q5466k57278k29977J86K12060K60155J91126R8153J6565l5822l9117
$$ 274463 188997 -68281 -298258 -298072 -86012 174143 365269 463422 479987 444165 405048
38844D05048j4487o471j3372k777P308l5816j08964j02844L0503J80735J93211
$$ 405048 390561 384090 370718 367941 375249 339433 230469 127625 158128 338863 532074
38833E32074M8764j29734k27098k22617j40685q896J08193J25953N2046R940P6304
$$ 532074 580838 451104 224006 1389 -139296 -148192 -39999 85954 138000 147940 224244
38822B24244J59878J33301K6481k5574J6195P9245J36536K20106K71691J55858
$$ 224244 384122 517423 543904 518330 534525 613770 750306 970412 1242103 1397961
38812A397961j17406l36097l41536k18941j43085j49394j64822j61307j46635
$$ 1397961 1280555 944458 602922 383981 240896 91502 -73320 -234627 -381262
38803c81262p5391Q8769K51914K58225Q6261j09888j64964n2975J19158K15903
$$ -381262 -456653 -367884 -115970 142255 228516 118628 -46336 -99311 19847 235750
38793B35750J74826M5861o1116p0120K5323J82048L03826K59058J5844k45497
$$ 235750 410576 456437 395321 325201 350524 532572 836398 1095456 1111300 865803
38783H65803k88667j16913K6070m356p0206O267J69707K40071J84760J25419J27033
$$ 865803 577136 460223 486293 481937 411731 417998 587705 827776 1012536 1137955 1264988
38772A264988J19150J7889j59798k99385k80339j11895K3913l0203j64570j22787
$$ 1264988 1384138 1402027 1242229 942844 662505 550610 574523 544320 379750 256963
38762B56963J01244K06629L4968j57589p4789J67887K23242J9240j86012j93613
$$ 256963 358207 564836 599804 442215 367426 535313 758555 777795 591783 398170
38752C98170n3568J07880K13689J89020N323k04822k54168j38199j7360J9199
$$ 398170 344602 452482 666171 855191 860514 655692 401524 263325 245965 265164
38742B65164R054k9503j04527j31166j6275J36206J21877m1142j10366J0943J27617
$$ 265164 274218 244715 140188 9022 -7253 128953 250830 209688 99322 110265 237882
38731B37882O4852p8595j14062l9605N060m2674j10600r4479M4400K28735K95916
$$ 237882 302734 224139 110077 70472 75532 32858 -77742 -172221 -127821 100914 396830
38720C96830J61436m9326j36967q2332l4383o3137r2890q2334q0003p2266K4897
$$ 396830 558266 508940 371973 289641 255258 192121 99231 16897 -63106 -135372 -110475
38709a10475J70250J93447N9910n2756k5236M9862P2455Q4720J06515M2331j00720
$$ -110475 59775 253222 313132 260376 235140 285002 357457 442177 548692 591023 490303
38698D90303j23711M6330J59786K485k28273j87056J01788K87509J92155k2495
$$ 490303 366592 412922 572708 575193 346920 159864 261652 549161 741316 718821
38688G18821j65600k14030j80355m9378R7460J23340N7897N8164J03371q072k64943
$$ 718821 553221 339191 158836 109458 206918 330258 388155 446319 549690 541618 276675
38677B76675l40302o8590K36631K06644m2712j16354M6244J34750J6317o8807
$$ 276675 -63627 -132217 104414 311058 268346 151992 198236 332986 349303 280496
38667B80496M8997J78166J04097n6405p3585K1251L3573n5400r5792l4111M8526
$$ 280496 329493 507659 611756 555351 481766 503017 536590 481190 385398 351287 399813
38656C99813R6510Q2285o1026k92961l56053q0582K82481L38185J03249n5535
$$ 399813 496323 578608 517582 224621 -131432 -212014 70467 408652 511901 456366
38646D56366j1453o868j46054j90574r652J65020J43626P7379J18146J25838r768
$$ 456366 444913 438045 291991 101417 91765 256785 400411 477790 595936 721774 712006
38635G12006q2884P7344K64094K33837J10952R7835O2784j70296l69491j98197
$$ 712006 629122 706466 970560 1204397 1315349 1413184 1475968 1305672 936181 737984
38625G37984K06252M19998L61440K87302L04838L58274N51440R41291J111248
$$ 737984 944236 1364234 1725674 2012976 2317814 2676088 3227528 4168819 5280067
38616E280067N59915m72692j152920j099202p28940m84504l14419j01160j5009
$$ 5280067 5839982 5367290 4214370 3115168 2386228 1901724 1587305 1486145 1471136
38607A471136j43110k34424j15619K3546P748m2353l1881r2831k23649j47556
$$ 1471136 1328026 1093602 977983 1001529 1009277 966924 935043 842212 618563 471007
38597D71007J86453L71704J39381j91466k10255j3277O9309L1204O9564J54197
$$ 471007 657460 1029164 1168545 977079 766824 753547 822856 854060 923624 1077821
38587A077821J16614q511p5413j01890j58426j56984k4776R1374M7233o4534j23692
$$ 1077821 1194435 1185924 1110511 1008621 850195 693211 668435 759809 807042 742508 618816
38576F18816j85369k48260j16586K27580M24425K42584p076O8543L42485M20526
$$ 618816 433447 185187 68601 296181 720606 963190 956114 1024657 1367142 1787668
38566A787668K52103P5257l7702j62715k34206j75697j47787k80504l52448j39226
$$ 1787668 2039771 2115028 2077326 1914611 1680405 1504708 1356921 1076417 723969 584743
38556E84743J30262J12366n8768j1346J98019J91469o0496k12197j37394l8533
$$ 584743 715005 827371 768603 757257 955276 1146745 1086249 874052 736658 698125
38546F98125J4075J46537K81366J74682j02313j91309j8495J09166M2619k1843
$$ 698125 712200 858737 1140103 1314785 1212472 1021163 1002668 1111834 1154453 1132610
38536A132610K1746J1070j04398j23285J8430R7251j950r0650m1072j7837j59749
$$ 1132610 1154356 1165426 1061028 937743 956173 1053424 1051474 960824 919752 901915 742166
38525G42166l11560k68158p0772J06322J93550K20539K10177J73218J17263L5442
$$ 742166 430606 162448 91676 197998 391548 612087 822264 995482 1112745 1148187
38515A148187m1132l6945L0240K9364m5818r629J72446K21290k4691k84307k59995
$$ 1148187 1107055 1070110 1100350 1129714 1083896 1074267 1246713 1468003 1443312 1159005 899010
38504H99010j11710j16455j41550O0885K90060J92588o6347l6320K36080K85961
$$ 899010 787300 670845 529295 590180 880240 1072828 1006481 970161 1206241 1492202
38494A492202K6110j67801j47329j34221j60735o589K49613K46329q784j14559
$$ 1492202 1518312 1350511 1203182 1068961 908226 901637 1151250 1397579 1388795 1274236
38484A274236J3939M0934r3697m7246K08939K33897j01804l38685j93811K2022
$$ 1274236 1288175 1329109 1235412 1188166 1397105 1631002 1529198 1190513 996702 1018724
38474A018724L2245K8599J67459K16822M3840q2712m062L1094j10313j51066M8732
$$ 1018724 1050969 1079568 1247027 1463849 1507689 1424977 1420915 1452009 1341696 1190630 1239362
38463A239362J77198M5825l4993J77968L98019K87851j8348k06044k04932o0358
$$ 1239362 1416560 1462385 1427392 1605360 2003379 2291230 2272882 2066838 1861906 1801548
38453A801548K07104L99327K48830r2384j67260N0780J20155n2253n8351J75818
$$ 1801548 2008652 2407979 2656809 2564425 2397165 2447945 2568100 2515847 2457496 2633314
38443B633314J94626q6994j28552K40029M27097J18102j52682K7536K57063J58744
$$ 2633314 2827940 2740946 2612394 2852423 3279520 3397622 3244940 3272476 3529539 3688283
38433C688283P5086L07661M72272K65622R1747K64176L71634J13035m1760K73437
$$ 3688283 3763369 4071030 4543302 4808924 4900671 5164847 5536481 5649516 5607756 5881193
38423E881193O01006N24118M13773O06463P37021O11863P51608J294917J467989
$$ 5881193 6482199 7006317 7420090 8026553 8763574 9375437 10127045 11421962 12889951
38414A2889951J004060Q80324J669869K469027K556777K687688L487525M151430
$$ 12889951 13894011 14774335 16444204 18913231 21470008 24157696 27645221 31796651
38406C1796651M211605M874692O873808Q877606J0048161J2029898J6008059K0491708
$$ 31796651 36008256 40882948 47756756 56634362 66682523 78712421 94720480 115212188
38398A15212188K5230082L3621397M5230953M8528233L0131123o731679m0602227
$$ 115212188 140442270 174063667 219294620 267822853 297953976 291222297 250620070
38391B50620070n2886463m5335986l2738473k4276263j8634021j3281621r667121
$$ 250620070 197733607 152397621 119659148 95382885 76748864 63467243 53800122
38384E3800122q748498q136727o028218l882156l289296l320549k671730j872552
$$ 53800122 45051624 36914897 30886679 27004523 23715227 20394678 17722948 15850396
38376A5850396j754008j769678j292553r12439j170592j406797r72098l74578
$$ 15850396 14096388 12326710 11034157 10121718 8951126 7544329 6572231 6197653
38368F197653k65427l75547k85005k32938m24559m80921k26367j15088l18540
$$ 6197653 5932226 5556679 5271674 5038736 4614177 4133256 3906889 3791801 3473261
38359C473261l22923L9540J37150l14281o24301k86761J48963N7984k41416j81217
$$ 3473261 3150338 3189878 3327028 3012747 2388446 2101685 2250648 2308632 2067216 1885999
38349A885999O7180L9730j73883k18454j21353o3981M3814K54719K98978N5773
$$ 1885999 1953179 1992909 1819026 1600572 1479219 1415238 1459052 1713771 2012749 2068522
38339B068522j49018j08314r0832k51496k48697J10653M01738K49217m2425k6281
$$ 2068522 1919504 1811190 1720358 1468862 1220165 1330818 1732556 1981773 1939348 1913067
38329A913067J83284K37558J49548P8705o8362l43194m48981j96265R7402J01396
$$ 1913067 2096351 2333909 2483457 2562162 2493800 2150606 1701625 1505360 1602762 1704158
38319A704158n049O5786J73940P5181q8319q7499m7003j27132j24586J27703L22578
$$ 1704158 1699109 1764895 1938835 2014016 1925697 1838198 1791195 1664063 1539477 1667180 1989758
38308A989758J62256o1668O3055L29566K60955m2006o5870K37489M01020K49171
$$ 1989758 2152014 2090346 2153401 2482967 2743922 2701916 2636046 2873535 3274555 3523726
38298C523726J35368K94394M96280M99730M18623M50927N65074O38889O88440
$$ 3523726 3659094 3953488 4449768 4949498 5368121 5819048 6384122 7023011 7711451
38289G711451Q05258R97669J188618J303950J344475J401213J533376J605719
$$ 7711451 8516709 9514378 10702996 12006946 13351421 14752634 16286010 17891729
38281A7891729J395992R20032M42424O7873m14553j106606j699199j865007j735099
$$ 17891729 19287721 20207753 20650177 20718050 20303497 19196891 17497692 15632685 13897586
38272A3897586j675491j739058j657567j304923q84313o58899o83507p93149p54798
$$ 13897586 12222095 10483037 8825470 7520547 6636234 5977335 5293828 4500679 3745881
38263C745881m95067k30392k31136m19592m34387j69613M8738l0223k18540k44634
$$ 3745881 3250814 3020422 2789286 2369694 1935307 1765694 1814432 1784209 1565669 1321035
38253A321035j60078j27314r2874K2934P1559o2600j80503p9207Q2594P5763K5602
$$ 1321035 1160957 1033643 940769 963703 1035262 972662 792159 712952 795546 871309 896911
38242H96911J51401K88733J23420k29495l42851j20613J01488Q7209n5866j72177
$$ 896911 1048312 1337045 1460465 1230970 888119 767506 868994 956203 900337 728160
38232G28160k37543k11920l9335J61674J92123Q7276P5411K08596K93495K05894
$$ 728160 490617 278697 239362 401036 593159 680435 755846 964442 1257937 1463831
38222A463831L0107j25660k25443k24472j16952m3822j27563k38176j63040M1313
$$ 1463831 1493938 1368278 1142835 918363 801411 757589 630026 391850 228810 270123
38212B70123J34256Q1829O4729J14691O2994j14710k09260j13240J7147K7512
$$ 270123 404379 486208 550937 665628 728622 613912 404652 291412 308559 336071
38202C36071k9783m6313k4896j3790k0667m0842m8622L2591K09055L05033J55388
$$ 336071 306288 259975 235079 221289 200622 159780 111158 143749 352804 657837 813225
38191H13225j20960k37916j13831O6376J33722P9209n2180j95680k19757o4269
$$ 813225 692265 454349 340518 406894 540616 619825 567645 371965 152208 87939
38181H7939R7803N8549r8274j12218M2558J35790P1465R696M9723O3339o3588
$$ 87939 185742 244291 146017 33799 76357 212147 283612 293308 343031 406370 342782
38170C42782k39903l08595k16102l739K13104K62225R2628q5531m0057J40941
$$ 342782 102879 -205716 -421818 -425557 -212453 49772 142400 56869 16812 157753
38160A57753J77712K8280q3989n2286M138K3527Q2432J49171O8809j30456k12937
$$ 157753 335465 363745 279756 227470 231608 255135 337567 486738 555547 425091 212154
38149B12154j06208j0125m2419o6691J2716P3190L0336K268O3967Q5505k4383
$$ 212154 105946 95821 53402 -13289 -573 72617 102953 105221 169188 254693 230310
38138B30310j37521j22530l5356L9627J25380K01589J44679l9313j41446n4280
$$ 230310 92789 -29741 -65097 -25470 99910 301499 446178 406865 265419 211139
38128B11139O2005N1949k0403o2454j13689j62665o2881J81576K98422J30894
$$ 211139 273144 325093 304690 242236 128547 -34118 -96999 84577 382999 513893
38118E13893r2381r7836M2593J00057N6506K5629k282o6891o1543P3964J43371
$$ 513893 421512 323676 366269 466326 522832 548461 546179 479288 417745 491709 635080
38107F35080l5039k87455l12657j31748k292J6505Q2594K09356K20276P5323m9382
$$ 635080 600041 312586 -71 -131819 -134111 -117606 -35012 174344 394620 469943 420561
38096D20561m6038M546K7519M4088L8957m7689j61280j65192o5871j4732n2141
$$ 420561 374523 379069 406588 450676 489633 441944 280664 115472 49601 34869 -17272
38085a7272m6199N8029J17732J1844j65576k32886j46011j1415O7125R1186J34665
$$ -17272 -63471 -5442 112290 124134 -41442 -274328 -420339 -431754 -364629 -273443 -138778
38074a38778K24144K61677J29311j07998k18353r9774O3998O6259l3782n5569
$$ -138778 85366 347043 476354 368356 150003 50229 114227 180486 146704 91135
38064I1135j1499m9293j51819j51783l4378K9807j0227O670J58737K73790J84088
$$ 91135 79636 30343 -121476 -273259 -307637 -277830 -288057 -281387 -122650 151140 335228
38053C35228k0701j36474j15141n1109N941P1277J07304L8925j00959j61104o4849
$$ 335228 314527 178053 62912 11803 17744 89021 196325 235250 134291 -26813 -91662
38042i1662N9352L0462j16809j30289J21575M03672L63125M146k80425k15109
$$ -91662 -32310 -1848 -118657 -248946 -127371 276301 639426 643572 363147 148038
38032A48038J4468O2600r5672j92577q7103P1524R5019j5837j30845j51051p7553
$$ 148038 162506 225106 129434 -63143 -150246 -78722 16297 460 -130385 -281436 -358989
38021c58989K100J267l7733K7664J99085K43296L301k99567l03604k379K47071
$$ -358989 -356889 -355622 -393355 -365691 -166606 76690 79991 -219576 -523180 -525559 -278488
38010b78488K20100P4141L8425R5175R7404K1692m4372m9461M737R7914J52751
$$ -278488 -58388 15753 54178 149353 246757 268449 224077 174616 179353 277267 430018
37999D30018O7424j22003k16307r2025J23992K19319J53193M4462k5719q1034
$$ 430018 497442 375439 159132 67107 191099 410418 563611 608073 582354 501320
37989E01320j54168k22280k32011j41292L2630J76058J55826j4600j54432j25607
$$ 501320 347152 124872 -107139 -248431 -215801 -39743 116083 101483 -52949 -178556
37979a78556R70O1345J6755l4855k1547K5796M5304J5240m2082p1402j4288J18197
$$ -178556 -177586 -116241 -99486 -134341 -155888 -130092 -84788 -69548 -111630 -183032 -197320 -79123
37967g9123K21092K00700Q8923k808k6352k7426m0858l3877J9942P2546N7549
$$ -79123 141969 342669 431592 428784 402432 375006 334148 300271 320213 392759 450308
37956D50308j2630n4246j6681N4086O7756j3326j37083j99560j11206J31945L99769
$$ 450308 437678 383432 366751 420837 488593 475267 338184 138624 27418 159363 559132
37945E59132M86133K95667k3857k10449j61563n63J33008K29849L00292K82083
$$ 559132 1045265 1340932 1317075 1106626 945063 944500 1077508 1307357 1607649 1889732
37935A889732J92531K33254N41220R20248J063316J013832J116435J431989J487739
$$ 1889732 2082263 2315517 2856737 3776985 4840301 5854133 6970568 8402557 9890296
37926I890296Q23344l75284j414750j797758j603044j221302r33374p84089o89276
$$ 9890296 10713640 10338356 8923606 7125848 5522804 4301502 3368128 2584039 1894763
37917A894763n50610l29490q4946P5236R8156J8693r5371j79398j72398o6065
$$ 1894763 1344153 1014663 929717 1004953 1103109 1121802 1026431 847033 674635 608570
37907F08570L7448P660j36854k17088j18649M7683R4682P383p0079o5080n3731
$$ 608570 646018 653678 516824 299736 181087 228770 323452 330835 260756 195676 141945
37896A41945q6748q3132J8496J15293P1907o6083j24578m3023O5439R6332O9204
$$ 141945 55197 -27935 -9439 105854 177761 111678 -12900 -55923 9516 105848 175052
37885A75052L4641j4276q5305j35387j31004q9324k5293O3535J35515J27474O7570
$$ 175052 209693 195417 110112 -25275 -156279 -245603 -270896 -207361 -71846 55628 123198
37874A23198N1336P5739M3526k1740L9321K15638K23525q9446m20524l63438K4030
$$ 123198 174534 250273 293799 272059 311380 527018 750543 661097 240573 -122865 -98835
37863i8835L00486K44273O8084J0461K3545k5021r7689r1607j7274O8741J62238
$$ -98835 201651 445924 514008 524469 548014 522993 425304 333697 316423 385164 547402
37852E47402K22033J35301r0567k41993j60453K7290J02913P7726J30929K87473
$$ 547402 769435 904736 814169 572176 411723 439013 541926 619652 750581 1038054
37842A038054L61576K35034L4135k0095J52981M35697O23324N86451L85484K31549
$$ 1038054 1399630 1634664 1668799 1648704 1801685 2237382 2860706 3447157 3832641 4064190
37832D064190K91736N43270Q49838J128021J359142J468645J301050P53754r4937
$$ 4064190 4355926 4899196 5749034 6877055 8236197 9704842 11005892 11759646 11664709
37823A1664709r91293j622460j779670j491208j006384o02629l93137l26568l26670
$$ 11664709 10673416 9050956 7271286 5780078 4773694 4171065 3777928 3451360 3124690
37814C124690l69417m38173m74904m10834k33372j6603J16912R0096n4197j89357
$$ 3124690 2755273 2317100 1842196 1431362 1197990 1181387 1298299 1388395 1334198 1144841
37804A144841k26400j78297j04577l9170P726K5072J6111Q847K1677L9950L9655
$$ 1144841 918441 740144 635567 596397 604123 629195 645306 654153 675830 715780 755435
37793G55435M081q4557k17733l16756k86915j45556k5955r420k1996M0325J44637
$$ 755435 759516 674959 457226 140470 -146445 -292001 -317956 -327376 -349372 -309047 -164410
37782a64410J63817N8467o4816q2068J3116J15432J22974L7208n0311p2665o4508
$$ -164410 -593 57874 -6942 -89010 -75894 39538 162512 199720 149409 76744 12236
37771A2236r1607j33672j04985J7112J58079K40387K39310J54390J6352q5949
$$ 12236 -79371 -213043 -318028 -300916 -142837 97550 336860 491250 507602 421653
37761D21653r2751p6888j29281j61513j4583K22635K53799K3952j40763j6172
$$ 421653 328902 252014 122733 -38780 -53363 169272 423071 447023 306260 290088
37751B90088J58499O6762j58949j53297P0893J37297q1978k74693j96539m097
$$ 290088 448587 515349 356400 203103 273996 411293 329315 54622 -141917 -146014
37741a46014P9433J06129J86722K02512K0386j85113j31135J39757L04537K07035
$$ -146014 -66581 39548 226270 428782 449168 264055 132920 272677 577214 784249
37731G84249J3080q1877p1706l0085J7708M7843J7657m7976p8648r7499j85935
$$ 784249 797329 715452 643746 613661 631369 679212 696869 648893 570245 472746 286811
37720B86811k76945j80959R3520K52974J12717j03946q2713J02100J08118j31680
$$ 286811 9866 -171093 -77573 175401 288118 184172 101459 203559 311677 179997
37710A79997l01252j81696N7567J69320J66303J63824J11206o6252k12292j18230
$$ 179997 -121255 -302951 -245384 -76064 90239 254063 365269 299017 86725 -31505
37700c1505J14546J79438K0522r8073j9058Q8731M4149n7900l7006P3427J02385
$$ -31505 83041 262479 283001 184928 165870 254601 298750 240850 203844 277271 379656
37689C79656M999j14020j67408j45621p4647j6938m2126j12969r9479J0509N3087
$$ 379656 384655 270635 103227 -42394 -117041 -133979 -176105 -289074 -388553 -378044 -324957
37678c24957m3905r8375M5006K23790J80492l4838j48921q3841o825J1530Q1001
$$ -324957 -368862 -467237 -422231 -198441 -17949 -52787 -201708 -285549 -292374 -280844 -199843
37667a99843J97551J71881m2908k18542j83907n9428j0311J3601J09502J90120
$$ -199843 -2292 169589 126681 -91861 -275768 -335196 -345507 -331906 -222404 -32284
37657c2284J35957K6187n286j8600j36288k60809j85035N5947J97943J21309j2221
$$ -32284 103673 129860 124574 105974 -30314 -291123 -476158 -420211 -222268 -100959 -113180
37646a13180k6947O3413J60961K05396J41178n6036k61252k86922j55054r3600
$$ -113180 -140127 -76714 84247 289643 430821 374785 113533 -173389 -328443 -422043
37636d22043j74582j69947Q2919L75889M08678K21978R4555J02985P3483n1416
$$ -422043 -596625 -766572 -683653 -307764 100914 322892 417447 520432 593915 542499
37626E42499j03255p779O3138j1769r3299m5088k827j46001l42147k96628n909
$$ 542499 439244 431465 494603 482834 389535 344447 341620 195619 -146528 -443156 -449065
37615d49065K12801J66767J3391l1714J5149L2995K1963L0766j388j33406k41400
$$ -449065 -236264 -69497 -56106 -87820 -72671 -39676 -17713 13053 11665 -121741 -363141
37604c63141j59901L4891J00260m268m7958R4310K10604O2603k19242k73377K464
$$ -363141 -523042 -488151 -387891 -392159 -440117 -345807 -135203 -72600 -291842 -565219 -562755
37593e62755L10648L40375J23575p8756j15043n0278j1767n1760j36470j73939
$$ -562755 -252107 88268 211843 133087 18044 -32234 -44001 -95761 -232231 -406170
37583d06170p3342J32352K49565J25051j22776k07335l5749J72120J88523N9599
$$ -406170 -479512 -347160 -97595 27456 -95320 -302655 -338404 -166284 22239 81838
37573H1838k6580k8312m5824j00917j01184j4589P5069J03026Q5303L3434n9531
$$ 81838 55258 26946 -18878 -119795 -220979 -235568 -160499 -57473 27830 61264 1733
37562A733j25858o0608R4892J43772r182k03243k22264o3130R9233J50623J30061
$$ 1733 -124125 -184733 -89841 53931 44749 -158494 -380758 -443888 -344655 -194032 -63971
37551f3971J11413R3952L0743p7463j40459n6579J32527K11935K8704k53370k90378
$$ -63971 47442 141394 172137 94674 -45785 -102364 30163 242098 270802 17432 -272946
37540b72946k289K81223K33059n1150k10862j08399M2684K3770j07626j48212
$$ -272946 -275235 5988 239047 187897 -22965 -131364 -88680 -64910 -172536 -320748
37530c20748k8611J35564K11644J78859R7415J6659m9338q2682o0111j0661j2494
$$ -320748 -349359 -213795 -2151 176708 274123 290782 241444 158762 98651 87990 75496
37519G5496p7514j00706j3277P3608J3498j22366j12112Q4585K48489K10405N7488
$$ 75496 -2018 -102724 -116001 -42393 -28895 -151261 -263373 -178788 69701 280106 337594
37508C37594n3805j12994j66504j73821r5220O21M4734O4689O3663m5310k46168
$$ 337594 283789 170795 4291 -169530 -264750 -264129 -219395 -154706 -91043 -136353 -382521
37497c82521l21488j23932J86596L50069L18113J91954J6877j50899j47690O2101
$$ -382521 -704009 -827941 -641345 -291276 26837 218791 235668 84769 -62921 -820
37487h20K03650M1388k18436k04222M9287J79124P9687j045M8013M2991q2973
$$ -820 202830 244218 25782 -178440 -129153 49971 129658 128613 176626 219617 136644
37476A36644j22159O575P2188o2561j81253q0466R4551J22445O3156Q4474J38147
$$ 136644 14485 21060 93248 30687 -150566 -231032 -136481 -14036 49120 133594 271741
37465B71741P7454n4619j07495q1377q0166r9376o3129M409K3298O137J1253J9606
$$ 271741 349195 294576 187081 105704 25538 -73838 -136967 -132558 -109260 -103123 -91870 -72264
37453g2264j1521n4573q5007j43243k11222j59187M7601K24354K07904R6674P7228
$$ -72264 -83785 -138358 -223365 -366608 -577830 -737017 -689416 -465062 -257158 -160484 -83256
37442h3256J28883R6936k6621r7483n0287L5231P1283L3496o1213j35827q1318
$$ -83256 45627 142563 115942 18459 -31828 3403 74686 108182 46969 -88858 -170176
37431a70176P9918J44593k0472k57520k97012r8326J29339J97856J03601l8397
$$ -170176 -90258 54335 33863 -223657 -520669 -618995 -489656 -291800 -188199 -226596
37421b26596j11197p8020j8884l2773p3537l267J50895J76429N773j37564p3389
$$ -226596 -337793 -415813 -434697 -467470 -541007 -544274 -393379 -216950 -211177 -348741 -422130
37410d22130N3618K5060r3660q3572O8456J82992J75740J12817M5488j7182l5737
$$ -422130 -368512 -343452 -437112 -520684 -452228 -269236 -93496 19321 64809 47627 11890
37399A1890n448j0629p1835o5873N1269J14945L3261o029J42368K58985P5440
$$ 11890 6442 -4187 -76022 -141895 -90626 24319 57580 51551 193919 452904 528344
37388E28344k54265l51127j61909M2425J20927J46344J12231n0118j95274r5412
$$ 528344 274079 -77048 -238957 -196532 -75605 70739 182970 132852 -62422 -157834
37378a57834J50986K15482N1862o3960k0604k166q4927j02452j681M0132m5160
$$ -157834 -6848 208634 260496 196536 175932 173766 88839 -13613 -15294 24838 -20322
37367b0322j10816j13137j73307k42667j03090J91833K93884J21342J4042J47641
$$ -20322 -131138 -244275 -417582 -660249 -763339 -571506 -277622 -156280 -142238 5403
37357E403K37704P0257j08239l9529J00126N0281p9452o9991m467m5793p6703
$$ 5403 243107 313364 205125 165596 265722 316003 236551 166560 162093 116300 39597
37346C9597N2362J61255K5490j89364j85497l9742l2822j25650m8810J78095K55584
$$ 39597 91959 253214 278704 89340 -96157 -135899 -168721 -294371 -343181 -165086 90498
37335I0498J04854l9052m1692j9878n3089o5108l1420k6664l7968J8714Q7799
$$ 90498 195352 156300 114608 94730 41641 -23467 -54887 -81551 -119519 -100805 -13006
37324a3006K3343j48153k44501j98539r4465K8744J74760K38914J22382l5467
$$ -13006 10337 -137816 -382317 -580856 -675321 -646577 -471817 -232903 -110521 -145988
37314a45988r103J50791J83557L5023q0470m6267J4713J652k8066l3004n4512
$$ -145988 -155091 -4300 179257 214280 133810 87543 102256 103908 75842 42838 -11674
37303a1674o9353o114P0637L1993n3144O651J73717J94993P467j64817j75602
$$ -11674 -81027 -87141 -16504 15489 -37655 -31004 142713 337706 345173 180356 4754
37292D754j16339m3575J22915L14613K66663n9853l07454j98175O8340J29761
$$ 4754 -111585 -155160 -32245 282368 549031 489178 181724 -16451 51889 181650
37282A81650l4811j66691j36395m1279P300j7469j04750j84266j25321R7220L00062
$$ 181650 146839 -19852 -156247 -197526 -190226 -207695 -312445 -496711 -622032 -524812 -224750
37271b24750K82302O6474j44405j88882o0545J17590J79145P0319n1347k723J29667
$$ -224750 57552 124026 -20379 -209261 -269806 -152216 26929 97248 45901 43178 172845
37260A72845P5182j94404l65232k25150K8705J01723J6890LJ01598J68910J12287
$$ 172845 248027 53623 -311609 -536759 -508054 -406331 -389441 -389438 -287840 -118930 -6643
37249f643k326p9809o6523M5405J63019J28298o7416k04973j08273J08739K08797
$$ -6643 -8969 -88778 -155301 -109896 53123 181421 114005 -90968 -199241 -90502 118295
37238A18295J42050L2875m7340j15297j44793p5633O2945J61442J48174K9151
$$ 118295 260345 293220 245880 130583 -14210 -89843 -26898 134544 282718 311869
37228C11869j31827k18544j45466P796P1617M5812R9872K37229K07231q3422l21149
$$ 311869 180042 -38502 -183968 -176172 -104555 -58743 41129 278358 485589 402167 81018
37217H1018j96050J33705K68031J06144j23531k48424k65175j62829N4636K18336
$$ 81018 -115032 18673 286704 392848 269317 20893 -244282 -407111 -352475 -134139
37207a34139J56014k8263r1406r358O3717J05748J87234K04248J0971k26446j97421
$$ -134139 21875 -6388 -97794 -107152 -43435 62313 249547 453795 464766 238320 40899
37196D0899L8042J10124n8442j51670m1761K039j45017j81919Q8594L62217L00698
$$ 40899 78941 189065 130623 -21047 -62808 -60769 -205786 -387705 -299111 63106 363804
37185C63804N8902j8703N1905L2550p1814q5778m2631r8866j80071r2518Q4853
$$ 363804 422706 404003 455908 488458 416644 330866 288235 189369 9298 -83220 1633
37174A633R2847o1451j16278r643M0687m8982q9280J2765P0326n1761j93735j60188
$$ 1633 94480 33029 -83249 -92892 -52205 -101187 -190467 -177702 -107376 -159137 -352872 -513060
37162e13060q658R1051J12235J20534J10318N4107Q674K8937O1746M2097K999
$$ -513060 -521718 -430667 -318432 -197898 -87580 -33473 -24799 4138 65884 107981 110980
37151A10980k1619r6766k51251l37754j98220P9874K42777J96525R6010Q9636
$$ 110980 89361 -7405 -258656 -596410 -794630 -714756 -471979 -275454 -179444 -89808
37141h9808J27984R3070k414m8928j0487M3877O1637O5865P4362L8912p5794j91471
$$ -89808 38176 131246 128832 79904 69417 113294 174931 240796 315158 354070 278276 86805
37129H6805j72594l27J64849J43584n2282k17592j80881n03J13140O6878p05O4065
$$ 86805 -85789 -86116 78733 222317 170035 -47557 -228438 -228941 -115801 -48923 -49628 14437
37117A4437J66645O5476k48818m55701l07604J3128J33546j031r9137J2656J66384
$$ 14437 181082 246558 -2260 -457961 -765565 -752437 -618891 -619922 -719059 -706403 -540019
37106e40019J64948O9050L1791M6628L1162P223K1399J5263n0402o5192M9877
$$ -540019 -375071 -306021 -274230 -227602 -196440 -189217 -167818 -152555 -202957 -268149 -218272
37095b18272J47882N3819j38766j95489r3624j2364k2217k5725J9889N8671R6143
$$ -218272 -70390 -16571 -155337 -350826 -444450 -456814 -479031 -504756 -484867 -426196 -330053
37084c30053J67614J71496m786k07516j58956J06932K61070J72236M8377J4614
$$ -330053 -162439 9057 4271 -203245 -362201 -255269 5801 178037 226414 241028
37074B41028o8858k21720j79285J33304L28418J01922k40515k06461J37156K76331
$$ 241028 172170 -49550 -228835 -95531 232887 334809 94294 -112167 24989 301320
37064C01320R562l24900l72064j43470J57174L69877L76708J44841j41394k12901
$$ 301320 310882 -14018 -386082 -529552 -372378 -2501 374207 519048 377654 164753
37054A64753m9627J07535J09024M7939K1542k5897j38777k29292k19677j49185
$$ 164753 115126 222661 331685 379624 401166 375269 236492 7200 -212477 -361662
37044c61662o6518L4314J15953R7101P862j6820M4613N9578j9346n8814K5524
$$ -361662 -428180 -393866 -277913 -180812 -172950 -189770 -145157 -85579 -104925 -163739 -138215
37033a38215J22542J14666N0533J7002o704m8733m7530J6305L2552n4759j11850
$$ -138215 -15673 98993 149526 166528 159824 111091 63561 79866 112418 57659 -54191
37022e4191k3551Q4124J8352j65053k24140q4939N5739J5460j30263j64950j7294
$$ -54191 -77742 6382 24734 -140319 -364459 -449398 -393659 -378199 -508462 -673412 -690706
37011f90706J54550J68413N0541p050P8859J63544J05573n834j0525L6952l2718
$$ -690706 -536156 -367743 -317202 -324252 -245393 -81849 23724 17890 7365 44317 11599
37000A1599j69071j39413Q3315K50529K19457J26126Q5996J7994r6550q8481O9066
$$ 11599 -157472 -296885 -213570 36959 256416 382542 468538 486532 389982 301501 370567
36989C70567J05150j21565l19084j90970Q0033J32184k409l0978M8982j3174j99304
$$ 370567 475717 354152 35068 -155902 -75869 56315 53906 22928 71910 58736 -140568
36978a40568k06333J4279J35941j6588k01278j69802j5067O9755R7419J49938
$$ -140568 -346901 -332622 -196681 -213269 -414547 -584349 -599416 -529661 -432242 -282304
36968b82304J60710M4533j10756j64909j24615q2411n9119k3631J9357N1346P1740
$$ -282304 -121594 -77061 -187817 -352726 -477341 -559752 -618871 -642502 -623145 -571799 -500059
36957e00059O0922Q416n871J03467K41468K02324k7440k09489j67486j82R4532
$$ -500059 -439137 -430721 -436592 -333125 -91657 110667 83227 -126262 -293748 -293930 -199398
36946a99398O1349j9785n2758J5414J35845J53952J0719r5642K8337J98038O3037
$$ -199398 -138049 -157834 -210592 -195178 -59333 94619 105338 9696 38033 236071 299108
36935B99108k97800l92867m7768K94618K28284m6584j18989L833M7872l954L1733
$$ 299108 1308 -391559 -439327 -144709 83575 36991 -81998 -78165 -30293 -34247 -2514
36924b514J20343P3081n7577m5554Q4298P3145j31163k90904k55520j15427L2339
$$ -2514 117829 190910 133333 87779 172077 245222 114059 -176845 -432365 -547792 -515453
36913e15453J69734K01051L1386j68728j07348J64660K70878P4483j26539j00376
$$ -515453 -345719 -144668 -113282 -282010 -389358 -224698 46180 120663 -5876 -106252
36903a06252j5513p0112j28315j1089J27136N0433j24770j05608Q4356J51194
$$ -106252 -121765 -191877 -320192 -331281 -204145 -153712 -278482 -384090 -299734 -148540
36893a48540K9340k2997J26363K60285J65636m3360j27925p1295k9206m8295l8680
$$ -148540 -119200 -142197 -15834 244451 410087 366727 238802 167507 138301 90006 51326
36882E1326J7572K8183k2977k8713L5586J8127j68956l33827k18221J11436K91866
$$ 51326 68898 97081 74104 45391 80977 99104 -69852 -403679 -621900 -510464 -218598
36871b18598J25015j71682k72841j41309K8048J29859K12074K76395K32732Q2210
$$ -218598 -93583 -265265 -538106 -679415 -651367 -521508 -309434 -33039 199693 281903
36861B81903k6468P509J01522J15266K3998r4070j70321j80184j14895J1252J32471
$$ 281903 255435 262944 364466 479732 503730 409660 239339 59155 -55740 -44488 87983
36850H7983J55041L8318j36652k05867r0732P1992O3559j16523k04486k0750K49738
$$ 87983 243024 281342 144690 -61177 -151909 -79917 -16358 -132881 -337367 -358117 -108379
36839a08379K76125J1076k66111l06655j31482P8690J74730J05619o4197j75717
$$ -108379 167746 178822 -87289 -393944 -525426 -446736 -272006 -166387 -230584 -406301
36829d06301j26134n379K7759j8843p976P2886Q5390p841o4616p137L8314m7651
$$ -406301 -532435 -537814 -510055 -528898 -536874 -463988 -378598 -386439 -451055 -458192 -419878 -467529
36817d67529j75686j82500o2424N6090R6743R5252J09208J38679J29447M8022
$$ -467529 -643215 -825715 -888139 -832049 -735306 -640054 -530846 -392167 -262720 -214698
36807b14698l1382K1773J84138K24678J6457k02993j24236J47770K13352j5421
$$ -214698 -246080 -224307 -40169 184509 200966 -2027 -126263 21507 234859 219438
36797B19438j91262j02515J9118m6977j20421J8714J88219R5025j52559k21598
$$ 219438 28176 -74339 -55221 -102198 -222619 -203905 -15686 79339 -73220 -294818
36787b94818r5392l0250o3284R967J85428K07739L8985l4598J07393J93913J6353
$$ -294818 -390210 -420460 -483744 -473777 -288349 -80610 -41625 -76223 31170 225083 241436
36776B41436k15707k15094n2197K6206J3529P3468J76626J26277p9994k00906
$$ 241436 25729 -189365 -241562 -215356 -201827 -128359 48267 174544 94550 -106356
36766a06356j08671L8279O4907K8645O7177J35180P1902j09400j76554J5675K89014
$$ -106356 -215027 -176748 -111841 -83196 -16019 119161 191063 81663 -94891 -79216 209798
36755B09798L29344P8071j92730k30115j01086m0060q7840n8597J33928L02402
$$ 209798 539142 617213 424483 194368 93282 53222 -34618 -93215 40713 343115
36745C43115K32779k0044k13248k22444j30864m7805J0847M4241J4237o0484p2894
$$ 343115 575894 555850 342602 120158 -10706 -58511 -47664 -3423 10814 -49670 -122564
36734a22564J4657P4617j453r8586k4697J72156K37156R2426l2746L4257J28234
$$ -122564 -107907 -33290 -34743 -133329 -158026 14130 251286 343712 310966 345223 473457
36723D73457K5052j67259j67659J5996R3010m0460j49199o2979N5640J2879q0591
$$ 473457 498509 331250 163591 179587 272597 232137 82938 19959 75599 88478 7887
36712G887m16K08752K72775N9974k55981l89391k07256J49762L54782K02749j16389
$$ 7887 7471 216223 488998 548972 292991 -96400 -303656 -153894 200888 403637 287248
36701B87248k05609N727J38242p2846l39498k29633J68095L53650J27404j76617
$$ 287248 81639 87366 225608 152762 -186736 -416369 -248274 105376 232780 56163
36691E6163k10370l7937P4979M3015k4957l4776Q208M1007J966q8001j07193O806
$$ 56163 -154207 -192144 -117165 -74150 -99107 -133883 -125675 -84668 -82702 -170703 -277896 -271090
36679b71090J21173P8163m8451o1406L2985M5276n2455p4336L7415R6682J045
$$ -271090 -149917 -71754 -120205 -181611 -148626 -103350 -155805 -230141 -192726 -96044 -94999
36668i4999q8252l4610M6532J8718l2793J4367P4298M976j32659j73974j02774
$$ -94999 -183251 -217861 -171329 -152611 -185404 -171037 -96739 -91763 -224422 -398396 -501170
36657e01170j9147M6698J12642J29188N8465j2267O411N5519M7728K9706O0781
$$ -501170 -520317 -473619 -360977 -231789 -173324 -185591 -179180 -123661 -75933 -46227 14554
36646A4554N3621o1887j31396K1549K62307K83685N5490j29066q1048N5444O6197
$$ 14554 68175 6288 -125108 -103559 158748 442433 497923 368857 287809 343253 409450
36635D09450n3329j72652k14609j72724o2366O2559J28916J26592R8560M6246
$$ 409450 356121 183469 -31140 -203864 -266230 -203671 -74755 51837 150397 196643
36625A96643n3751j44352j26912j6354O7775P6233O7780O6176K4722m6949p0340
$$ 196643 142892 -1460 -128372 -144726 -76951 -718 67062 133238 157960 111011 40671
36614D0671m1439l6882m9278J3731J21309J00839q4537k20702j30954O9977J51096
$$ 40671 -768 -37650 -86928 -73197 48112 148951 64414 -156288 -287242 -217265 -66169
36603f6169P3894j8633k4008N3389J80196K95214K88602J14769j06520k09886
$$ -66169 7725 -10908 -34916 18473 198669 493883 782485 897254 790734 580848
36593E80848j72755r8970o6241p7573j05793r7822j591J23839J14851p0361k34620
$$ 580848 408093 309123 242882 165309 59516 -38306 -39897 83942 198793 128432 -106188
36582a06188j94815n2273k9225j18896j21648J1765J19568J21977J29065J99579
$$ -106188 -301003 -353276 -382501 -501397 -623045 -611280 -491712 -369735 -240670 -41091
36572d1091K23892J38574M4669K279q1317k18200k11429L5314K60969J61216j51613
$$ -41091 182801 321375 366044 368323 287006 68806 -142623 -107309 153660 314876 163263
36561A63263k82032r9039J30391J70115J02405R7943J31751P8270o2271j82901
$$ 163263 -118769 -217808 -87417 82698 185103 283046 414797 493067 430796 247895
36551B47895k22444j79552n4062J10775J88681Q7601j18082k50521k02222p886
$$ 247895 25451 -154101 -208163 -97388 91293 178894 60812 -189709 -391931 -399817
36541c99817J98276K54860R4501j34631j68966M5165K29311J21116j46027k11331
$$ -399817 -201541 53319 147820 13189 -155777 -110612 118699 239815 93788 -117543
36531a17543O276K06575J52139k1017n9454L2332O3013j0257l5744N9866J47603
$$ -117543 -111267 95308 247447 226430 166976 199308 262321 252064 216320 276186 423789
36520D23789J04254L302n218O9374O4633r1629k48334k12760j9655Q4930m6388
$$ 423789 528043 531345 526127 595501 660134 568505 320171 107411 87756 172686 126298
36509A26298k65748l24301j88643l3839M2849J23098K44219K64835Q5960j33045
$$ 126298 -139450 -463751 -652394 -686233 -643384 -520286 -276067 -11232 74728 -58317
36499e8317j63899l7535K1878l7230k8211J25075K12620N9424j63036j64287L2458
$$ -58317 -222216 -259751 -237873 -275103 -303314 -178239 34381 93805 -69231 -233518 -201060
36488b01060J38654N6617J0808J42531K33788L6597k92194l54939o5768K25192
$$ -201060 -62406 -5789 5019 147550 381338 417935 125741 -229198 -294966 -69774
36478f9774K11753R692o9301M8122J65208J29528n213j20149j79629j98965j68308
$$ -69774 141979 151671 82370 130492 295700 425228 420015 299866 120237 -78728 -247036
36467b47036p1197O2668J61824J63869O9184m1871p5277l3779j8042p9342j31355
$$ -247036 -318233 -255565 -93741 70128 139312 97441 22164 -11615 -29657 -108999 -240354
36456b40354p5100M6546J10466Q6926N1054N2190P7466J19395J66031J47178J9914
$$ -240354 -315454 -268908 -158442 -71516 -20462 31728 109194 228589 394620 541798 561712
36445E61712j07643q7488L0079L6313j24838k60295k11612o6411J5442L0785N3302
$$ 561712 454069 366581 396660 432973 308135 47840 -163772 -230183 -214741 -183956 -130654
36434a30654N6411j6656r1048m5179P6828R8180l8897j82819j65151J880J55077
$$ -130654 -74243 -90899 -181947 -227126 -150298 -52118 -91015 -273834 -438985 -437105 -282028
36423b82028J63521N9524q161M0488J05338M6059q9923j08477L6488J45210N5358
$$ -282028 -118507 -58983 -67144 -26656 78682 124741 34818 -73659 -37171 108039 163397
36412A63397j19505j62462n0746O5070R1508N0663k3052r2172p7445M0243J29579
$$ 163397 43892 -118570 -169316 -104246 -12738 37925 14873 -77299 -154744 -114501 15078
36401A5078P2025l9155l3545N0827K0823j41599k20900q9961R9674J38146K5152
$$ 15078 87103 47948 14403 65230 86053 -55546 -276446 -366407 -266733 -128587 -103435
36390a03435p8953o9667K3490J14806J52469J54474J65708J57840K6285k35980
$$ -103435 -182388 -252055 -228565 -113759 38710 193184 358892 516732 543017 307037
36380C07037m30161l52881p1494J47977J69744R1766L4202L136j3726J0369N5326
$$ 307037 -123124 -476005 -547499 -399522 -229778 -138012 -103810 -100674 -114400 -104031 -48705
36369d8705N7838L7064P1715J29997Q9814m3330j25379j21244j52360k28125j64587
$$ -48705 9133 46197 117912 247909 337723 294393 169014 47770 -104590 -332715 -497302
36358d97302R9586L21614K65679K9689j18580r2922L034R3231J60296J51798M5545
$$ -497302 -397716 -76102 189577 219266 100686 7764 10798 104029 264325 416123 461668
36347D61668n2622l9895J4056k0546j17612j47948r0931l7912k8801k9476l0347
$$ 461668 409046 369151 383207 362661 245049 97101 6170 -31742 -60543 -90019 -120366
36336a20366l5777m741P2250J01134K0719o4588l4168M7470M0951l6736p0903
$$ -120366 -156143 -160884 -88634 12500 33219 -31369 -65537 -18067 22884 -13852 -84755
36325h4755o1261p7096p2695K9329J27412N9668r9950j24438j041O2026J0155
$$ -84755 -146016 -223112 -295807 -266478 -139066 -79398 -179348 -303786 -304827 -242801 -232646
36314b32646J9688J36177J48522m3092k16834j63735Q311R8640J22398J73340
$$ -232646 -212958 -76781 71741 28649 -188185 -351920 -343609 -244969 -122571 50769
36304E0769J72061J5466j54283j07270J10166K20853J07056o6574j28333r7754
$$ 50769 222830 238296 84013 -23257 86909 307762 414818 348244 219911 122157
36294A22157o7337m9450j1892L3503L9437k0395j17043j68929j13440p49N4252
$$ 122157 54820 5370 -6522 26981 66418 46023 -71020 -239949 -353389 -354138 -299886
36283b99886M7630J01987K39181K81350J05959j33502k09119j27709m8763j316
$$ -299886 -252256 -150269 88912 370262 476221 342719 133600 5891 -42872 -44188
36273d4188Q5073J47755O1192r1396r7365L1854P7626J0281L9031J82794J55327
$$ -44188 40885 188640 249832 158436 61071 92925 170551 180832 219863 402657 557984
36262E57984j34746l18692r7987K39995K13527j24765k72439l4762K21293J41183
$$ 557984 423238 104546 6559 246554 460081 335316 62877 28115 249408 390591
36252C90591j42629k69116j33529O6618J19205j6158k13208k74247j07316J34212
$$ 390591 247962 -21154 -154683 -88065 31140 14982 -198226 -472473 -579789 -445577
36242d45577J93594L5174j05899n3849Q2092J04430K666r2812j12321o6001M1808
$$ -445577 -251983 -216809 -322708 -376557 -294465 -190035 -187369 -280181 -392502 -458503 -416695
36231d16695J73224K05655O8563j11541j38820J727J36618J28471N877j16841
$$ -416695 -243471 -37816 30747 -80794 -219614 -217887 -81269 47202 53079 -63762
36221f3762j58977j19745o8105o4168n7215O1753K53257K99095R5491j43039j43692
$$ -63762 -222739 -342484 -410589 -474757 -531972 -470219 -216962 82133 177624 34585 -109107
36210a09107M7654J51787O7611k8304O422R8065J39079J43148J27313K0310j86698
$$ -109107 -61453 90334 157945 129641 136063 234128 373207 516355 643668 663978 477280
36199D77280l33658k74536q4875L4318J1112l9874N927J24447J75008P4465p6335
$$ 477280 143622 -130914 -215789 -181471 -170359 -210233 -204306 -79859 95149 169614 93279
36188I3279r2862L9105J08945k4342j96069j66625K675M5697p3302j07685N0477
$$ 93279 417 39522 148467 124125 -71944 -238569 -235894 -190197 -263499 -371184 -320707
36177c20707J94107J55774O1244O5180Q2090j2414j20721r6558j3520k1190o8798
$$ -320707 -126600 29174 90418 155598 237688 225274 104553 7995 -5525 -26715 -95513
36166i5513j8302P5055M9135p0904j11477m0640J0686o955r588L7012P0047N7029
$$ -95513 -113815 -38760 10375 -60529 -172006 -212646 -201960 -208915 -218503 -181491 -111444 -54415
36154e4415J2798p2649j69630j48181L3681J74113Q6233p9220m3390J42754J75807
$$ -54415 -41617 -114266 -283896 -432077 -398396 -224283 -138050 -217270 -260660 -117906 57901
36143E7901O769r6282l2408k9075j93452k72651p5388J78422J97874P1680Q3495
$$ 57901 64670 -31612 -64020 -93095 -286547 -559198 -634586 -456164 -258290 -186610 -103115
36132a03115K43567L10698J96201O1102K6174K5057k0750o5525m3738M448j6613
$$ -103115 140452 451150 647351 708453 734627 759684 738934 673409 629671 634119 617506
36121F17506j23766k12299j60205J5670J44377R8361l8937r8995o6660m4948l3066
$$ 617506 493740 281441 121236 136906 281283 379644 340707 241712 175052 130104 97038
36110I7038M9447J34163O0437j04061r2203J19100K06875M487k13017j81737p5860
$$ 97038 146485 280648 341085 237024 144821 263921 470796 475283 262266 80529 4669
36099D669j56896k69858j12822J71988J62631j43633k86623n6735K08894J99972
$$ 4669 -152227 -422085 -534907 -362919 -200288 -343921 -630544 -687279 -478385 -278413
36089b78413Q8467J55675K90439J91457j18078l08471k10336L700J00613M5258
$$ -278413 -189946 -34271 256168 447625 329547 21076 -189260 -185560 -84947 -39689
36079c9689n1261r0798n0468K0290L2807m9917j45961j34379o495J19514J46361
$$ -39689 -90950 -181748 -232216 -211926 -179119 -229036 -374997 -509376 -515871 -396357 -249996
36068b49996J04022P7733P4115K1752r3910j65326q9714P4028J58870R9990o28
$$ -249996 -145974 -68241 5874 27626 -66284 -231610 -321324 -247296 -88426 11564 10936
36057A0936m5229p0537j40670k04788j63867k0627J36144K47493K85792J97292
$$ 10936 -34293 -104830 -245500 -450288 -614155 -634782 -498638 -251145 34647 231939
36047B31939k5142k35079k38983l3974J65394J72178K5529q2678k6696J26314
$$ 231939 206797 -28282 -267265 -301239 -135845 36333 61862 -20816 -47512 78802
36037G8802J83957L6564j89390k45345o2384J48884J65316J6541j13273j38238
$$ 78802 262759 299323 109933 -135412 -197796 -48912 116404 132945 19672 -118566
36027a18566q7281L0627J96290K78492J58336o5739j73862j11858j7336J7132
$$ -118566 -205847 -175220 21070 299562 457898 392159 218297 106439 89103 106235
36017A06235K6397L3204J3314l549K1902J0598j21629k50714j78628L2409J24135
$$ 106235 132632 165836 179150 175601 197503 208101 86472 -164242 -342870 -310461 -186326
36006a86326M6244j139L9181j0885j68309j66310R0891K93716J93458k657K350
$$ -186326 -140082 -141221 -102040 -112925 -281234 -447544 -356653 -62937 130521 127864 130214
35995A30214J00472O1k52247l45537j92921N79R9333J50995J70778J02292r656
$$ 130214 230686 230747 -21500 -367037 -559958 -559379 -460046 -309051 -138273 -35981 -45637
35984d5637n1839l5956m6679m7704L3546R9840K3631p8145n618J41750Q0584j71667
$$ -45637 -97476 -133432 -180111 -227815 -194269 -94429 -70798 -148943 -154561 -12811 67773 -103894
35972a03894k87206j42273K2013L9709N6645J80304K34398P1237j48932k10372
$$ -103894 -391100 -533373 -511360 -471651 -415006 -234702 -304 70933 -77999 -288371
35962b88371j43412p0860K2971J54871J87021M5083r0826n0287M3952M307p8097
$$ -288371 -431783 -502643 -479672 -324801 -137780 -92697 -183523 -233810 -189858 -185551 -263648
35951b63648m541J49304J40467k2511q3783M8336J82687J66129O9192L150k5502
$$ -263648 -268189 -118885 21582 -929 -84712 -36376 146311 312440 381632 384782 359280
35940C59280k0133M6562J14691O0085r7364j76445r9064j2158n6598j58608j62488
$$ 359280 339147 385709 500400 560485 463121 286676 187612 175454 118856 -39752 -202240
35929b02240o0508K9750M9897N1686Q8670J38455J39756P3347m618k1101J6543
$$ -202240 -262748 -232998 -183101 -131415 -42745 95710 235466 308813 304195 283094 299637
35918B99637K2845l7109q2517l9320L7958N0357j614n5591j02705j46599j13925
$$ 299637 322482 285373 202856 163536 201494 251851 250237 194646 91941 -54658 -168583
35907a68583M2552J94533J58652m5398k09250j99886o5886R5118K11530K01877
$$ -168583 -126031 68502 227154 181756 -27494 -227380 -293266 -198148 13382 215259
35897B15259M5572j16272j27759m7611m1888r2466n7650J6854l9013j46022l8960
$$ 215259 260831 144559 16800 -30811 -72699 -165165 -222815 -205961 -244974 -390996 -429956
35886d29956K28099K57864m4978k36686j6800K58099J27629k38032l22181n3160
$$ -429956 -201857 56007 11029 -225657 -242457 15642 143271 -94761 -416942 -470102
35876d70102J79706J68298N6760o0343k22743k90820l2523M00184N27977K04170
$$ -470102 -290396 -122098 -65338 -125681 -348424 -639244 -671767 -271583 256394 460564
35866D60564j77983k72787j87325j35253q0648L7622P5701m0244r5439O9116K42028
$$ 460564 282581 9794 -177531 -312784 -393432 -355810 -280109 -320353 -415792 -346676 -104648
35855a04648J67029l7359r5958k5444l0232r5372l7845J16312J51468L5893l8101
$$ -104648 62381 25022 -70936 -96380 -126612 -221984 -259829 -143517 7951 43844 5743
35844E743K046J5398o0258q8073J6160J31638J30424N8703K5579L8777L5159j2369
$$ 5743 7789 23187 -37071 -125144 -108984 22654 153078 211781 237360 276137 311296 298927
35832B98927p3402q6996n546J22154J47462L830j50410j08756Q7543J85073N5518
$$ 298927 225525 138529 132983 255137 402599 406429 256019 147263 234806 419879 475397
35821D75397j53566k34752j53718k2254N1596L5529l0703p6900p8675p6027p8709
$$ 475397 321831 87079 -66639 -88893 -37297 -1768 -32471 -109371 -188046 -264073 -342782
35810c42782k6696P8436J09316J3029l6109J22120L28558K87820J6729j66606
$$ -342782 -369478 -291042 -181726 -168697 -204806 -82686 245872 533692 550421 383815
35800C83815j16474l1466p6595j22917j7360J31458J40587M8965J1104J8789m9562
$$ 383815 267341 235875 159280 36363 19003 150461 291048 340013 351117 369906 320344
35789C20344j67903j66689n099J26979L9490k04797l28722j37392K33705M17729
$$ 320344 152441 -14248 -19347 107632 147122 -57675 -386397 -523789 -290084 127645
35779A27645K17763j49304l13752j94396j3711P7335J43056K07769J42786o3124
$$ 127645 345408 196104 -117648 -312044 -325755 -248420 -105364 102405 245191 182067
35769A82067j74565m5719J15648M6123j67781k29805p2621R8867J45051J23032
$$ 182067 7502 -38217 77431 123554 -44227 -274032 -346653 -247786 -102735 20297
35759B0297R2129J9106q7388j33260q1823m855M1231O9861P4503Q121j09432j63556
$$ 20297 112426 131532 44144 -89116 -170939 -175794 -134563 -64702 9801 17922 -91510 -255066
35747b55066p3779J01558K11456J43512o1150k03672j14191J16654K08410O7530
$$ -255066 -328845 -227287 -15831 127681 66531 -137141 -251332 -134678 73732 141262
35737A41262o0717M3256K20838J73409o6393j90861j03653l8440j45403k52510
$$ 141262 80545 123801 344639 518048 451655 260794 157141 118701 -26702 -279212
35727b79212j62974M4683J74096J92527J85036J54058L9030j30081k42918k45203
$$ -279212 -442186 -397503 -223407 -30880 154156 308214 347244 217163 -25755 -270958
35717b70958j72104p6828M823N3583Q2072J14283J24737O1601m6040r1559m1475
$$ -270958 -443062 -519890 -515067 -461484 -379412 -265129 -140392 -78791 -124831 -216390 -257865
35706b57865J1157j504j5146M4191J18834J03145J3890k7644L2471J09143Q8022
$$ -257865 -246708 -248212 -263358 -219167 -100333 2812 16702 -10942 21529 130672 218694
35695B18694l6152j45773j25421m678O0214j1293r6654l9421J04108J33871Q202
$$ 218694 182542 36769 -88652 -93330 -33116 -44409 -141063 -180484 -76376 57495 65697
35684F5697r9010p3188l197J9854N3134J31800J35465k362j08416r061J57797
$$ 65697 -33313 -106501 -109698 -89844 -36710 95090 230555 228193 119777 110716 268513
35673B68513J16958j15504k40051j16764N3607N9931l6133p0522m6570o5748j03460
$$ 268513 385471 269967 29916 -86848 -33241 26690 -9443 -79965 -126535 -192283 -295743
35662b95743l9783J19799K11358J23392n9671j60601r7897N4907J57612J25539
$$ -295743 -335526 -215727 -4369 119023 59352 -101249 -199146 -144239 13373 138912
35652A38912j1314j42471j69792q0156N7348J52016J53535P8539o300l3698J4971
$$ 138912 127598 -14873 -184665 -264821 -207473 -55457 98078 176617 170317 136619 151590
35641A51590R6987J38163Q3542n6673j97617k36243j44058J028R2853R8642O4575
$$ 151590 248577 386740 470282 413609 215992 -20251 -164309 -163281 -70428 28214 92789
35630I2789L6340J1010k9689p3644q8313o4053l0005k3481m5539n2862o682O9403
$$ 92789 129129 140139 110450 36806 -51507 -115560 -145565 -169046 -214585 -267447 -274129 -204726
35618b04726J04642O9243K0569K9202P7795Q0664M811p7195p6528M040P8290O9938
$$ -204726 -100084 -30841 -10272 18930 96725 177389 182200 105005 28477 32517 110807 180745
35606A80745k5028j46472k13359j78660p2567K2225O1969Q2403J16401J19019
$$ 180745 155717 9245 -204114 -382774 -455341 -433116 -371147 -288744 -172343 -53324
35596e3324M7684k2655J7036J12561Q0363j08174k32346j26538O3078R7724P937
$$ -53324 -5640 -28295 -11259 101302 181665 73491 -158855 -285393 -222315 -124591 -116654
35585a16654O730J04170R1135o7829j21460O7104K63100J92186o5401k24921j93832
$$ -116654 -109924 -5754 85381 17552 -103908 -36804 226296 418482 353081 128160 -65672
35574f5672r7132j8892N1262Q5939N1746K2855P0339J05147L0418m1172L4947
$$ -65672 -162804 -181696 -130434 -44495 7251 30106 100445 205592 236010 194838 229785
35563B29785J30722J8382k09488k39476m9019O3490O633L1403K06800K06471j26485
$$ 229785 360507 378889 169401 -70075 -119094 -55604 -48971 -17568 189232 395703 269218
35552B69218m09491k73285M5704Q8299j04677j31424O4971J46067K528p1055R1561
$$ 269218 -140273 -413558 -367854 -279555 -384232 -515656 -450685 -304618 -302090 -373145 -281584
35541b81584K56716K01162L2387p0998j20276j34855k770K50793L25943N4457
$$ -281584 -24868 176294 208681 137683 17407 -117448 -120218 130575 456518 510975
35531E10975k66856k51732J6656J26411m3813j85422n8167J80109K52007J39061
$$ 510975 244119 -7613 9043 135454 91641 -93781 -151948 28161 280168 419229
35521D19229K3687p738l5273j26728k22080k16991j00823K0806M0357k4062m6466
$$ 419229 442916 435178 399905 273177 51097 -165894 -266717 -245911 -205554 -229616 -276082
35510b76082M1271J47309J39892L0933m6415k5864L0503O5048R5040J03004j0223
$$ -276082 -234811 -87502 52390 83323 36908 11044 41547 106595 201635 304639 294416
35499B94416k48632l95251k31333J42054L71345K72630L1268r0814q8617j14340
$$ 294416 45784 -349467 -580800 -438746 -67401 205229 236497 145683 57066 -57274
35489e7274j68533j06925P0314J61870O6309m2200L6548K30196K95624J48439
$$ -57274 -225807 -332732 -262418 -100548 -34239 -76439 -39891 190305 485929 634368
35479F34368o1338j74540j78754j34131p8961n0839r2625j72717j73740k7619
$$ 634368 573030 398490 219736 85605 6644 -44195 -136820 -309537 -483277 -510896
35469e10896J82236L03653K64205J05352p3663j55872n7876J66004L05918J95243
$$ -510896 -328660 -25007 239198 344550 270887 115015 57139 223143 529061 724304
35459G24304o6366j98585q5783P3977M1025j49209k71014k39711j79632j65570
$$ 724304 657938 459353 373570 447547 488572 339363 68349 -171362 -350994 -516564
35449e16564r6793Q9919K53014K32798Q9068k590n860o734j0503M3175Q7507k6519
$$ -516564 -613357 -523438 -270424 -37626 51442 48852 42992 36258 25755 68930 156437 129918
35437A29918k54311l35405j38903J35723K16869R0144m7666n8455L7085J53246
$$ 129918 -124393 -459798 -598701 -462978 -246109 -155965 -203631 -262086 -225001 -71755
35427g1755K11962J63024K8755r1983j23599q9681n7971n9458q6085j05753o3988
$$ -71755 140207 303231 331986 240003 116404 26723 -31248 -90706 -176791 -282544 -346532
35416c46532N0751J38311Q7654m6032r1596m324Q5246Q3778L4283j8441p5417
$$ -346532 -295781 -157470 -69816 -115848 -207444 -211768 -126522 -42744 -8461 -26902 -102319
35405a02319p5619L7149J15512m3341l01522k82108K4028J67429m0617j82136
$$ -102319 -177938 -140789 -25277 -68618 -370140 -652248 -628220 -460791 -501408 -683544
35395f83544N4645K88225P6064k71770j69344K30698K61989j28338k90812K1406
$$ -683544 -628899 -340674 -264610 -536380 -705724 -475026 -213037 -341375 -632187 -610781
35385f10781K67901Q1919j38774J379J94065J6228k92993k41380Q5064K05505
$$ -610781 -342880 -260961 -399735 -398356 -204291 -188063 -481056 -722436 -637372 -431867
35375d31867M1126m9711P2579J67507R6482J0906J3659N627o2744q7852k5247
$$ -431867 -390741 -440452 -367873 -200366 -103884 -92978 -79319 -73692 -136436 -224288 -249535
35364b49535L5022M4104L9439J0964p2900j19205o646J79250K22864R2547l1346
$$ -249535 -214513 -170409 -130970 -120006 -192906 -312111 -318757 -139507 83357 175904 144558
35353A44558m9646n4944j19323j68046j23863l0092K4769R412l8085l3899P4264
$$ 144558 94912 39968 -79355 -247401 -371264 -401356 -376587 -367175 -405260 -439159 -364895
35342c64895J90156J35829o7985j48319L2389K18375J27938r7740j31014n236
$$ -364895 -174739 -38910 -106895 -255214 -222825 -4450 123488 25748 -105266 -110502
35332a10502l1579k24550k47729J2327K37704J86163L6425L2026J00919O7567
$$ -110502 -142081 -366631 -614360 -602033 -364329 -178166 -141741 -109715 -8796 58771
35322E8771j6448j3007K9358k983m6624J3505R2941K2277j59469k43408j44592
$$ 58771 42323 29316 58674 55691 9067 22572 115513 137790 -21679 -265087 -409679
35311d09679K0702J20526J20984N1808q191M0766J76498K05887J1375k18167j97006
$$ -409679 -388977 -268451 -147467 -95659 -103850 -63084 113414 319301 330676 112509 -84497
35300h4497M0022J48451m7389k89366k27025J12525L68903L14357R8198j2416
$$ -84497 -44475 103976 56587 -232779 -459804 -347279 21624 335981 434179 421763
35290D21763J7153K4137m9560p4782K2012J08526M8250p3068p2268N4585J40675
$$ 421763 438916 463053 413493 338711 360723 469249 517499 444431 372163 426748 567423
35279E67423R3890k4464j41695k27729k17479o3641J12344J08610p0041j92814
$$ 567423 661313 636849 495154 267425 49946 -13695 98649 207259 137218 -55596
35269e5596j32842l0226l5948q0694l2669P3920J26887J30017J47244J49111P5764
$$ -55596 -188438 -218664 -254612 -335306 -367975 -294055 -167168 -37151 110093 259204 334968
$$ [...]
##END NTUPLES=NMR SPECTRUM
##END=
