##TITLE=31Pdec_IPPA1911D
 CDCl3, 88 sc
 20.11.2019
##JCAMPDX= 6.0         $$ Bruker NMR JCAMP-DX V2.0
##DATA TYPE= NMR SPECTRUM
##DATA CLASS= NTUPLES
##ORIGIN= UXNMR, Bruker Analytische Messtechnik GmbH
##OWNER= root
$$ XWIN-NMR		Version 3.5
$$ Wed Nov 20 14:11:35 2019 Russian Standard Time (UT+4h)  she@DPX200
##.OBSERVE FREQUENCY= 81.013821
##.OBSERVE NUCLEUS= ^31P
##.ACQUISITION MODE= SIMULTANEOUS
##.ACQUISITION SCHEME= undefined
##.AVERAGES= 24
##.DIGITISER RES= 17
##SPECTROMETER/DATA SYSTEM= spect
##.PULSE SEQUENCE= zgpg30
##.SOLVENT NAME= THF
##.SHIFT REFERENCE= (INTERNAL, THF, 0, 182.463)
##AUDIT TRAIL= $$ (NUMBER, WHEN, WHO, WHERE, WHAT)
$$ ##TITLE= Audit trail, XWIN-NMR		Version 3.5
$$ ##JCAMPDX= 5.01
$$ ##ORIGIN= Bruker BioSpin GmbH
$$ ##OWNER= she
$$ F:/spectra/data/she/nmr/P31/1/pdata/1/auditp.txt
$$ ##AUDIT TRAIL=  $$ (NUMBER, WHEN, WHO, WHERE, WHAT)
(   1,<2019-11-20 14:10:29.48 +0400>,<she>,<DPX200>,
      <created by zg, POWCHK disabled, PULCHK disabled
       configuration hash MD5:
       00 E9 B6 7A A2 85 ED C7 34 08 36 98 17 FE 4E 26
       data hash MD5: 32K
       20 1C 77 83 D9 E4 EF 1B 7E 4C B4 13 10 CB B6 5B>)
(   2,<2019-11-20 14:10:32.35 +0400>,<she>,<DPX200>,
      <Start of raw data processing
       efp BC_mod = 2 LB = 1 FT_mod = 6 PKNL = 1 PHC0 = -1270.127 PHC1 = -37.99901 SI = 64K 
       data hash MD5: 64K
       20 2D 5A AC 93 8B D3 E3 22 63 91 74 22 53 8D A9>)
(   3,<2019-11-20 14:10:42.79 +0400>,<she>,<DPX200>,
      <pk PHC0 = -3.471324 PHC1 = 0 
       data hash MD5: 64K
       8E 1A AF E5 7C 40 DC 42 98 2B D1 B8 12 DA 84 AB>)
(   4,<2019-11-20 14:10:46.31 +0400>,<she>,<DPX200>,
      <abs ABSG = 5 
       data hash MD5: 64K
       A0 0F 73 A6 10 AB 27 82 AB 0C A5 AE 38 B9 EA BD>)
(   5,<2019-11-20 14:11:00.46 +0400>,<she>,<DPX200>,
      <pk PHC0 = 8.601551 PHC1 = 0 
       data hash MD5: 64K
       8D D6 63 68 DE EE C6 0A 33 69 BB 10 BE 97 5C E7>)
(   6,<2019-11-20 14:11:03.87 +0400>,<she>,<DPX200>,
      <abs ABSG = 5 
       data hash MD5: 64K
       2F 72 AB 75 42 13 A6 E9 A4 50 DE 39 89 42 9A EC>)
$$ ##END=
$$ 
$$ hash MD5
$$ 9A 25 D7 29 0C BC 30 6F A9 14 24 77 98 52 A1 56
##$RELAX= 
##$RELAX= 
##$RELAX= 
##$RELAX= 
##$RELAX= 
##$RELAX= 
##$RELAX= 
##$RELAX= 
$$ Bruker specific parameters
$$ --------------------------
##$DU= <F:/spectra>
##$EXPNO= 1
##$NAME= <P31>
##$PROCNO= 1
##$TYPE= <nmr>
##$USER= <she>
##$AMP= (0..31)
100 100 100 100 100 100 100 100 100 100 100 100 100 100 100 100 100 100 
100 100 100 100 100 100 100 100 100 100 100 100 100 100 
##$AQSEQ= 0
##$AQ_mod= 1
##$AUNM= <au_zg>
##$AUTOPOS= <>
##$BF1= 81.014009
##$BF2= 200.13
##$BF3= 200.13
##$BF4= 200.13
##$BF5= 200.13
##$BF6= 200.13
##$BF7= 200.13
##$BF8= 200.13
##$BYTORDA= 1
##$CFDGTYP= 0
##$CFRGTYP= 5
##$CHEMSTR= <none>
##$CNST= (0..31)
1 1 145 1 1 1 1 1 1 1 1 1 1 1 1 1 1 1 1 1 1 1 1 1 1 1 1 1 1 1 1 1 
##$CPDPRG= <waltz16>
##$CPDPRG1= <>
##$CPDPRG2= <waltz16>
##$CPDPRG3= <>
##$CPDPRG4= <mlev>
##$CPDPRG5= <mlev>
##$CPDPRG6= <mlev>
$$ [...]
##$SUBNAM3= <"">
##$SUBNAM4= <"">
##$SUBNAM5= <"">
##$SUBNAM6= <"">
##$SUBNAM7= <"">
##$SUBNAM8= <"">
##$SUBNAM9= <"">
##$SW= 369.568048894756
##$SWIBOX= (0..15)
0 1 3 0 0 0 0 0 0 0 0 0 0 0 0 0 
##$SW_h= 29940.119760479
##$TD= 32768
##$TD0= 1
##$TE= 0
##$TE2= 300
##$TE3= 300
##$TEG= 300
##$TL= (0..7)
0 120 53 12 22 120 120 120 
##$TP= (0..7)
150 150 150 150 150 150 150 150 
##$TP07= 0
##$TPNAME0= <>
##$TPNAME1= <>
##$TPNAME2= <>
##$TPNAME3= <>
##$TPNAME4= <>
##$TPNAME5= <>
##$TPNAME6= <>
##$TPNAME7= <>
##$TPOAL= (0..7)
0.5 0.5 0.5 0.5 0.5 0.5 0.5 0.5 
##$TPOFFS= (0..7)
0 0 0 0 0 0 0 0 
##$TUNHIN= 0
##$TUNHOUT= 0
##$TUNXOUT= 0
##$USERA1= <user>
##$USERA2= <user>
##$USERA3= <user>
##$USERA4= <user>
##$USERA5= <user>
##$V9= 5
##$VALIST= <valist>
##$VCLIST= <CCCCCCCCCCCCCCC>
##$VD= 0
##$VDLIST= <DDDDDDDDDDDDDDD>
##$VPLIST= <PPPPPPPPPPPPPPP>
##$VTLIST= <TTTTTTTTTTTTTTT>
##$WBST= 1024
##$WBSW= 4
##$XGAIN= (0..3)
0 0 0 0 
##$XL= 0
##$YL= 0
##$YMAX_a= 15671
##$YMIN_a= -19039
##$ZGOPTNS= <>
##$ZL1= 120
##$ZL2= 120
##$ZL3= 120
##$ZL4= 120
##$ABSF1= 182.463
##$ABSF2= -187.1042
##$ABSG= 5
##$ABSL= 3
##$ALPHA= 0
##$AQORDER= 0
##$ASSFAC= 0
##$ASSFACI= 0
##$ASSFACX= 0
##$ASSWID= 0
##$AUNMP= <proc_1d>
##$AZFE= 0.1
##$AZFW= 0.5
##$BCFW= 0
##$BC_mod= 2
##$BYTORDP= 0
##$COROFFS= 0
##$CY= -3
##$DATMOD= 1
##$DC= 0
##$DFILT= <>
##$DTYPP= 0
##$F1P= 0
##$F2P= 0
##$FCOR= 1
##$FTSIZE= 65536
##$FT_mod= 6
##$GAMMA= 0
##$GB= 0
##$INTBC= 1
##$INTSCL= 5.30512e-09
##$ISEN= 30
##$LB= 1
##$LEV0= 0
##$LPBIN= 0
##$MAXI= 10000
##$MC2= 0
##$MEAN= 0
##$ME_mod= 0
##$MI= 50
##$NCOEF= 0
##$NC_proc= -8
##$NLEV= 6
##$NOISF1= 182.463
##$NOISF2= 159.3651
##$NSP= 0
##$NTH_PI= 0
##$NZP= 0
##$OFFSET= 182.463
##$PC= 4
##$PHC0= -1264.996
##$PHC1= -37.99901
##$PH_mod= 1
##$PKNL= yes
##$PPARMOD= 0
##$PSCAL= 0
##$PSIGN= 0
##$REVERSE= no
##$SF= 81.0140089999434
##$SI= 65536
##$SIGF1= 159.3651
##$SIGF2= -187.1042
##$SINO= 113.3802
##$SIOLD= 16384
##$SREGLST= <1H.CDCl3>
##$SSB= 0
##$STSI= 65536
##$STSR= 0
##$SW_p= 29940.119760479
##$SYMM= 0
##$S_DEV= 0
##$TDeff= 32768
##$TDoff= 0
##$TI= <>
##$TILT= no
##$TM1= 0
##$TM2= 0
##$TOPLEV= 0
##$USERP1= <user>
##$USERP2= <user>
##$USERP3= <user>
##$USERP4= <user>
##$USERP5= <user>
##$WDW= 1
##$XDIM= 65536
##$YMAX_p= 334931486
##$YMIN_p= -198604850
$$ End of Bruker specific parameters
$$ ---------------------------------
##NTUPLES= NMR SPECTRUM
##VAR_NAME=  FREQUENCY,     SPECTRUM/REAL,   SPECTRUM/IMAG
##SYMBOL=    X,             R,               I
##VAR_TYPE=  INDEPENDENT,   DEPENDENT,       DEPENDENT
##VAR_FORM=  AFFN,          ASDF,            ASDF
##VAR_DIM=   65536,         65536,           65536
##UNITS=     HZ,            ARBITRARY UNITS, ARBITRARY UNITS
##FACTOR=    0.456856943014862, 1,           1
##FIRST=     14782.0589164792, 0,            0
##LAST=      -15158.0608439998, 0,           0
##MIN=       -15158.0608439998, -198604850,  0
##MAX=       14782.0589164792, 334931486,    0
$$ Real data points
##PAGE= N=1
##DATA TABLE= (X++(R..R)), XYDATA
$$ [...]
$$ plain form
44590 2241739 14701709 26344846 29825753 24443262 16600801 11850239 9938307 8779601
44582 8779601 8868414 10881889 12328471 10181150 5026366 -99608 -3305416 -4067399 -2121140
44573 -2121140 1038731 1689629 -1473617 -3679632 625806 8976670 11894965 4438134
44565 4438134 -6699445 -10595337 -4813332 2630814 3768679 -279499 -2475584 387492
44557 387492 4498245 5255982 3052552 1160100 718312 901091 2430003 6894962 12369061
44548 12369061 13572400 8367550 1593005 5913 4775072 11204790 14823781 15029175
44540 15029175 12958043 9056631 4398024 1944537 3448130 5863262 4149791 -1785279
44532 -1785279 -6163136 -4933159 -1074499 455259 -139231 178020 382553 -2857629 -7355504
$$ packed form
44590B241739J2459970J1643137L480907n382491p842461m750562j911932j158706
44582H779601Q8813K013475J446582k147321n154784n125974l205808p61983J946259
44573b121140L159871O50898l163246k206015M305438Q350864K918295p456831
44565D438134j1137579l895892N782005P444146J137865m048178k196085K863076
44557C87492M110753P57737k203430j892452m41788J82779J528912M464959N474099
44548A2369061J203339n204850o774545j587092M769159O429718L618991K05394
44540A5029175k071132l901412m658607k453487J503593K415132j713471n935070
44532a785279m377857J229977L858660J529758n94490L17251K04533l240182m497875
$$ plain form
44523 -7355504 -6722640 -805108 2822548 872355 -19229 5010268 9256133 4372273
44515 4372273 -5690425 -10467747 -9087184 -9709629 -14169151 -14785809 -8331318 -2413692
44507 -2413692 -3593740 -7904576 -8571195 -6056096 -4644997 -4852140 -5155051 -6542217 -9435453
44498 -9435453 -10001797 -5377523 592973 2481712 1470722 2773248 6894249 9170821
44490 9170821 7161154 3601589 2172753 3784801 6421696 6172466 329391 -7918266
44482 -7918266 -10931212 -6260867 -1142330 -2595683 -7078574 -6736143 -2611549 -2629403 -7328661
44473 -7328661 -7680010 359258 8208226 6899111 275617 -779705 6609305 14957184
44465 14957184 17645935 16137473 15186668 15919499 16283475 15524736 15039507 15511708 15894599
$$ packed form
44523g355504O32864N917532L627656j950193q91584N029497M245865m883860
44515D372273j0062698m777322J380563o22445m459522o16658O454491N917626
44507b413692j180048m310836o66619K515099J411099k07143l02911j387166k893236
44498i435453n66344M624274N970496J888739j010990J302526M121001K276572
44490I170821k009667l559565j428836J612048K636895k49230n843075q247657
44482g918266l012946M670345N118537j453353m482891L42431M124594j7854m699258
44473g328661l51349Q039268P848968j309115o623494j055322P389010Q347879
44465A4957184K688751j508462r50805P32831L63976p58739m85229M72201L82891
$$ plain form
44456 15894599 15774683 16613630 19271228 22032097 23199264 24193074 27120505 30423821
44448 30423821 31050443 30501563 33349845 38743764 39532631 32707520 24632605 21531702
44440 21531702 20755442 17585253 15132887 19105094 26380802 28292322 23849456 20297565
44432 20297565 20567170 19718832 15449398 12778512 14841500 17200744 15799123 13653039
44424 13653039 14708020 16977903 17078431 16709873 19301784 23944466 27289358 28082547
44416 28082547 25790003 18514283 6684439 -4557610 -10868426 -13410658 -14486653 -12822938
44408 -12822938 -7909952 -4599858 -7128747 -11533088 -10353977 -3013041 4249931 7096319
44400 7096319 6120248 2744464 -1981785 -5287304 -4976917 -3572925 -5416550 -10290863
$$ packed form
44456A5894599j19916Q38947K657598K760869J167167R93810K927431L303316
44448C0423821O26622n48880K848282N393919P88867o825111q074915l100903
44440B1531702p76260l170189k452366L972207P275708J911520m442866l551891
44432B0297565K69605q48338m269434k670886K062988K359244j401621k146084
44424A3653039J054981K269883J00528l68558K591911M642682L344892P93189
44416B8082547k292544p275720j1829844j1242049o310816k542232j075995J663715
44408a2822938M912986L310094k528889m404341J179111P340936P262972K846388
44400G096319r76071l375784m726249l305519L10387J403992j843625m874313
$$ plain form
44392 -10290863 -14435106 -16539164 -17583034 -16340799 -11370206 -6608267 -7945316 -13856829
44384 -13856829 -16407806 -12824467 -9177574 -10299612 -12635022 -10727922 -5579855 -2447088
44376 -2447088 -3815422 -7736887 -10294217 -7657980 1023584 10979928 15520772 13810096
44368 13810096 11027397 9810458 6984215 916083 -3982054 -3839338 -908801 1754278
44360 1754278 5669089 11611100 14385813 10111671 4556377 5768904 10833871 9230029
44352 9230029 -888801 -9282034 -8777205 -5090972 -6678263 -11734283 -12356343 -7790578
44344 -7790578 -5616474 -9825374 -14452481 -11992875 -4025706 869339 -1544475 -6391637
44336 -6391637 -7432699 -5708842 -6895063 -12092709 -16099590 -15000137 -10683747 -6209688
$$ packed form
44392a0290863m144243k104058j043870J242235M970593M761939j337049n911513
44384a3856829k550977L583339L646893j122038k335410J907100N148067L132767
44376b447088j368334l921465k557330K636237Q681564R956344M540844j710676
44368A3810096k782699j216939k826243o068132m898137J42716K930537K663079
44360A754278L914811N942011K774713m274142n555294J212527N064967j603842
44352I230029j0118830q393233N04829L686233j587291n056020o22060M565765
44344g790578K174104m208900m627107K459606P967169M895045k413814m847162
44336f391637j041062J723857j186221n197646m006881J099453M316390M474059
$$ plain form
44328 -6209688 -1332337 4349447 7911588 7054210 4637962 4809368 6906500 7794703 7886617
44319 7886617 9259472 9625287 5006914 -1845236 -2923169 3641557 10170711 9792164
44311 9792164 4146842 -2078237 -7915152 -13019845 -13765981 -8732607 -4040686 -6356537
44303 -6356537 -12951375 -15473890 -12169285 -9114819 -9247074 -7809022 -1352867 5203080
44295 5203080 5310388 596494 -1574706 1090553 2722192 -1863807 -8982325 -9848361
44287 -9848361 -1694495 7776883 8522563 -603808 -10872553 -13619232 -8605384 -1835791
44279 -1835791 1891403 1944298 -241816 -2716026 -3309619 -1673350 -923289 -4260784 -9600735
44270 -9600735 -10330454 -2330044 11632802 24838605 32017797 31938503 27325252 22902409
$$ packed form
44328f209688M877351N681784L562141q57378k416248J71406K097132Q88203R1914
44319G886617J372855L65815m618373o852150j077933O564726O529154l78547
44311I792164n645322o225079n836915n104693p46136N033374M691921k315851
44303f356537o594838k522515L304605L054466j32255J438052O456155O555947
44295E203080J07308m713894k171200K665259J631639m585999p118518q66036
44287i848361Q153866R471378P45680r126371j0268745k746679N013848O769593
44279a835791L727194N2895k186114k474210n93593J636269P50061l337495n339951
44270i600735p29719Q000410J3962846J3205803P179192p9294m613251m422843
$$ plain form
44262 22902409 21314283 20453255 16805879 11119310 7635631 7767339 8648351 8707223 9779055
44253 9779055 11711315 10320594 4513892 236746 1661740 2849580 -4066785 -14944119
44245 -14944119 -17376216 -9002368 -2327316 -7193531 -16947978 -19124028 -13762288 -11709479
44237 -11709479 -17093713 -21446866 -16948647 -7288227 -1053656 -17736 675615 4148093
44229 4148093 9054517 13330631 15493111 13180910 5840905 -883743 927832 11133257
44221 11133257 19738472 18248804 8988175 257723 -3531497 -2882579 1111731 5824161
44213 5824161 4938479 -4806784 -15590562 -15688384 -5751261 831676 -3096682 -8144032
44205 -8144032 -2952256 8924978 15491000 14038948 11899960 12100844 9544378 2374992
$$ packed form
44262B2902409j588126q61028l647376n686569l483679J31708Q81012N8872J071832
44253I779055J932260j390721n806702m277146J424994J187840o916365j0877334
44245a4944119k432097Q373848O675052m866215r754447k176050N361740K052809
44237a1709479n384234m353153M498219R660420O234571J035920O93351L472478
44229D148093M906424M276114K162480k312201p340005o724648J811575J0205425
44221A1133257Q605215j489668r260629q730452l789220O48918L994310M712430
44213E824161q85682r745263j0783778r7822R937123O582937l928358n047350
44205h144032N191776J1877234O566022j452052k138988K00884k556466p169386
$$ plain form
44197 2374992 -3078272 -2135329 1669947 4111873 7204245 13283954 18156995 16749599
44189 16749599 11744809 9966299 12343675 13617173 10875288 6539262 2989902 -288342
44181 -288342 -3311782 -4309728 -3780533 -5666137 -11382663 -15453558 -11068820 513025
44173 513025 9596513 8427752 -111016 -6212772 -4327482 2400998 8832736 14517524
44165 14517524 20715968 24435622 21016424 11637310 2661126 -2705425 -6547533 -9476514
44157 -9476514 -8521761 -4233859 -2871918 -6997078 -10172311 -6860286 -1808782 -2167526
44149 -2167526 -5200707 -3100357 3106677 4966061 1024597 -1187380 858218 -190586
44141 -190586 -8064154 -14462212 -11112652 -2627073 891792 -1238755 -1571614 2314995
$$ packed form
44197B374992n453264R42943L805276K441926L092372O079709M873041j407396
44189A6749599n004790j778510K377376J273498k741885m336026l549360l278244
44181b88342l023440r97946N29195j885604n716526m070895M384738J1581845
44173E13025R083488j168761q538768o101756J885290O728480O431738N684788
44165A4517524O198444L719654l419198r379114q976184n366551l842108k928981
44157i476514R54753M287902J361941m125160l175233L312025N051504l58744
44149b167526l033181K100350O207034J859384l941464k211977K045598j048804
44141a90586p873568o398058L349560Q485579L518865k130547l32859L886609
$$ plain form
44133 2314995 4970461 3130416 804020 2350078 5918358 6429809 2034404 -4287996
44125 -4287996 -7966355 -7106016 -4628041 -5341533 -9433988 -10858485 -4963973 4346222
44117 4346222 9130614 7755928 5944934 7842416 11212503 12327645 10466548 5715832
44109 5715832 -2545649 -11652786 -14606777 -7891244 2228220 6282203 3302152 930402
44101 930402 3884823 7641616 5734483 -844324 -5237348 -3634908 1173327 4578514
44093 4578514 4976953 3182572 136658 -2752838 -2785405 1855395 9120091 14088809 13628768
44084 13628768 9376632 5800628 5735626 7950631 8859221 6521464 2621867 -63068
44076 -63068 -1411039 -3194158 -4686500 -2473353 3393750 6579220 2036883 -5693062
$$ packed form
44133B314995K655466j840045k326396J546058L568280N11451m395405o322400
44125d287996l678359Q60339K477975p13492m092455j424497N894512R310195
44117D346222M784392j374686j810994J897482L370087J115142j861097m750716
44109E715832q261481r107137k953991O715533J0119464M053983k980051k371750
44101I30402K954421L756793j907133o578807m393024J602440M808235L405187
44093D578514L98439j794381l045914k889496l2567M640800P264696M968718m60041
44084A3628768m252136l576004o5002K215005R08590k337757l899597k684935
44076f3068j347971j783119j492342K213147N867103L185470m542337p729945
$$ plain form
44068 -5693062 -7237522 -1174670 3771325 825862 -6147585 -9264650 -7267644 -5048071
44060 -5048071 -5586194 -7234297 -7629149 -6159786 -3186999 -24887 1047636 -567264
44052 -567264 -2387034 -2637383 -3223492 -5399722 -5067399 2335584 13607192 20286979 19225703
44043 19225703 14951785 11383550 7841360 4811334 6394188 13003409 17594346 14500930
44035 14500930 7640142 4167700 3401007 -1250852 -10879327 -18380943 -17823978 -11257586
44027 -11257586 -4846378 -2327384 -3743145 -7110368 -9478565 -8896772 -6945533 -7376448
44019 -7376448 -11229739 -15386129 -16814308 -15786861 -13596032 -9678789 -3241343 3950637
44011 3950637 8730873 9708309 7827072 4989313 3728315 6563703 12873811 17183931
$$ packed form
44068e693062j544460O062852M945995k945463o973447l117065J997006K219573
44060e048071n38123j648103l94852J469363K972787L162112J072523j614900
44052e67264j819770k50349n86109k176230L32323P402983J1271608O679787j061276
44043A9225703m273918l568235l542190l030026J582854O609221M590937l093416
44035A4500930o860788l472442p66693m651859r628475p501616N56965O566392
44027a1257586O411208K518994j415761l367223k368197N81793J951239m30915
44019g376448l853291m156390j428179J027447K190829L917243O437446P191980
44011C950637M780236R77436j881237k837759j260998K835388O310108M310120
$$ plain form
44003 17183931 13923413 4539074 -2961815 -2942773 1752725 4520764 3572058 2539863
43995 2539863 3531703 3757749 328834 -5018857 -8578842 -9696798 -9887571 -8526916 -3680813
43986 -3680813 2762620 5223110 1350356 -4802696 -8720730 -10909774 -13151788 -12910637
43978 -12910637 -7024331 683348 2106969 -3822726 -8547208 -5433403 1118127 2319132
43970 2319132 -3058652 -8650299 -10163181 -9188776 -7804560 -5329384 -2051304 -1194094
43962 -1194094 -4143367 -7109794 -5883077 -1703071 784032 -173195 -2364483 -3780278
43954 -3780278 -4523175 -4899847 -4756351 -4917526 -6355702 -7415264 -4906927 805496 4626330
43945 4626330 2602023 -3168119 -7655304 -9053020 -9169876 -9203315 -8623929 -7966698 -9040296
$$ packed form
44003A7183931l260518r384339p500889J9042M695498K768039r48706j032195
43995B539863R91840K26046l428915n347691l559985j117956j90773J360655M846103
43986c680813O443433K460490l872754o153052l918034k189044k242014K41151
43978a2910637N886306P707679J423621n929695m724482L113805O551530J201005
43970B319132n377784n591647j512882R74405J384216K475176L278080Q57210
43962a194094k949273k966427J226717M180006K487103r57227k191288j415795
43954c780278p42897l76672J43496j61175j438176j059562K508337N712423L820834
43945D626330k024307n770142m487185j397716j16856l3439N79386O57231j073598
$$ plain form
43936 -9040296 -11317713 -11367478 -7926303 -4802369 -5460047 -6292270 310208 15336109 29328657
43927 29328657 31825272 22675224 11182927 5208941 4440190 4280437 2481709 22293
43919 22293 -1844176 -2645815 -2097685 -759950 -312946 -1062326 -334980 3977051 9134131
43910 9134131 10008967 5652053 83912 -3661671 -6399910 -8488708 -6853128 520563
43902 520563 9677966 13809705 10389855 2931648 -3265658 -5038988 -2434289 1493767
43894 1493767 2554622 -807349 -6091085 -10349481 -13564361 -16433666 -16963409 -12751989
43886 -12751989 -5641331 -425358 988176 994770 1882508 3102641 3302078 2310176 577133
43877 577133 -1184338 -1854887 -1652550 -3292283 -8321108 -13009017 -11907508 -5542658 -304509
$$ packed form
43936i040296k277417m9765L441175L123934o57678q32223O602478J5025901J3992548
43927B9328657K496615r150048j1492297n973986p68751j59753j798728k459416
43919B2293j866469q01639N48130J337735M47004p49380P27346M312031N157080
43910I134131Q74836m356914n568141l745583k738239k088798J635580P373691
43902E20563R157403M131739l419850p458207o197306j773330K604699L928056
43894A493767J060855l361971n283736m258396l214880k869305n29743M211420
43886a2751989P110658N215973J413534O594Q87738J220133J99437r91902j733043
43877E77133j761471o70549K02337j639733n028825m687909J101509O364850N238149
$$ plain form
43868 -304509 -86451 -2376752 -3507498 -2953977 -935838 2900041 5736089 1923961 -8751693
43859 -8751693 -17589335 -16776964 -9473864 -5002339 -6461696 -8432531 -5473058 2156514
43851 2156514 10399976 14589387 11583133 3018873 -4309681 -5290541 -2557019 -1733616
43843 -1733616 -2878423 -2414241 -1636576 -5376215 -11908892 -12806412 -5704502 715612 -644840
43834 -644840 -4463373 -1472996 6999678 10961218 6491761 1038131 2927243 10962273
43826 10962273 16675696 14061076 5372281 -1514455 -1068669 4016473 5932157 1375136
43818 1375136 -4563593 -6009155 -4129680 -3155364 -1828852 4386242 13303960 15938002
43810 15938002 8834740 -37557 -1989882 869721 373715 -4924256 -8471354 -6318524
$$ packed form
43868c04509K18058k290301j130746N53521K018139L835879K836048l812128j0675654
43859h751693q837642Q12371P303100M471525j459357j970835K959473P629572
43851B156514Q243462M189411l006254q564260p328554r80860K733522Q23403
43843a733616j144807M64182P77665l739639o532677q97520P101910O420114j360452
43834f44840l818533K990377Q472674L961540m469457n453630J889112Q035030
43826A0962273N713423k614620q688795o886736M45786N085142J915684m557021
43818A375136n938729j445562J879475R74316J326512O215094Q917718K634042
43810A5938002p103262q872297j952325K859603m96006n297971l547098K152830
$$ plain form
43802 -6318524 -2382081 -1607977 -3230604 -3838329 -3288115 -3581476 -3959969 -1533026 3188886
43793 3188886 5023375 2204 -9250570 -15578744 -14155146 -6637439 787469 2898453
43785 2898453 -292241 -4024554 -3879921 -505858 1733361 987175 626454 3837371 7323389
43776 7323389 4125450 -6883785 -17903018 -20683647 -15587226 -9372105 -5800438 -2466641
43768 -2466641 2987681 7630517 6664412 199394 -5950673 -6179914 -693094 4804465
43760 4804465 4889238 463482 -1386816 4831936 15678152 21953636 19800566 14965374
43752 14965374 13840770 14291240 9976887 1179303 -4793693 -3716255 903824 4320243
43744 4320243 6156639 7438440 7177751 4978604 2739926 757019 -3331460 -8329490
$$ packed form
43802f318524L936443P74104j622627o07725N50214k93361l78493K426943M721912
43793C188886J834489n021171r252774o328174J423598P517707P424908K110984
43785B898453l190694l732313J44633L374063K239219p46186l60721L210917L486018
43776G323389l197939j1009235j1019233k780629N096421O215121L571667L333797
43768b466641N454322M642836r66105o465018o150067k29241N486820N497559
43760D804465Q4773m425756j850298O218752J0846216O275484k153070m835192
43752A4965374j124604M50470m314353q797584n972996J077438M620079L416419
43744D320243J836396J281801k60689k199147k238678j982907m088479m998030
$$ plain form
43736 -8329490 -7696716 722797 8302010 6170129 -1634094 -3878020 1534275 6379254
43728 6379254 6250312 5312331 5609807 2640578 -4164351 -6654965 -367292 6366993 3592654
43719 3592654 -6127594 -12883889 -13747872 -13213621 -12935019 -10338691 -6056930 -4274469 -5754751
43710 -5754751 -7539205 -9302207 -13237457 -17838295 -18618305 -15321286 -12141858 -10804411
43702 -10804411 -9782968 -9802466 -12581125 -14367927 -9650458 -2294335 -3010758 -12697217
43694 -12697217 -18624852 -12772618 -4312988 -5663879 -13712748 -14975167 -5100911 6652372
43686 6652372 10677870 6213694 -2219289 -10006702 -13315223 -10822775 -5972897 -3575753
43678 -3575753 -3937514 -3728549 -1726857 343149 1768478 3386835 4887113 5574909 6746365
$$ packed form
43736h329490O32774Q419513P579213k131881p804223k243926N412295M844979
43728F379254j28942r37981K97476k969229o804929k490614O287673O734285k774339
43719C592654r720248o756295q63983N34251K78602K596328M281761J782461j480282
43710e754751j784454j763002l935250m600838p80010L297019L179428J337447
43702a0804411J021443j9498k778659j786802M717469P356123p16423r686459
43694a2697217n927635N852234Q459630j350891q048869j262419R874256J1753283
43686F652372M025498m464176q432983p787413l308521K492448M849878K397144
43678c575753l61761K08965K001692K070006J425329J618357J500278O87796J171456
$$ plain form
43669 6746365 9053511 9004518 3295358 -4440727 -7098387 -4007288 -1189196 -1373872 -523841
43660 -523841 3961951 8302673 8915877 8217413 9566598 11026622 9162317 5822636 5742406
43651 5742406 8821700 9652304 4808633 -2873311 -7772976 -6847402 -1229599 5389812
43643 5389812 9144920 8119943 3463088 -1314457 -2664139 241769 4459232 6054294
43635 6054294 4963765 5623277 10880679 16842164 16808384 9578850 515710 -5283977 -7141321
43626 -7141321 -6098268 -2529792 2118343 5078062 5768661 6469089 7815559 7019581 2645082
43617 2645082 -2290737 -4607844 -5077111 -5166445 -2938956 3551954 10881116 13013509 9091842
43608 9091842 4683616 4895814 8993378 12363326 11948098 9336499 9296707 14634079 21877463
$$ packed form
43669F746365K307146m8993n709160p736085k657660L091099K818092j84676Q50031
43660e23841M485792M340722O13204o98464J349185J460024j864305l339681q0230
43651E742406L079294Q30604m843671p681944m899665R25574N617803O619411
43643E389812L755108j024977m656855m777545j349682K905908M217463J595062
43635F054294j090529O59512N257402N961485l3780p229534r063140n799687j857344
43626g141321J043053L568476M648135K959719O90599P00428J346470p95978m374499
43617B645082m935819k317107m69267q9334K227489O490910P329162K132393l921667
43608I091842m408226K12198M097564L369948m15228k611599l9792N337372P243384
$$ plain form
43599 21877463 23825135 17848565 9762401 7320402 11472689 16381799 16601804 11653966
43591 11653966 4741277 -239162 -1079377 810148 1201016 -2440060 -8071895 -12186427
43583 -12186427 -14071445 -14931406 -14850899 -13462659 -11762694 -10041637 -5766753 2803004
43575 2803004 12331481 17631834 17993986 16371033 13731934 9058849 4057135 2401171
43567 2401171 4095585 5645342 6167355 8083512 11051505 10803080 5663670 -685766
43559 -685766 -4465618 -5123263 -2670258 2373869 5242707 373680 -8830036 -11416036
43551 -11416036 -4034902 3349020 2380588 -1535634 -12868 3352912 -58694 -7363061
43543 -7363061 -7571495 393818 5872476 3265676 -1306350 -2259272 -1756792 -808995 5443797
$$ packed form
43599B1877463J947672n976570q086164k441999M152287M909110K20005m947838
43591A1653966o912689m980439q40215J889525L90868l641076n631835m114532
43583a2186427j885018q59961Q0507J388240J699965J721057M274884Q569757
43575B803004R528477N300353L62152j622953k639099m673085n001714j655964
43567B401171J694414J549757N22013J916157K967993k48425n139410o349436
43559f85766l779852o57645K453005N044127K868838m869027r203716k586000
43551a1416036P381134P383922r68432l916222J522766L365780l411606p304367
43543g363061k08434P965313N478658k606800m572026r52922N02480R47797O252792
$$ plain form
43534 5443797 17256888 24788222 20774888 11076566 4991439 2303078 -1510015 -4073360
43526 -4073360 -859367 3509873 428565 -8169277 -11850225 -8035025 -4896890 -6123828
43518 -6123828 -4260588 5745815 15936954 15668016 6388631 -1240897 -1201083 3510578
43510 3510578 7790521 9301491 7208228 1441318 -5950894 -11744583 -14153029 -12872058
43502 -12872058 -7745239 268125 7869457 11709606 11544480 9636768 8078609 8046196
43494 8046196 10001517 12846800 14515823 14969965 16394316 18702590 18021802 12608384
43486 12608384 7113393 6851909 10352672 12228230 11142858 9361042 6203750 -992212
43478 -992212 -9396278 -11685396 -6744309 -2787971 -6333559 -13631755 -17247911 -16200559
$$ packed form
43534E443797J1813091P531334m013334r698322o085127k688361l813093k563345
43526d073360L213993M369240l081308q597842l680948L815200L138135j226938
43518f123828J863240J0006403J0191139k68938r279385p629528L9814M711661
43510C510578M279943J510970k093263n766910p392212n793689k408446J280971
43502a2872058N126819Q013364P601332L840149j65126j907712j558159l2413
43494H046196J955321K845283J669023M54142J424351K308274o80788n413418
43486A2608384n494991k61484L500763J875558j085372j781816l157292p195962
43478i92212q404066k289118M941087L956338l545588p298196l616156J047352
$$ plain form
43470 -16200559 -14372010 -12851326 -10121322 -7581541 -8326633 -10817592 -9709734 -3949123
43462 -3949123 901955 110841 -4501421 -8369629 -10297648 -12007189 -13875444 -14179965
43454 -14179965 -11920059 -8370654 -5966232 -6455859 -9396124 -11873111 -11080167 -8089261
43446 -8089261 -7337002 -10777727 -14284861 -12352195 -5240248 1601132 4766319 5916751
43438 5916751 7026310 6802385 4307700 2590884 4641971 7800288 6910123 2324170
43430 2324170 -269913 1430265 2948622 336756 -3977316 -5981479 -6556893 -8632333
43422 -8632333 -10897490 -9656847 -5352630 -1970197 -630431 1046019 3222983 2790853
43414 2790853 -1037563 -4883251 -6345452 -6624202 -6693805 -5546570 -3953584 -4826867 -7270254
$$ packed form
43470a6200559J828549J520684K730004K539781p45092k490959J107858N760611
43462c949123M851078p91114m612262l868208j928019j709541j868255l04521
43454a4179965K259906L549405K404422m89627k940265k476987P92944K990906
43446h089261P52259l440725l507134J932666P111947O841380L165187J150432
43438E916751J109559k23925k494685j716816K051087L158317q90165m585953
43430B324170k594083J700178J518357k611866m314072k004163n75414k075440
43422h632333k265157J240643M304217L382433J339766J676450K176964m32130
43414B790853l828416l845688j462201k78750o9603J147235J592986q73283k443387
$$ plain form
43405 -7270254 -5785330 574522 3570351 -3808691 -16103969 -21501384 -17280694 -11963304
43397 -11963304 -12068198 -13766960 -10088006 -1157579 6343818 7185027 2161636 -3762849
43389 -3762849 -5819746 -3021282 913238 669428 -5426470 -13085505 -15358063 -8970466
43381 -8970466 1723870 7595502 3547918 -5278501 -8682179 -3476780 3068336 3478807
43373 3478807 -667579 -3326607 -3585984 -5055510 -8447701 -11351794 -14215861 -19718157
43365 -19718157 -25917807 -26558569 -19581379 -9693764 -1148167 6162215 11656810 11635490
43357 11635490 5423030 -1384339 -3787999 -3118482 -2268901 69736 5735364 11611174
43349 11611174 13124221 10696330 8129863 6920263 6489749 7575303 10662781 13024636
$$ packed form
43405g270254J484924O359852K995829p379042j2295278n397415M220690N317390
43397a1963304j04894j698762L678954Q930427P501397Q41209n023391n924485
43389c762849k056897K798464L934520k43810o095898p659035k272558O387597
43381h970466J0694336N871632m047584q826419l403678N205399O545116M10471
43373C478807m146386k659028k59377j469526l392191k904093k864067n502296
43365a9718157o199650o40762O977190R887615Q545597P310382N494595k1320
43357A1635490o212460o807369k403660O69517Q49581K338637N665628N875810
43349A1611174J513047k427891k566467j209600m30514J085554L087478K361855
$$ plain form
43341 13024636 11848456 8527883 5757282 2940130 -760334 -1959732 1955343 5885746
43333 5885746 2904024 -4033954 -5100975 904301 3543449 -3284799 -11211014 -9610955
43325 -9610955 -1406124 1458281 -4959877 -12090535 -10889885 -1805701 8413368 14787135
43317 14787135 16783260 16220410 15069157 14117415 12363579 8370372 2908241 -468438
43309 -468438 1634858 8839850 16689950 20564981 20330335 20537962 25236657 33303390 40118347
43300 40118347 42795835 41596502 37160370 29859856 22131354 17553838 16138000 14036306
43292 14036306 9852333 7529947 10011689 13477984 12120927 6437303 2251812 2665851
43284 2665851 5377785 7542234 9035751 10618021 12516267 15241054 18505718 19196207
$$ packed form
43341A3024636j176180l320573k770601k817152l700464j199398L915075L930403
43333E885746k981722o937978j067021O005276K639148o828248p926215J600059
43325i610955Q204831K864405o418158p130658J200650R084184J0219069O373767
43317A4787135J996125n62850j151253r51742j753836l993207n462131l376679
43309d68438K103296P204992P850100L875031k34646K07627M698695Q066733O814957
43300D0118347K677488j199333m436132p300514p728502m577516j415838k101694
43292A4036306m183973k322386K481742L466295j357057n683624m185491M14039
43284B665851K711934K164449J493517J582270J898246K724787L264664O90489
$$ plain form
43276 19196207 14089838 5106349 -1856528 -4070553 -4152770 -4251151 -2615015 1905855 6191142
43267 6191142 6897691 5098312 3813168 3609339 3597670 4035773 4692723 3355049 -383135
43258 -383135 -2466603 379273 5315427 8085977 10556656 17393240 26546338 30149820
43250 30149820 25455115 18057143 12498352 6300853 -3479435 -13630954 -19153644 -20091416
43242 -20091416 -19809877 -19717740 -19261122 -17893581 -13914284 -5474154 3642387 4532002 -4811070
43233 -4811070 -12888301 -7851176 6103898 14300198 11461831 5862519 3688824 925477
43225 925477 -5279481 -8015548 -1256630 8083733 7815551 -3312233 -14940706 -18747189
43217 -18747189 -15779833 -11146319 -8023370 -7385446 -8313117 -7642290 -3371155 1354830
$$ packed form
43276A9196207n106369q983489o962877k214025q2217r8381J636136M520870M285287
43267F191142P06549j799379j285144k03829j1669M38103O56950j337674l738184
43258c83135k083468K845876M936154K770550K470679O836584R153098L603482
43250C0149820m694705p397972n558791o197499r780288j0151519n522690r37772
43242b0091416K81539R2137M56618J367541L979297Q440130R116541Q89615r343072
43233d811070q077231N037125J3955074Q196300k838367n599312k173695k763347
43225I25477o204958k736067O758918R340363k68182j1127784j1628473l806483
43217a8747189K967356M633514L122949O37924r27671O70827M271135M725985
$$ plain form
43209 1354830 1779381 -922747 -424271 5559034 11745092 13029405 11447755 12242614 16009260
43200 16009260 18431524 16488446 11810549 8102122 7361663 8834736 10363351 10325340
43192 10325340 8697328 6626226 5485146 6462713 9739891 12878273 11568840 4476993
43184 4476993 -3474059 -5771840 -2255500 997157 384540 -565563 2440617 6841193
43176 6841193 5969922 -1746764 -10139628 -12407102 -8369136 -3500407 -2182618 -3413996
43168 -3413996 -3278592 -754071 335558 -3874976 -11425993 -15519562 -11686047 -2130182
43160 -2130182 7673660 14586671 18576770 19830529 17693257 12328859 5753919 766420
43152 766420 -931838 -145204 79427 -2619031 -6763018 -8498913 -7059341 -6503403 -10104647
$$ packed form
43209A354830M24551k702128M98476N983305O186058J284313j581650P94859L766646
43200A6009260K422264j943078m677897l708427p40459J473073J528615l8011
43192A0325340j628012k071102j141080R77567L277178L138382j309433p091847
43184D476993p951052k297781L516340L252657o12617r50103L006180M400576
43176F841193q71271p716686q392864k267474M037966M868729J317789j231378
43168c413996J35404K524521J089629m210534p551017m093569L833515R555865
43160b130182R803842O913011L990099J253759k137272n364398o574940m987499
43152G66420j698258P86634K24631k698458m143987j735895J439572N55938l601244
$$ plain form
43143 -10104647 -15086052 -15845418 -11199739 -5225796 -1472336 223394 1034566 966745 651456
43134 651456 2063303 5263109 6805082 3961047 -1006467 -3385272 -1870929 734474
43126 734474 2214196 3443196 5607001 7400463 6588604 3094939 -898181 -3254868
43118 -3254868 -3157078 -693779 3371552 7305662 8982642 7402593 3457274 -877004
43110 -877004 -3934707 -5274126 -5778083 -6671719 -7786690 -7021490 -2527242 4474059 10125971
43101 10125971 11555709 9091520 4658482 -421914 -5038234 -7370619 -6396838 -3624611
43093 -3624611 -1412240 65963 2380933 5875891 9413187 12917947 17490166 22697011
43085 22697011 26926538 31547997 41137286 56905522 72775058 81610782 83446015 83470527
$$ packed form
43143a0104647m981405p59366M645679N973943L753460J695730Q11172o7821l15289
43134F51456J411847L199806J541973k844035m967514k378805J514343K605403
43126G34474J479722J229000K163805J793462q11859l493665l993120k356687
43118c254868R7790K463299M065331L934110J676980j580049l945319m334278
43110h77004l057703j339419n03957q93636j114971P65200M494248P001301N651912
43101A0125971J429738k464189m433038n080396m616320k332385R73781K772227
43093c624611K212371J478203K314970L494958L537296L504760M572219N206845
43085B2697011M229527M621459R589289J5768236J5869536Q835724J835233K4512
$$ plain form
43077 83470527 83242331 79105887 69654478 59254595 51743293 45184067 36594058 28384249
43069 28384249 25247667 26539180 27045523 25015626 24075705 25856544 25738209 19155869
43061 19155869 8767661 1459203 14516 1421076 2374159 2636667 2988775 3493136
43053 3493136 4761597 7996725 12351650 14563174 12793616 9025308 6173342 4641127
43045 4641127 3521250 3469096 5824033 9648399 12240213 12780307 13364699 15584370 17521672
43036 17521672 15563842 9074618 2119557 -600307 457048 -349055 -6600947 -14098722
43028 -14098722 -15292910 -8823982 -830618 3649864 5840381 7717392 6621001 265798
43020 265798 -6435041 -6024060 937528 5919234 3585829 -2261646 -5235991 -4234042
$$ packed form
43077H3470527k28196m136444r451409j0399883p511302o559226q590009q209809
43069B8384249l136582J291513N06343k029897r39921J780839j18335o582340
43061A9155869j0388208p308458j444687J406560R53083K62508L52108N04361
43053C493136J268461L235128M354925K211524j769558l768308k851966j532215
43045D641127j119877n2154K354937L824366K591814N40094N84392K219671J937302
43036A7521672j957830o489224o955061k719864J057355q06103o251892p497775
43028a4098722j194188O468928P993364M480482K190517J877011j096391o355203
43020B65798o700839M10981O961588M981706k333405n847475k974345J001949
$$ plain form
43012 -4234042 -2604428 -3144317 -6554117 -12341576 -18618424 -22167911 -20555919 -14247969
43004 -14247969 -6963972 -4325629 -9765257 -19207820 -22533358 -14892573 -4382413 -2383349
42996 -2383349 -7908272 -9680206 -3669137 1632111 488119 -340553 5826144 12449027
42988 12449027 9399800 -127877 -3597896 2604300 9658936 10605919 8095707 6477341
42980 6477341 5053923 2021573 -2004455 -7210638 -15011269 -22508136 -22796061 -14479070
42972 -14479070 -5547388 -3614491 -6520248 -6802068 -2130043 2941162 3524041 -736935
42964 -736935 -6051012 -7581196 -3543636 2664072 6313862 7450179 9782164 13296466
42956 13296466 13129088 7817652 3415455 5678855 12289399 16976534 17924998 17570592
$$ packed form
43012d234042J629614n39889l409800n787459o276848l549487J611992O307950
43004a4247969P283997K638343n439628r442563l325538P640785J0510160J999064
42996b383349n524923j771934O011069N301248j143992q28672O166697O622883
42988A2449027l049227r527677l470019O202196P054636R46983k510212j618366
42980F477341j423418l032350m026028n206183p800631p496867k87925Q316991
42972a4479070Q931682J932897k905757k81820M672025N071205N82879m260976
42964g36935n314077j530184M037560O207708L649790J136317K331985L514302
42956A3296466j67378n311436m402197K263400O610544M687135R48464l54406
$$ plain form
42948 17570592 16738776 13892061 8996876 4283260 1923067 3281407 8258350 12679250
42940 12679250 9638522 -2127245 -13681976 -14865932 -6501396 1373095 2556651 585375
42932 585375 1423718 5574136 9178368 9172879 5407033 2465 -4176604 -6008389 -7127409
42923 -7127409 -8823807 -9139255 -5960665 -1717417 -793952 -2633557 -2147591 2313701 6129952
42914 6129952 5210536 1320313 -1674389 -2898836 -2786654 162840 6782324 13366114
42906 13366114 14725114 10841083 7100764 7428253 9838485 10033024 7781845 7922279
42898 7922279 14893190 27356043 39253034 45794709 46620417 42768593 33779948 20782807
42890 20782807 10005640 8032784 13289053 16938491 13731291 7767354 5424679 6914467
$$ packed form
42948A7570592q31816k846715m895185m713616k360193J358340M976943M420900
42940A2679250l040728j1765767j1554731j183956Q364536P874491J183556j971276
42932E85375Q38343M150418L604232n489l765846n404568m179069j831785j119020
42923g127409j696398l15448L178590M243248R23465j839605M85966M461292L816251
42914F129952r19416l890223k994702j224447J12182K949494O619484O583790
42906A3366114J359000l884031l740319L27489K410232J94539k251179J40434
42898G922279O970911J2462853J1896991O541675Q25708l851824q988645j2997141
42890B0782807j0777167j972856N256269L649438l207200n963937k342675J489788
$$ plain form
42882 6914467 8368801 8789569 10314018 13576309 17422822 22261761 29319044 36914371
42874 36914371 41702134 43735704 46071128 48777331 47957411 42432219 36968689 35968515
42866 35968515 37668851 38282645 38707055 42275179 47752424 50110177 47963664 44741786
42858 44741786 41665845 35440922 25592784 18604450 20002011 26125846 29247318 28155382
42850 28155382 27355725 27425149 23929787 16810124 13050958 16604981 22122428 23264743
42842 23264743 21517859 20900570 19100797 11979628 3917541 4181915 12710659 18449585
42834 18449585 14519486 7231612 5577004 8413929 8598266 5580017 6260097 14130407
42826 14130407 23852923 27825527 24083864 16585308 10781188 9890278 12844600 14844302
$$ packed form
42882F914467J454334M20768J524449L262291L846513M838939P057283P595327
42874C6914371M787763K033570K335424K706203q19920n525192n463530j000174
42866C5968515J700336O13794M24410L568124N477245K357753k146513l221878
42858D4741786l075941o224923r848138o988334J397561O123835L121472j091936
42850B8155382p99657O9424l495362p119663l759166L554023N517447J142315
42842B3264743j746884o17289j799773p121169q062087K64374Q528744N738926
42834A8449585l930099p287874j654608K836925J84337l018249O80080P870310
42826A4130407R722516L972604l741663p498556n804120q90910K954322J999702
$$ plain form
42818 14844302 12228004 7659762 7876342 14807528 21638910 20484084 12275693 5465942
42810 5465942 5223532 7804957 6880707 1663856 -4245086 -9068331 -13139622 -14368010
42802 -14368010 -9418832 -567521 4431332 2478820 165771 4169266 10866680 11601190
42794 11601190 5516351 108618 15188 2396680 3767463 4319765 4092733 1870294 160679
42785 160679 4140506 12320952 15605542 10427228 5429318 8251072 12597223 8114702
42777 8114702 -1576950 -2622040 8113444 17748882 16012214 8831348 7533429 12357595
42769 12357595 14532807 10210354 4007862 -7575 -3216889 -6819143 -7410966 -2253968
42761 -2253968 4180734 3929294 -4145025 -11962318 -12256619 -7657963 -5818166 -7664525
$$ packed form
42818A4844302k616298m568242K16580O931186O831382j154826q208391o809751
42810E465942k42410K581425r24250n216851n908942m823245m071291j228388
42802a4368010M949178Q851311M998853j952512k313049M003495O697414P34510
42794A1601190o084839n407733r3430K381492J370783N52302k27032k222439j709615
42785A60679L979827Q180446L284590n178314m997910K821754M346151m482521
42777H114702r691652j045090J0735484R635438j736668p180866j297919M824166
42769A2357595K175212m322453o202492m015437l209314l602254n91823N156998
42761b253968O434702k51440q074319p817293k94301M598656J839797j846359
$$ plain form
42753 -7664525 -6548732 534172 7701930 9288781 7852049 7794526 6618049 203115
42745 203115 -7004167 -6472755 872039 5173984 2687298 839433 5287317 10856568
42737 10856568 10488356 5820403 2601359 1369544 -544835 -2185227 -1151328 473223
42729 473223 -910971 -3727990 -3841478 -2048381 -2523978 -4930811 -4599572 -427579 3398100
42720 3398100 3922475 2323213 129854 -2015598 -1672634 3240940 8749576 7814214 1048242
42711 1048242 -2179121 3144313 9607311 7583160 -1230378 -6726997 -4065014 2021207
42703 2021207 5652163 6396404 6419371 6002467 4478114 2936688 3502917 6778964 11237058
42694 11237058 14630725 15619430 14796357 14338039 15665991 17191979 15620703 10302251
$$ packed form
42753g664525J115793P082904P167758J586851j436732n7523j176477o414934
42745B03115p207282N31412P344794M301945k486686j847865M447884N569251
42737A0856568l68212m667953l219044j231815j914379j640392J033899J624551
42729D73223j384194k817019j13488J793097m75597k406833L31239M171993L825679
42720C398100N24375j599262k193359k145452L42964M913574N508636r35362o765972
42711A048242l227363N323434O462998k024151q813538n496619K661983O086221
42703B021207L630956P44241K2967m16904j524353j541426N66229L276047M458094
42694A1237058L393667R88705q23073m58318J327952J525988j571276n318452
$$ plain form
42686 10302251 5199557 4927875 9026872 12085479 10544160 7628013 9203914 15569592
42678 15569592 20662451 20051670 16130574 13261087 11169260 6870306 782064 -3718270
42670 -3718270 -5717975 -6895740 -6566916 -1965001 5560125 9925983 8193377 4613228
42662 4613228 4150171 6174963 7883382 9964616 14412500 19507381 21721742 20975882
42654 20975882 19683743 17964744 14525315 11970063 16557525 31248681 51694726 70457377
42646 70457377 84375074 98211404 121648775 160069770 205393242 237935032 241421105
42639 241421105 216588000 178800789 144724525 123660262 117139332 119523826 119521656 108139507
42631 108139507 87356115 67117804 53611580 45152223 39188808 36560002 37023512 37003271
$$ packed form
42686A0302251n102694k71682M098997L058607j541319k916147J575901O365678
42678A5569592N092859o10781l921096k869487k091827m298954o088242m500334
42670c718270j999705j177765L28824M601915P525126M365858j732606l580149
42662D613228m63057K024792J708419K081234M447884N094881K214361p45860
42654B0975882j292139j718999l439429k555252M587462J4691156K0446045J8762651
42646G0457377J3917697J3836330K3437371L8420995M5323472L2541790L486073
42639B41421105k4833105l7787211l4076264k1064263o520930K384494k170j1382149
42631A08139507k0783392k0238311j3506224q459357n963415k628806M63510k0241
$$ plain form
42623 37003271 34919946 33483498 33696056 32033045 27184448 24007856 25987611 28722594
42615 28722594 26597419 21918838 21196984 25214724 28961364 29326584 26863554 21619050
42607 21619050 13412960 5435846 1839770 2171244 3125721 4555145 8092856 11241944
42599 11241944 9730100 5387858 4492327 7882130 10217773 10087638 12466362 18415316
42591 18415316 20860824 15444084 8159198 6094584 6783810 3826472 -1771529 -3685148
42583 -3685148 -585423 3306932 6272228 10584885 16912634 23937127 32987316 46091700
42575 46091700 59006502 63171726 56519643 46491545 40090493 36350909 31404870 25790717
42567 25790717 22623249 22026673 21475270 19631760 16889433 14059251 12839434 15071061
$$ packed form
42623C7003271k083325j436448K12558j663011m848597l176592J979755K734983
42615B8722594k125175m678581p21854M017740L746640L65220k463030n244504
42607B1619050q206090p977114l596076L31474R54477J429424L537711L149088
42599A1241944j511844m342242q95531L389803K335643j30135K378724N948954
42591A8415316K445508n416740p284886k064614O89226k957338n598001j913619
42583c685148L099725L892355K965296M312657O327749P024493R050189J3104384
42575D6091700J2914802M165224o652083j0028098o401052l739584m946039n614153
42567B5790717l167468n96576n51403j843510k742327k830182j219817K231627
$$ plain form
42559 15071061 18966096 19026054 13212123 7484976 8627045 14303992 15609168 9123024
42551 9123024 787972 -3439622 -5162946 -8449511 -11671770 -9748579 -2664145 3733363
42543 3733363 5767905 6018287 7685616 9058521 6874708 2422402 154726 1429377
42535 1429377 3800607 6220354 10277390 15180963 16386432 12268329 8239089 9845207
42527 9845207 14454928 15107308 11215090 9147632 11500914 12364523 6645880 -1176113
42519 -1176113 -2979029 1407058 4755263 3739938 3113601 6743251 10195766 6789976
42511 6789976 -2079347 -8065537 -6794100 -2727218 -1829933 -3543239 -2853436 2481707
42503 2481707 10219194 17390241 22014487 22006882 16667814 9650181 6446974 7819880 9396042
$$ packed form
42559A5071061L895035N9958n813931n727147J142069N676947J305176o486144
42551I123024q335052m227594j723324l286565l222259J923191P084434O397508
42543C733363K034542K50382J667329J372905k183813m452306k267676J274651
42535A429377K371230K419747M057036M903573J205469m118103m029240J606118
42527I845207M609721O52380l892218k067458K353282Q63609n718643p821993
42519a176113j802916M386087L348205j015325o26337L629650L452515l405790
42511F789976q869323n986190J271437M066882Q97285j713306O89803N335143
42503B481707P737487P171047M624246p605n339068p017633l203207J372906J576162
$$ plain form
42494 9396042 8911845 9319407 12389036 14248762 11567202 7877736 7990320 9370880 6226629
42485 6226629 511740 657485 8638835 16419111 18093913 18151862 22867156 29531661 30735171
42476 30735171 25790712 21243572 21266844 23120479 22238629 17823269 13040279 12095556 16373957
42467 16373957 21355659 19359768 8512716 -3057277 -5898739 -302045 5844805 8523355
42459 8523355 10879620 15232616 18460102 17649916 15144383 14692164 16051754 16274994 13715422
42450 13715422 8676073 2858939 -43166 3399580 11144759 16140308 14819549 11682181
42442 11682181 12050555 14037959 12515751 7926970 5053882 4847395 4362679 4406032 9559771
42433 9559771 18802943 23822381 21187237 19970183 30710956 50611987 66840284 72697426
$$ packed form
42494I396042m84197M07562L069629J859726k681560l689466J12584J380560l144251
42485F226629n714889J45745P981350P780276J674802N7949M715294O664505J203510
42476C0735171m944459m547140K3272J853635q81850m415360m782990r44723M278401
42467A6373957M981702j995891j0847052j1569993k841462N596694O146850K678550
42459H523355K356265M352996L227486q10186k505533m52219J359590K23240k559572
42450A3715422n039349n817134k902105L442746P745179M995549j320759l137368
42442A1682181L68374J987404j522208m588781k873088k06487m84716M3353N153739
42433I559771R243172N019438k635144j217054J0740773J9901031J6228297N857142
$$ plain form
42425 72697426 73222221 75101415 79127070 85258597 97791702 119639310 145297028 165191899
42417 165191899 175285424 177941200 175395502 167960128 157909385 149002085 140873012 129015655
42409 129015655 112314555 96047884 84927655 77500148 70722514 65980999 66032943 69082547
42401 69082547 71396586 74364209 83427139 99840147 118041274 131828039 139339502 141613187
42393 141613187 140662752 140547951 146560794 160816211 180316138 199969159 215072542 221029284
42385 221029284 215186269 200818695 185370918 172301370 158127479 139908976 121362032
42378 121362032 107550352 97205588 85706266 73486638 65599870 63522313 63028936
42371 63028936 60883950 58652776 58391626 58888151 58284587 56893077 55092014 51494540
$$ packed form
42425G2697426N24795J879194M025655O131527J2533105K1847608K5657718J9894871
42417A65191899J0093525K655776k545698p435374j0050743q907300q129073j1857357
42409A29015655j6701100j6266671j1120229p427507o777634m741515N1944L049604
42401F9082547K314039K967623R062930J6413008J8201127J3786765P511463K273685
42393A41613187r50435j14801O012843J4255417J9499927J9653021J5103383N956742
42385B21029284n843015j4367574j5447777j3069548j4173891j8218503j8546944
42378A21362032j3811680j0344764j1499322j2219628p886768k077557m93377
42371F3028936k144986k231174k61150M96525o03564j391510j801063l597474
$$ plain form
42363 51494540 45913400 41744622 42380914 46624914 50267047 51269877 51073409 51488089
42355 51488089 52547750 53120890 51736223 47139086 40069488 34444122 34498726 39873710
42347 39873710 45203575 45915806 43444357 43078874 46837883 50287401 47618023 38962531
42339 38962531 30734659 28327403 30350566 31467323 29296172 26078109 24437180 24805191
42331 24805191 27343238 32688267 38920920 41179994 37751267 34502943 39125995 51542808
42323 51542808 64187191 72444345 80873728 97029380 121795901 148073663 167062718
42316 167062718 173765294 168387451 155458285 140874844 127210662 112258436 94187230
42309 94187230 76870494 66599356 63666468 61252603 54017149 44282231 37676032 36057409
$$ packed form
42363E1494540n581140m168778O36292M244000L642133J002830j96468M14680
42355E1488089J059661N73140j384667m597137p069598n625366N4604N374984
42347C9873710N329865P12231k471449l65483L759009L449518k669378q655492
42339C8962531q227872k407256K023163J116757k171151l218063j640929L68011
42331B4805191K538047N345029O232653K259074l428727l248324M623052J2416813
42323E1542808J2644383Q257154Q429383J6155652K4766521K6277762J8989055
42316A67062718O702576n377843j2929166j4583441j3664182j4952226j8071206
42309I4187230j7316736j0271138k932888k413865p235454r734918o606199j618623
$$ plain form
42301 36057409 37786320 41804804 46770900 47948132 40840562 28749319 21752236 25918455
42293 25918455 36972846 46551770 50976281 51113344 47538246 40610763 33281637 28824208
42285 28824208 26343961 22779410 18746777 17570460 18484181 16428033 10214713 5355753
42277 5355753 5703208 7346555 5208375 1327375 749229 2291114 508729 -4151698
42269 -4151698 -4559184 2561355 11741252 16704065 17500769 16838774 14904639 12065377 11821540
42260 11821540 15598862 18205937 14483800 7898741 6056305 9324071 11017216 8500536
42252 8500536 6479769 7961956 9598970 9149179 10432316 15893943 20152511 17333629
42244 17333629 10665685 7768125 8976643 7773784 1995166 -2817569 -2380896 470247
$$ packed form
42301C6057409J728911M018484M966096J177232p107570j2091243o997083M166219
42293B5918455J1054391R578924M424511J37063l575098o927483p329126m457429
42285B8824208k480247l564551m032633j176317R13721k056148o213320m858960
42277E355753L47455J643347k138180l881000n78146J541885j782385m660427
42269d151698m07486P120539R179897M962813P96704o61995j934135k839262k43837
42260A1821540L777322K607075l722137o585059j842436L267766J693145k516680
42252H500536k020767J482187J637014m49791J283137N461627M258568k818882
42244A7333629o667944k897560J208518j202859n778618m812735M36673K851143
$$ plain form
42236 470247 1391365 948472 2273935 5910479 10097966 13647597 15785259 15094530 11151484
42227 11151484 6002946 2280144 1011598 2388143 6885207 14091136 21795976 27411979
42219 27411979 29113909 25566045 17397482 9785273 9680213 17641000 25322368 24550281
42211 24550281 16911053 10860286 11139135 15283024 19577248 23306079 25965866 24683045
42203 24683045 17473958 7245087 18123 -545379 4136544 9623787 12293331 11701867
42195 11701867 10322938 11333469 16138107 23042915 27647665 25444479 16114987 5741669
42187 5741669 2657711 9439470 19977697 25671357 23573339 17580347 13269460 13247892
42179 13247892 16282253 18988428 18946420 17432886 18092161 21809927 24667384 22818436
$$ packed form
42236D70247R21118m42893J325463L636544M187487L549631K137662o90729l943046
42227A1151484n148538l722802j268546J376545M497064P205929P704840N616003
42219B7411979J701930l547864q168563p612209j05060P960787P681368p72087
42211B4550281p639228o050767K78849M143889M294224L728831K659787j282821
42203B4683045p209087j0228871p226964n63502M681923N487243K669544n91464
42195A1701867j378929J010531M804638O904808M604750k203186r329492j0373318
42187E741669l083958O781759J0538227N693660k098018n992992m310887k1568
42179A3247892L034361K706175m2008j513534O59275L717766K857457j848948
$$ plain form
42171 22818436 17681672 13963373 13959133 16293969 18969563 20955504 21928427 23190796 27597535
42162 27597535 35529707 42263678 43003401 39674615 38809988 43035424 48494093 50607066
42154 50607066 48646054 44725228 42096192 44142256 50720675 55679094 52899122 44894909
42146 44894909 39904698 40128656 39653383 35615745 33458047 36953000 40584615 38459261
42138 38459261 34800133 37141636 42772533 41630150 32460915 27124114 35800285 54120156
42130 54120156 69189323 75086770 78657170 91341983 118231866 155360868 195820201
42123 195820201 236211351 275634134 309925520 331220320 334931486 323746133 302253276
42116 302253276 271309930 231825010 190993628 158616487 137346820 121415123 105476544
$$ packed form
42171B2818436n136764l718299m240K334836K675594J985941R72923J262369M406739
42162B7597535P932172O733971P39723l328786q64627M225436N458669K112973
42154E0607066j961012l920826k629036K046064O578419M958419k779972q004213
42146D4894909m990211K23958m75273m037638k157698L494953L631615k125354
42138C8459261l659128K341503N630897j142383r169235n336801Q676171J8319871
42130E4120156J5069167N897447L570400J2684813K6889883L7129002M0459333
42123A95820201M0391150L9422783L4291386K1294800L711166j1185353k1492857
42116C02253276l0943346l9484920m0831382l2377141k1269667j5931697j5938579
$$ plain form
42109 105476544 90432957 79627616 73374650 69179820 64723240 59068442 52841414 48126632
42101 48126632 46356045 45767826 42938218 37360145 32527698 31804750 34798682 38195254
42093 38195254 38687844 34989418 28578261 22663832 19210682 17254809 15178734 13450059
42085 13450059 13378345 14625335 16326456 19149249 23186174 25285346 22533082 17783104
42077 17783104 17254380 22096353 26405691 24818096 18631472 12987424 10917749 11721796
42069 11721796 12949914 12639356 11126347 11061605 14059759 17819191 18854285 17354622
42061 17354622 16432518 17278051 18386177 18791232 18256066 15201225 9100581 4187984 5258175
42052 5258175 10036409 12009108 11053971 13666037 20934561 24818005 20495979 14366681
$$ packed form
42109A05476544j5043587j0805341o252966m194830m456580n654798o227028m714782
42101D8126632j770587n88219k829608n578073m832447p22948K993932L396572
42093C8195254M92590l698426o411157n914429l453150j955873k076075j728675
42085A3450059p1714J246990J701121K822793M036925K099172k752264m749978
42077A7783104n28724M841973M309338j587595o186624n644048k069675Q04047
42069A1721796J228118l10558j513009o4742K998154L759432J035094j499663
42061A7354622r22104Q45533J108126M05055n35166l054841o100644m912597J070191
42052E258175M778234J972699r55137K612066P268524L883444m322026o129298
$$ plain form
42044 14366681 13513159 14072643 8193946 -2178593 -7606307 -5191874 -1545643 -1502076
42036 -1502076 -1685061 2265315 7821920 8745593 3519309 -2531175 -3305722 1270032 5391041
42027 5391041 4635577 1512658 1366083 4189537 5088123 2701379 1241915 2805387 4354343
42018 4354343 5214931 10181864 20173477 26988872 24461510 18782075 19335070 24252393
42010 24252393 24701638 19913193 17202695 18675139 18956695 16545092 16704290 20775467
42002 20775467 22245431 17087736 9957953 6142150 4286598 1212689 -2023853 -2966622
41994 -2966622 -1884384 119278 2907594 5370246 6489475 9322496 17688794 27668582
41986 27668582 29978616 23208504 16627818 16468136 18073590 16438103 15382278 19053830
$$ packed form
42044A4366681q53522N59484n878697j0372539n427714K414433L646231M3567
42036a502076j82985L950376N556605R23673n226284o050484p74547M575754M121009
42027E391041p55464l122919j46575K823454Q98586k386744j459464J563472J548956
42018D354343Q60588M966933R991613O815395k527362n679435N52995M917323
42010B4252393M49245m788445k710498J472444K81556k411603J59198M071177
42002B0775467J469964n157695p129783l815803j855552l073909l236542r42769
41994b966622J082238K003662K788316K462652J119229K833021Q366298R979788
41986B7668582K310034o770112o580686j59682J605454j635487j055825L671552
$$ plain form
41978 19053830 22253354 18030960 9004373 2394142 -1038918 -4095159 -4090436 2855774
41970 2855774 11577287 12679135 6369054 1380096 718244 -950819 -4868062 -4101507
41962 -4101507 4515505 13563873 15216501 11392935 8837496 9639117 11524212 13101551
41954 13101551 13955603 12653571 8818958 4961646 3195744 2343566 699676 -790631
41946 -790631 -392796 1713352 4439781 6999616 7705503 4809606 286386 -934583 2084255
41937 2084255 3941075 667588 -3849589 -3385470 1650083 5683278 6646933 7909439
41929 7909439 11665777 15011033 13817692 7605989 -411920 -6053527 -6512982 -2099495
41921 -2099495 3684934 7196080 7976780 7945172 7970263 7300994 6065713 5804411 6991378
$$ packed form
41978A9053830L199524m222394r026587o610231l433060l056241M723O946210
41970B855774Q721513J101848o310081m988958o61852j669063l917243P66555
41962d101507Q617012R048368J652628l823566k555439Q01621J885095J577339
41954A3101551Q54052j302032l834613l857312j765902q52178j643890j490307
41946g90631L97835K106148K726429K559835P05887k895897m523220j220969L018838
41937B084255J856820l273487m517177M64119N035553M033195R63655J262506
41929G909439L756338L345256j193341o211703q017909n641607m59455M413487
41921b099495N784429L511146P80700l1608K5091o69269j235281k61302J186967
$$ plain form
41912 6991378 8231655 8830629 10274621 13952757 18910115 23175875 26031888 27434327
41904 27434327 26314246 21582303 14537059 8180385 3875898 815641 -397060 3787552
41896 3787552 15263603 29408619 38010901 37400105 31351947 25701677 22852084 22328708
41888 22328708 23282342 24099726 22314122 18050612 15611122 18277125 23141276 24871991
41880 24871991 23240196 22280316 22688789 20833193 16361884 14731544 18936463 23836954
41872 23836954 23534883 20706406 22564589 29206023 32574564 28009558 21154994 20260092
41864 20260092 25290703 28846008 26554778 22492280 23299858 29546873 35144550 34719776
41856 34719776 29546884 25391858 25734677 28654786 30095572 28353459 24508366 19910563
$$ packed form
41912F991378J240277N98974J443992L678136M957358M265760K856013J402439
41904B7434327j120081m731943p045244o356674m304487l060257j212701M184612
41896C787552J1476051J4145016Q602282o10796o048158n650270k849593n23376
41888B2328708R53634Q17384j785604m263510k439490K666003M864151J730715
41880B4871991j631795r59880M08473j855596m471309j630340M204919M900491
41872B3836954l02071k828477J858183O641434L368541m565006o854564q94902
41864B0260092N030611L555305k291230m062498Q07578O247015N597677m24774
41856C4719776n172892m155026L42819K920109J440786j742113l845093m597803
$$ plain form
41848 19910563 15213660 11839379 12356888 17657956 24129024 25742235 20534394 14137775
41840 14137775 14592884 23161271 32347330 34273271 29164497 23701032 22735360 25500550
41832 25500550 29069677 32054714 34379954 36322240 38933855 43315967 48471682 51639551
41824 51639551 51389078 48489770 43463564 36155917 28766623 25906940 29018412 33161026
41816 33161026 32689788 28987469 29238930 37372707 48711446 54519538 50731058 41654992
41808 41654992 35540510 36693247 42088155 45942989 46480157 46287712 46842827 46229893 43185006
41799 43185006 39769051 37818185 35865396 32494880 29993066 31017996 33786372 34733344
41791 34733344 34462979 36488335 40889413 44274541 46150920 49812123 55227206 56404079
$$ packed form
41848A9910563m696903l374281N17509N301068O471068J613211n207841o396619
41840A4137775M55109Q568387R186059J925941n108774n463465r65672K765190
41832B5500550L569127K985037K325240J942286K611615M382112N155715L167869
41824E1639551k50473k899308n026206p307647p389294k859683L111472M142614
41816C3161026m71238l702319K51461Q133777J1338739N808092l788480r076066
41808D1654992o114482J152737N394908L854834N37168j92445N55115o12934l044887
41799D3185006l415955j950866j952789l370516k501814J024930K768376R46972
41791C4733344k70365K025356M401078L385128J876379L661203N415083J176873
$$ plain form
41783 56404079 49481731 39729766 35994811 40036259 45712100 48070852 48672133 50454945
41775 50454945 50993418 44718822 31643426 20467058 20252749 29711459 37819336 36203069
41767 36203069 28171251 23140786 24815342 29120528 32257865 34705013 36141521 32764335
41759 32764335 23763339 15912926 16143199 21981126 25049501 22699967 19898028 19510111
41751 19510111 17798240 12370875 8501152 12432779 22084964 29828405 32337929 32265411
41743 32265411 31469949 28753754 24647399 22133860 20468621 14235771 2679550 -4852501
41735 -4852501 1180145 17394783 30245853 31325771 24389172 16961468 11274333 6257023
41727 6257023 3210679 4432234 8476346 11432150 12247395 12890404 13276832 10129460 2514845
$$ packed form
41783E6404079o922348r751965l734955M041448N675841K358752O01281J782812
41775E0454945N38473o274596j3075396j1176368k14309R458710Q107877j616267
41767C6203069q031818n030465J674556M305186L137337K447148J436508l377186
41759C2764335r000996p850413K30273N837927L068375k349534k801939l87917
41751A9510111j711871n427365l869723L931627R652185P743441K509524p2518
41743C2265411p95462k716195m106355k513539j665239o232850j1556221p532051
41735d852501O032646J6214638J2851070J079918o936599p427704n687135n017310
41727F257023l046344J221555M044112K955804Q15245O43009L86428l147372p614615
$$ plain form
41718 2514845 -4652605 -5651677 -1250084 2084635 404092 -3117831 -3171729 540221 3947992
41709 3947992 5097775 6200288 8829386 10936017 10491866 8816608 7654695 5870644
41701 5870644 2369102 -370469 174328 1777465 1249573 1292352 7300549 17574340 23511254
41692 23511254 21041089 15569797 13195094 13256551 13146300 14493550 19300389 24330830
41684 24330830 25059223 22324047 19872049 17711227 13126416 6612858 1797923 351609
41676 351609 1047338 2812694 5070323 6505975 7095595 9541729 14989571 19646544 19971905
41667 19971905 18667500 20343893 23660814 23941512 21815268 22181464 25026428 24517994
41659 24517994 18328027 11539047 9456460 11488434 13479054 11870371 5430633 -2338571
$$ packed form
41718B514845p167450r99072M401593L334719j680543l521923n3898L711950L407771
41709C947992J149783J102513K629098K106631m44151j675258j161913j784051
41701E870644l501542k739571N44797J603137n27892M2779O008197J0273791N936914
41692B3511254k470165n471292k374703O1457j10251J347250M806839N030441
41684B4330830P28393k735176k451998k160822m584811o513558m814935j446314
41676C51609O95729J765356K257629J435652N89620K446134N447842M656973L25361
41667A9971905j304405J676393L316921K80698k126244L66196K844964n08434
41659B4517994o189967o788980k082587K031974J990620j608683o439738p769204
$$ plain form
41651 -2338571 -3171528 7365284 21517452 26795430 22082356 18027448 20209181 21850879
41643 21850879 17165509 11884838 13450051 18769042 20452967 19520228 22427266 28687852
41635 28687852 30794015 25800737 19161742 16304897 16500304 16362912 14778317 12779513
41627 12779513 11514660 11512694 12602854 14691161 19023956 26486417 33619451 33977872 26265063
41618 26265063 17948840 17296670 24194270 31870981 34921242 32269156 25165296 16440812
41610 16440812 9943840 7384109 7299459 8793613 12668678 16783894 15710178 9023812
41602 9023812 4559440 8182288 15350858 18616873 18204855 18298443 18303821 16362444 16840077
41593 16840077 24402251 33937763 36579073 33057233 30446306 28493941 21863933 14406418
$$ packed form
41651b338571q32957J0536812J4152168N277978m713074m054908K181733J641698
41643B1850879m685370n280671J565213N318991J683925r32739K907038O260586
41635B8687852K106163m993278o638995k856845J95407j37392j584595j998804
41627A2779513j264853j966J090160K088307M332795P462461P133034L58421p712809
41618B6265063q316223o52170O897600P676711L050261k652086p103860q724484
41610A6440812o496972k559731q4650J494154L875065M115216j073716o686366
41602I023812m464372L622848P168570L266015m12018R3588N378j941377M77633
41593A6840077P562174R535512K641310l521840k610927j952365o630008p457515
$$ plain form
41585 14406418 16422890 26352476 30418967 24491101 20855079 26327179 29003630 17952974
41577 17952974 3247665 1963342 12826390 20128224 18027156 15559355 18545178 20929893
41569 20929893 16901399 10201329 6603451 5226619 2580478 -29002 1721320 8258648
41561 8258648 14521741 15139418 10347384 6621454 10108979 18806464 23812396 19799545
41553 19799545 10963419 4670803 3797085 8537942 19793549 34368362 41708323 34170806
41545 34170806 18501228 8687728 8387017 8999042 4959080 1177624 2861501 7073277
41537 7073277 9241169 11024400 15921926 21911448 24045935 21218051 15874284 9943256
41529 9943256 5263688 5232002 11257628 19085072 22720046 21210806 18567105 18163881 19998203
$$ packed form
41585A4406418K016472R929586M066491n927866l636022N472100K676451j1050656
41577A7952974j4705309j284323J0863048P301834k101068k467801K985823K384715
41569B0929893m028494o700070l597878j376832k646141k609480J750322O537328
41561H258648O263093O17677m792034l725930L487525Q697485N005932m012851
41553A9799545q836126o292616q73718M740857J1255607J4574813P339961p537517
41545C4170806j5669578r813500l00711O12025m039962l781456J683877M211776
41537G073277K167892J783231M897526N989522K134487k827884n343767n931028
41529I943256m679568l1686O025626P827444L634974j509240k643701m03224J834322
$$ plain form
41520 19998203 22104919 21982287 18191849 13270892 12938650 18804821 23884561 20192288
41512 20192288 9974664 4067185 8387382 17068614 20882910 18021864 13548469 11674968
41504 11674968 12401701 13712284 13284708 9054206 1527600 -4872361 -5821951 -2354234
41496 -2354234 524235 118548 -1901758 -3185096 -2745153 574707 7152348 13205731
41488 13205731 13375313 8717454 6801238 10546916 12680006 6613190 -2439744 -4753554
41480 -4753554 -732729 845657 -2498566 -4120022 -762008 2319507 1815533 2488519
41472 2488519 7923549 13370438 13820402 12172997 12789260 13266438 9908965 5798041 5586832
41463 5586832 7226006 7173907 8992018 16960372 24892036 22559592 11804436 5057997
$$ packed form
41520A9998203K106716j22632l790438m920957l32242N866171N079740l692273
41512B0192288j0217624n907479M320197Q681232L814296k861046m473395j873501
41504A1674968P26733J310583m27576m230502p526606o399961r49590L467717
41496b354234K878469m05687k020306j283338M39943L319860O577641O053383
41488A3205731J69582m657859j916216L745678K133090o066816r052934k313810
41480d753554M020825J578386l344223j621456L358014L081515n03974O72986
41472B488519N435030N446889M49964j647405O16263M77178l357473m110924k11209
41463E586832J639174n2099J818111P968354P931664k332444j0755156o746439
$$ plain form
41455 5057997 7681480 12635752 13860073 13801612 14764861 13587684 9625423 8412455 11665416
41446 11665416 12215092 5392416 -2104419 -1888472 3990678 8076420 9078352 10301317
41438 10301317 10781236 6599187 -993003 -6045929 -5423253 -468856 6603573 12596860
41430 12596860 12566944 5539413 -1467271 -1698241 1448861 -98444 -6088037 -8930962
41422 -8930962 -6565626 -4837947 -6028713 -4407003 3506377 12245626 15474159 14472325
41414 14472325 13862526 14047180 12820027 10450909 8361314 5822928 2264141 79191
41406 79191 931175 1681735 -1698656 -7932216 -12138738 -12290820 -10179494 -7251719 -3497797
41397 -3497797 166483 2213864 3094413 4249598 4732141 2236748 -2214815 -4033461
$$ packed form
41455E057997K623483M954272J224321n8461R63249j177177l962261j212968L252961
41446A1665416N49676o822676p496835K15947N879150M085742J001932J222965
41438A0301317M79919m182049p592190n052926O22676M954397P072429N993287
41430A2596860k9916p027531p006684k30970L147102j547305n989593k842925
41422h930962K365336J727679j190766J621710P913380Q739249L228533j001834
41414A4472325o09799J84654j227153k369118k089595k538386l558787k184950
41406G9191Q51984P50560l380391o233560m206522j52082K111326K927775L753922
41397c497797L664280K047381Q80549J155185M82543k495393m451563j818646
$$ plain form
41389 -4033461 -648114 5184530 8759716 8137392 4773832 1667499 1884287 6715313
41381 6715313 13680265 17896046 16988324 13469513 10949668 9496178 6706552 2222995
41373 2222995 -1487370 -2806142 -2915691 -3316486 -3490533 -2391332 -659180 411303 1023457
41364 1023457 1976175 2305740 280230 -3299555 -5603631 -6382515 -8921529 -14131485 -16549362
41355 -16549362 -10374227 1562062 9611722 8901852 4515425 2772568 1909415 -3646307
41347 -3646307 -12408287 -15959617 -10632596 -3024167 -956412 -3780327 -5952071 -6218228
41339 -6218228 -6989344 -6737624 -981024 7993815 10219875 1272740 -9523519 -10294437
41331 -10294437 -2068014 4128390 3285611 1026890 1810105 1394761 -4911436 -13304202
$$ packed form
41389d033461L385347N832644L575186o22324l363560l106333K16788M831026
41381F715313O964952M215781r07722l518811k519845j453490k789626m483557
41373B222995l710365j318772j09549m00795j74047J099201J732152J070483O12154
41364A023457R52718L29565k025510l579785k304076p78884k539014n209956k417877
41355a6549362O175135J1936289Q049660p09870m386427j742857q63153n555722
41347c646307q761980l551330N327021P608429K067755k823915k171744k66157
41339f218228p71116K51720N756600Q974839K226060q947135j0796259p70918
41331a0294437Q226423O196404q42779k258721P83215m15344o306197q392766
$$ plain form
41323 -13304202 -16649219 -14335063 -10927073 -7798522 -2633056 3698691 6285279 3411856
41315 3411856 -428386 -866236 820311 906892 -1118418 -3025053 -3969147 -4890919 -5395547
41306 -5395547 -3324632 1588583 5600337 4457746 -1140275 -5209312 -2611529 5216448
41298 5216448 11810615 12442291 7951700 2379039 -1110088 -1965265 -2401727 -6155028 -14170286
41289 -14170286 -20832778 -18303130 -6611248 4434332 6524948 2378425 -27435 1065525
41281 1065525 1512500 563421 2158447 6593780 8145354 3605248 -2313579 -3395982
41273 -3395982 190817 3511106 3341867 328877 -2969017 -4079411 -2699598 -1956268
41265 -1956268 -5007237 -9693074 -10186895 -5052293 641548 2926283 3750356 5527214
$$ packed form
41323a3304202l345017K314156L407990L128551N165466O331747K586588k873423
41315C411856l840242m37850J686547Q6581k025310j906635r44094r21772n04628
41306e395547K070915M913215M011754j142591n598021m069037K597783P827977
41298E216448O594167O31676m490591n572661l489127q55177m36462l753301q015258
41289a4170286o662492K529648J1691882J1045580K090616m146523k405860J092960
41281A065525M46975r49079J595026M435333J551574m540106n918827j082403
41273c395982L586799L320289j69239l012990l297894j110394J379813P43330
41265a956268l050969m685837m93821N134602N693841K284735Q24073J776858
$$ plain form
41257 5527214 6124077 3474688 565910 660700 1342046 -980624 -3843472 -2467587 1548007
41248 1548007 2327958 -451628 -961453 3327572 8493081 11636137 14686022 18297244
41240 18297244 18354338 12568470 5536776 2429227 1210146 -3593730 -11317662 -14752424
41232 -14752424 -9665626 -772043 3509141 413255 -4711964 -5049095 -230943 3621639
41224 3621639 1905046 -2467301 -3071416 1499841 6299108 6808179 3491526 -932987
41216 -932987 -5014792 -7702833 -7262307 -3777578 -832267 -2087332 -6876736 -10756116
41208 -10756116 -9963218 -4758738 881745 3003385 2235193 3473814 8642411 11714661
41200 11714661 5905611 -4925018 -8930718 -2101529 5705129 4474770 -3040271 -8019354
$$ packed form
41257E527214N96863k649389k908778R4790O81346k322670k862848J375885M015594
41248A548007P79951k779586n09825M289025N165509L143056L049885L611222
41240A8297244N7094n785868p031694l107549j219081m803876p723932l434762
41232a4752424N086798Q893583M281184l095886n125219l37131M818152L852582
41224C621639j716593m372347o04115M571257M799267N09071l316653m424513
41216i32987m081805k688041M40526L484729K945311j255065m789404l879380
41208a0756116P92898N204480N640483K121640p68192J238621N168597L072250
41200A1714661n809050j0830629m005700O829189P806658j230359p515041m979083
$$ plain form
41192 -8019354 -9016905 -10379830 -11370153 -6828578 2306771 8674864 9711410 10571931 13796742
41183 13796742 14568243 10083081 5968806 7831484 12251133 12187270 6947507 864837
41175 864837 -4202896 -8681580 -10389811 -6713840 -578936 1870729 -809120 -5017799
41167 -5017799 -8755726 -12487971 -13760113 -8368819 1236878 5770795 1117404 -5191781
41159 -5191781 -4266090 2045682 5089520 2051126 -2061318 -3579933 -4140737 -4643121 -1961594
41150 -1961594 5025418 10968368 10126048 4286684 253302 822430 2583907 2257347 613282
41141 613282 -931196 -3159828 -5774354 -4799041 2523750 11939866 15735500 11823639
41133 11823639 5238496 491671 -2754737 -5053784 -3755007 1807266 5957955 3172796
$$ packed form
41192h019354r97551j362925r90323M541575R135349O368093J036546Q60521L224811
41183A3796742P71501m485162m114275J862678M419649o3863n239763o082670
41175H64837n067733m478684j708231L675971O134904K449665k679849m208679
41167e017799l737927l732245j272142N391294R605697M533917m653391o309185
41159e191781R25691O311772L043838l038394m112444j518615n60804n02384K681527
41150a961594O987012N942950q42320n839364m033382N69128J761477l26560j644065
41141F13282j544478k228632k614526R75313P322791R416116L795634l911861
41133A1823639o585143m746825l246408k299047J298777N562273M150689k785159
$$ plain form
41125 3172796 -3298945 -5328394 -1591993 1074681 -1249132 -3882320 -1975598 1197952
41117 1197952 -469913 -5918111 -8027618 -3685944 2142990 2866602 -2444984 -8740962
41109 -8740962 -9882829 -3929161 4761553 9250719 7236471 3128686 1343953 383415
41101 383415 -2924547 -6143611 -4055329 2026903 4375250 -132205 -4926964 -2740646
41093 -2740646 4918035 10908453 11366447 7456379 1334834 -4786582 -7213687 -3370714
41085 -3370714 4026496 8918972 8403277 4855824 1925321 1099762 2038635 3521962 3862372
41076 3862372 2766927 2880747 7062406 13921414 18472358 17680380 13306736 9090008
41068 9090008 7350444 8458886 10903200 11269254 6981756 184717 -3726301 -2766321
$$ packed form
41125C172796o471741k029449L736401K666674k323813k633188J906722L173550
41117A197952j667865n448198k109507M341674N828934P23612n311586o295978
41109h740962j141867N953668Q690714M489166k014248m107785j784733r60538
41101C83415l307962l219064K088282O082232K348347m507455m794759K186318
41093b740646P658681N990418M57994l910068o121545o121416k427105L842973
41085c370714P397210M892476n15695l547453k930503q25559R38873J483327L40410
41076C862372j095445J13820M181659O859008M550944p91978m373644m216728
41068I090008j739564J108442K444314L66054m287498o797039l911018R59980
$$ plain form
41060 -2766321 -840453 -1721892 -3358796 -1270287 4103585 7127016 4042894 -2503813
41052 -2503813 -6744106 -5678609 -868954 4182880 7146889 7792075 6965616 5422839
41044 5422839 3797143 3038063 3894910 6010242 8476373 11231823 14579179 17169646
41036 17169646 16334621 11482164 5692863 2559827 2533098 3766596 5464812 8522748
41028 8522748 13324651 18607731 22403611 22878807 18748681 10619393 1973201 -2935687
41020 -2935687 -3044813 -1638539 -3025298 -8293708 -14317750 -16672295 -13794378 -8494132
41012 -8494132 -4855676 -3674604 -2260708 969641 3950212 4527880 4312921 6159071
41004 6159071 9237682 10139749 8498738 7834008 10163226 13086921 13410135 10752208 6281437
$$ packed form
41060b766321J925868q81439j636904K088509N373872L023431l084122o546707
41052b503813m240293J065497M809655N051834K964009O45186q26459j542777
41044E422839j625696p59080Q56847K115332K466131K755450L347356K590467
41036A7169646q35025m852457n789301l133036k6729J233498J698216L057936
41028H522748M801903N283080L795880M75196m130126q129288q646192m908888
41020b935687j09126J406274j386759n268410o024042k354545K877917N300246
41012h494132L638456J181072J413896L230349K980571N77668k14959J846150
41004F159071L078611R02067j641011o64730K329218K923695L23214k657927m470771
$$ plain form
40995 6281437 946020 -3220151 -3259614 344822 2054987 -2361665 -9521740 -12391044
40987 -12391044 -9750000 -7552817 -10496419 -16059191 -18275790 -14474089 -6684293 1154061
40979 1154061 5655575 5908486 4927007 7172380 12334225 13650342 5863029 -6227478
40971 -6227478 -11430261 -5174951 4958122 8813408 5548439 2417462 3642098 5491616
40963 5491616 3349470 -751700 -1064037 3469848 7676516 7083887 3093526 -159479
40955 -159479 -1650021 -3666960 -7153748 -9694051 -8997562 -6445556 -5227573 -5558017 -4115062
40946 -4115062 776341 5410819 4665736 -961860 -5406307 -4770775 -1626650 434096
40938 434096 2952493 9019991 15699372 15840768 7854699 -1689592 -6926226 -9141644
$$ packed form
40995F281437n335417m166171l9463L604436J710165m416652p160075k869304
40987a2391044K641044K197183k943602n562772k216599L801701P789796P838354
40979A154061M501514K52911r81479K245373N161845J316117p787313j2090507
40971f227478n202783O255310J0133073L855286l264969l130977J224636J849518
40963E491616k142146m101170l12337M533885M206668n92629l990361l253005
40955a59479j490542k016939l486788k540303O96489K552006J217983l30444J442955
40946d115062M891403M634478p45083n627596m444447O35532L144125K060746
40938D34096K518397O067498O679381J41396p986069r544291n236634k215418
$$ plain form
40930 -9141644 -11597724 -12817337 -9693272 -4016669 -630070 -721501 -1735945 -2718200 -4725077
40921 -4725077 -6428573 -4537714 714546 5028216 6018145 5719749 6108658 6258566 5531783
40912 5531783 5784490 8374580 11966182 14833858 16504201 16304779 13857382 11649508
40904 11649508 12528519 13724104 9326742 869612 -1664015 6126696 14975537 14611226
40896 14611226 8469864 6896932 9993805 8227501 -800698 -7445156 -4512951 2638248
40888 2638248 5034280 1993551 -1240854 -2622202 -4269199 -6910902 -7949282 -4263200
40880 -4263200 4954910 16510311 23752034 22072653 14799673 9724026 8845994 6658133
40872 6658133 310595 -4920762 -4291229 -1846569 -4275630 -10744091 -15034039 -14803015
$$ packed form
40930i141644k456080j219613L124065N676603L386599r1431j014444r82255k006877
40921d725077j703496J890859N252260M313670R89929k98396L88909J49908p26783
40912E531783K52707K590090L591602K867676J670343j99422k447397k207874
40904A1649508Q79011J195585m397362q457130k533627P790711Q848841l64311
40896A4611226o141362j572932L096873j766304r028199o644458K932205P151199
40888B638248K396032l040729l234405j381348j646997k641703j038380L686082
40880d263200R218110J1555401P241723j679381p272980n075647q78032k187861
40872F658133o347538n231357O29533K444660k429061o468461m289948K31024
$$ plain form
40864 -14803015 -12634841 -10322143 -8364901 -9198259 -14159241 -18309187 -15349496 -7684317
40856 -7684317 -4356027 -7719485 -9445903 -2879365 7014960 10921244 8106805 6476442
40848 6476442 11303811 18642644 20406682 13324195 1997522 -5868797 -6635071 -2921249
40840 -2921249 1124719 4850128 9468906 13117075 11502380 4082544 -3754665 -6336777
40832 -6336777 -3485173 560867 2152830 909982 -1274891 -2794910 -4268004 -7596547
40824 -7596547 -12415156 -15147742 -13715319 -11245297 -11546842 -12461196 -8633463 -484666
40816 -484666 5202319 4588712 1065608 -1580146 -4405059 -8416829 -9941754 -5865128
40808 -5865128 306283 2882602 1964133 1969267 4089896 5417030 4856251 5076961 8071649
$$ packed form
40864a4803015K168174K312698J957242q33358m960982m149946K959691P665179
40856g684317L328290l363458j726418O566538R894325L906284k814439j630363
40848F476442M827369P338833J764038p082487j1326673p866319p66274L713822
40840b921249M045968L725409M618778L648169j614695p419836p837209k582112
40832f336777K851604M046040J591963j242848k184873j520019j473094l328543
40824g596547m818609k732586J432423K470022l01545r14354L827733Q148797
40816d84666N686985o13607l523104k645754k824913m011770j524925M076626
40808e865128O171411K576319r18469N134K120629J327134n60779K20710K994688
$$ plain form
40799 8071649 12259578 14663145 13747186 10153207 6307956 4479917 3751442 810431
40791 810431 -4274222 -5918992 -127901 8754127 12782769 10115792 5171729 581177
40783 581177 -5153781 -12014721 -16505509 -16926645 -15741965 -14858061 -12993078 -9804832 -8142816
40774 -8142816 -9128366 -8738712 -3136692 4921757 8632982 4834586 -3654914 -12120576
40766 -12120576 -17424003 -18023979 -13601777 -5752004 2021508 5824366 3526319 -3474303
40758 -3474303 -10595300 -13722575 -13046206 -11889342 -11599961 -9972991 -5770398 -2135310
40750 -2135310 -2904717 -6766402 -7910997 -2882865 4862348 8102837 3207374 -6065913
40742 -6065913 -12345952 -11993097 -7676984 -3509926 2522 4068979 6963585 5423009
$$ packed form
40799H071649M187929K403567r15959l593979l845251j828039p28475k941011
40791H10431n084653j644770N791091Q882028M028642k666977m944063m590552
40783E81177n734958o860940m490788m21136J184680Q83904J864983L188246J662016
40774h142816r85550L89654N602020Q058449L711225l798396q489500q465662
40766a2120576n303427n99976M422202P849773P773512L802858k298047p000622
40758c474303p120997l127275O76369J156864K89381J626970M202593L635088
40750b135310p69407l861685j144595N028132P745213L240489m895463r273287
40742f065913o280039L52855M316113M167058L512448M066457K894606j540576
$$ plain form
40734 5423009 213850 -4118496 -5707813 -7024930 -8513376 -5620292 4064017 14396042
40726 14396042 16339412 8582929 -1543338 -6896264 -6607247 -3842717 -1143089 1338056
40718 1338056 5110664 11042316 16562457 16732582 10549660 4308494 4801859 10311354
40710 10311354 13187291 11234878 10626542 15464945 20299730 17728714 9556811 4337766
40702 4337766 5291596 6944043 4520825 749312 247800 1664683 172053 -4520915
40694 -4520915 -7794112 -7214657 -5054283 -3150179 -424986 2455042 1246476 -4970988
40686 -4970988 -9431116 -5907881 1668744 4522599 2144281 1993748 5879694 5795658 -3217296
40677 -3217296 -14343301 -18837733 -17726877 -16461434 -13664703 -4565363 7519164 13305113
$$ packed form
40734E423009n209159m332346j589317j317117j488446K893084R684309J0332025
40726A4396042J943370p756483j0126267n352926K89017K764530K699628K481145
40718A338056L772608N931652N520141J70125o182922o241166M93365N509495
40710A0311354K875937j952413o08336M838403M834785k571016q171903n219045
40702D337766R53830J652447k423218l771513n01512J416883j492630m692968
40694d520915l273197N79455K160374J904104K725193K880028j208566o217464
40686d970988m460128L523235P576625K853855k378318j50533L885946q4036r012954
40677c217296j1126005m494432J110856J265443K796731R099340J2084527N785949
$$ plain form
40669 13305113 10830641 7230401 6218731 3380266 -2907696 -5227990 1997508 12358985
40661 12358985 15808918 12724677 11619746 15050339 16027297 9160228 -1293373 -6969597
40653 -6969597 -4637891 2546644 9822034 14105665 14311895 11048247 6001717 749075
40645 749075 -3620622 -5770452 -4334331 185782 4381816 4024736 -2105505 -10414628
40637 -10414628 -15103205 -13356322 -7798803 -3048861 -424436 2223683 5754447 7716147
40629 7716147 6256525 3355763 1928460 1649639 189815 -2887869 -6095320 -8495873
40621 -8495873 -9214856 -5771766 3181897 13725242 19415759 19047301 18005776 20547751
40613 20547751 24247538 24154548 19332979 12648370 6671667 2838754 2470974 4812942
$$ packed form
40669A3305113k474472l600240j011670k838465o287962k320294P225498J0361477
40661A2358985L449933l084241j104931L430593R76958o867069j0453601n676224
40653f969597K331706P184535P275390M283631K06230l263648n046530n252642
40645G49075m369697k149830J436121M520113M196034l57080o130241q309123
40637a0414628m688577J746883N557519M749942K624425K648119L530764J961700
40629G716147j459622k900762j427303k78821j459824l077684l207451k400553
40621h495873p18983L443090Q953663J0543345N690517l68458j041525K541975
40613B0547751L699787r2990m821569o684609n976703l832913l67780K341968
$$ plain form
40605 4812942 5174996 -808351 -10627850 -16047321 -12262949 -3709427 921987 -1721763
40597 -1721763 -6494976 -5946150 1150170 8033866 7376128 172373 -4768042 -1220388
40589 -1220388 7070601 11905760 11019065 8492417 6259849 1731578 -4650324 -6316313
40581 -6316313 150862 7505767 6296487 -1441963 -4099394 3857809 14977524 19546087
40573 19546087 17111336 13553799 11598707 9718529 7788391 7693359 8300464 5045762
40565 5045762 -3502592 -11929177 -13221013 -6219226 3773605 10524668 11354841 7216126
40557 7216126 920246 -3896265 -3917561 1314079 7599957 8759963 2900549 -4739731
40549 -4739731 -7182204 -3670050 114494 -5621 -1673166 -594429 2762659 4334088
$$ packed form
40605D812942L62054n983347r819499n419471L784372Q553522M631414k643750
40597a721763m773213N48826P096320O883696o57738p203755m940415L547654
40589a220388Q290989M835159q86695k526648k232568m528271o381902j665989
40581f316313O467175P354905j209280p738450k657431P957203J1119715M568563
40573A9546087k434751l557537j955092j880178j930138r5032O07105l254702
40565E045762q548354q426585j291836P001787R992831O751063Q30173m138715
40557G216126o295880m816511k1296N231640O285878J160006n859414p640280
40549d739731k442473L512154L784544j20115j667545J078737L357088J571429
$$ plain form
40541 4334088 2859090 1436503 2603987 4954240 5708202 4588860 3743351 4651434 6010381
40532 6010381 4828274 78232 -4783667 -4775383 -893 3008822 -800385 -7579465 -8791193
40523 -8791193 -2143950 5734998 7837280 4028287 -1277115 -4909335 -6398396 -6411861
40515 -6411861 -5912262 -5310846 -3496168 476557 4587969 5560941 3526048 1392269 -604802
40506 -604802 -4755668 -9206684 -7743741 471459 7015402 5030160 -1274624 -3756270
40498 -3756270 -1941264 -157203 2556655 10233429 19660438 22162812 15906770 7398649
40490 7398649 216786 -7874095 -14899252 -13083904 -2206440 5937147 3787903 -274790
40482 -274790 4386827 12995679 12778122 3061008 -4653206 -4869773 -3797631 -5898136 -6680994
$$ packed form
40541D334088j474998j422587J167484K350253P53962j119342q45509R08083J358947
40532F010381j182107m750042m861899Q284M774490L009715l809207o779080j211728
40523h791193O647243P878948K102282l808993n305402l632220j489061j3465
40515f411861M99599O01416J814678L972725M111412R72972k034893k133779j997071
40506f04802m150866m451016J462943Q215200O543943j985242o304784k481646
40498c756270J815006J784061K713858P676774R427009K502374o256042q508121
40490G398649p181863q090881p025157J815348J0877464Q143587k149244m062693
40482b74790M661617Q608852k17557r717114p714214k16567J072142k100505p82858
$$ plain form
40473 -6680994 -2758516 982966 -94713 -2363617 -453280 4186136 7194905 8833972
40465 8833972 11592570 14358258 15091326 15959030 19475367 22138657 18561756 10341677
40457 10341677 4223087 2321631 875923 -1565337 -2136013 -1066911 -3448204 -10052467
40449 -10052467 -12926047 -5473574 7478740 15428417 15176715 12319932 11525490 11668617
40441 11668617 10974872 10943401 12439730 12110403 6683815 -948332 -3785315 915330 8013700
40432 8013700 10457954 7274491 3745475 4105624 6452888 6255103 3158150 1420810
40424 1420810 3489683 6095146 4474151 -1406898 -7046894 -8735160 -6345968 -1375719
40416 -1375719 5000083 11041330 13687948 10624281 3009206 -4742538 -8395960 -7425145
$$ packed form
40473f680994L922478L741482j077679k268904J910337M639416L008769J639067
40465H833972K758598K765688P33068Q67704L516337K663290l576901q220079
40457A0341677o118590j901456j445708k441260n70676J069102k381293o604263
40449a0052467k873580P452473J2952314P949677k51702k856783p94442J43127
40441A1668617o93745l1471J496329l29327n426588p632147k836983M700645P098370
40432H013700K444254l183463l529016L60149K347264j97785l096953j737340
40424A420810K068873K605463j620995n881049n639996j688266K389192M970249
40416a375719O375802O041247K646618l063667p615075p751744l653422R70815
$$ plain form
40408 -7425145 -5193515 -5210673 -7229081 -7999784 -5993798 -3487128 -2725894 -2056263 1402792
40399 1402792 6130939 6589147 76761 -9026950 -13125643 -8521824 1556046 9731399
40391 9731399 10307671 4074205 -2378117 -3504501 -618606 1038733 49079 -73377 2331874
40382 2331874 3943417 2294898 350400 1547564 3782398 3167061 1400169 3605180
40374 3605180 9546426 13094168 11520636 9556877 11394622 13597771 10515057 3595501
40366 3595501 -204899 1509112 3425124 767130 -3551150 -3023855 3433096 9964437
40358 9964437 10903085 6673189 2004983 417494 1764020 3889517 5068256 5044399 4502663
40349 4502663 3317115 -519141 -8499437 -17476097 -20582801 -14785848 -5567414 -843568
$$ packed form
40408g425145K231630j7158k018408p70703K005986K506670P61234O69631L459055
40399A402792M728147M58208o512386r103711m098693M603819J0077870Q175353
40391I731399N76272o233466o452322j126384K885895J657339r89654j22456K405251
40382B331874J611543j648519j944498J197164K234834o15337j766892K205011
40374C605180N941246L547742j573532j963759J837745K203149l082714o919556
40366C595501l800400J714011J916012k657994m318280N27295O456951O531341
40358I964437R38648m229896m668206j587489J346526K125497J178739k3857n41736
40349D502663j185548l836256p980296q976660l106704N796953R218434M723846
$$ plain form
40341 -843568 -1861260 -4216326 -6208593 -9874149 -13543913 -11139374 -2271616 3949234
40333 3949234 794469 -5993784 -6944151 -3262333 -3982883 -11144372 -17185536 -17146842 -14382511
40324 -14382511 -12306506 -9110756 -4274627 -2529822 -6109462 -9199752 -6023736 236592
40316 236592 2646654 937904 331584 2415746 3708182 2419870 803997 465343 -75334
40307 -75334 -2442600 -6302555 -10386915 -13102385 -12869040 -10488267 -9727122 -12285327 -13968748
40298 -13968748 -10191283 -3890464 -2618993 -7906755 -13088240 -12888684 -9967365 -9494459
40290 -9494459 -11385955 -11223309 -6533084 606874 6014290 6854672 3678442 -236370
40282 -236370 -2566250 -4552205 -8045280 -11033218 -9704590 -4762701 -1306843 -1522060
$$ packed form
40341h43568j017692k355066j992267l665556l669764K404539Q867758O220850
40333C949234l154765o788253r50367L681818p20550p161489o041164L8694K764331
40324a4382511K076005L195750M836129J744805l579640l090290L176016O260328
40316B36592K410062j708750o06320K084162J292436j288312j615873l38654n40677
40307g5334k367266l859955m084360k715470K33345K380773P61145k558205j683421
40298a3968748L777465O300819J271471n287762n181485J99556K921319M72906
40290i494459j891496J62646M690225P139958N407416Q40382l176230l914812
40282b36370k329880j985955l493075k987938J328628M941889L455858k15217
$$ plain form
40274 -1522060 -2046732 -507490 -30937 -3897651 -9379132 -11037764 -7846109 -3129814
40266 -3129814 771270 3725378 4743148 1840083 -4718478 -11906203 -16931219 -18653793
40258 -18653793 -16536584 -10899803 -4172604 857801 4469334 9114726 14351890 15317674
40250 15317674 8219709 -3970585 -13235935 -13740542 -6416514 3069606 9430736 10676313
40242 10676313 7686468 2816365 -1069007 -2075703 -1153473 -1550624 -4909009 -8488087
40234 -8488087 -7980215 -2906425 2501114 3927329 1038754 -3011938 -4541358 -1923991
40226 -1923991 2870282 5254974 2456978 -3055138 -6685391 -7953995 -10617107 -16211924
40218 -16211924 -20944093 -20465712 -15043758 -8606526 -5123143 -6825972 -12868889 -18477558
$$ packed form
40274a522060n24672J539242M76553l866714n481481j658632L191655M716295
40266c129814L901084K954108J017770k903065o558561p187725n025016j722574
40258a8653793K117209N636781O727199N030405L611533M645392N237164R65784
40250A5317674p097965j2190294r265350n04607P324028R486120O361130J245577
40242A0676313k989845m870103l885372j006696R22230l97151l358385l579078
40234h488087N07872N073790N407539J426215k888575m050692j529420K617367
40226a923991M794273K384692k797996n512116l630253j268604k663112n594817
40218a6211924m732169M78381N421954O437232L483383j702829o042917n608669
$$ plain form
40210 -18477558 -18857750 -15423135 -14202855 -16262522 -14799839 -5390984 5749032 9101358
40202 9101358 3977709 -2486393 -5872133 -7562191 -8606115 -7276244 -3384720 423864
40194 423864 2884422 5371773 8162647 9399540 8538592 7232730 6253123 4949371 3911702
40185 3911702 4444286 5177015 3070154 -1750477 -5754425 -6846145 -6030416 -4652501 -3828450
40176 -3828450 -5604831 -9732034 -10440490 -3016532 6631726 6879622 -3536146 -12500702
40168 -12500702 -10922802 -4281750 -2847015 -7600486 -12544140 -15248578 -17214410 -17278447
40160 -17278447 -12655783 -5441260 -1715069 -4332341 -10889393 -17616402 -21209336 -18725685
40152 -18725685 -10480918 -1907816 1605958 447431 -2011501 -5130550 -9326301 -11661783
$$ packed form
40210a8477558l80192L434615J220280k059667J462683R408855J1140016L352326
40202I101358n123649o464102l385740j690058j043924J329871L891524L808584
40194D23864K460558K487351K790874J236893q60948j305862r79607j303752j037669
40185C911702N32584P32729k106861m820631m003948j091720Q15729J377915Q24051
40176c828450j776381m127203p08456P423958R648258K47896j0415768q964556
40168a2500702J577900O641052J434735m753471m943654k704438j965832o4037
40160a7278447M622664P214523L726191k617272o557052o727009l592934K483651
40152a8725685Q244767Q573102L513774j158527k458932l119049m195751k335482
$$ plain form
40144 -11661783 -9147525 -4570868 -2788943 -2597531 959806 6797357 7615641 557150
40136 557150 -8419555 -12563901 -11254269 -7289051 -2602594 1255260 3021627 4036778
40128 4036778 6481743 8097037 3645063 -6577018 -14887307 -15536076 -11277419 -7896479
40120 -7896479 -6800945 -6481680 -7107119 -9284235 -10922594 -9319658 -4954665 -701671
40112 -701671 1161209 -232537 -3895966 -6108340 -3571734 810920 -363683 -8795103
40104 -8795103 -16507491 -15982532 -10082104 -6832512 -7703987 -7337669 -3497890 -939890 -4381808
40095 -4381808 -12016766 -17671751 -17106729 -11362849 -5323988 -3106905 -4099863 -4254673 -1528388
40086 -1528388 1943078 3416871 2087594 -2694775 -11138094 -18855731 -18550384 -9977618
$$ packed form
40144a1661783K514258M576657J781925J91412L557337N837551Q18284p058491
40136E57150q976705m144346J309632L965218M686457L857854J766367J015151
40128D036778K444965J615294m451974j0222081q310289o48769M258657L380940
40120g896479J095534L19265o25439k177116j638359J602936M364993M252994
40112g01671J862880j393746l663429k212374K536606M382654j174603q431420
40104h795103p712388N24959N900428L249592q71475L66318L839779K558000l441918
40095d381808p634958n654985N65022N743880O038861K217083r92958j54810K726285
40086a528388L471466J473793j329277m782369q443319p717637L05347Q572766
$$ plain form
40078 -9977618 -2925584 -4565825 -8813429 -5829039 1997957 3380965 -4110937 -10384321
40070 -10384321 -8469731 -3789375 -3782537 -6855040 -7429972 -5367196 -3651597 -1352462 4028160
40061 4028160 9685887 9606120 3035106 -4038716 -5874366 -1920842 4733981 10353974
40053 10353974 12040690 9294764 4716323 1542851 632402 880684 1333989 1437763 931037
40044 931037 1378138 5681520 13453785 19087699 18063236 13499625 11992967 13724823
40036 13724823 11850927 2553382 -9152252 -15863604 -16204817 -13941263 -11723972 -9342846
40028 -9342846 -6635362 -4585400 -3750250 -4069219 -5953757 -9215083 -11080987 -7987245
40020 -7987245 -181219 7497224 10586455 9381958 7464180 7349861 8837862 10311162
$$ packed form
40078i977618P052034j640241m247604K984390P826996J383008p491902o273384
40070a0384321J914590M680356O838l072503n74932K062776J715599K299135N380622
40061D028160N657727p9767o571014p073822j835650L953524O654823N619993
40053A0353974J686716k745926m578441l173472r10449K48282M53305J03774n06726
40044I31037M47101M303382P772265N633914j024463m563611j506658J731856
40036A3724823j873896r297545j1705634o711352l41213K263554K217291K381126
40028i342846K707484K049962Q35150l18969j884538l261326j865904L093742
40020g987245P806026P678443L089231j204497j917778j14319J488001J473300
$$ plain form
40012 10311162 9973237 6664996 1289760 -3102638 -4559777 -5163471 -8390250 -13430613
40004 -13430613 -14935396 -9687243 -1223169 3986778 3181512 -1683992 -7501904 -11753002
39996 -11753002 -12177054 -8433611 -4044268 -3314131 -5765812 -6752406 -4364196 -2206798
39988 -2206798 -3667361 -7021808 -9025929 -10020310 -11327638 -10228173 -3403329 5245327
39980 5245327 6970732 502053 -4216635 806280 9528557 9693737 264998 -7037257
39972 -7037257 -4253996 2844627 4944034 2281630 1178947 2349738 916760 -3754804
39964 -3754804 -6820430 -7281797 -10343377 -17391944 -20873523 -14444362 -3123465 2759998
39956 2759998 646402 -3084684 -3059125 -229247 2013485 1788519 -1347746 -6097606 -8903111
$$ packed form
40012A0311162l37925l308241n375236m392398j457139o03694l226779n040363
40004a3430613j504783N248153Q464074N209947q05266m865504n817912m251098
39996a1753002m24052L743443M389343P30137k451681r86594K388210K157398
39988b206798j460563l354447k004121r94381j307328J099465O824844Q648656
39980E245327J725405o468679m718688N022915Q722277J65180r428739p302255
39972g037257K783261P098623K099407k662404j102683J170791j432978m671564
39964c754804l065626m61367l061580p048567l481579O429161J1320897N883463
39956B759998k113596l731086K5559K829878K242732k24966l136265m749860k805505
$$ plain form
39947 -8903111 -7571062 -5148961 -6091836 -9073946 -8679581 -4404166 -2015665 -4223404
39939 -4223404 -5982035 -2660665 2094803 1662456 -3513729 -6562017 -3696871 1645162
39931 1645162 4337007 3449766 1572515 771211 557920 -1248986 -6230265 -13083031 -17486620
39922 -17486620 -15415939 -7371983 1173570 4509077 2287198 -105367 2460876 8995134
39914 8995134 13948786 14166108 11541572 8365141 4079685 -932379 -2599233 1178166
39906 1178166 5241338 3380083 -2128013 -3709759 -171542 2220107 505871 -1280709
39898 -1280709 -1026691 -2631397 -7363922 -9276654 -5021180 -1131057 -4126150 -8985944
39890 -8985944 -6236110 2853228 7263289 1489807 -8323311 -14075989 -14494152 -12517293
$$ packed form
39947h903111J332049K422101r42875k982110L94365M275415K388501k207739
39939d223404j758631L321370M755468m32347n176185l048288K865146N342033
39931A645162K691845q87241j877251q01304k13291j806906m981279o852766m403589
39922a7486620K070681Q043956Q545553L335507k221879k392565K566243O534258
39914H995134M953652K17322k624536l176431m285456n012064j666854L777399
39906A178166M063172j861255n508096j581746L538217K391649j714236j786580
39898a280709K54018j604706m732525j912732M255474L890123k995093m859794
39890h985944K749834R089338M410061n773482r813118n752678m18163J976859
$$ plain form
39882 -12517293 -9650294 -5724412 -1041884 3291175 5763066 5224489 2753646 1383218
39874 1383218 1861415 840561 -3853992 -8803530 -9653722 -7518722 -6109418 -5020746
39866 -5020746 -1474322 3114086 4479869 2557093 1290864 1916471 2043552 811451
39858 811451 -778681 -3753986 -8972475 -11922991 -7216920 1669453 5008286 16923
39850 16923 -6522830 -9888848 -12575326 -15414444 -13447285 -5626513 230995 -1266305
39842 -1266305 -4256572 -1336979 4220598 4028104 -2442448 -8710787 -11718843 -13276928
39834 -13276928 -13301183 -9601713 -3741042 -143038 746844 2555511 6021115 7313465
39826 7313465 4149346 -759003 -3469004 -2987391 -984609 675091 1975162 4978228
$$ packed form
39882a2517293K866999L925882M682528M333059K471891n38577k470843j370428
39874A383218M78197j020854m694553m949538q50192K135000J409304J088672
39866e020746L546424M588408J365783j922776j266229O25607J27081j232101
39858H11451j590132k975305n218489k950516M706071Q886373L338833m991363
39850A6923o539753l366018k686478k839118J967159P820772N857508j497300
39842a266305k990267K919593N557577j92494o470552o268339l008056j558085
39834a3276928k4255L699470N860671L598004Q89882J808667L465604J292350
39826G313465l164119m908349k710001M81613K002782J659700J300071L003066
$$ plain form
39818 4978228 10493955 14403016 11294604 3212654 -589831 4045463 9724630 8162625
39810 8162625 1673251 -2434935 -3700362 -6458045 -9810011 -9158920 -5935542 -6310461
39802 -6310461 -10559651 -12712464 -11108746 -10240281 -10802701 -7079423 2824323 12112158
39794 12112158 14260000 10325629 4388851 -1745514 -6303197 -6652300 -4178950 -4035404
39786 -4035404 -6982912 -7953888 -5714090 -6186200 -11649236 -14767256 -10013618 -3930993
39778 -3930993 -5833098 -13639076 -17669161 -14773267 -9958735 -6461142 -2862667 1023492
39770 1023492 3421618 5488137 9731000 13614873 11827493 5404492 1694701 4014541
39762 4014541 7677643 7875656 5454983 2838537 -33560 -3022556 -4093133 -3170876
$$ packed form
39818D978228N515727L909061l108412q081950l802485M635294N679167j562005
39810H162625o489374m108186j265427k757683l351966O51091L223378l74919
39802f310461m249190k152813J603718Q68465n62420L723278R903746R287835
39794A2112158K147842l934371n936778o134365m557683l49103K473350J43546
39786d035404k947508r70976K239798m72110n463036l118020M753638O082625
39778c930993j902105p805978m030085K895894M814532L497593L598475L886159
39770A023492K398126K066519M242863L883873j787380o423001l709791K319840
39762D014541L663102J98013k420673k616446k872097k988996j070577R22257
$$ plain form
39754 -3170876 -3288113 -5157374 -5049857 -1268874 1589202 -1041832 -6471965 -8303167
39746 -8303167 -4846616 375295 4709606 8080305 9170176 5022276 -3697179 -10295140
39738 -10295140 -7863507 2918433 13353160 14663230 6216171 -4454523 -9766369 -9165328
39730 -9165328 -7172428 -5940579 -2929266 3600506 10164685 11496917 6651518 -564624
39722 -564624 -6033237 -8063298 -6910078 -4450237 -4179301 -8572735 -15269314 -17895086
39714 -17895086 -12457910 -2066226 6241169 8917484 8495795 8718417 9379344 7883166
39706 7883166 4543208 3098979 5320156 8021486 7407113 4271922 2419264 3551988
39698 3551988 6605142 10694960 14975469 16267107 11310138 2061359 -5346310 -8029482
$$ packed form
39754c170876j17237j869261J07517L780983K858076k631034n430133j831202
39746h303167L456551N221911M334311L370699J089871m147900q719455o597961
39738a0295140K431633J0781940J0434727J310070q447059j0670694n311846O01041
39730i165328J992900J231849L011313O529772O564179J332232m845399p216142
39722e64624n468613k030061J153220K459841K70936m393434o696579k625772
39714a7895086N437176J0391684Q307395K676315m21689K22622O60927j496178
39706G883166l339958j444229K221177K701330o14373l135191j852658J132724
39698C551988L053154M089818M280509J291638m956969r248779p407669k683172
$$ plain form
39690 -8029482 -8583475 -8573021 -5094878 2817912 9305791 8499742 2961168 -464477 -801882
39681 -801882 -2250364 -4580514 -2275968 5153943 9658049 5648477 -1358836 -2828988
39673 -2828988 -5879 -1767975 -10841905 -18865417 -17075587 -7415815 81287 -1130244
39665 -1130244 -7955620 -12553439 -11172435 -7172354 -6013623 -8768002 -11665094 -11304433
39657 -11304433 -8165410 -4387824 -416438 4159459 7968337 8843500 7207068 5841437
39649 5841437 5542882 3152893 -4348588 -14614388 -20662399 -17708801 -8830012 -2643637
39641 -2643637 -4532385 -10907861 -13710453 -10178463 -5599827 -5678162 -9262250 -11079762
39633 -11079762 -9309131 -6868646 -6265349 -6947020 -7737142 -8287006 -7381329 -3145768 3598449
$$ packed form
39690h029482n53993J0454L478143P912790O487879q06049n538574l425645l37405
39681h01882j448482k330150K304546P429911M504106m009572p007313j470152
39673b828988K823109j762096r073930q023512J789830R659772P497102j211531
39665a130244o825376m597819J381004M000081J158731k754379k897092L60661
39657a1304433L139023L777586L971386M575897L808878Q75163j636432j365631
39649E841437k98555k389989p501481j0265800o048011K953598Q878789O186375
39641b643637j888748o375476k802592L531990M578636p8335l584088j817512
39633a1079762J770631K440485O03297o81671p90122n49864R05677M235561O744217
$$ [...]
##END NTUPLES=NMR SPECTRUM
##END=
