##TITLE=31Pdec_IPEM51
 CDCl3, 24 sc
 24.7.2019
##JCAMPDX= 6.0         $$ Bruker NMR JCAMP-DX V2.0
##DATA TYPE= NMR SPECTRUM
##DATA CLASS= NTUPLES
##ORIGIN= UXNMR, Bruker Analytische Messtechnik GmbH
##OWNER= root
$$ XWIN-NMR		Version 3.5
$$ Wed Jul 24 14:57:19 2019 Russian Standard Time (UT+4h)  she@DPX200
##.OBSERVE FREQUENCY= 81.013821
##.OBSERVE NUCLEUS= ^31P
##.ACQUISITION MODE= SIMULTANEOUS
##.ACQUISITION SCHEME= undefined
##.AVERAGES= 24
##.DIGITISER RES= 17
##SPECTROMETER/DATA SYSTEM= spect
##.PULSE SEQUENCE= zgpg30
##.SOLVENT NAME= CDCl3
##.SHIFT REFERENCE= (INTERNAL, CDCl3, 0, 182.463)
##AUDIT TRAIL= $$ (NUMBER, WHEN, WHO, WHERE, WHAT)
$$ ##TITLE= Audit trail, XWIN-NMR		Version 3.5
$$ ##JCAMPDX= 5.01
$$ ##ORIGIN= Bruker BioSpin GmbH
$$ ##OWNER= she
$$ F:/spectra/data/she/nmr/P31/1/pdata/1/auditp.txt
$$ ##AUDIT TRAIL=  $$ (NUMBER, WHEN, WHO, WHERE, WHAT)
(   1,<2019-07-24 14:56:06.14 +0400>,<she>,<DPX200>,
      <created by zg, POWCHK disabled, PULCHK disabled
       configuration hash MD5:
       00 E9 B6 7A A2 85 ED C7 34 08 36 98 17 FE 4E 26
       data hash MD5: 32K
       48 40 38 C3 88 50 E4 5B 75 AD C2 5E C2 35 A4 B6>)
(   2,<2019-07-24 14:56:08.57 +0400>,<she>,<DPX200>,
      <Start of raw data processing
       efp BC_mod = 2 LB = 1 FT_mod = 6 PKNL = 1 PHC0 = -2449.913 PHC1 = -133.6007 SI = 64K 
       data hash MD5: 64K
       77 9B DE BC D6 DC 3A C5 6E FF 42 80 29 0D FF AF>)
(   3,<2019-07-24 14:56:18.26 +0400>,<she>,<DPX200>,
      <pk PHC0 = -3.262262 PHC1 = 0 
       data hash MD5: 64K
       63 AB 31 F4 A7 BB C7 6C 77 D8 FE C6 A3 7F D7 1C>)
(   4,<2019-07-24 14:56:21.18 +0400>,<she>,<DPX200>,
      <abs ABSG = 5 
       data hash MD5: 64K
       C2 1F B3 4D 9C 91 79 82 91 07 80 7F 3F 38 01 F4>)
$$ ##END=
$$ 
$$ hash MD5
$$ AC 6E 38 42 57 35 87 67 16 9D E4 08 EC 54 C8 92
##$RELAX= 
##$RELAX= 
##$RELAX= 
##$RELAX= 
##$RELAX= 
##$RELAX= 
##$RELAX= 
##$RELAX= 
$$ Bruker specific parameters
$$ --------------------------
##$DU= <F:/spectra>
##$EXPNO= 1
##$NAME= <P31>
##$PROCNO= 1
##$TYPE= <nmr>
##$USER= <she>
##$AMP= (0..31)
100 100 100 100 100 100 100 100 100 100 100 100 100 100 100 100 100 100 
100 100 100 100 100 100 100 100 100 100 100 100 100 100 
##$AQSEQ= 0
##$AQ_mod= 1
##$AUNM= <au_zg>
##$AUTOPOS= <>
##$BF1= 81.014009
##$BF2= 200.13
##$BF3= 200.13
##$BF4= 200.13
##$BF5= 200.13
##$BF6= 200.13
##$BF7= 200.13
##$BF8= 200.13
##$BYTORDA= 1
##$CFDGTYP= 0
##$CFRGTYP= 5
##$CHEMSTR= <none>
##$CNST= (0..31)
1 1 145 1 1 1 1 1 1 1 1 1 1 1 1 1 1 1 1 1 1 1 1 1 1 1 1 1 1 1 1 1 
##$CPDPRG= <waltz16>
##$CPDPRG1= <>
##$CPDPRG2= <waltz16>
##$CPDPRG3= <>
##$CPDPRG4= <mlev>
##$CPDPRG5= <mlev>
##$CPDPRG6= <mlev>
##$CPDPRG7= <mlev>
##$CPDPRG8= <mlev>
##$CPDPRGB= <>
##$CPDPRGT= <>
##$D= (0..31)
0 1 0 0 0 0 0 0 0 0 0 0.03 2e-05 3e-06 0 0 0 0 0 0 0 0 0 0 0 0 0 0 0 0 
0 0 
##$DATE= 1563965765
##$DBL= (0..7)
120 120 120 11 120 120 24 19 
##$DBP= (0..7)
150 150 150 150 150 150 150 150 
##$DBP07= 0
##$DBPNAM0= <>
##$DBPNAM1= <>
##$DBPNAM2= <>
$$ [...]
##$SUBNAM3= <"">
##$SUBNAM4= <"">
##$SUBNAM5= <"">
##$SUBNAM6= <"">
##$SUBNAM7= <"">
##$SUBNAM8= <"">
##$SUBNAM9= <"">
##$SW= 369.568048894756
##$SWIBOX= (0..15)
0 1 3 0 0 0 0 0 0 0 0 0 0 0 0 0 
##$SW_h= 29940.119760479
##$TD= 32768
##$TD0= 1
##$TE= 0
##$TE2= 300
##$TE3= 300
##$TEG= 300
##$TL= (0..7)
0 120 53 12 22 120 120 120 
##$TP= (0..7)
150 150 150 150 150 150 150 150 
##$TP07= 0
##$TPNAME0= <>
##$TPNAME1= <>
##$TPNAME2= <>
##$TPNAME3= <>
##$TPNAME4= <>
##$TPNAME5= <>
##$TPNAME6= <>
##$TPNAME7= <>
##$TPOAL= (0..7)
0.5 0.5 0.5 0.5 0.5 0.5 0.5 0.5 
##$TPOFFS= (0..7)
0 0 0 0 0 0 0 0 
##$TUNHIN= 0
##$TUNHOUT= 0
##$TUNXOUT= 0
##$USERA1= <user>
##$USERA2= <user>
##$USERA3= <user>
##$USERA4= <user>
##$USERA5= <user>
##$V9= 5
##$VALIST= <valist>
##$VCLIST= <CCCCCCCCCCCCCCC>
##$VD= 0
##$VDLIST= <DDDDDDDDDDDDDDD>
##$VPLIST= <PPPPPPPPPPPPPPP>
##$VTLIST= <TTTTTTTTTTTTTTT>
##$WBST= 1024
##$WBSW= 4
##$XGAIN= (0..3)
0 0 0 0 
##$XL= 0
##$YL= 0
##$YMAX_a= 105144
##$YMIN_a= -107143
##$ZGOPTNS= <>
##$ZL1= 120
##$ZL2= 120
##$ZL3= 120
##$ZL4= 120
##$ABSF1= 182.463
##$ABSF2= -187.1042
##$ABSG= 5
##$ABSL= 3
##$ALPHA= 0
##$AQORDER= 0
##$ASSFAC= 0
##$ASSFACI= 0
##$ASSFACX= 0
##$ASSWID= 0
##$AUNMP= <proc_1d>
##$AZFE= 0.1
##$AZFW= 0.5
##$BCFW= 0
##$BC_mod= 2
##$BYTORDP= 0
##$COROFFS= 0
##$CY= -3
##$DATMOD= 1
##$DC= 0
##$DFILT= <>
##$DTYPP= 0
##$F1P= 0
##$F2P= 0
##$FCOR= 1
##$FTSIZE= 65536
##$FT_mod= 6
##$GAMMA= 0
##$GB= 0
##$INTBC= 1
##$INTSCL= 5.30512e-09
##$ISEN= 30
##$LB= 1
##$LEV0= 0
##$LPBIN= 0
##$MAXI= 10000
##$MC2= 0
##$MEAN= 0
##$ME_mod= 0
##$MI= 50
##$NCOEF= 0
##$NC_proc= -1
##$NLEV= 6
##$NOISF1= 182.463
##$NOISF2= 159.3651
##$NSP= 0
##$NTH_PI= 0
##$NZP= 0
##$OFFSET= 182.463
##$PC= 4
##$PHC0= -2453.175
##$PHC1= -133.6007
##$PH_mod= 1
##$PKNL= yes
##$PPARMOD= 0
##$PSCAL= 0
##$PSIGN= 0
##$REVERSE= no
##$SF= 81.0140089999434
##$SI= 65536
##$SIGF1= 159.3651
##$SIGF2= -187.1042
##$SINO= 113.3802
##$SIOLD= 16384
##$SREGLST= <1H.CDCl3>
##$SSB= 0
##$STSI= 65536
##$STSR= 0
##$SW_p= 29940.119760479
##$SYMM= 0
##$S_DEV= 0
##$TDeff= 32768
##$TDoff= 0
##$TI= <>
##$TILT= no
##$TM1= 0
##$TM2= 0
##$TOPLEV= 0
##$USERP1= <user>
##$USERP2= <user>
##$USERP3= <user>
##$USERP4= <user>
##$USERP5= <user>
##$WDW= 1
##$XDIM= 65536
##$YMAX_p= 337044518
##$YMIN_p= -3902521
$$ End of Bruker specific parameters
$$ ---------------------------------
##NTUPLES= NMR SPECTRUM
##VAR_NAME=  FREQUENCY,     SPECTRUM/REAL,   SPECTRUM/IMAG
##SYMBOL=    X,             R,               I
##VAR_TYPE=  INDEPENDENT,   DEPENDENT,       DEPENDENT
##VAR_FORM=  AFFN,          ASDF,            ASDF
##VAR_DIM=   65536,         65536,           65536
##UNITS=     HZ,            ARBITRARY UNITS, ARBITRARY UNITS
##FACTOR=    0.456856943014862, 1,           1
##FIRST=     14782.0589164792, 0,            0
##LAST=      -15158.0608439998, 0,           0
##MIN=       -15158.0608439998, -3902521,    0
##MAX=       14782.0589164792, 337044518,    0
$$ Real data points
##PAGE= N=1
##DATA TABLE= (X++(R..R)), XYDATA
$$ [...]
41885d0244k3198k5867p337N440l896n957L3762Q5560Q1101J9203k1333o366n258
41872H5610o4371j03483l7005O6857P5290k31k8461K1008L8742k2186o3196j5910
41860d7336M1767K5265k1805k3533o80p773k4940p689K2960K5209J0204j100k6447
41847c5898n9502l8954M3389R0847M5535q303J2607M0153k2243j09402q4024L3848
41835i1947R0252L2231l4890l0428K896P861j221J231J394q655q714L210M653
41822c2127k843N44K995j7424l2497J50N1157N0554l06l0469j3031M805r280l1060
41808e8832l5884k7369m805L3704N6853L3521n731p049J7642J1582k8788n3013
41796f8169m4221l0445j8511N648K2954P522q461J9881N9878M8771Q451P381K8141
$$ y = [-40244, -63442, -89309, -96646, -91206, -95102, -101059, -67297, 18263, 99364, 118567, 97234, 90868, 85610, 21239, -82244, -119249, -52392, 22898, 22667, -5794, 15214, 53956, 31770, -31426, -47336, -5569, 19696, -2109, -25642, -26322, -34095, -59035, -66724, -43764, -18555, -8351, -9451, -35898, -95400, -134354, -90965, -118, 45417, 37114, 49721, 89874, 67631, -41771, -125795, -91947, -1695, 30536, -4354, -34782, -31886, -24025, -25246, -24015, -22621, -31276, -39990, -36780, -32127, -34970, -34426, -31431, -48855, -81352, -81202, -30045, 20509, 20203, -10266, -23297, -18492, -27772, -58832, -94716, -122085, -126890, -93186, -36333, -2812, -8543, -15592, 2050, 13632, -15156, -68169, -112390, -142835, -161346, -155698, -132744, -125222, -133683, -113802, -53924, -5153, 3298, 10679, 38820]
41783C8820n685p8062q6877j1999N1566M9390L0547K8035M628m2723m8418K740
41771f8038L6298J6120j408J1886J760m4915m7480K3848P0051J8059n4114m3462
41759h1395K1514N0170L3104J6303L735j8388k4060j957j935m4012n5667R381
41747i3207O9271L6528l2658l1082K2580L1096p140j1902K1046J8948k0009j6828
41735a3357L9334O2014J4440l0634j7544Q333p255l7138l1833m005L878p184k643
41722b3594K6139M8059K8667l1036q2518o7221J0705P0369N0225p766k2040P748
41710G737J5753j1830k2329k638l798l5439l1060L4695Q1889M5266j6383j5161
41698D6702K0157l149p4840q4029M654Q7811P6470J8187N25R169k5237q5397q3659
$$ y = [38820, 33135, -44927, -131804, -143803, -92237, -42847, -12300, 15735, 20363, -22360, -70778, -68038, -31740, -15620, -17028, -5142, -3382, -48297, -95777, -71929, -1878, 16181, -37933, -81395, -59881, -9711, 23393, 39696, 43431, 25043, 983, -974, -2909, -46921, -102588, -93207, -23936, 12592, -20066, -51148, -28568, 2528, -4612, -16514, 4532, 23480, 3471, -13357, 25977, 87991, 102431, 71797, 54253, 62586, 55331, 18193, -13640, -17645, -13767, -20951, -23594, 2545, 50604, 79271, 48235, -34283, -101504, -90799, -20430, 29795, 22029, -11, 7737, 23490, 11660, -10669, -13307, -17105, -52544, -83604, -48909, 32980, 78246, 61863, 46702, 66859, 63710, -11130, -95159, -90505, -2694, 73776, 91963, 92488, 101657, 76420, -8977, -92636]
41685i2636j4161K2984j8952n1138Q572R2909P9684j8140o6412o416O7563N4343
41673E8200j7825n2641k3557J2038P060k2970l6363j5617K2837M8752M4332J9093
41661D3339p70J785K1796L8549K8761j2532n3690n0637o655K0973J132k1305O60
41648A1406L1991J1191l9103m0099J4454M6178J6835k1653k2923q317j460J8813
41636A7313N6027N8689l48o4999p1452l5807j4604j9377k1929j1475J710J5418
41624i0834L0214L5680K7261J3393o886l8263n4814k2606L3108M6242J2822L104
41612a1579M3069O3514J2304n8337p3350l7787q34K0516K3788q502n7510n2000
41600a36708K6010Q2946L9439m5416o2987j4655J4767J603l637J4347J5137j0829
$$ y = [-92636, -106797, -83813, -102765, -153903, -145331, -52422, 27262, 9122, -57290, -63706, 3857, 58200, 40375, -12266, -35823, -23785, -16725, -39695, -76058, -91675, -68838, -20086, 24246, 43339, 42569, 44354, 66150, 104699, 133460, 120928, 67238, 16601, 9946, 30919, 32051, 10746, 11406, 43397, 54588, 15485, -24614, -10160, 36018, 52853, 31200, 8277, -40, -1500, 17313, 73340, 132029, 131681, 66682, -4770, -40577, -55181, -74558, -96487, -107962, -106252, -90834, -60620, -24940, 2321, 15714, 8828, -29435, -84249, -106855, -73747, -27505, -14683, -11579, 31490, 95004, 107308, 48971, -24379, -62166, -63000, -42484, -18696, -27198, -84708, -136708, -110698, -27752, 11687, -33729, -96716, -111371, -96604, -95001, -98638, -84291, -69154, -79983]
41588g9983k1377M652L9503N4392M4639J5218j4881j4077J4087J8031k2147m9301
41576a1244j9589J7991M701k3245k928L4834J9135k6763k1258K8538L5541j6877
41564A8836m9205j9751K1381K8809J8341J0332J978P243M1028N9539P483p1131
41552G4883p1051J1766O3229K4209k8182j7932J3275o640n5182n3849J3867Q4712
41540E3105R2475K9037m9391o6397o819N1477L2342k9514m1319L558K5223k964
41528I0813j9998J710J0883j3162j4099K8638M4594n546m8258j5665L7692K5911
41516A23513k7369l5824P450L0139m60m2456n5363m4744l1761k5381k3936j6528
41504a42720N050K1321M053k5183o525O0429R1174L5274l7971l6384K0402L9096
$$ y = [-79983, -101360, -96708, -57205, -2813, 41826, 57044, 42163, 28086, 42173, 60204, 38057, -11244, -30833, -12842, -8141, -31386, -34314, 520, 19655, -7108, -28366, 172, 35713, 18836, -30369, -50120, -28739, 70, 18411, 28743, 30721, 37964, 78992, 138531, 146014, 74883, 3832, 15598, 78827, 103036, 74854, 56922, 70197, 63557, 8375, -45474, -31607, 53105, 145580, 174617, 125226, 58829, 52010, 103487, 135829, 106315, 64996, 68554, 93777, 90813, 70815, 72525, 83408, 70246, 56147, 84785, 129379, 123833, 75575, 59910, 97602, 123513, 96144, 60320, 67770, 97909, 97449, 54993, -370, -45114, -76875, -102256, -126192, -142720, -137670, -116349, -112296, -137479, -144004, -83575, 7599, 42873, 4902, -31482, -11080, 28016]
41492B8016m230l9678j5481L5891N3800K1319l1758o3794n0631l647L6948L9593
41480F348Q049l3334o0816n1615L277O8144P9857K4350l4581l3465J2446M2090
41468C0750L2261Q392q444k1810l2646k7590j64L4313M7647K0005l6395p4364
41456b8045n4933J711L4736J8861q749q451R688J3659O40m417J4371M4934N6679
41443I0684K8134k2204m4858k1647K332j5374m5188l6707j0208j9268m0304J648
41431a32960R1692J17147L3623o0027o2574p2M0670L0513q939n8529q6713m9315
41419a45484L4309P0857J9508m1140l5644j814j659o472L0318O2093K8407j6437
41407c158J4564P5888N0678m5496p5689l832M6663l437o7319m4795J8361J7880
$$ y = [28016, 23786, -15892, -31373, 4518, 58318, 79637, 47879, -15915, -66546, -70193, -33245, 6348, 14397, -18937, -79753, -131368, -128091, -59947, 19910, 44260, 9679, -23786, -11340, 30750, 63011, 71403, 62959, 41149, 8503, -19087, -19251, 15062, 62709, 82714, 46319, -28045, -82978, -81267, -46531, -27670, -36419, -44870, -35182, -21523, -20883, -25300, -10929, 34005, 90684, 118818, 96614, 51756, 30109, 32441, 17067, -28121, -64828, -75036, -94304, -134608, -132960, -41268, 75879, 109502, 49475, -13099, -13171, 27499, 58012, 49073, -9456, -96169, -145484, -111175, -40318, -20810, -61950, -97594, -99408, -101067, -107539, -77221, -15128, 13279, -3158, 11406, 87294, 137972, 92476, 16787, 12955, 59618, 56181, -11138, -55933, -37572, -19692]
41395a9692m0771o2891j3548M4423N1407J9954n008o928r43n16R61J6072L7833
41382B0353L9562Q006l4551n4418m1269n123M2157P9165O9794K504p4659r5081
41370d3560m8770J2809M3686M3951L3929K0703J498j9209k7962j4619J2655K7329
41358D2440J4146m150L574K2094P132l4515l8225J7818O3486L4717k9734m8099
41346E0684j2602J7720J2025j0279l1702m6660l5274J0347M7921L5927P881K6437
41334G2425P3968O7957r651p7527p1010k3979k701j4567k2323r864N594P047l881
41321h512j2439m098J8107L1549K3300J0474J1046J2123k545j3317O191L5834
41309A07713L2528p26j9144q034J03j3396k3869j0731N200n751l6345m9354k2729
$$ y = [-19692, -60463, -123354, -136902, -92479, -41072, -21118, -26126, -33054, -33997, -34513, -33552, -17480, 20353, 59915, 67921, 33370, -21048, -62317, -67440, -25283, 53882, 123676, 126180, 51521, -43560, -92330, -79521, -35835, 8116, 42045, 62748, 64246, 45037, 17075, 2456, 15111, 42440, 56586, 52436, 56010, 78104, 85236, 50721, 12496, 30314, 93800, 128517, 98783, 50684, 38082, 55802, 67827, 57548, 25846, -20814, -56088, -45741, 2180, 38107, 45988, 72425, 146393, 214350, 204699, 127172, 56162, 32183, 29482, 14915, -7408, -17272, -11678, -4631, -8512, -20951, -25049, -6942, 24607, 47907, 58381, 69427, 81550, 79005, 65688, 71879, 107713, 140241, 139515, 120371, 112337, 112440, 99044, 75175, 64444, 69644, 63893, 27548, -21806, -44535]
41296d4535J9940K8339j3080n0224k1813M3125M9397k2384p1875k5586M8118M6907
41284a3671r289k9371p125p723k7614Q00O5814P0336m528n3555j3152L7434Q124
41271A6480n9397o3753K051N2041L3683j4881k7581J0616N0653L6791j7969l5068
41259a6334J9999O7351J8964p4709q3660K926N5335O570m5637j043Q6378R9988
41247A36128K8964m6924q3013r0128p0854k1752K5609L7591L1712L8633M1100
41236B7066J1642k1613j5941N911r528m8762m4438J6797O9370O0413R597l4268
41224B6246n0099m5436l5363l0278k2756Q641O0483Q6486N1339j3564m6089l1982
41212d2372q194oJ715O974J3078K2778L8190M0007J0458k7357l3246j0040K722
$$ y = [-44535, -24595, 3744, -9336, -59560, -81373, -38248, 11149, -11235, -83110, -108696, -60578, -13671, -22960, -52331, -59456, -67179, -94793, -93993, -28179, 42157, 37629, -15926, -29078, 8356, 16480, -42917, -106670, -104619, -52578, -18895, -33776, -61357, -50741, -88, 36703, 18734, -16334, 3665, 71016, 89980, 15271, -68389, -65463, -10128, -3558, -49195, -50238, 36140, 136128, 165092, 118168, 35155, -54973, -125827, -147579, -121970, -84379, -52667, -14034, 27066, 38708, 17095, 1154, 7065, -2463, -51225, -95663, -78866, -9496, 50917, 60514, 26246, -23853, -69289, -104652, -134930, -157686, -149045, -88562, -2076, 49263, 35699, -10390, -42372, -50566, -50572, -48857, -41883, -28805, -6027, 32163, 72170, 82628, 55271, 22025, 11985, 14707]
41199A4707n362l767J7138K1976j0937m8590n0689k7579j7351k3889j3124L1383
41187a16084P6668P5173K1571l6239m7370j4925J0731j10j6537M000M5055M7405
41175D9338o039o2957p1973m0846j894L9425Q0324Q0314Q998p7165p9437O404
41163g5508O8326K9232m6556n6124r336O051k5370l2309J1913M5189K5813m734
41151f3413m448M624j527K164K7716L2502l371k7801p277N951k8939n1734j527
41138a17080O1213M3353k3704l7006P090K5156N333J5148N5563M7773j7838n3459
41126A1542k4390j618k5660m0197r798J3033m358j0244K5228M5239J6971L053
41114a199M2770O1907l462p9800o0194K9022P2867L3742k6084n4794n3321l1049
$$ y = [14707, 9345, 5578, 22716, 44692, 33755, -14835, -65524, -93103, -110454, -134343, -147467, -116084, -39416, 35757, 57328, 21089, -26281, -41206, -30475, -30585, -47122, -43122, 1933, 49338, 43299, -19658, -91631, -132477, -134371, -94946, -14622, 65692, 74690, -2475, -81912, -75508, -7182, 22050, -24506, -80630, -89966, -83915, -109285, -141594, -129681, -84492, -58679, -63413, -67861, -63237, -64764, -62600, -34884, -2382, -5753, -33554, -40831, -34880, -63819, -115553, -117080, -55867, -12514, -36218, -73224, -66134, -40978, -35645, -20497, 35066, 82839, 65001, 11542, -12848, -14466, -40126, -80323, -90121, -77088, -81446, -91690, -66462, -21223, -4252, -1199, 41571, 103478, 100016, 20216, -39978, -10956, 61911, 95653, 69569, 14775, -38546, -69595]
41102f9595J174J1499j3840l2438l351M4438N5978L2304J3250Q687J333r254j3692
41089B6493j6285j4121R460L7982K1692l7257o3684k2039J9951M50l6227k1735
41077i5320K2639L7672K9926L5644L6188l08m2060m4859k8909k1111J4850R4635
41065C8987J31331N5683m6744n2622K021o596o6443n2804L9142O8848j7648r9694
41053f539p6300j436L5173L3017K1396r257m8845m2086J3963M1371Q975r497L1741
41040h324O1235J3188n3356n1122m513O129j7790j2099L0022N0747K3063k1911
41028A5269n0701n0660j3967M6222Q0731N7006R623r412q780l1739p0051o8031
41016i4490j4232K9179R071m5882o2645j5544M5964O1763L3313J3004K7599M4264
$$ y = [-69595, -68421, -56922, -70762, -103200, -106551, -62113, -6135, 26169, 39419, 48106, 49439, 40185, 26493, 10208, -3913, 5547, 43529, 65221, 27964, -35720, -57759, -37808, -37358, -73585, -95320, -72681, -35009, -5083, 30561, 66749, 66441, 24381, -20478, -49387, -70498, -55648, 38987, 170318, 226001, 179257, 126635, 128656, 122060, 55617, 2813, 41955, 110803, 93155, -6539, -82839, -84275, -49102, -16085, 5311, -3946, -52791, -94877, -80914, -39543, -30568, -40065, -8324, 52911, 66099, 12743, -38379, -42892, -36763, -54553, -66652, -36630, 14117, 37180, 15269, -35432, -86092, -100059, -53837, 26894, 83900, 93523, 84111, 75331, 43592, -26459, -94490, -108722, -79543, -70472, -116354, -178999, -194543, -148579, -86816, -53503, -40499, -12900, 31364]
41004C1364K7145p327k4893l1615m8174n0524j821O4831O9397K952m7163j7980
40992c3808M3255N1796k477n7439o2399k1982K5228M3632K5227q871l5567n0471
40980h3876m8271r368N7048Q6057L2929m3038m3663K6195O3911K2418l0363k9432
40968E47k572o24j5010j7189j7170k8245k5950N713L3376K7965J4847K3546L2154
40955C1388J1830j4430r735J4498K3551J5538P066o318l0628m3843k8633o925
40943c6641l585o393J346M811o012l670K8045N2442L6486R054P317M697m1034
40930D6863r8296r4190k2480M8382O8849N0388K0194p311j5367L536J9376k623
40918A7321m1685m4078n445K2254J0494j2380j7452j2564o197J5824N0329N5686
$$ y = [31364, 58509, 51182, 26289, -5326, -53500, -104024, -105845, -41014, 28383, 31335, -15828, -33808, 9447, 61243, 58766, 1327, -61072, -83054, -57826, -14194, 11033, 2162, -33405, -83876, -132147, -141515, -84467, 1590, 34519, -8519, -52182, -25987, 37924, 60342, 29979, 547, -2025, -2649, -17659, -34848, -52018, -80263, -106213, -100500, -67124, -39159, -24312, -766, 31388, 43218, 28788, 19053, 33551, 57102, 72640, 79706, 73388, 42760, -1083, -29716, -36641, -40226, -46619, -45273, -40462, -46474, -50144, -22099, 30343, 66829, 75883, 83200, 87897, 46863, -51433, -145623, -168103, -119721, -50872, -484, 19710, 12399, -2968, 568, 19944, 17321, -24364, -68442, -73887, -51633, -41139, -53519, -70971, -83535, -89732, -73908, -23579, 32107]
40906C2107P148n3106n8593q84N9775O5387K1171j9533j9028P073J6453o963m0189
40893A0818n6579n2048l1411M852M3675N3867K3983j0934j0577J3266J4596j3966
40881a0458k4184J7558P2652P2126P020n2993m2584J7713M8488J5660k6511j4002
40869H0485L6365N3152J2184l6036m5478l3203l5616m4485k5341J8293L9537J0205
40857C0062m0331o1731m2252j3557r78O749K6103M1030K7713L213N510K7890K7132
40844C6553M301J0019M5445L8160l3677p7968k8723L1628R84o0078k1378Q0812
40832B6078P7963n1093j21175k6414Q6140M2795r1494j21954j4143Q2389O8750
40821d2158R437j918K5512K4586k2623o7904o0177k324M8956M2688m616k9271
$$ y = [32107, 39255, -13851, -72444, -73328, -13553, 51834, 73005, 53472, 34444, 41517, 57970, 51007, 10818, -45761, -97809, -129220, -124368, -80693, -26826, -2843, -13777, -24354, -11088, 3508, -10458, -34642, -17084, 55568, 127694, 134714, 81721, 39137, 56850, 105338, 120998, 94487, 80485, 116850, 170002, 182186, 146150, 100672, 67469, 31853, -12632, -37973, -19680, 19857, 30062, -10269, -72000, -114252, -127809, -128787, -122038, -95935, -54905, -27192, -23979, -18469, 9421, 36553, 40854, 50873, 96318, 134478, 100801, 22833, -5890, 25738, 26722, -33356, -54734, 26078, 104041, 52948, -68227, -94641, -8501, 34294, -57200, -179154, -193297, -110908, -42158, -32721, -34639, -9127, 15459, -7164, -75068, -135245, -137569, -88613, -45925, -50541, -79812]
40809g9812p978J4433J882j6880k822K6756K9743L689k3528l8601l9222j4465
40797a46805L0853N7324L5572r861l2372j8327J3522M0366M1326P933k9801k5155
40785c5425J6898L7034Q985k3402k3963j8080k9097k3514K6178P7555P7183L9692
40773A30044J0071j1036m3580o7708n2200j6113j493n644M837L0674M0673K3273
40761D1798k236j4610n961J3437J3232k1936n1221k2873L4699L8991j6124m4208
40749c7012p633K5170Q112n035K4187L5876j1523m5884l982M6619K1425l3160
40737A7160k9504M219p695l3822K425O0259L7030m7509p6488k7450R115n855k0260
40724a18375j4791k7494m7366j6727M7634O2558K1328L768K9398K8147j9571m0666
$$ y = [-79812, -87790, -73357, -71475, -88355, -91177, -64421, -34678, -30989, -54517, -93118, -132340, -146805, -115952, -58628, -23056, -32917, -65289, -83616, -70094, -29728, 11598, 19531, -10270, -35425, -18527, 18507, 27492, 4090, -19873, -37953, -67050, -90564, -64386, 13169, 90352, 130044, 140115, 129079, 85499, 17791, -34409, -50522, -52015, -57659, -52822, -22148, 18525, 41798, 39562, 24952, 18991, 32428, 45660, 23724, -27497, -50370, -15671, 23320, 7196, -37012, -44645, -19475, -11363, -16398, 7789, 43665, 32142, -13742, -17724, 28895, 50320, 17160, -12344, -8125, -15820, -49642, -47217, 13042, 50072, 2563, -73925, -101375, -92260, -98115, -118375, -133166, -160660, -208026, -224753, -177119, -114561, -93233, -89465, -60067, -31920, -51491, -92157]
40712i2157j703L3964K1636J551R187J6640K836n929L17p073k7846k2816R443
40699f1950K4512J1815L086R61j5612k4670L762K5033j4660n5128k988Q4327O2356
40686D0844n2699q8928n78N6235n248n8129N659Q4989N1812l1259l4564J8475
40674a3391J9306k7029l2587M973J3804j1470j2078J8302L1725J8711P986r88
40662A7264k1756k9344k551K1094P688l676K6401N0531J2778l8637k3079K9532
40650D6245K3809l6993n2630R303O4903N1168J1149L376P591k3769p1467o8522
40638c5837j2O4130N2772j2677m2403o08M0495N601o6848q0304k6904Q778j1665
40625a05482l3931j8550P73k760n42K1439K7901P991R29J2897q66l4834j8191
$$ y = [-92157, -93860, -59896, -38260, -36709, -27522, -10882, -8046, -13975, -13658, -20731, -48577, -71393, -61950, -37438, -25623, -22537, -21576, -37188, -61858, -58096, -33063, -47723, -102851, -105839, -21512, 40844, -11855, -100783, -101361, -45126, -50374, -108503, -102844, -17855, 33957, 2698, -31866, -13391, 5915, -21114, -53701, -48728, -34924, -46394, -58472, -40170, -8445, 10266, 18252, 17264, -4492, -33836, -36387, -15293, -7605, -11281, 15120, 65651, 78429, 39792, 16713, 46245, 70054, 33061, -19569, -10266, 54637, 105805, 116954, 120330, 127921, 104152, 32685, -35837, -35849, 28281, 81053, 68376, 25973, 25365, 65860, 71461, 4613, -75691, -102595, -93817, -105482, -139413, -157963, -157190, -159950, -160492, -139053, -111152, -103161, -102232, -89335, -90201, -125035, -143226]
40612a43226N1899P6040J4701l3938J002M0869L203m6239j5670L7195P13q9199
40600a02650r8614q257O8561O3809K2663K24J822K3016N3625N0241j0429o9980
40588e969o3073k2761k0183l7342q414M3453L4850k3929l0760M1891J00258P5903
40576H3924J6450p169M70n329l7042p1748p7439k9955N3728J01211N6095l8231
40564D4965q1443m2356J3021K0553r705k9258j4917J5375K6110L552j9355p81
40552g4239M0169L9306j0033l6517n274K5166R840m433K3159L9660j861l8476
40540F467k175M5944J1372o4041o4987N849M0090M490k8051j9327p504q246M429
40527g5690J6788r154l8741j069P4667Q0010l290p1522n5854j968K7727K8943
$$ y = [-143226, -91327, -15287, -586, -34524, -33522, 7347, 10550, -35689, -51359, -14164, -13451, -102650, -201264, -209521, -140960, -77151, -54488, -54264, -52442, -29426, 24199, 74440, 64011, -5969, -69042, -91803, -111986, -149328, -157742, -114289, -79439, -103368, -134128, -92237, 8021, 83924, 100374, 93205, 93675, 88346, 51304, -20444, -97883, -127838, -74110, 27101, 83196, 44965, -36478, -78834, -65813, -45260, -54965, -84223, -99140, -83765, -57655, -54103, -73458, -74239, -34070, 5236, -4797, -41314, -46588, -21422, -11582, -16015, 7144, 46804, 44943, 6467, 4292, 50236, 61608, -2433, -67420, -61571, -21481, -16991, -45042, -64369, -71873, -80119, -75690, -58902, -68056, -106797, -107866, -33199, 46811, 43521, -28001, -83855, -85823, -58096, -29153]
40515b9153J2398j8507l1823N99L1937k346o3213n5814Q279K6042j5835j8115
40503a55551M8417Q4522L4171k2275r017L2748M0618K9523K6526Q018l1026l8749
40491D7925n79J9570r014k6980r67O317m3611p5633k2399N2233N0354r302l7233
40478d9319j4643P295Q095Q155Q810J698J2221O0282R8757O1507l6636j06780
40466E9442r1950k4149K3874J5913j8910k4928Q272K7134p439m9552l0099L3063
40454g9329O1517M0589K6869L1536J703o0481p0364J925O7211M8858j0286l5725
40442B4023l1938l3806k4771J4598L8932L913m7130m2692P968M0476L8228L5087
40430B2888L6812J3449l4179o1320m1583k466J2237n169k0095K72L9094M3809
$$ y = [-29153, -16755, -35262, -67085, -66486, -34549, -36895, -100108, -155922, -147643, -121601, -137436, -155551, -107134, -22612, 11559, -10716, -19733, 13015, 53633, 83156, 109682, 117700, 86674, 47925, 47346, 66916, 57902, 30922, 29955, 36272, -7339, -82972, -105371, -53138, -2784, -12086, -49319, -63962, -56667, -48572, -40417, -31607, -29909, -17688, 42594, 141351, 202858, 166222, 59442, -32508, -56657, -32783, -16870, -35780, -60708, -52436, -25302, -32741, -82293, -112392, -79329, -17812, 22777, 49646, 81182, 82885, 22404, -47960, -46035, 21176, 70034, 59748, 24023, -7915, -41721, -66492, -51894, -12962, -9049, -56179, -98871, -90903, -50427, -12199, 22888, 59700, 73149, 38970, -22350, -63933, -66399, -54162, -59331, -79426, -79154, -40060, 3749]
40418C749J201l3570j6339J6558J2352n801J2498M0001J3770m1060m1548Q255
40406b9934K4080m853j079M4668M4494k0012m7033P471M1865j6071p6118l4677
40394f7199N1229N8652j2145o0764m3572k436K3901K8580P951k6196l6651j2956
40382i1606Q130J0663K6782N9054N3115m672m4940k5455J355j0060j8762J4131
40370b2265M6747L8688K4058K9496J1555m6440p2650k8516P463k5782n5190k069
40358i4905O9888O0476K039j0456J3508J87l8495l1743J4809L6091K5048K0530
40346F6977J6044j2945l2926o449K5373J4160m49K9120N1454N862n2017m2087
40334F2117o066k3108n1190q385N3447K8954l9570k6701M6933M5234m0166p6905
$$ y = [3749, 4950, -28620, -44959, -28401, -16049, -21850, -9352, 30649, 44419, 3359, -38189, -29934, -5854, -10707, -11786, 32882, 77376, 57364, 10331, 17802, 59667, 43596, -32522, -67199, -15970, 42682, 30537, -30227, -73799, -76235, -52334, -23754, -15803, -41999, -78650, -91606, -83476, -72813, -46031, 13023, 66138, 61466, 16526, -8929, -7574, -17634, -36396, -22265, 24482, 63170, 87228, 116724, 128279, 81839, 9189, -19327, -11864, -37646, -92836, -94905, -25017, 35459, 37498, 27042, 40550, 40737, 2242, -29501, -14692, 21399, 46447, 66977, 83021, 70076, 37150, 30701, 56074, 70234, 69785, 98905, 150359, 156221, 104204, 62117, 56051, 32943, -18247, -26632, 26815, 55769, 16199, -10502, 36431, 81665, 41499, -35406]
40322c5406k6846M707k1450j6580M2678M9990l1403p9625j4605O4245M3487k7879
40310d8687l7035J5827M7758L1764R068M825N670k888k0241l1640j3885K7070
40298a2394L4786k6453r6655r0000k3539J1292p068j4044J7250M2357M2671N1506
40286g0291O9743N5379J0868j4572j5891k7392l1237J5990O9904M2317l6407m3080
40274B5331L1822N8186j5351p6885m5732M372k008j2574K8716N8735J0826n5297
40262A0141n5889k2781k4859l3406J2571P3754O7440J0720r453K1798M0626J8912
40250A09574r489k4375l7582m2892k0065J3600J5758j7732m8214m7929k1846J3202
40238a17990L9246M0298K0995P520J2837K1951K1941J6798N431j6283k6291J677
$$ y = [-35406, -62252, -57545, -78995, -95575, -52897, -2907, -34310, -113935, -128540, -64295, -20808, -48687, -85722, -69895, -22137, 9627, 18695, 23520, 29190, 26302, 6061, -25579, -39464, -12394, 22392, -4061, -100716, -190716, -214255, -202963, -210031, -224075, -206825, -164468, -121797, -70291, -548, 54831, 65699, 51127, 35236, 7844, -23393, -7403, 62501, 104818, 68411, 25331, 57153, 115339, 99988, 23103, -22629, -18257, -20265, -32839, -4123, 54612, 65438, 10141, -45748, -68529, -93388, -126794, -114223, -40469, 26971, 37691, 28238, 50036, 90662, 109574, 100085, 75710, 38128, -4764, -24829, -11229, 4529, -13203, -61417, -109346, -131192, -117990, -78744, -38446, -17451, -9931, 2906, 24857, 46798, 63596, 69027, 52744, 26453, 28130]
40226B8130L9287K5588l7493p5817n1344j2301m588l101K4281M8786L3677N535
40214B0640J1789L9187L1447k6503q4914q6534k6089M3336O0213K2096q495J2870
40202I043M9352M2213J965j9625k0826l6742n3072k1251M2657O2580J5071m1581
40190B9784n7987l8027O193O1540P9603K5303m3516m0826J0275J3749l2685l6276
40178b2870J7529L3306k1900n6337j3714L7215L2912J0833J1257J799l3461m2564
40166d5995q723P000j2726J922O3314O9613k3205j01531o6147J4533L0140k815
40154g4620j0138K772j926l62K9042L3813j4433m0375R354N6470K1565l4198k3511
40141d6547R848j1151l5974J6842Q1404L8133o9189r0987j6879J7276l5417o4780
$$ y = [28130, 67417, 93005, 55512, -20305, -71649, -83950, -88538, -91639, -67358, -18572, 15105, 20640, 32429, 71616, 103063, 76560, -8354, -94888, -120977, -77641, -17428, 4668, -3827, 9043, 58395, 100608, 102573, 82948, 62122, 25380, -27692, -48943, -6286, 56294, 71365, 29784, -28203, -66230, -60037, 1503, 81106, 106409, 62893, 22067, 32342, 46091, 13406, -22870, -5341, 27965, 6065, -50272, -63986, -26771, 6141, 16974, 28231, 30030, -3431, -45995, -54718, -47718, -60444, -58522, 4792, 74405, 51200, -50331, -116478, -101945, -71805, -74620, -84758, -81986, -83912, -84274, -55232, -21419, -35852, -76227, -66873, -10403, 11162, -23036, -46547, -36699, -47850, -83824, -66982, 14422, 52555, -16634, -107621, -124500, -107224, -142641, -207421]
40129b07421j52P5962O6183k087l6730q262L3773L3367j0414m0897r526N0277
40117e5927N6291l116n0310m3116k8917l4034q206N6142O8343o095n5478Q31O3843
40104c9749K0570n4347k6341O3561P3487K521l1229p993j1429m3117k0727M4820
40092b9973N0024j5074m7152r295K4883J9592J8127K2942j4419o7194m8316K7737
40080f8118M7927j0585m5764j3296J1561o678k25N1788O2266m725n3492j4699
40068d4040M1253L1481j1255k1591j1217j1916m56L6993M7744P81m1841k0244
40056d308K2980J4983l2073n3018l2208o028M031N863R600K2668M4881M9715J0853
40043E7939m0422l9995R938L0793j6077o7450n0788J6267O1794N3897J9407m522
$$ y = [-207421, -207573, -131611, -65428, -67515, -104245, -112507, -78734, -45367, -55781, -96678, -106204, -55927, 364, -2752, -53062, -96178, -125095, -159129, -167335, -111193, -42850, -48945, -104423, -103592, -39749, -19179, -73526, -99867, -36306, 37181, 39702, 8473, 480, -10949, -54066, -74793, -29973, 20051, 4977, -42175, -51470, -26587, -6995, 11132, 34074, 19655, -47539, -95855, -68118, -20191, -30776, -76540, -89836, -78275, -84953, -85178, -33390, 28876, 24151, -29341, -44040, -2787, 28694, 17439, -4152, -15369, -27285, -27741, 9252, 56996, 57777, 15936, -4308, 18672, 33655, 1582, -51436, -83644, -89672, -85641, -79778, -70178, -47510, -2629, 47086, 57939, 17517, -22478, -12540, 18253, 2176, -65274, -116062, -99795, -38001, 15896, 35303, 30781]
40031C0781p767r653l2239o0550m7634J5733O8944O0982K3350Q458J311l2868
40019A8848n8754k4172L1218K6526k3978l5039N407L0816K3540K7233L6966M635
40007F3246m2595k3734M1787M1383m0186p9803j3623O0829M6307j2540k7136j832
39995A2103Q699k800j5035k8695l8814j6908L3124O0375M1556Q549j7548m7071
39983b465o4632l8262K450n232l9246j4405O1873Q2023J6431l5249j5697N333
39971d7078k1435l1021K2053O4549L1685j9931k0415j779j0519r002L4399N4851
39959D6357j48n8995l5392K6767L0541j8191m2873k7681r814J0842N1482P6383
39947D9278M2571j8256m6394m5042m7630l8497J0744O4137O3747K0606r303j2517
$$ y = [30781, 23014, 13361, -18878, -79428, -127062, -111329, -42385, 18597, 41947, 50405, 51716, 18848, -39906, -64078, -32860, -6334, -30312, -65351, -59944, -29128, -5588, 21645, 58611, 63246, 20651, -3083, 38704, 80087, 39901, -39902, -53525, 7304, 53611, 41071, 13935, 12103, 20802, 18002, 2967, -25728, -64542, -81450, -48326, 12049, 53605, 62154, 44606, -2465, -67097, -105359, -102909, -108141, -147387, -161792, -99919, -17896, -1465, -36714, -52411, -47078, -68513, -99534, -77481, -12932, 18753, -1178, -21593, -23372, -33891, -42893, -8494, 46357, 46209, -12786, -48178, -21411, 9130, -9061, -51934, -79615, -89429, -78587, -27105, 49278, 91849, 73593, 27199, -17843, -65473, -103970, -93226, -29089, 34658, 55264, 45961, 33444]
39935C3444j5959k4258j9284m33J9006L0221J7254k9561o8556l8834L7915O5055
39923F010J1993m0320l3123q908n619J8177P9582R9167K3656p0196q8402n4759
39911f2742m1100m2694j9765R454J1999J0881K8684L1867Q114J2805N7930N7247
39899F2680k2777p1069p607O5683L0694m2483k4974L5000J279r3235q9796K4919
39887a31686R7975O3249K0498L4887L8179j8798p1042o2053l5181l7462l6536
39876a37970M699N4884O9849N4511L0116q85k9498l4653k1255j4262j0779R863
39864b5380L4726L4061J7887J3643N626l2470o5331l8663K0273L2322r532l3967
39852d6805j0057J5109Q279o32J9324N1731O3055L5847k6774q7532q5356j0255
$$ y = [33444, 17485, -6773, -26057, -26490, -7484, 22737, 39991, 10430, -58126, -96960, -59045, 6010, 18003, -22317, -55440, -64348, -69967, -51790, 27792, 126959, 150615, 80419, -7983, -62742, -103842, -146536, -166301, -156847, -144848, -133967, -105283, -73416, -65302, -52497, 5433, 62680, 39903, -31166, -38773, 26910, 57604, 15121, -9853, 25147, 26426, -66809, -156605, -131686, -33711, 29538, 50036, 84923, 123102, 104304, 33262, -28791, -63972, -101434, -137970, -133271, -78387, -8538, 45973, 76089, 75204, 45706, 11053, -10202, -24464, -35243, -25380, 9346, 43407, 61294, 74937, 80563, 48093, -17238, -55901, -35628, -3306, -12838, -46805, -56862, -41753, -33474, -34106, -14782, 36949, 100004, 135851, 109077, 21545, -63811, -74066]
39840g4066N9953N6215J5898J3943L7352J8090l8870o0970k9243J972M071M654
39828H999J7770K4396K3309K7974J7995l2683q7711q4288k9611J1145J2105L05
39816i0295j0748k4533j7671K6422N8818K4391l8301m3632J1485N3634N0691L0787
39804C1048K465m2760o2257o006P4308P0394j9403p7806l7514L6291N7785K6741
39792E3286q129k0363j1671J613m187k6072k1509K4392N3915K1526k1914r896
39780C0991K4635J4156j1892J9783P8089O5822j2456n6320l7009k3370l7735k4214
39768C0480K2449L0766j5470m2502j6716N971n488n414K7872M3886J3621k1248
39756F8207k8925l2341m5621m7471l7829m0294l8352M725N9036N5633L571j9244
$$ y = [-74066, -14113, 42102, 58000, 71943, 109295, 127385, 88515, 27545, -1698, 274, 4345, 8999, 26769, 51165, 74474, 102448, 120443, 87760, 49, -84239, -113850, -102705, -90600, -90295, -101043, -125576, -143247, -116825, -58007, -33616, -71917, -115549, -104064, -50430, 261, 31048, 33513, -9247, -71504, -77510, -3202, 67192, 47789, -30017, -67531, -31240, 26545, 53286, 45157, 24794, 13123, 14736, 10549, -15523, -37032, -12640, 41275, 62801, 40887, 30991, 55626, 69782, 57890, 77673, 155762, 221584, 209128, 152808, 115799, 92429, 54694, 30480, 52929, 83695, 68225, 25723, 9007, 14978, 9490, 4076, 31948, 75834, 89455, 68207, 39282, 6941, -38680, -86151, -123980, -164274, -202626, -197901, -138865, -83232, -79661, -98905]
39744i8905O645K6644K1609K3630K6190m179l1423P695O8716M6793l9488o3854
39732i927l991K5727j9055m2875M610M0200R176k0347J07R735k8419m5058r68
39719h1085K8080p111l0634K0131P7509O3916J8405L788p355n0706p0824j1681
39707d7567P0407Q3273K6389l6029o6693n7695j0925L1866J5765l1211k1143M2688
39695h75N5404q320m1969K925K5354l9307r1121l6357M8131M9768K826J166K8843
39682c532J6108j7784j1892J3395L158k2058j3059J0481R017N329K4141K1976
39670C5280k7866n8164j4797L8268K3097k2769k5412k117k456l793K3331K8861
39658h537k1666n1094O377P1227M1630l0240k8854L0220M7844K0570J6198K2693
$$ y = [-98905, -92260, -65616, -44007, -20377, 5813, 1634, -29789, -22094, 46622, 93415, 53927, -9927, -13918, 11809, -7246, -50121, -45511, -5311, 3865, -16482, -16375, -6640, -35059, -80117, -81085, -53005, -60116, -90750, -70619, 6890, 70806, 89211, 92999, 85644, 34938, -35886, -47567, 22840, 106113, 132502, 96473, 29780, -27915, -38840, -6974, 8791, -22420, -43563, -875, 54529, 46209, 4240, 7165, 32519, -6788, -97909, -134266, -86135, -36367, -33541, -32375, -3532, 12576, -5208, -17100, -3705, -547, -22605, -35664, -25183, -16166, -10837, 13304, 35280, 7414, -50750, -65547, -27279, -4182, -26951, -52363, -54480, -56936, -60729, -37398, -8537, -30203, -81297, -74920, -3693, 37937, 7697, -21157, 9063, 56907, 77477, 93675, 116368]
39646A16368j7972o5650l4637L7304L5065l4000m8720J6957N3180L389n1484l6497
39634b6697J2301L1760K2889J5801J7626K5029L1875J5982k8366n5801k8468J1867
39622D5798O07m4751n5373k4990p627j6002r348K1035L4068J0811k0499l2181
39610i8452j8932J7260N7699O3092K3432j6869k3951k2100l3381k6792J6896N0740
39598a1358L6858J4982K6980L7866Q349k0992l676J9264q010n1585n2242l4791
39586c8355n0528o6291k0936N2156O8845K6763o557o212K807J6440L9136L5215
39574E2483k0725p8771p6427k7408J7966M5986N0622P110n4803m2754N0308R4914
39562A8501K0211n7136k1259M9079K7468l5367j5209N2639M3059k6546l7975L733
$$ y = [116368, 98396, 32746, -1891, 35413, 70478, 36478, -12242, 4715, 57895, 61284, 9800, -26697, -14396, 17364, 40253, 56054, 73680, 98709, 130584, 146566, 118200, 62399, 33931, 45798, 46405, 1654, -53719, -78709, -86336, -102338, -111686, -90651, -56583, -45772, -66271, -98452, -117384, -100124, -42425, 20667, 44099, 27230, 3279, -18821, -52202, -78994, -62098, -11358, 25500, 40482, 67462, 105328, 113677, 92685, 89009, 108273, 100263, 48678, -3564, -38355, -88883, -155174, -176110, -123954, -55109, -28346, -34903, -41115, -38308, -21868, 17268, 52483, 31758, -47013, -123440, -150848, -132882, -86896, -36274, -29164, -83967, -126721, -76413, 18501, 38712, -18424, -39683, 9396, 36864, 1497, -13712, 38927, 81986, 55440, 17465, 21198]
39550B1198n896n5805l5825M5094O0084j0857m9641j0747J8114p952k3948K783
39538e3398J8274M356J3364M8736M2975j6256n8763n1291l2330k0134L036J8223
39526h3208n893k9588J278M1784J7113l1322j2089M1746K4856m4472n3590M37
39514a32948J6555j2382M991O4326N6807k9443q0817n1960j5026J13L8672P9749
39502f1363M5229l0954k7686M8174O2577n434k5588M3347P9346J7700m9627n6100
39490C9621n4430o7689l2657M5360O4607J4575O498N9376N3160m0316q8063l6284
39478c6242p289o1912p9903P217P2464J8141m7908q149O5788O1451J7369J6764
39466A7791K9330K008k0571K685J2829k6021l8803J2637L6615j7768n0004O128
$$ y = [21198, 15302, -40503, -76328, -31234, 28850, 17993, -31648, -42395, -24281, -32233, -56181, -53398, -35124, -30768, -17404, 31332, 74307, 58051, -712, -52003, -84333, -104467, -101431, -83208, -89101, -118689, -117411, -75627, -58514, -89836, -101925, -60179, -35323, -79795, -133385, -132948, -116393, -128775, -123784, -59458, -2651, -32094, -112911, -164871, -179897, -179784, -141112, -61363, -16134, -47088, -74774, -26600, 35977, 30543, 4955, 48302, 127648, 145348, 95721, 39621, -14809, -82498, -115155, -69795, -5188, 9387, 15885, 75261, 128421, 88105, 42, -36242, -43531, -105443, -185346, -178129, -105665, -87524, -135432, -143581, -77793, -16342, 1027, 17791, 47121, 49129, 28558, 31243, 44072, 18051, -20752, -8115, 28500, 10732, -39272, -33144]
39454c3144M6666j0362n8678N556P8659K1553r2087r7782r001L3696N880l7L4557
39441g4524M0966J0238Q5J4826O827k1550k4805L8K1283L2734L5471Q446l9420
39428A0615n0054q238K0305k520k6763j5686p335j9307l651M3366M8023j436j4773
39415b7454L3724M5831j6052m5535J2207M9590m995m7206J1463P5820M0470k3239
39403A04624j3770J2362l1710q2030m6224J4781L224l1544o98M3112J0834m1235
39391e8274j5626L6701J2220m7839l5367K8580M7240K2700J6106J2267k2196l2261
39379c5749K3069N9011P289m1428K029M7353j2407q8336m8684L6829K5863l3677
39367e8838m638P0064M4768n5219q0995k3873L666k908L4944P5680J8983p1669
$$ y = [-33144, 13522, 3160, -55518, -49962, 28697, 50250, -41837, -139619, -148620, -114924, -109044, -109081, -74524, -33558, -23320, -23235, -8409, -1582, -23132, -47937, -47899, -26616, 6118, 41589, 50035, 10615, -39439, -47677, -27372, -29892, -56655, -72341, -79676, -98983, -102634, -59268, -11245, -12681, -27454, 6270, 52101, 36049, -9486, 2721, 52311, 47316, 110, 11573, 87393, 127863, 104624, 90854, 103216, 71506, -10524, -56748, -41967, -38743, -70287, -70985, -27873, -17039, -58274, -73900, -37199, -24979, -72818, -108185, -79605, -32365, -9665, 6441, 18708, -3488, -35749, -12680, 46331, 53620, 12192, 14221, 61574, 49167, -39169, -87853, -51024, -25161, -58838, -63476, 6588, 51356, -3863, -84858, -108731, -105065, -107973, -73029, 2651, 21634, -50035]
39355e0035m8206N4310O9410j0038l6513J7008L2989p986m919M1260K3381m5178
39343C5483l6794M2597M8783l4856o2301J0214N3982O474l9038k9996l0022n1271
39331h6745j8464N2174M4262l8583n0432M3486R7273L3127m1754l9978k1390l6129
39319f3153k7197K3647K9144l2997m8021M2090J23570Q6618j5129o9964n7391
39308h783j7459K2907L3634q527n4767l0975L2597L5331k4307m9905k2800k2026
39296a15080n4917l4459M4646P3854J6226l3609j7905P240L746J1494L8330L5465
39284b4969J2617L1059O3612K1515o4546o7552J0880L0210m0788o6949R386O9236
39272a6289L3398j4914p374p295n5913p2201o951N2788K9325k7314m6371l6002
$$ y = [-50035, -98241, -43931, 25479, 15441, -21072, -4064, 28925, 20939, 16020, 57280, 80661, 35483, -1311, 41286, 90069, 55213, -7088, 3126, 57108, 63582, 24544, -5452, -35474, -86745, -105209, -53035, -8773, -47356, -97788, -54302, 42971, 76098, 34344, -5634, -27024, -63153, -90350, -66703, -37559, -70556, -118577, -76487, 47083, 133701, 118572, 48608, -8783, -26242, -3335, 30299, 21772, -32995, -63970, -31373, 3958, -20349, -70254, -93054, -115080, -169997, -204456, -159810, -85956, -69730, -103339, -121244, -114004, -110258, -98764, -60434, -24969, -12352, 18707, 82319, 103834, 39288, -28264, -17384, 12826, -27962, -94911, -85525, -16289, 17109, 2195, -5179, -12474, -68387, -140588, -147539, -94751, -65426, -92740, -139111, -175113]
39260a75113j3340L6345Q0134N1005k0250k9168K0514K1013l2016k3138N8241
39249b5773P9947N167l9387J688K0202l5538o0247k022L5244r67q656N7624P9436
39236A06718l042o3695j4587L8463Q48m0424L600N3737K2252k5227j4140n017
39224E9486n0062o8186p495L0549k3015n8531J7142R9839O7003j2800j6774K5231
39212F2387K5778R487K6419K3873l8587p2326r511N8688M1526R699M4916P1584
39200B53933L635p8831p0488k6012l3764l9441K5610P4556J4443o0994k5892M8648
39188H5403K4843n1939m7894R265m689o9427o2471R861L1366r954j8055K6557
39176g7134N0876L6055K7066K2256q320k9609L670M3151K1341k3480j8781Q563
$$ y = [-175113, -188453, -152108, -71974, -20969, -41219, -70387, -49873, -28860, -60876, -84014, -25773, 54174, 59341, 19954, 21642, 41844, 6306, -53941, -55963, -20719, -21686, -30342, 27282, 106718, 103676, 39981, 25394, 63857, 64705, 24281, 27881, 81618, 103870, 78643, 64503, 59486, 9424, -58762, -66257, -35708, -58723, -117254, -100112, -273, 66730, 53930, 37156, 62387, 88165, 97652, 124071, 147944, 109357, 37031, 27520, 86208, 127734, 137433, 182349, 253933, 257568, 178737, 108249, 82237, 48473, 9032, 34642, 109198, 123641, 62647, 36755, 85403, 110246, 58307, 10413, 19678, 14989, -54438, -116909, -107048, -75682, -85636, -103691, -77134, -26258, 9797, 36863, 59119, 50799, 21190, 24860, 68011, 89352, 65872, 47091, 55654]
39164E5654n414l2568j3034K2114J4433m244J8846M3114J2790k6457j0965J9619
39152I3888M474j9715j733J3680k0396m5799q686K7373L327j3581L6592P1689
39140A41113J1896o1782m8218n031k4344n1196j15O3093L8774j5272M793M8586
39128A02297J0768o5404p0435k4095q864k865M2859O3058l511o3036k0896L0639
39116i485k1741q4659j9346Q8539O5357m3428n6605L0979P1960L8567K5915L7101
39104A23154J374m3355j2732L6137J390m9749K014P5462J0552j25733j30082j0718
39092a22286L6819k6997m8855J8602N5721K3351J3407L6589L759o5994n5173K1449
39080a09608K7254m4072n5655K1431O9299M7020L3463L9718j339n4639j4915P7146
$$ y = [55654, 50240, 17672, 4638, 26752, 41185, 36941, 55787, 98901, 111691, 85234, 74269, 93888, 98362, 78647, 76914, 90594, 70198, 24399, 15713, 43086, 46413, 32832, 69424, 141113, 153009, 91227, 43009, 37978, 13634, -37562, -37677, 25416, 64190, 48918, 53711, 102297, 113065, 47661, -22774, -46869, -55733, -58598, -15739, 47319, 43808, -19228, -40124, -9485, -31226, -115885, -135231, -46692, 18665, -24763, -81368, -50389, 21571, 60138, 86053, 123154, 124528, 81173, 68441, 104578, 105968, 56219, 58233, 133695, 144247, 18514, -111568, -122286, -85467, -112464, -161319, -142717, -86996, -63645, -50238, -13649, -9890, -75884, -131057, -109608, -82354, -126426, -182081, -160650, -91351, -44331, -10868, 28850, 27511, -27128, -42043, 35103]
39068C5103P4202j9689n6250r880m192o1904o3252K1535P8945N7256K3505N673
39056H1052k7098l7637K4738P1588p931j19592q8537L6887O4523n215o934O0706
39044D6550M0287o1958p3214J8944M8541n771K606O8807K6050j07272j10427M7933
39032e8924J36439N5899k3322l026j924o0215l6510Q0497Q8451o3699j47809m2015
39020g6158O8560L5877j3673L7418P2172q453p7550k5948L1250j6633p1039l0921
39008g5098J6582j2886l2401K8344P4377L6604L193K4649J0628n1466k2171J09143
38996A09498J35592j6873j24496l3590P9699K5885q3354p0111k093k2500p4199
38985g6542l8467K8194K3211K98L5487N4248j2797o6835j8760M0023K0986R845
$$ y = [35103, 109305, 89616, 33366, 23486, 19294, -42610, -105862, -84327, -5382, 51874, 75379, 81052, 53954, 16317, 41055, 112643, 104712, -14880, -103417, -66530, -2007, -7222, -14156, 46550, 86837, 24879, -48335, -29391, 19150, 13379, 15985, 84792, 110842, 3570, -106857, -58924, 77515, 133414, 110092, 107066, 105142, 44927, 8417, 88914, 177365, 113666, -34143, -76158, -7598, 28279, 14606, 52024, 124196, 115743, 38193, 12245, 43495, 26862, -44177, -75098, -58516, -71402, -103803, -75459, -1082, 35522, 38715, 63364, 73992, 22526, 355, 109498, 245090, 228217, 103721, 70131, 149830, 175715, 92361, 22250, 20157, -2343, -76542, -115009, -86815, -63604, -63306, -27819, 26429, 13632, -53203, -71963, -31940, -10954, -1109]
38973a109P6207J05451J0493q0839m5665J7423j0481m5403J3719O7759N098p3712
38961C8941l9718K7696O325l5615Q322O2290K1971k9882J6319P4124J9681p1669
38949I8785o3470N558K7271K4276M8924L3999o0130j08142k6364N0091k621o8085
38937c9908n742Q4906M9705m0553l8236J0623j3063n7624j7868M2679J8974k3796
38925b9903J1203M7633q240o0548P72P5588L5767l1035K452N0786j1425r1488
38913h438n2068K1043j1084o5646n446Q1343M9552j6177K6337P9518j0638j27854
38901c9558o8687Q2552R5802n275k2714M0131K3884m8932k1072P4940O5689l6934
38889A39826o6493j3513r956m9767j5749N9593M2447l8453m7239n244l1966q6455
$$ y = [-1109, 75098, 180549, 191042, 110203, 64538, 81961, 71480, 26077, 39796, 107555, 112653, 38941, -777, 26919, 33244, -2371, 5951, 68241, 90212, 60330, 76649, 150773, 170454, 98785, 35315, 40873, 68144, 92420, 141344, 175343, 115213, 7071, -19293, 30798, 28177, -39908, -45650, 39256, 88961, 48408, 10172, 20795, 7732, -49892, -67760, -25081, -6107, -29903, -18700, 28933, 20693, -39855, -39083, 36505, 72272, 41237, 43689, 94475, 83050, -8438, -60506, -39463, -50547, -116193, -121639, -40296, 9256, -6921, 19416, 98934, 88296, -39558, -108245, -25693, 70109, 64834, 42120, 82251, 106135, 57203, 36131, 111071, 176760, 139826, 73333, 59820, 49864, 97, -15652, 43941, 86388, 47935, 696, -4548, -36514, -122969]
38877a22969m1033N2551M6096k2884o853O4533N0119k3189k5333J0350l2381q9683
38865a40676k6060Q0017N7315l8441l1012M2361K2208m1423J3206J14298O2929
38854A14722q3539r5042J8663M3140l6368l4350N8893O7474j7735l3762K0592
38843B2688j277o4222O20J32340J01284o5555j03141K9455R0909n93n0866K2755
38831A14397N7541j6901n1317J8927N4595j4377p9153p9950p7501o4158K6419
38820a11478J13698N7962n8254l7847P0131M9057p7160q0259M3599O9382k6676
38809A2155l3528P0950P1629n8401r2804J7837N5351m2156o6933M7823R7859L014
38797H2796m8821K5204N5292l0471o7266R504L8674l4856m9402L7509N1517m7638
$$ y = [-122969, -164002, -111451, -65355, -88239, -95092, -30559, 19560, -3629, -28962, -18612, -50993, -140676, -166736, -86719, -29404, -67845, -98857, -56496, -34288, -75711, -62505, 51793, 114722, 31183, -63859, -45196, -2056, -38424, -72774, -13881, 53593, 35858, 2096, 22688, 21411, -42811, -42191, 90149, 191433, 125878, 22737, 52192, 143101, 142508, 91642, 114397, 171938, 155037, 103720, 122647, 177242, 162865, 83712, 3762, -73739, -137897, -111478, 2220, 60182, 1928, -35919, 34212, 83269, 6109, -74150, -30551, 38831, 12155, -21373, 49577, 121206, 62805, -29999, -12162, 43189, 1033, -65900, -18077, 79782, 82796, 33975, 59179, 114471, 84000, 16734, 26238, 64912, 30056, -19346, 18163, 69680, 22042]
38785B2042p0779L2472O9576j5754k8179R1356J35179K3347m3243K8503N2935
38774B97455n5371r5140N1531K01179J93245J12663M0025r2312k52027k51612
38764A49636q6724K052o3148p4186N2049J09433l355r4181m2081R845j9941K828
38752e7773J04738R9538l8726p6077N2472J04137k1446r6407k144N7750l1005
38741I5057p9686R210M4308n7992r1759K2756O3492n0429p8138O7713J20626l2952
38729C2206j14439K5335J20824M683p5008M7288J22136k0242j21350N968J02161
38718A29562l7683j53736j6149J25602J7599j14032p874J22868M092j64764q4311
38707a78826R1439P1101l2210K9726J33041L9725j11169n5267J00379R2610j9817
$$ y = [22042, -48737, -16265, 53311, 37557, 9378, 100734, 235913, 259260, 216017, 244520, 297455, 242084, 146944, 198475, 399654, 592899, 705562, 745587, 653275, 401248, 149636, 62912, 64964, 1816, -72370, -20321, 89112, 85757, -8424, -50505, -40660, -60601, -57773, 46965, 146503, 107777, 31700, 84172, 188309, 166863, 70456, 68312, 126062, 95057, 15371, 24581, 68889, 10897, -80862, -58106, 5386, -45043, -123181, -55468, 65158, 32206, -82233, -56898, 63926, 68609, -6399, 40889, 163025, 142783, 21433, 27401, 129562, 91879, -61857, -78006, 47596, 65195, -48837, -56711, 66157, 70249, -94515, -178826, -87387, -16286, -48496, -18770, 114271, 153996, 42827, -12440, 87939, 180549, 160732]
38696A60732k7940J3447m0425q0345K3103R7069k4627j40299k8632J25359O3871
38685A41313p3622l8060O0641Q005p5861O590J10468K6413r5543l5149O6881J417
38673A03493q1972J5274J13314k118j25740n433J51477N1193j24071n6944J08277
38662A46750N9527q5314l9018P6751q770j45184m0786J40886O5702j28918q7428
38651d5802R2697O5125r6040o1289J02674P6304p8770n1569R8633O6738r1594
38640G7107p9332N2270K6807q6783k1072J20705M5316j29748p0164J25750R6972
38629A57828r7318r9097O8674Q1220m3465j7817J05025L3931j47334j07948Q6307
38618B0006R1635n4143k9961J19423Q5854n8587J3678K21319K11419N7158J21826
$$ y = [160732, 132792, 146239, 105814, 25469, 48572, 145641, 121014, -19285, -47917, 77442, 141313, 67691, 29631, 90272, 98277, 22416, 29006, 139474, 165887, 70344, 35195, 102076, 103493, 21521, 36795, 150109, 147991, 22251, 16818, 168295, 219488, 95417, 38473, 146750, 206277, 120963, 81945, 158696, 149926, 4742, -36044, 104842, 170544, 41626, -45802, 46895, 112020, 15980, -45309, 57365, 133669, 54899, 3330, 101963, 168701, 77107, -2225, 50045, 76852, -9931, -31003, 89702, 135018, 5270, -64894, 60856, 157828, 60510, -38587, 30087, 111307, 67842, 50025, 155050, 188981, 41647, -66301, 20006, 111641, 57498, 27537, 146960, 232814, 174227, 187905, 409224, 620643, 677801, 799627]
38607G99627L21163K40951p9893k07873j01295j14127k62102k18833j3881j058
38597C62679j49180r3565J25244J12001j11028j30615O5559P8995j14250j29030
38587A6810O3101R4543n2634k5465J56213J11106j22981j09017J50929J95511
38577D78116k4511n5922K06428L67528K95339K51796K19885q5339m87659m72548
38567F93113j02926L1258j65832j97996M0194R9461j04539j33968P5303Q0951
38557C15019j57833j63332J15311J70834q5200j54563O9192J10894j18166j36392
38547c4236J29372J69824r4912j34851J39130J73448j38969k18438Q4831J98271
38537B73470n6754j33369J39571K13577q0108j81932Q4960J59719j26848j92662
$$ y = [799627, 1120790, 1361741, 1281848, 1073975, 972680, 858553, 596451, 377618, 363737, 362679, 213499, 119934, 245178, 357179, 246151, 115536, 181095, 260090, 145840, 16810, 79911, 174454, 121820, 96355, 252568, 363674, 240693, 131676, 282605, 478116, 453605, 397683, 604111, 971639, 1266978, 1518774, 1738659, 1653320, 1165661, 693113, 590187, 621445, 455613, 257617, 297811, 397272, 292733, 158765, 234068, 315019, 157186, -6146, 109165, 279999, 194799, 40236, 109428, 220322, 102156, -34236, 95136, 264960, 170048, 35197, 174327, 347775, 208806, -9632, 75199, 273470, 216716, 83347, 222918, 436495, 356387, 174455, 259415, 419134, 292286, 99624]
38527I9624J31756K27472j02354k14747J23698K56483r5336k79285L4605K34094
38517D16010l0226k00198M0597J50783j33842k32653J01258K32245j08091k45758
38507i875J23504L03968n0674k46652Q4534K48611j28556l20266Q8809L55906
38497D49309K057k67475M2284K59566q3221k91156J03412L64634k1059l20289
38487B38062P896K48303j19831l38102J36495M96533J19815k19112J11389L42726
38477A024174j34996m79757j5820L86107l5729m39953k3075M01408J5534l75765
38467C22128M9648M64856J7775m48673m0086M09834j954m22134O3242N49831O8637
38456A033104m54646m157M81670l1801n47437K3646O16863M1857o10657n2394
$$ y = [99624, 231380, 458852, 356498, 141751, 265449, 521932, 426596, 147311, 181916, 416010, 385784, 185586, 226183, 376966, 243124, 10471, 111729, 343974, 235883, -9875, 113629, 417597, 366923, 120271, 204805, 453416, 324860, 4594, 93403, 449309, 451366, 183891, 226175, 485741, 402520, 111364, 214776, 579410, 558351, 238062, 245958, 494261, 374430, 36328, 172823, 669356, 789171, 570059, 681448, 1024174, 889178, 409421, 393601, 779708, 743979, 304026, 280951, 682359, 697893, 322128, 371776, 836632, 854407, 405734, 365648, 775482, 773528, 351394, 414636, 964467, 1033104, 578458, 574301, 1055971, 1024170, 476733, 500379, 1117242, 1159099, 548442, 496048]
38446D96048O25899O8434o17569j8674P05856N3573p53305p3477Q48738K29069
38436A564592p05251p0913Q96745K26715p90062n0776J093930L68690q42419q8138
38426A603113J224918M93837p99673J27485J657044P34842q67639K98790K394726
38417F867443J562140l35562Q85961L171216J970167o3871K639122P117822O675829
38408C0490267M761604R694669J7538892J8714432K1767132M5748963Q0529891
38401B29245850Q1759322K6039346m8467183q2383206o4387370l3824592k1993888
38394H5988279k1483546j5454814o913055n845497q603230o372361j450577j047759
38386A8817440l559183k959813l35370n52697k486823j833912L41260J03227j628884
$$ y = [496048, 1121947, 1190381, 572812, 554138, 1259994, 1313567, 560262, 486785, 1335523, 1564592, 859341, 788428, 1685173, 1911888, 1121826, 1071050, 2164980, 2533670, 1691251, 1603113, 2828031, 3321868, 2522195, 2649680, 4306724, 5041566, 4173927, 4472717, 6867443, 8429583, 8094021, 8979982, 12151198, 14121365, 14057494, 16696616, 23814438, 30490267, 35251871, 44946540, 62485432, 81199864, 102966996, 148715959, 229245850, 311005172, 337044518, 288577335, 206194129, 141806759, 107982167, 85988279, 64504733, 49049919, 42136864, 36291367, 27688137, 21315776, 19865199, 18817440, 15258257, 12298444, 11963074, 11410377, 8923554, 7089642, 7430902, 7534129, 5905245]
38377E905245j246385M89828L03662j126020p83091P04401M88770r08711q17331
38368C010368L67091K19909q71657o49025M84213L49690o89976n42958M78592
38359B156247L76030n79859m79173M35900L26748n89868n19113L80936L79697
38350A887545m26236l98604L89415L70598l98368m00927L39148L66202l24617
38341A404156l48252L05919L07524l52096l75956K56054K81798l27514l34554
38332H17079L05242L70094k27537l13727K26360K83474k42504k70750K86265L46197
38322A580193j97834k68219K80743L96781j05891k23362K46942L45040j34538
38313A919855k57317J99976L41908n9094j39436L26703M87273R0221m5571L60551
$$ y = [5905245, 4658860, 5148688, 5452350, 4326330, 3543239, 4247640, 4736410, 3827699, 3010368, 3377459, 3597368, 2725711, 2076686, 2560899, 2910589, 2220613, 1677655, 2156247, 2532277, 1952418, 1473245, 1909145, 2235893, 1646025, 1126912, 1507848, 1887545, 1461309, 1062705, 1452120, 1822718, 1424350, 1023423, 1362571, 1728773, 1404156, 1055904, 1361823, 1669347, 1317251, 941295, 1197349, 1479147, 1151633, 817079, 1122321, 1492415, 1264878, 951151, 1177511, 1460985, 1218481, 947731, 1233996, 1580193, 1382359, 1114140, 1394883, 1791664, 1685773, 1462411, 1709353, 2054393, 1919855, 1662538, 1862514, 2204422, 2145328, 2005892, 2332595, 2819868, 2910089, 2864518, 3225069]
38303C225069N53339K59842J83642N76677P81346N94068O71110J192988J497282
38294I535363J405797J576539K185296K555355K397416K119746J667503M43327
38286B3886342j308974k429772k517660k366095k424198k201190j560622j189105
38278G888726j297665j191293o30568l31860o01465p42903l71759r0568k80987
38269B349658m11613j43516J5393k35073l72051r1577Q6750j48120k88071j9543
38259G42237J57488p7540k36009J0562J87214m4280k28310j7984J60192l5626
38249F17944k04330j6855J48349r653j15401R7123K11872n2015k49092m3981J46276
38238E30237l3880j94986K5683K55326J13451n3028J61946M61815M09468J59143
$$ y = [3225069, 3778408, 4038250, 4221892, 4798569, 5579915, 6173983, 6845093, 8038081, 9535363, 10941160, 12517699, 14702995, 17258350, 19655766, 21775512, 23443015, 23886342, 22577368, 20147596, 17629936, 15263841, 12839643, 10638453, 9077831, 7888726, 6591061, 5399768, 4769200, 4437340, 3835875, 3092972, 2721213, 2630645, 2349658, 1938045, 1794529, 1809922, 1574849, 1202798, 1111221, 1197971, 1049851, 761780, 742237, 899725, 822185, 586176, 596738, 783952, 739672, 511362, 493378, 653570, 617944, 413614, 396759, 545108, 535455, 420054, 517177, 729049, 677034, 427942, 383961, 530237, 496357, 301371, 327054, 582380, 695831, 642803, 804749, 1266564, 1676032, 1835175]
38228A835175J9314j30552m04896m82291j88357N9647n9091k09600n9721J03309
38218D82937l1785j86392n0706J13866Q291j18144J3043J41754j0403j75432n7949
38207A29080R3042j2363j35688J639J58577N4957p6599L4993J56189K1215j32250
38196B92792l5733Q1472l2181j33969J8635J52378M215j37382J9179J81239K0582
38185D31227j86409q0100J01882R21j67811n4103J30360K9321j50816m0242J62936
38174A77166O2871j68201j02748J52089J75934N18k5320P5915J4025j54031j36730
38163G1488J5100K1513q2635n4473O1941N5354r372M6247J03415k2755j56922
38152D8901n3095J17402N9566r9933o4477P4079M5128o5699j5400Q9803J4169
$$ y = [1835175, 1854489, 1723937, 1319041, 836750, 648393, 708040, 648949, 439349, 379628, 482937, 451152, 264760, 214054, 327920, 336211, 218067, 231110, 372864, 362461, 187029, 129080, 222122, 209759, 74071, 75710, 234287, 289244, 212645, 247638, 403827, 425042, 292792, 257059, 338531, 306350, 172381, 191016, 343394, 347609, 210227, 229406, 410645, 431227, 244818, 164718, 266600, 267521, 99710, 45607, 175967, 205288, 54472, 14230, 177166, 240037, 71836, -30912, 121177, 297111, 297629, 272309, 348224, 362249, 208218, 71488, 86588, 108101, 25466, -29007, 32934, 88288, 78916, 125163, 228578, 205823, 48901, -4194, 113208, 172774, 72841, 8364, 82443, 127571, 61872, 46472, 136275, 150444]
38141A50444j07497k3845J08157L976j68622o8961J63073J34264r1794j22456
38131b3261N5973J03419l0021o9240L2757N5385j6578Q866J02735O5554m9353
38120B36236k3369Q9694O5049m4893j7353Q8387M5322q1704n4211P4916Q1440
38109D59514K7825J15173K10078M0115k49002k71764n6766K0861r8997j18758
38099G8279K4266P1070l6251o2396M8568Q4600o197l8380K8064L8730j3607N426
38087B22172M7444l8976j53463q3443O8365L5089j09735o9641J16844J34831k8214
38076A41273p4258M4193O8084m7189o2154N6610P0846n1846p3045M5359P1692
38065A89565l4693n3758M4764M2128p5464o7724Q1744J02889n8038j31565j9930
$$ y = [150444, 42947, 19102, 127259, 131235, -37387, -106348, 56725, 190989, 99195, -23261, 32712, 136131, 106110, 36870, 69627, 125012, 108434, 117300, 220035, 285589, 236236, 212867, 302561, 367610, 322717, 305364, 393751, 439073, 357369, 303158, 378074, 459514, 487339, 602512, 812590, 852705, 603703, 331939, 275173, 296034, 197037, 78279, 102545, 173615, 137364, 74968, 123536, 208136, 201939, 163559, 191623, 230353, 216746, 222172, 269616, 230640, 77177, -6266, 62099, 97188, -12547, -82188, 34656, 169487, 141273, 67015, 111208, 179292, 132103, 69949, 126559, 197405, 145559, 72514, 117873, 189565, 154872, 101114, 145878, 188006, 112542, 44818, 126562, 229451, 171413, 39848, 19918]
38054A9918N1078j7268l7001N8085P6780l1121n9558M4069O4268n9578j01920
38043G752K2163R5875R345n2557K3621Q8492M3207r41M277m7033j32541q0156
38031a8496P9106R9412n0186j18366k1425L0571m5056o0674M5905P7390k7292
38020i111o0514M9444R4499o044m8444N0111Q3743l5660r4808J5549R2027P360
38008A38152o2052N444N1870k4057n7781M5046J02872j062r7843n6389p825n0118
37996a3743n1589N2361R0213j6055p4597J9392P6056k7555j05330j1084Q7624
37985B5693K8835m9061J5966J11405P7326j5031l9328l4706m9962p421R4438R4378
37973B52532m2007j11005j5276O4035P165l8213K5756M3488p2254j33045j7601
$$ y = [19918, 70996, 53728, 16727, 74812, 151592, 120471, 60913, 104982, 169250, 109672, 7752, 29915, 125790, 135135, 82578, 106199, 194691, 237898, 236957, 241234, 194201, 61660, -18496, 60610, 160022, 109836, -8530, -29955, 616, -44440, -105114, -59209, 18181, -9111, -69625, -20181, 74318, 68274, 19830, 69941, 153684, 118024, 23216, 38765, 130792, 138152, 76100, 81544, 133414, 109357, 51576, 96622, 199494, 198432, 100589, 44200, 36375, -13743, -65332, -12971, 77242, 61187, -13410, 5982, 82038, 54483, -50847, -61931, 25693, 54528, 5467, 21433, 132838, 210164, 195133, 155805, 121099, 71137, 63716, 158154, 252532, 210525, 99520, 84244, 148279, 155444, 117231, 142987, 186475, 114221, -18824, -36425]
37962c6425Q6061J9950o2001R06Q0825K8663m0979P471O5356J1154m7378n335
37950A08268K1644n2871q5070J4196P0839l1655j08068o085J02822L9604o0823
37939A2801k8918K2324m2141q2423L6926J41026M8131p7779j7600J04493O3515
37928A80355n4437m0822M5396L6575Q888J11527K20581J29381o6539j25102n9747
37917C86056n2422j02044q5608l8734o2504q2903q17O6553r824r1949r362J05529
37905B1971M6897p7927m5152O9981M9148m7889r977J01727N8630r8148j21520
37894e2259M583P0981L4698L7447P5928J4954r8927q6233K3467L3827n4236n3127
37882d8897N0265P4625j2062m6394J7162M4256p746l1099J940L375l0174j7683
$$ y = [-36425, 49636, 69586, 7585, 8491, 89316, 117979, 77000, 84471, 149827, 160981, 113603, 108268, 129912, 77041, -8029, 6167, 77006, 45351, -62717, -68802, 34020, 73624, 12801, -16117, 6207, -35934, -118357, -81431, 59595, 107726, 29947, 12347, 116840, 180355, 125918, 85096, 130492, 167067, 175955, 287482, 508063, 637444, 570905, 445803, 386056, 333634, 231590, 145982, 107248, 44744, -38159, -38976, 27577, 17753, -74196, -83558, 21971, 68868, -9059, -54211, 15770, 64918, 17029, 7052, 108779, 167409, 69261, -52259, -47676, 23305, 58003, 95450, 171378, 186332, 87405, 1172, 24639, 58466, 4230, -48897, 1368, 75993, 63931, 17537, 34699, 78955, 71209, 40110, 42050, 45425, 15251, -2432]
37870b432J8815m813m1370R422Q2531M8045l5536k1142M8126K8275l6275j44Q0353
37857A73855L7059p9242p3542L4136M3795o1446j03808m2078n316j3248L2125
37846e7710R4755M9417m3397j6000P9727M5576q8066j00442J7259N0402l9111
37835g590n9409L3831O3609j2102k0103Q1215J12652J5843l9874J6266L6456m0944
37823A79850o9322J6378P3004K0125l0239j2387j4166n7386l2212O5884R4220
37812B33749L1830K1809P8123L9990j02546j43032k0191O1345o496n7199K1407
37801A58789P8407o372r2962l7768N7415M3553l3003o0625n0520m2352K13O6999
37789H1774N5188l7659o5564J3813M8563l3259q3795k679P9426L6980l9892l1199
$$ y = [-2432, 16383, 11570, -29800, -20378, 62153, 110198, 74662, 53520, 101646, 129921, 93646, 93502, 173855, 210914, 131672, 58130, 92266, 136061, 74615, -29193, -71271, -76587, -89835, -57710, 37045, 86462, 43065, 27065, 106792, 152368, 64302, -36140, -18881, 31521, -7590, -66999, -33168, 30441, 18339, -1764, 79451, 192103, 207946, 168072, 184338, 220794, 179850, 110528, 126906, 199910, 220035, 189796, 177409, 163243, 105857, 73645, 139529, 233749, 265579, 287388, 365511, 405501, 302955, 159923, 139732, 201077, 194581, 137382, 158789, 237196, 230824, 137862, 100094, 157509, 201062, 168059, 107434, 56914, 14562, 14775, 81774, 136962, 99303, 33739, 47552, 96115, 62856, -20939, -23618, 55808, 92788, 52896, 21697]
37777B1697R822j38q472L8385O2324O066m1534j1185J5588k8209o2331k0764J8765
37764A4n982j8793L3783O5308J6057l2488k6401m1112r6481o9171P2586J50368
37752D7688N1640p1077n1323K9240K1434k5051J0838P3935L4830o8206r6677m0299
37740h3028M976J6582L8479N7485L2705p291j7127k1839m9908n5693l757N1960
37728c6456N8529M3140K9073j7852q5956q5671k376M8767O156l5326M966N9323
37716a3683M7485J1682J4475K7940J7663J3609J9869j2970o2684l7267M1004L5930
37704A03053n4746o3427N1605J08583J5114o5554r011N4110l131o5550q820M8502
37692A10728l2915j30568o0971R2275J16737J5753m3082k6225l1916o3918m1777
$$ y = [21697, 31519, 31381, 22909, 61294, 123618, 129684, 88150, 76965, 92553, 64344, 2013, -18751, 14, -5968, -24761, 9022, 74330, 90387, 57899, 31498, -9614, -106095, -175266, -102680, 47688, 99328, 28251, -23072, 6168, 27602, 2551, 13389, 87324, 122154, 53948, -42729, -83028, -78052, -61470, -22991, 34494, 67199, 59908, 42781, 20942, -28966, -84659, -88416, -36456, 22073, 65213, 94286, 76434, -9522, -95193, -97569, -48802, -42646, -77972, -73006, -13683, 33802, 45484, 59959, 87899, 105562, 119171, 139040, 126070, 63386, 26119, 67123, 103053, 48307, -15120, 36485, 145068, 160182, 94628, 85617, 139727, 136596, 71046, 62226, 110728, 77813, -52755, -113726, -21451, 95286, 111039, 67957, 41732, 9816, -54102, -95879]
37681i5879J5713K3940K11J6147M2729J4452k1858Q815N3484K6900k0120M11L4770
37668I9715j1783q0229n2563L2431M6704o829k3856Q122J9319O647J2359J2795
37656F2832k0850k5201L9620O8091k8382j32889q5918M9245Q6910J4712k1141
37645G029K3983N5968L6066J8803J2823k2581n8889l3344K1532K7984N080J8296
37633A12750L7290n898o7805n6320N495K6465O026K067J735l0092m3313P484M5447
37620D1331o11m2681K0439J01886O4957l1822m0999Q086j6939q1002l6977Q6737
37608G2405J08734j139p9532m4709P142L908p380L552K02j2532O988K1699l2791
37595D6547r5812n5929M1460M9942k8533n0602J5675N2000J5307m182K3798J8501
$$ y = [-95879, -80166, -56226, -56015, -39868, 2861, 17313, -4545, 4270, 57754, 84654, 64534, 64945, 99715, 87932, 7703, -44860, -12429, 34275, 27446, 3590, 11712, 31031, 37678, 50037, 62832, 41982, 16781, 56401, 124492, 96110, -36779, -122697, -73452, 13458, 28170, 7029, 31012, 86980, 123046, 141849, 154672, 132091, 73202, 39858, 61390, 89374, 94454, 112750, 150040, 144142, 76337, 20017, 25512, 51977, 58003, 60070, 61805, 31713, -11600, -4116, 41331, 40720, -1961, 18478, 120364, 185321, 153499, 112500, 120586, 103647, 22645, -14332, 72405, 181139, 180000, 100468, 55759, 62901, 66809, 59429, 62981, 63183, 50651, 57639, 79338, 46547, -49265, -105194, -63734, -13792, -42325, -92927, -77252, -25252, -9945, -14127, 9671, 28172]
37583B8172l2460l4053K9779N0557j1794n7645k3472K4820K7492J8568K7749K3043
37571G0756m427j2017P499J3094k86n136j6410n3982o1463J0758Q0919M0137n8147
37558A1295p3164n332K2716j5869l4519j3107j1724k0210K2155P2942M0644k7154
37546c1327p878O4827M9229l8661m1136N3829Q4913O454l7992J7224N4018J032
37534A74532n0492l9496l6729p1796n6324L3437Q2776L4245j6052J951K5291O096
37522H7439p81K7415K2443k8203l7102J5317L1859k1515n3136k1340o06j4905
37510F885J3964Q8491R1672p400q6708q0051o5887p9031l5152P2529J06685J7983
37498D3980n3114j4382L2149l341l9576J69L7336o25l8035m695L0168P547l7N2844
$$ y = [28172, -4288, -38341, -8562, 41995, 30201, -27444, -50916, -26096, 1396, 19964, 47713, 70756, 66329, 54312, 61811, 74905, 74619, 69483, 53073, -909, -62372, -51614, 29305, 69442, 11295, -61869, -67201, -44485, -60354, -94873, -107980, -119704, -139914, -117759, -44817, -4173, -31327, -39205, 25622, 74851, 36190, -4946, 48883, 133796, 140250, 102258, 119482, 173500, 174532, 124040, 84544, 47815, -23981, -80305, -46868, 35908, 70153, 54101, 56052, 81343, 87439, 86658, 114073, 136516, 108313, 71211, 86528, 118387, 96872, 43736, 22396, 21790, 6885, 20849, 109340, 201012, 193612, 106904, 26853, -39034, -118065, -153217, -80688, 25997, 43980, -9134, -23516, 8633, 5292, -34284, -34115, 3221, 2596, -35439, -40134, -9966, -2419, -2456, 50388]
37484E0388O9113j0895p6456l5913J9675r931n3392j7181L3333P058l4824o51
37472e9676N6108M6082J1690K5988L8563j6574o8443k7978M0556K8360l0263l6545
37460G868o086j3341l7618j6502J9532Q917j4777O910L3566L763l7571j9514K0895
37447d3958J3348j0869J3067N2040L9088K105N593K7244R105l0502m3839m6092
37435a3670o0393m5242K2534P1384M2111r119j0800Q462m61p684J7579K8636j444
37422D1893j0149L0203L7883k4767n5503J0874O7337J3380o6724n6013m303j0571
37410b6460l0300K0090P6429L3281n3704n8180J440J5932j6486j9107K467n076
37398e9674j3132K5006N2675Q784l3303J1699O8930K9228m3646k2758M8710L8628
$$ y = [50388, 119501, 108606, 32150, -3763, 15912, 5981, -47411, -64592, -31259, -24201, -59025, -59676, -3568, 42514, 54204, 80192, 118755, 102181, 33738, 5760, 46316, 74676, 44413, 7868, 1782, -11559, -49177, -65679, -46147, -37230, -52007, -45097, -11531, -7768, -45339, -64853, -43958, -30610, -41479, -28412, 23628, 62716, 64821, 70414, 97658, 106763, 76261, 32422, -13670, -74063, -119305, -96771, -25387, 16724, 7605, -3195, 5267, 4806, -2878, 14701, 43337, 41893, 31744, 61947, 99830, 75063, 19560, 30434, 97771, 111151, 44427, -11586, -15889, -26460, -56760, -36670, 39759, 73040, 19336, -38844, -37404, -21472, -37958, -57065, -54598, -59674, -72806, -47800, 4875, 13659, -19644, -7945, 60985, 90213, 46567, 23809, 72519, 111147]
37386A11147l0680l3188K3076K5400j8300r90O2992N2447l6823q4784n8731l9864
37374b8298m4150p998M8355L4153k8631k2025N4165O8260j9190r0507o4241J688
37362i8419L4042L3337J2881k5798m2859k393M0162J1702m0590j9142M6504M5051
37350e522j8256l4639R035J5720l4127m8729M496M9802M4159K6576J4663j3027
37338A0151l0191N611M3302L228o4102m0698N2129P9651K0282j3283J4311J4276
37326I4667l7114m6091J7910N6919J2529m8431o3116n1124k7634K6057P4159M4538
37314E3269l6465o2191j9931n699m5466n3841p19L4978J8575J7687N9195O9441
37302B8833J1965m1673l2250O595K9008L5570K5339r788l1860q78L5070P605l7191
$$ y = [111147, 80467, 47279, 70355, 95755, 77455, 76465, 139457, 191904, 155081, 70297, 11566, -28298, -72448, -80446, -32091, 2062, -26569, -48594, 5571, 73831, 54641, -35866, -100107, -98419, -64377, -31040, -18159, -43957, -86816, -89209, -49047, -37345, -77935, -97077, -50573, -5522, -23778, -58417, -49382, -33662, -67789, -116518, -112022, -62220, -18061, 8515, 23178, 10151, -20040, -14429, 28873, 32101, -32001, -72699, -20570, 59081, 79363, 66080, 80391, 94667, 57553, 11462, 29372, 86291, 98820, 50389, -12727, -63851, -91485, -65428, 8731, 53269, 16804, -45387, -65318, -71017, -116483, -170324, -171043, -136065, -117490, -99803, -40608, 28833, 40798, -875, -33125, -26530, 2478, 38048, 63387, 53599, 21739, 20861, 55931, 63536, 26345]
37289B6345p407N9238M8181k4671l6619J8574K1998m7274p5835k6673P339o648
37277d3452Q434N9679N0067k5609m4868K3449N6065k111m2582K367M3946J1550
37265I6935k9245k0902j3735l8172l4580J1548K0282k5771l5120J6676L5010m055
37253b1129M255Q5528J11378K3416n7708m6866k7933o4021o6907J8049Q0294L4455
37241G2811k7965j4293P986l3836o4440j1386M2978J1458l8446k1291J0011j0808
37229g7221k2183L4533Q1035M5953N070L1264M7688j5459o4859j1917M7455O88
37217A02047p0235l6361M4113L8824k1204j9429K5103J5806k2831n90N3160M5085
37205A53488n431j9758k0153o2555q4867n764R4513Q0587j1846m4023j0238j2465
$$ y = [26345, 18938, 78176, 126357, 101686, 65067, 83641, 105639, 58365, -17470, -44143, -36804, -43452, -35018, 24661, 74728, 49119, 4251, 27700, 83765, 81654, 39072, 41439, 85385, 96935, 67690, 46788, 33053, -5119, -39699, -28151, -7869, -33640, -68760, -52084, -17074, -21129, -16874, 68654, 180032, 203448, 145740, 98874, 70941, 6920, -59987, -41938, 38356, 72811, 44846, 30553, 38539, 4703, -59737, -71123, -28145, -16687, -55133, -76424, -66413, -77221, -99404, -64871, 16164, 62117, 67187, 98451, 146139, 130680, 65821, 53904, 101359, 102047, 31812, -4549, 39564, 78388, 57184, 37755, 62858, 78664, 55833, 55243, 108403, 153488, 148057, 128299, 108146, 45591, -39276, -45040, 49473, 130060, 118214, 74191, 63953, 51488]
37193E1488m9099k9458L2681L5789j7598l0239L143j683l9178j6074O4639R1662
37181I6073L0435l2502m2429l2762k1075J4059M4097R673o0478o9965k573N9228
37169h219O3856L5976R30l5189m3468o724K4418J18l9384l3764q738r947K668
37156e7467P1387J19584N8005m5246n6810N239J0937n7267q9554m6089n072q164
37144a00517p185K1197L8280L2155K9978K3183j2408l7953l411M6317L1051k9006
37132C1681n3708m0617l8700k9715K8534Q4582O2217M628L071K9389k569n8480
37120B0313m1175J6373L105n8468m9085K2280L4728j6195j9077K5751J750q3610
37108a43310q2072L1703J02164N5822O597K8578L6455j8832l9959K3410N8835
$$ y = [51488, 2389, -27069, 5612, 41401, 23803, -6436, -3293, -4976, -44154, -60228, 4411, 96073, 126508, 94006, 51577, 18815, -2260, 11799, 55896, 65569, 5091, -64874, -67447, -8219, 55637, 91613, 92543, 57354, 13886, 7162, 31580, 31698, -7686, -41450, -50188, -60135, -57467, 13920, 133504, 191509, 146263, 89453, 94692, 105629, 48362, -41192, -87281, -92353, -100517, -107702, -86505, -48225, -16070, 13908, 37091, 24683, -13270, -16681, 29636, 60687, 31681, -22027, -62644, -101344, -131059, -102525, -17943, 44274, 48902, 51973, 81362, 78793, 20313, -20862, -4489, -1384, -59852, -108937, -86657, -51929, -68124, -87201, -61450, -59700, -143310, -225382, -193679, -91515, -35693, -29096, -518, 35937, 17105, -22854, 556, 59391]
37097E9391j0582q0502m5142K8111L4661Q367K5883N1353J5119m2561l7396J5152
37085B1854L4094M49l9021n1774l6338l537J4682r267l9706j5560L9714M1740
37073d2670n786m442O5649R7411L4687l2145k0220J7197J059m0573m1036r387
37061A9744R377J4738J7753k367m3846n2997p213L9138L9468J6090j094j7790
37049C1001k3572J2610N9071L3357n9454j04958m7340K6724L0944L57J46J4206
37037b6908M890k008K5446N1588L0700j6730m2392l4245m290L2172M2460O640
37025F7323k9202q202L2914J5732l3072j7358M6277L8339n0134q5466j8438L3369
37013g918j488l1391J0970L8670j6636o2569r106O8233O7202L3011N0135P5520
$$ y = [59391, 48809, -31693, -76835, -48724, -14063, -5696, 20187, 71540, 86659, 44098, 6702, 21854, 55948, 56397, 17376, -34398, -70736, -74273, -59591, -68858, -108564, -124124, -84410, -42670, -48456, -52898, 12751, 110162, 144849, 112704, 92484, 109681, 110740, 70167, 29131, 19744, 29121, 43859, 61612, 59245, 15399, -37598, -44811, -5673, 33795, 49885, 48791, 31001, 7429, 20039, 79110, 112467, 53013, -51945, -99285, -72561, -41617, -41260, -41114, -26908, -22018, -24026, 1420, 53008, 83708, 66978, 24586, -9659, -13949, 18223, 60683, 67323, 38121, 29919, 62833, 78565, 45493, 28135, 74412, 112751, 62617, -22849, -41287, -7918, -9406, -40797, -29827, 8843, -7793, -70362, -79468, -11235, 55967, 88978, 139113, 214633]
37001B14633K9182m6569o4387m3603m8411n6486k2499P359k2768n8122k5729K8019
36989a09381K2703q739P321L8377J2346l4886k2331K2589J6322k4507j9928K3277
36977g6837L4673J3872R874Q513k7168m8343P828P7697N0493m1331o3906K343
36965e2292M4219J3590r831K3732N4037L0232n404k810J5265M275l3015o0396
36953B1602m8288Q422P5081R2736M9388P084J1929K1962j4571o1008n1170j577
36941A11590K0908O410p839j8829m3236n4765k1506K4091L1270J2136L505m598
36929E9137k4090j1958N0209Q3304K3125n6200m8829J2303K2615j1514n157L1074
36917A24019J0846n2552n4781J2807M3589K006k1608K3012O4826M3007k876k4285
$$ y = [214633, 243815, 197246, 132859, 89256, 40845, -15641, -38140, -30781, -53549, -111671, -137400, -109381, -86678, -95417, -88096, -49719, -37373, -72259, -94590, -72001, -55679, -80186, -100114, -76837, -42164, -28292, -18418, -9905, -37073, -85416, -77588, 109, 50602, 9271, -54635, -52292, -8073, 5517, -4314, 19418, 73455, 103687, 98283, 95473, 110738, 115013, 81998, 21602, -26686, -18264, 56817, 149553, 198941, 206025, 217954, 239916, 225345, 164337, 113167, 111590, 132498, 138908, 131069, 112240, 69004, 14239, -7267, 16824, 48094, 60230, 63735, 59137, 35047, 23089, 73298, 156602, 179727, 123527, 74698, 87001, 109616, 98102, 92945, 124019, 134865, 82313, 27532, 40339, 83928, 85934, 64326, 87338, 152164, 195171, 192295, 168010]
36905A68010l6394n0257l2445J7048L5627m183m6129m1555j5487l474N393K3242
36893A9396K6133k92l2010n0070o1196n9385k5306K1839L3453P898l525J8618
36881a04447L4520J9944N136J4885K6714J7074L003R034K5074K0537j5840n8331
36869b697o1797j2900L2591O025o6301p6606P863Q1234N4288r434l548M9181N0700
36856D8599O72j3726K4850M2680O361l5783m6595l8350j8432J5910L4876J1280
36844C2342j5912M378M1762L2719q281k2315j6330l4365n4253k8460P393p820
36832f9142l0679J8959R1710O8315l0800o4146J042M9541K5405L871K1939J0932
36820I6947m8366o8017j6578J3332k6013m7971P520O3047M4312L954R408K3691
$$ y = [168010, 131616, 81359, 48914, 65962, 101589, 97406, 51277, 9722, -5765, -9239, -3846, 19396, 45529, 45237, 13227, -36843, -98039, -157424, -182730, -160891, -127438, -119540, -123065, -104447, -69927, -49983, -44847, -29962, -3248, 13826, 16829, 25863, 50937, 71474, 55634, -2697, -64494, -77394, -44803, -38778, -105079, -181685, -173822, -92588, -38300, -47734, -51282, -2101, 48599, 49271, 35545, 60395, 103075, 109436, 73653, 27058, -11292, -29724, -13814, 21062, 32342, 16430, 20808, 62570, 95289, 87008, 64693, 48363, 13998, -40255, -68715, -61322, -69142, -99821, -80862, 10848, 79163, 48363, -15783, -14741, 34800, 60205, 64076, 86015, 96947, 48581, -19436, -36014, -22682, -48695, -96666, -89146, -26099, 18213, 22167, 31575, 55266]
36808E5266l866l2924j5660R901K135l89L2658M3577r339n5288j9395M9266N8860
36795A14802J5371j6814l0708n1715n2993q59N5708M1062k7320o1993k9491K3170
36783b1780M8734M2005J7106m059L079L0570L1596j4592o2663o2618k7692m565
36771b4879q733k3955l5046l1671q858J5540J5715J166N764K9568M0797L6282
36759A1690L9742M0218N140m1114l4660J9394M3158R714j9824q070L783j2628
36747E6543j8885R522L2748K0888K416O80l021j3042m976R555r131l8777j4269
36734C0251M5615M8415r546k4068L3214N6640o882o0525k9397J2686j1560m4654
36722D0189j6001K0654l058l3146M75L8691m201p4074n8882K4446O5296L5783
$$ y = [55266, 51400, 18476, 2816, 12717, 14852, 14463, 47121, 90698, 81359, 26071, 6676, 55942, 114802, 130173, 113359, 82651, 30936, -22057, -22916, 32792, 73854, 46534, -15459, -44950, -21780, 26954, 68959, 86065, 82006, 85085, 115655, 147251, 132659, 69996, 7378, -20314, -24879, -33612, -57567, -92613, -124284, -133142, -117602, -101887, -100721, -94957, -65389, -24592, 11690, 51432, 91650, 96790, 55676, 21016, 40410, 83568, 93282, 73458, 65388, 69171, 56543, 37658, 47180, 79928, 100816, 103232, 103912, 100891, 87849, 82873, 92428, 83297, 44520, 30251, 75866, 124281, 114735, 90667, 123881, 180521, 173639, 113114, 83717, 96403, 84843, 40189, 24188, 44842, 41784, 8638, 9113, 47804, 43603, -30471, -89353, -64907, 389, 36172]
36710C6172J545p854j9219l3783k9660j9690j9750Q95N4117P1849M367p4235o0123
36697i5369K6488P9751N7787J386n1403p8811n1357J7252M6846L047l0764J6202
36685e8945P6296N5994l211m303L1657J2959n0762o8790l0230o210j3161n013
36673f3719J5887O462j4233P166M2725J8569m6481o1449j5809J0641r727j8382
36661a28350J3646M4883M7895L9089K2156r218k1941J1705L9188k497o5688n2634
36649f1766K2018N1196Q934k2049J22K2926J0888l259m6n030k1090k0520j3765
36636c1441l5511o1638l5931K2068L7167N363m885K1448K9790J1359J9936N7983
36624C5708N8273L295m0457l3212j1764o311J107J5370J2874K384J6638L6409
$$ y = [36172, 37717, 29863, 10644, -23139, -52799, -72489, -92239, -91344, -37227, 34622, 38989, -35246, -95369, -68881, 10870, 68657, 70043, 18640, -60171, -111528, -94276, -47430, -44383, -75147, -58945, 17351, 73345, 70134, 65831, 97488, 110447, 59685, -9105, -39335, -45545, -58706, -63719, -47832, -41370, -55603, -48437, -5712, 12857, -33624, -95073, -110882, -100241, -109968, -128350, -114704, -69821, -21926, 17163, 39319, 30101, 8160, 19865, 59053, 56556, -9132, -61766, -39748, 11448, 20382, -1667, -1545, 21381, 32269, 29010, 28964, 23934, 2844, -17676, -31441, -66952, -128590, -164521, -142453, -105286, -99923, -104808, -83360, -53570, -42211, -22275, 35708, 93981, 97276, 56819, 23607, 11843, 5532, 6639, 22009, 34883, 37267, 53905, 90314]
36612I0314J1196m1984n3695j6606J0896J2465K3486L8745J9421j3024n035J4964
36600I1143k2687q2032n9489K8434N3772o482l0208L1838O8994J0964m7064j3586
36588B3597M6471L5758j6684l2301k1590l4654n0275k0645K9564M1211J6157J529
36576A8138J4069L3871L8958J3312l7146o2950k4699K9671K1674k5905j8993M2093
36564D2093N6108J509k1494K4768M0190l2036r5250o3913m511m421k1907J3294
36552f5570N7032L6373j1318j2044R763n180k4407J0414N3458K3967m2658m6357
36540a6527Q471K5576j9240m9275j9524K8466M9169M0819P674m5291p7833m6786
36528a14301K3869O6154N8512L7258K5882J1164j2163k4352j3281R029K1506Q039
$$ y = [90314, 101510, 59526, 5831, -10775, 121, 12586, 36072, 74817, 94238, 81214, 76179, 91143, 68456, -13576, -73065, -44631, 9141, 2659, -27549, 4289, 73283, 84247, 37183, 23597, 70068, 105826, 89142, 56841, 35251, 597, -49678, -70323, -40759, 452, 16609, 18138, 32207, 66078, 105036, 118348, 81202, 18252, -6447, 23224, 44898, 18993, 0, 42093, 98201, 99710, 78216, 102984, 143174, 111138, 15888, -48025, -52536, -56957, -78864, -65570, -8538, 27835, 16517, 4473, 14236, 9056, -15351, -4937, 48521, 72488, 29830, -16527, -8056, 17520, -1720, -50995, -70519, -42053, 7116, 47935, 55609, 10318, -67515, -114301, -90432, -24278, 34234, 71492, 97374, 108538, 96375, 72023, 58742, 67771, 89277, 97316]
36516I7316k7459m8853k1485L1758N1128K6408N965P529p003m4535n2712j7184
36504H73k30l1912m9928r204L5423K8125R234L1002N5620L0226p224L256L0253
36491A25514R474l6926m5016k8378m3726p1210m1057L6802P4972L9567r858j6603
36479f445R077K7808J8698j0840k7886m673K9537J2209m8243o2290j111L7178
36467b6981k0100q6478m1082P8226J27321O1947k6426n8772m2664q888K6680L9661
36455B2444J7244m742P997K3716r93l7692l5621j5461k4928l9625p398M1620L6344
36442a7095q373j6050J7046K4086l640m186L3801M5985N505l4457l2180r026P932
36429I348K1116K7144J2913o595o556k979k3821m5577k7782Q669J2306j1045j9099
$$ y = [97316, 69857, 21004, -481, 31277, 82405, 108813, 114778, 122307, 115304, 70769, 18057, 873, 643, -31269, -81197, -90401, -54978, -26853, -17619, 13383, 69003, 99229, 92005, 95261, 125514, 134988, 98062, 53046, 24668, -19058, -90268, -131325, -94523, -19551, 20016, 10158, -6445, 2632, 30440, 49138, 38298, 10412, 5739, 35276, 47485, -758, -63048, -64159, -26981, -47081, -133559, -174641, -96415, 30906, 92853, 66427, 7655, -35009, -43897, -17217, 22444, 39688, 34946, 42943, 66659, 65666, 27974, -7647, -23108, -48036, -87661, -95059, -53439, -17095, -25468, -41518, -24472, -386, -4026, -8212, 25589, 71574, 77079, 42622, 10442, 1416, 9348, 30464, 57608, 70521, 63926, 57370, 54391, 30570, -15007, -42789, -34120, -21814, -32859, -51958]
36416e1958j5913k8682l0866J5265O5531M8435p950j5201K5112K8813j9730m6233
36404c3377k0672O553J1731K3969L4397r0m8885k9240M3631N8024j2195n9895
36392b6049k2623K3571P302k5362j3609J2670Q509J33J8835L2505J4229J2J2460
36379D2583Q155l2381m6269O516O0309M6091J199q355l905l7163p7066n7872M
36366i8154K1038M026J9431P9040J00555K6959q3213j20791n1343N0716Q5493
36355C3757L1814l9331n4995k1051Q056J1467Q602M462j2151k4589n936K2939
36343c6956J8593n524J408L0941K4117j6950k2319K0968L7997m080l4490P96M7703
36330F2204L6380j1814l5683k8251j6955o161M690j311j5799J475M3545M0316
$$ y = [-51958, -67871, -96553, -127419, -112154, -46623, 1812, -6138, -21339, 3773, 32586, 12856, -33377, -54049, -47496, -35765, -11796, 22601, 22511, -26374, -55614, -11983, 46041, 33846, -26049, -48672, -25101, -17799, -43161, -56770, -44100, -35591, -35458, -16623, 15882, 30111, 30123, 42583, 50738, 18357, -27912, -21396, 38913, 85004, 86203, 77848, 73943, 36780, -40286, -98158, -98154, -77116, -73090, -53659, 25381, 125936, 152895, 69682, -51109, -102452, -51736, 33757, 65571, 26240, -28755, -49806, -41750, -30283, -21681, -17219, -29370, -53959, -59895, -36956, -18363, -23887, -22479, 8462, 32579, 15629, -6690, 14278, 52275, 48195, 13705, 14501, 62204, 98584, 86770, 51087, 22836, 5881, -280, 4410, 3099, -12700, -11225, 32320, 72636]
36318G2636k7827p5826l6143L6659N4733K3894L764K83j7671m0294l7232j9602
36306f2626j0154R604N3028P2894K8962k9196k8066J4931K5521o783k8133k0683
36294A9299j6741k1618n635K5469K8126k624k1358r049j081k0619l5930j0638
36282g2399L7351N4357J6885l5540l8654J9347P0223M3627l5385p4743m2533j481
36270e8945M43l111K0474L1584n259m0005j2726L8786L5266j3387k6091J5471
36258a7500M1276P393m2112m8912j7707P479O974l50Q261K4914J6286k6935n7633
36245i8566k6234L7653N5274J9157Q416N4109P5083P943p8015p9827j4393K2118
36233a7282N372p460N930Q951p237p318R513k500n0815p7424m1017K6117O5636
$$ y = [72636, 44809, -31017, -67160, -30501, 24232, 48126, 51890, 52173, 34502, -5792, -43024, -62626, -72780, -63176, -10148, 62746, 91708, 62512, 34446, 49377, 74898, 68115, 39982, 19299, 2558, -19060, -24695, 774, 28900, 26276, 4918, -4131, -5212, -25831, -61761, -72399, -35048, 19309, 36194, 654, -38000, -18653, 51570, 95197, 59812, -14931, -57464, -58945, -58502, -61613, -41139, -9555, -14814, -54819, -67545, -28759, 6507, -6880, -32971, -17500, 23776, 31169, -10943, -59855, -77562, -70083, -63109, -63459, -55198, -30284, -13998, -40933, -98566, -124800, -87147, -31873, -12716, -4300, 49809, 124892, 132835, 54820, -25007, -39400, -17282, -11910, -19370, -13440, -4489, -11726, -19044, -9531, -12031, -62846, -140270, -181287, -155170, -89534]
36220h9534O0050L6785L0696M7185M9378j455p8043r8136l3450L9375M2556L055
36208H462m961K3635L9057K7950J1493j4468n4537o1259K41O2312L2552n5707
36196A4770q2051k2691K3847N636j3430J2592L0968J495k0653J0484L6445n790
36184h378o0932l4840M8370P4736J1633m7365k3213M1503N2866n349n8254m1149
36172e0372K1032M7182N56o4193o5380O828P8437P7857J1517n3317o1861j7060
36160f8774L4812N0738K6954m523j2886J805J6342J2025r984l1297l0485o102
36148b1375J4761Q905m792J0793M7362N1843M637m4835m4711n276K8753L3368
36136G9433O705m3162q0847n7987J8221P4124O5176L3466K6699J8872k6076o8319
$$ y = [-89534, -29484, 7301, 37997, 85182, 134560, 133105, 55062, -43074, -76524, -37149, 5407, 8462, 3501, 27136, 66193, 94143, 105636, 91168, 36631, -24628, -24387, 37925, 70477, 14770, -67281, -89972, -66125, -60489, -73919, -61327, -30359, -28864, -49517, -39033, -2588, -8378, -69310, -104150, -55780, 18956, 30589, -16776, -39989, 1514, 54380, 49031, -9223, -50372, -29340, 17842, 18398, -45795, -111175, -104347, -25910, 51947, 63464, 10147, -51714, -68774, -33962, 16776, 43730, 39207, 26321, 28126, 44468, 56493, 46509, 15212, -15273, -21375, -6614, 2291, -2501, 8292, 55654, 107497, 112134, 67299, 22588, 17312, 46065, 79433, 86138, 42976, -37871, -95858, -77637, -3513, 61663, 95129, 121828, 140700, 114624, 46305]
36124D6305n1347n386k328l4821l2711J3980M0995J8585j1788j7835j4859j0791
36112f2001J3233M8266M9625P363k9723k2332J1562L2029K1515j2987m5698m2241
36100c1389j530K4775j920m2574l7130j560K779k1256j2567L5562N8015K6616
36088b179p069j929J4582Q282p768j2741j5076k1297j7772n619m266l979K9493
36075d7338Q3964R4310L4898l5577n4416l4473k8738n0608o3321l1573L4283P8031
36063b0558M9901k4782n7289r482M3451K0269l8967l6036K5587M8050k41m0833
36051d0930j9319J8832K0149K439J332J0474J3901J7256J7065l940l0682k3705
36039a7128J3372L5970L3515L3198K9753o242m9617m3278l479j330l4225l0146
$$ y = [46305, -5042, -10428, -12756, -47577, -80288, -66308, -25313, -6728, -18516, -36351, -51210, -62001, -48768, -502, 49123, 56486, 26763, 4431, 15993, 48022, 69537, 56550, 10852, -31389, -32919, -8144, -10064, -52638, -89768, -91328, -88549, -109805, -122372, -86810, -28795, -2179, -9248, -11177, 3405, 11687, 3919, -8822, -23898, -45195, -62967, -68586, -72852, -76831, -47338, 36626, 130936, 165834, 130257, 75841, 41368, 12630, -37978, -101299, -132872, -98589, -20558, 29343, 4561, -52728, -62210, -18759, 1510, -37457, -73493, -47906, 144, -97, -40930, -60249, -41417, -21268, -18829, -17497, -7023, 6878, 24134, 41199, 37259, 6577, -17128, -3756, 32214, 65729, 98927, 128680, 122438, 72821, 29543, 26064, 24734, -9491, -39637]
36027c9637J0188P305l7698k4612N9683R0375J0833o2123l2527K0766L7l6662
36015c4072M076O9624N3894j5728l7785j4660k0129m5299k8224O276j3065n5753
36003a30845l1293M1268N4824k003k8762J2399M7017L1876J4504J8187o305o8720
35991d7853r0778k6279N9427Q4791N4605K0307K078n597m408m654k1812l8032
35979a8205j5920L3311N1556K1314p731p17J4374Q073l74J0036J6029p310l6364
35966F8072l2560l14K3017J7976k477j7293j7814j1087j0661j8763k1407j0764
35954c4075p4r14k619N196J0715N705P587K3571K1618k0043o0538m4886J3386
35941g5371N0835M1413J2291j4593l8656m4938j2625L5957M8080J1563l0195l9790
$$ y = [-39637, -29449, -22144, -59842, -84454, -24771, 65604, 76437, 14314, -18213, 2553, 2590, -34072, -29996, 39628, 93522, 77794, 40009, 25349, 5220, -40079, -68303, -62027, -75092, -130845, -162138, -120870, -66046, -68049, -96811, -84412, -37395, -5519, 8985, 27172, 20867, -47853, -138631, -164910, -105483, -20692, 33913, 54220, 56298, 50701, 46293, 41639, 19827, -18205, -34125, -814, 50742, 72056, 64325, 63608, 77982, 86055, 85681, 95717, 111746, 104436, 68072, 35512, 35198, 58215, 76191, 73714, 56421, 38607, 27520, 16859, -1904, -23311, -34075, -34149, -35063, -37682, -32486, -21771, -16066, -8479, 15092, 36710, 16667, -43871, -88757, -75371, -24536, 16877, 29168, 14575, -24081, -69019, -81644, -45687, 2393, 13956, -16239, -56029]
35929e6029k3166k962Q468P971M637J7989M5196M8418R562k8637k1573N825K526
35916A8225k1539j9416L666K357j8558q105L4811N0639J8136j0471N403L8777
35904I3925M5867J7977l1343p7079p5408q298O0254M5842k8936n2651Q291N5159
35892E3600J3295m9236l1884M1518O6452J7201k9502j9282J2115R401k2786l8036
35880B2856j4231K3928L8274J7856j4614l0540k1704K258K7633L6724J1400m1813
35868E8027q3065p9557m3732r697J0050J7693N601k1435k3664K2810P0912N7082
35856a8975j17k1545J3073L7154K662n2047o6133l4005J0729M4910N8829M4181
35844A8716P902k4245l5179k9133j3097R009K4307K2508J5829J6829Q231k5519
$$ y = [-56029, -79195, -82157, -73689, -65718, -61081, -43092, 2104, 50522, 60084, 31447, 9874, 15699, 18225, -3314, -22730, -19064, -16707, -35265, -43370, -8559, 42080, 60216, 49745, 55148, 93925, 139792, 157769, 126426, 49347, -26061, -34359, 25895, 71737, 42801, -9850, -1559, 53600, 66895, 17659, -14225, 27293, 93745, 110946, 81444, 62162, 74277, 83678, 60892, 22856, 8625, 32553, 70827, 88683, 74069, 43529, 21825, 24083, 51716, 88440, 99840, 58027, -25038, -104595, -148327, -158024, -147974, -130281, -124680, -146115, -169779, -146969, -76057, -18975, -19092, -40637, -27564, 9590, 12252, -39795, -105928, -139933, -129204, -84294, -25465, 18716, 26618, 2373, -32806, -61939, -75036, -66027, -41720, -19212, -3383, 13446, 21677, -3842]
35832c842n2285l0134J9634L6522J2456m245M811P264p184m512K5494M4484K9774
35819G8237M002j6681m2669o2777m1989J0827L7463J5970j1282j4279j0045p87
35807e4010M0278Q9392O7310l5524j11325p6388J1370M4836J2981k1413l1883
35796f4376l2466j5119L0225O0566K7824l2898l9586J7382O1678M0607j2718l9373
35784A746k8352j0488q979j6092r866J4412L3981K7948P330o311j9200m4063n2852
35771a10786q470N7260O7685J7126j3574J5309M0330N751m2488l7803j216O226
35759d650j3047j5767m211j0642k2972l126L5781M0579L17l9770m2517j2425K5291
35746f7159M1829J8135k4514l2150R758M5736K9841o081j0644N932P010K467J7937
$$ y = [-3842, -56127, -86261, -66627, -30105, -17649, -21894, -17083, -9819, -17003, -21515, 3979, 48463, 78237, 82239, 65558, 22889, -39888, -81877, -71050, -33587, -17617, -28899, -43178, -53223, -54010, -13732, 75660, 142970, 107446, -3879, -80267, -68897, -24061, -11080, -32493, -64376, -96842, -111961, -81736, -21170, 6654, -26244, -65830, -48448, 13230, 53837, 41119, 1746, -26606, -37094, -46073, -62165, -72031, -57619, -23638, 4310, 11640, 5329, -13871, -57934, -110786, -119256, -61996, 5689, 22815, 9241, 24550, 64880, 70631, 28143, -9660, -10876, -4650, -17697, -33464, -37675, -48317, -71289, -74415, -38634, 1945, 2262, -37508, -80025, -92450, -67159, -25330, -7195, -31709, -63859, -54101, -8365, 21476, 15395, 4751, 10683, 17693, 20160, 38097]
35733C8097K8016m387m9220m7237p512R970m403m010K3623L6348J2384j9628l2184
35720b0143k5002O40L9066N5668K2900k2836j9919K4475M1011K090m2088m1186
35708A4676m086L1003L9814J8306j3411j4073L0651P1453N2517q182m8093n1594
35696A18981m8569l9373p60L9404K2094l8094n6736j0739K2129r178m7764k9125
35684g7730J2243P370l0525l2912R582L5599J1259k2151j1407L8488P5527O2134
35672G7477J1473l1363l7254j8332m225l880m503M43L603K183M213J5021L1098
35659D5954M3725L7932P71n3295q3213o9422m1147k9540j9097J6762N5644N1871
35647d3055R935j9411j3238J971M018L442J1538K0394K3010K0862R519j2125k2538
$$ y = [38097, 66113, 61726, 12506, -34731, -42243, -32273, -36676, -40686, -17063, 19285, 31669, 12041, -20143, -45145, -44505, -5439, 50229, 73129, 50293, 30374, 54849, 95860, 97950, 55862, 14676, 10590, 41593, 81407, 99713, 86302, 72229, 102880, 174333, 226850, 218668, 170575, 118981, 70412, 31039, 30279, 69683, 91777, 53683, -3053, -13792, 8337, -841, -48605, -77730, -65487, -58117, -88642, -121554, -111972, -76373, -65114, -87265, -98672, -60184, 15343, 77477, 88950, 57587, 20333, 2001, -2224, -6104, -10607, -10164, -6561, -4378, -165, 14856, 45954, 89679, 127611, 128382, 75087, -8126, -77548, -118695, -148235, -167332, -150570, -94926, -43055, -33120, -52531, -65769, -63798, -59780, -56338, -44800, -24406, -1396, 19466, 28985, 16860, -5678]
35634e678k203K8454L3268J4987N110O938n046l1938m2662k1806J3992M5286N8550
35621I7252L5928k0369o3810n0582j047L0988L3448K8708J4528k1577m7951k4781
35609A0735J7506J6508j4139m915M3189N2979M940k7651p180O838l0176o8826
35597a92n6207k3608k1290l4705k7317o422J0674L7665P1975O7000R529l3944
35585f842r606M0233M8630K4258J3163J1888p995l1236k7142j0539p677R68L5764
35572G3867N5840J7055m2605n4314k5927j7083l1777k2128J4953L1942J8372J2694
35560C0889K3191J4590j7051k8921o376J1600J09j5675j0302O381J8410K2779
35548D9624R797k8653o4122n4099p143K5039K6481L0603M5522L2168j8402n0288
$$ y = [-5678, -7881, 20573, 53841, 68828, 73938, 80876, 75830, 43892, 1230, -20576, -6584, 38702, 97252, 133180, 112811, 49001, -1581, -2628, 28360, 61808, 90516, 105044, 83467, 35516, 10735, 28241, 44749, 30610, 25695, 68884, 121863, 126803, 99152, 91972, 98810, 68634, -192, -56399, -80007, -101297, -136002, -163319, -169741, -159067, -121402, -49427, 17573, 27102, -6842, -16448, 23785, 72415, 96673, 109836, 121724, 113729, 82493, 55351, 44812, 37135, 38103, 73867, 129707, 146762, 104157, 49843, 23916, 6833, -24944, -47072, -32119, -177, 18195, 30889, 54080, 68670, 51619, 22698, 16322, 27922, 28031, 12356, 2054, 8435, 26845, 49624, 59421, 30768, -33354, -87453, -94596, -69557, -43076, -12473, 33049, 65217, 46815, -3473]
35536c473k4329J9143K3675k638j8361k1086l2119l7314o626L8963M3454L526
35524a7185j8847R006L7132J1808l4124k6002L5701O8209K6233l2390l5867k998
35512B0676k753m0958n6978k5717Q525J1267L361L775o960k9021j3088N7998J11583
35499D1710P6984m994l9115j4498l717l5292n6330l4046r874j8240k1685K2564
35487i6533Q0533Q3175K4294l4925m9031l1930j6803j0351j577P532K911j3821
35475e6526j7970N990L4206K6352j8310n1549l7411j25J4883R405K3129O0097
35463g829O9767K0225m3728m9579R084O1762M8397j0733n0002m3429k3113j7111
35451c6289j0277J3224K6698J886l0898j7904L0574M7471J0491k5654j9094k90
$$ y = [-3473, -27802, -8659, 15016, 12378, -5983, -27069, -59188, -96502, -103128, -64165, -20711, -17185, -36032, -27026, 10106, 21914, -12210, -38212, -2511, 65698, 91931, 59541, 23674, 20676, 17923, -23035, -80013, -105730, -97205, -85938, -82577, -78802, -85762, -114783, -127871, -69873, 41710, 118694, 113700, 74585, 60087, 56370, 21078, -35252, -69298, -79172, -97412, -119097, -96533, -16000, 67175, 91469, 56544, 7513, -24417, -41220, -51571, -53148, -45616, -42705, -56526, -74496, -68506, -34300, -7948, -26258, -77807, -115218, -115343, -100460, -91055, -67926, -7829, 61938, 82163, 38435, -11144, -2060, 59702, 108099, 97366, 47364, 3935, -19178, -36289, -46566, -33342, -6644, -4758, -35656, -53560, -22986, 24485, 34976, 9322, -9772, -10062]
35439a0062o134j4189O113K7217J1376j4597l329K2875N117m3180m7177L730K9106
35426c3134j3706n4077j6007N8409O6347m439n9140l3442K1765K5392j4175k0653
35414g6860K7681O3643L6201j0526j0437J7364N441m0649m6233Q72J8058l4112
35402d9557p1884j5834P3743Q0868P557l7838p706L0410J4331k7193l7256j1302
35390e1661J8484L1848K6510J0643M681J8774K5019q964n9366o7117k3051J9426
35378e4774K4467J2518P098n18j3782j2229M746N150j8194k5708M404L5939L1107
35365B24M690j1267j6452k1578j6581M611K0854J8537J7104K9781L4447J4312
35353G8682j0563k3337l8428n5260l5953K4532N9779K3887k7535j9876K2262K4223
$$ y = [-10062, -16196, -30385, -24272, 2945, 14321, -276, -3605, 19270, 24387, -18793, -65970, -62240, -33134, -46840, -100917, -116924, -58515, 7832, 3393, -55747, -89189, -67424, -42032, -56207, -76860, -49179, 14464, 50665, 40139, 29702, 47066, 52507, 11858, -34375, -33503, -15445, -49557, -121441, -137275, -63532, 17336, 24893, -12945, -20651, 9759, 24090, -3103, -40359, -51661, -33177, -1329, 25181, 35824, 40505, 59279, 84298, 75334, 15968, -51149, -74200, -54774, -30307, -17789, -10691, -11209, -24991, -37220, -32474, -27324, -45518, -71226, -66822, -30883, 224, 4914, -6353, -22805, -44383, -60964, -56353, -35499, -16962, 142, 29923, 64370, 78682, 68119, 44782, 6354, -48906, -84859, -60327, -548, 23339, -4196, -24072, -1810, 22413]
35341B2413r118j4366K613k3169p6086n6100N0084J14374N0109n2535o2062N053
35329d8790L6560Q334n381J8297J6225l2230n4021k149O2039O2898J9987L80J1250
35316I3399R141j3840k2564p134K343q952k0829k0274k0196k6124k2276l701J0010
35303e0997O576j285j891j567l573K686J6682J6787o659k9832k5830M04K3762
35290e4737K9681J8445m789k7942l3012j4439J1822K6192K3282R848n99P890L4531
35277B6173M9401K6774j2221k4904j2459j4425l4688l1305K510J2812k2862m1827
35265g7021Q174P2226N9814j9674o9342l8608K6490O4341O3521L9867N676k1329
35253A14135k1498j946Q561M14q719p339l347n182j4980l3279m6386k6733K2861
$$ y = [22413, 13295, -1071, 1542, -21627, -97713, -153813, -103729, 10645, 60754, 8219, -53843, -48790, -12230, -3896, -9277, 9020, 25245, -6985, -61006, -63155, -1116, 61782, 81769, 82149, 93399, 102540, 88700, 66136, 59002, 61345, 52393, 31564, 11290, -8906, -35030, -57306, -61007, -50997, -44421, -45706, -47597, -49164, -52737, -50051, -33369, -16582, -23241, -53073, -78903, -78499, -54737, -25056, -6611, -11400, -39342, -72354, -86793, -74971, -48779, -25497, -15649, -16248, -8358, 26173, 75574, 102348, 90127, 65223, 52764, 38339, 3651, -27654, -25144, -12332, -35194, -77021, -68847, 3379, 63193, 43519, -25823, -64431, -37941, 26400, 89921, 129788, 135464, 114135, 92637, 90691, 99252, 99666, 90947, 83608, 80261, 75079, 60099, 26820, -19566, -46299, -23438]
35240b3438M9861K0329j9206n556L6091K3963m7634q8220m3662K4296L0211j8412
35228f1377m5583j5695K9454L4103k871l0128q372L5031L5945j4471m4380o59
35216h9003O4516O3537L778k4980J3008N4100M0684j033k0257j9399k9732m7406
35204G813l6465J7560Q0281R2265K4826p4955j15113o2523J0851K5041k53M260
35192b6412L4921K9401j3127k4527J3696L9380J5791j9769l5278m3780l9913R750
35180e9867P9562Q3956Q048n3691l9412o426j6735l3130o209K4177N133k6282
35168d0876j2032J7861L243l2479k6823P138J1226p174M494L7744L6159J02j4781
35155a6198M132J5584O682M766J0917m61j7992n021K5428K1136k1338m8972l6305
$$ y = [-23438, 26423, 46752, 27546, 21990, 58081, 82044, 34410, -53810, -97472, -73176, -42965, -61377, -106960, -122655, -93201, -59098, -61969, -92097, -100469, -65438, -29493, -43964, -88344, -89003, -24487, 39050, 42828, 17848, 30856, 84956, 125640, 124607, 104350, 84951, 55219, 7813, -28652, -11092, 69189, 161454, 186280, 111325, -3788, -66311, -55460, -30419, -30672, -26412, 8509, 37910, 24783, 256, 13952, 53332, 69123, 49354, 14076, -29704, -69617, -59867, 19695, 103651, 111699, 58008, 18596, 12170, -4565, -37695, -43904, -19727, -14594, -40876, -52908, -35047, -31804, -64283, -91106, -83968, -72742, -79916, -75422, -37678, -1519, -1417, -16198, -12066, 3518, 10200, 14966, 25883, 25422, 7430, 2409, 27837, 48973, 27635, -21337, -57642]
35142e7642j1780J409O740k684l6124n9924k8648L5075O0313L3169J2509L0067
35130a7520M5404J9868k7482n9934o4784l7793K0193P4210P5350K7593j3195j8240
35118B3670j2255j1717K662L3170M4683K3958N975J2365J3831j3305l9147k6995
35106E6895P501K1630N145j7091k3862j5218n097r964l0591m1808k1096J4076
35094e9480K5927J1532L791J6281K5134J1822j1943k8335k9654r503K6588M5169
35082B7329K2138q481N202M5847M3153j4507n5450l6280o605j9318m0658j2378
35070e0008M1847M6464p041m2327p974N0475N5192l80m8661m0143k291J0367k968
35057B552R29K7421K7930j5878m9136k6423J3017J0442j4522l741L2190L1016
$$ y = [-57642, -69422, -68013, -61273, -63957, -100081, -160005, -188653, -153578, -93265, -60096, -47587, -17520, 27884, 47752, 20270, -39664, -104448, -142241, -122048, -47838, 27512, 55105, 41910, 23670, 11415, -302, 2360, 35530, 80213, 104171, 110146, 122511, 136342, 123037, 83890, 56895, 64396, 86026, 91171, 74080, 50218, 35000, 29903, 19939, -10652, -52460, -73556, -59480, -33553, -22021, -18230, -1949, 23185, 35007, 23064, -5271, -34925, -44428, -17840, 27329, 49467, 40986, 46188, 92035, 135188, 120681, 65231, 28951, 22346, 3028, -37630, -50008, -8161, 38303, 31262, -11065, -19039, 31436, 86628, 86248, 37587, -2556, -4847, 5520, 2552, 3481, 30902, 58832, 42954, -6182, -32605, -19588, -9146, -23668, -27409, 4781, 35797]
35045C5797j0471l0480q000J1288N076N004J8007K913m3843o0731j9498K2967
35033g1971J5504j3585j9674j0315J14L3908Q6044Q4456o573r6491p1553M3764
35021b6372J16436Q0763O23m3715n1144n9740p1362n3944M460O8504Q2357K7920
35009G4786m1588m9025J2506O3284L8768k5708m8951j3874K4563K5409M525q880
34997E5815j4645k7330m5722n1045k8061J3651L9463K3467j5373l1664j2301J1640
34985h2105J8484K2990L3754K7543m477k6080r986J3133L438k1323j7028J3348
34973b8309K9629K0396O737o631k9389m2421j4684L4403M6780J2037j2745Q367
34961B4170L2655O651m6947n8966j3829K8977J8059k5390m6417l1709j3495r321
$$ y = [35797, 25326, -5154, -13154, -1866, 3210, 8214, 26221, 29134, -14709, -75440, -94938, -71971, -56467, -70052, -89726, -100041, -99927, -66019, 20025, 104481, 97908, 1417, -70136, -26372, 90064, 170827, 171450, 127735, 76591, 16851, -54511, -108455, -103995, -35491, 46866, 74786, 33198, -15827, -3321, 59963, 98731, 73023, 24072, 10198, 34761, 60170, 64695, 55815, 41170, 13840, -31882, -82927, -110988, -97337, -57874, -34407, -49780, -81444, -93745, -82105, -63621, -40631, -6877, 20666, 16189, -9891, -19877, -6744, -3306, -24629, -41657, -28309, 1320, 21716, 28453, 21822, -7567, -49988, -64672, -30269, 16511, 28548, 15803, 24170, 56825, 63476, 16529, -42437, -56266, -27289, -9230, -34620, -81037, -112746, -126241, -135562]
34949a35562J723L1558M8369J9150l5172o3037m9106k0918L775L2642N8485M9463
34937e8630r29m8193m4715O741O1327P5593L7237k4482n4203k4144K5343L1264
34925a7791n775k3848N366L5056J7471k7314m7456k8170M913K2930J1525k0550
34913g3643l4361L939O5759P8746K2310l8848m0713L632M0164M3092J8413j9363
$$ y = [-135562, -133839, -102281, -53912, -34762, -69934, -132971, -182077, -202995, -199220, -166578, -108093, -58630, -59559, -107752, -152467, -145726, -84399, -8806, 28431, 3949, -50254, -74398, -49055, -17791, -23566, -47414, -42048, -6992, 10479, -16835, -64291, -92461, -87548, -64618, -53093, -73643, -108004, -104065, -38306, 40440, 62750, 23902, -16811, -13179, 26985, 70077, 88490, 69127]
$$ [...]
##END NTUPLES=NMR SPECTRUM
##END=
