##TITLE=31Pdec_IPEM41
 CDCl3, 24 sc
 25.7.2019
##JCAMPDX= 6.0         $$ Bruker NMR JCAMP-DX V2.0
##DATA TYPE= NMR SPECTRUM
##DATA CLASS= NTUPLES
##ORIGIN= UXNMR, Bruker Analytische Messtechnik GmbH
##OWNER= root
$$ XWIN-NMR		Version 3.5
$$ Thu Jul 25 15:25:12 2019 Russian Standard Time (UT+4h)  she@DPX200
##.OBSERVE FREQUENCY= 81.013821
##.OBSERVE NUCLEUS= ^31P
##.ACQUISITION MODE= SIMULTANEOUS
##.ACQUISITION SCHEME= undefined
##.AVERAGES= 24
##.DIGITISER RES= 17
##SPECTROMETER/DATA SYSTEM= spect
##.PULSE SEQUENCE= zgpg30
##.SOLVENT NAME= CDCl3
##.SHIFT REFERENCE= (INTERNAL, CDCl3, 0, 182.463)
##AUDIT TRAIL= $$ (NUMBER, WHEN, WHO, WHERE, WHAT)
$$ ##TITLE= Audit trail, XWIN-NMR		Version 3.5
$$ ##JCAMPDX= 5.01
$$ ##ORIGIN= Bruker BioSpin GmbH
$$ ##OWNER= she
$$ F:/spectra/data/she/nmr/P31/1/pdata/1/auditp.txt
$$ ##AUDIT TRAIL=  $$ (NUMBER, WHEN, WHO, WHERE, WHAT)
(   1,<2019-07-25 15:22:29.28 +0400>,<she>,<DPX200>,
      <created by zg, POWCHK disabled, PULCHK disabled
       configuration hash MD5:
       00 E9 B6 7A A2 85 ED C7 34 08 36 98 17 FE 4E 26
       data hash MD5: 32K
       D6 31 08 62 13 D2 4D BE E4 3A 63 D6 73 0D 74 A4>)
(   2,<2019-07-25 15:22:31.84 +0400>,<she>,<DPX200>,
      <Start of raw data processing
       efp BC_mod = 2 LB = 1 FT_mod = 6 PKNL = 1 PHC0 = -411.7604 PHC1 = 148.4 SI = 64K 
       data hash MD5: 64K
       59 1D B4 16 87 93 7D 29 B6 D9 F8 9E C7 87 D6 21>)
(   3,<2019-07-25 15:22:55.51 +0400>,<she>,<DPX200>,
      <pk PHC0 = -5.203562 PHC1 = 0 
       data hash MD5: 64K
       6B DB C2 08 49 A7 07 06 02 D9 1F AF 19 33 87 76>)
(   4,<2019-07-25 15:22:59.64 +0400>,<she>,<DPX200>,
      <abs ABSG = 5 
       data hash MD5: 64K
       B6 29 87 A2 E7 2B 40 6D 56 C5 06 EF 45 D5 29 EF>)
$$ ##END=
$$ 
$$ hash MD5
$$ 3F B1 9D 4C E5 8B 13 72 28 D9 A3 91 D2 0D 88 21
##$RELAX= 
##$RELAX= 
##$RELAX= 
##$RELAX= 
##$RELAX= 
##$RELAX= 
##$RELAX= 
##$RELAX= 
$$ Bruker specific parameters
$$ --------------------------
##$DU= <F:/spectra>
##$EXPNO= 1
##$NAME= <P31>
##$PROCNO= 1
##$TYPE= <nmr>
##$USER= <she>
##$AMP= (0..31)
100 100 100 100 100 100 100 100 100 100 100 100 100 100 100 100 100 100 
100 100 100 100 100 100 100 100 100 100 100 100 100 100 
##$AQSEQ= 0
##$AQ_mod= 1
##$AUNM= <au_zg>
##$AUTOPOS= <>
##$BF1= 81.014009
##$BF2= 200.13
##$BF3= 200.13
##$BF4= 200.13
##$BF5= 200.13
##$BF6= 200.13
##$BF7= 200.13
##$BF8= 200.13
##$BYTORDA= 1
##$CFDGTYP= 0
##$CFRGTYP= 5
##$CHEMSTR= <none>
##$CNST= (0..31)
1 1 145 1 1 1 1 1 1 1 1 1 1 1 1 1 1 1 1 1 1 1 1 1 1 1 1 1 1 1 1 1 
##$CPDPRG= <waltz16>
##$CPDPRG1= <>
##$CPDPRG2= <waltz16>
##$CPDPRG3= <>
##$CPDPRG4= <mlev>
##$CPDPRG5= <mlev>
##$CPDPRG6= <mlev>
##$CPDPRG7= <mlev>
##$CPDPRG8= <mlev>
##$CPDPRGB= <>
##$CPDPRGT= <>
##$D= (0..31)
0 1 0 0 0 0 0 0 0 0 0 0.03 2e-05 3e-06 0 0 0 0 0 0 0 0 0 0 0 0 0 0 0 0 
0 0 
##$DATE= 1564053748
##$DBL= (0..7)
120 120 120 11 120 120 24 19 
##$DBP= (0..7)
150 150 150 150 150 150 150 150 
##$DBP07= 0
##$DBPNAM0= <>
##$DBPNAM1= <>
##$DBPNAM2= <>
$$ [...]
##$SUBNAM3= <"">
##$SUBNAM4= <"">
##$SUBNAM5= <"">
##$SUBNAM6= <"">
##$SUBNAM7= <"">
##$SUBNAM8= <"">
##$SUBNAM9= <"">
##$SW= 369.568048894756
##$SWIBOX= (0..15)
0 1 3 0 0 0 0 0 0 0 0 0 0 0 0 0 
##$SW_h= 29940.119760479
##$TD= 32768
##$TD0= 1
##$TE= 0
##$TE2= 300
##$TE3= 300
##$TEG= 300
##$TL= (0..7)
0 120 53 12 22 120 120 120 
##$TP= (0..7)
150 150 150 150 150 150 150 150 
##$TP07= 0
##$TPNAME0= <>
##$TPNAME1= <>
##$TPNAME2= <>
##$TPNAME3= <>
##$TPNAME4= <>
##$TPNAME5= <>
##$TPNAME6= <>
##$TPNAME7= <>
##$TPOAL= (0..7)
0.5 0.5 0.5 0.5 0.5 0.5 0.5 0.5 
##$TPOFFS= (0..7)
0 0 0 0 0 0 0 0 
##$TUNHIN= 0
##$TUNHOUT= 0
##$TUNXOUT= 0
##$USERA1= <user>
##$USERA2= <user>
##$USERA3= <user>
##$USERA4= <user>
##$USERA5= <user>
##$V9= 5
##$VALIST= <valist>
##$VCLIST= <CCCCCCCCCCCCCCC>
##$VD= 0
##$VDLIST= <DDDDDDDDDDDDDDD>
##$VPLIST= <PPPPPPPPPPPPPPP>
##$VTLIST= <TTTTTTTTTTTTTTT>
##$WBST= 1024
##$WBSW= 4
##$XGAIN= (0..3)
0 0 0 0 
##$XL= 0
##$YL= 0
##$YMAX_a= 196191
##$YMIN_a= -199628
##$ZGOPTNS= <>
##$ZL1= 120
##$ZL2= 120
##$ZL3= 120
##$ZL4= 120
##$ABSF1= 182.463
##$ABSF2= -187.1042
##$ABSG= 5
##$ABSL= 3
##$ALPHA= 0
##$AQORDER= 0
##$ASSFAC= 0
##$ASSFACI= 0
##$ASSFACX= 0
##$ASSWID= 0
##$AUNMP= <proc_1d>
##$AZFE= 0.1
##$AZFW= 0.5
##$BCFW= 0
##$BC_mod= 2
##$BYTORDP= 0
##$COROFFS= 0
##$CY= -3
##$DATMOD= 1
##$DC= 0
##$DFILT= <>
##$DTYPP= 0
##$F1P= 0
##$F2P= 0
##$FCOR= 1
##$FTSIZE= 65536
##$FT_mod= 6
##$GAMMA= 0
##$GB= 0
##$INTBC= 1
##$INTSCL= 5.30512e-09
##$ISEN= 30
##$LB= 1
##$LEV0= 0
##$LPBIN= 0
##$MAXI= 10000
##$MC2= 0
##$MEAN= 0
##$ME_mod= 0
##$MI= 50
##$NCOEF= 0
##$NC_proc= 0
##$NLEV= 6
##$NOISF1= 182.463
##$NOISF2= 159.3651
##$NSP= 0
##$NTH_PI= 0
##$NZP= 0
##$OFFSET= 182.463
##$PC= 4
##$PHC0= -416.964
##$PHC1= 148.4
##$PH_mod= 1
##$PKNL= yes
##$PPARMOD= 0
##$PSCAL= 0
##$PSIGN= 0
##$REVERSE= no
##$SF= 81.0140089999434
##$SI= 65536
##$SIGF1= 159.3651
##$SIGF2= -187.1042
##$SINO= 113.3802
##$SIOLD= 16384
##$SREGLST= <1H.CDCl3>
##$SSB= 0
##$STSI= 65536
##$STSR= 0
##$SW_p= 29940.119760479
##$SYMM= 0
##$S_DEV= 0
##$TDeff= 32768
##$TDoff= 0
##$TI= <>
##$TILT= no
##$TM1= 0
##$TM2= 0
##$TOPLEV= 0
##$USERP1= <user>
##$USERP2= <user>
##$USERP3= <user>
##$USERP4= <user>
##$USERP5= <user>
##$WDW= 1
##$XDIM= 65536
##$YMAX_p= 312621763
##$YMIN_p= -1317448
$$ End of Bruker specific parameters
$$ ---------------------------------
##NTUPLES= NMR SPECTRUM
##VAR_NAME=  FREQUENCY,     SPECTRUM/REAL,   SPECTRUM/IMAG
##SYMBOL=    X,             R,               I
##VAR_TYPE=  INDEPENDENT,   DEPENDENT,       DEPENDENT
##VAR_FORM=  AFFN,          ASDF,            ASDF
##VAR_DIM=   65536,         65536,           65536
##UNITS=     HZ,            ARBITRARY UNITS, ARBITRARY UNITS
##FACTOR=    0.456856943014862, 1,           1
##FIRST=     14782.0589164792, 0,            0
##LAST=      -15158.0608439998, 0,           0
##MIN=       -15158.0608439998, -1317448,    0
##MAX=       14782.0589164792, 312621763,    0
$$ Real data points
##PAGE= N=1
##DATA TABLE= (X++(R..R)), XYDATA
$$ [...]
$$ plain form
42002 -41126 -39028 -32497 -39295 -39370 -14238 12071 14444 11839 26156 33492 6938 -26369 -26591 -10689
41988 -10689 -22373 -55599 -67921 -53859 -45662 -50286 -41360 -10561 20898 38223 39170 14357 -35405
41975 -35405 -73146 -61355 -14406 24251 41694 49773 40974 3112 -36944 -40328 -18273 -14579
41963 -14579 -35533 -50973 -54852 -66009 -75130 -53100 -12659 -954 -25131 -42365 -30909 -15493
41951 -15493 -13646 -11766 -6000 -14306 -33613 -33040 -3802 27227 43065 52457 54548 34481 1206
41938 1206 -16858 -19622 -31620 -48612 -41705 -18546 -20195 -47076 -51127 -18551 3505 -12760 -30731
41925 -30731 -15655 11215 20507 24266 38166 41082 15216 -12397 -10574 6643 10540 7304 17330
41912 17330 30222 20356 -9420 -33317 -39248 -33795 -23291 -11981 -7189 -9141 -7334 1625 6792
$$ packed form
42002d1126K098O531o798p5K5132K6309K373k605J4317P336k6554l3307k22J5902
41988a0689j1684l3226j2322J4062Q197m624Q926L0799L1459J7325R47k4813m9762
41975c5405l7741J1791M6949L8657J7443Q079q799l7862m0056l384K2055L694
41963a4579k0954j5440l879j1157r121K2030M0441J1705k4177j7234J1456J5416
41951a5493J847J880N766q306j9307N73K9238L1029J5838R392K091k0067l3275
41938A206j8064k764j1998j6992O907K3159j649k6881m051L2576K2056j6265j7971
41925c0731J5076K6870R292L759J3900K916k5866k7613J823J7217L897l236J0026
41912A7330J2892r866k9776k3897n931N453J0504J1310M792j952J807Q959N167
$$ plain form
41899 6792 1072 -9827 -20673 -30049 -30547 -18731 -11903 -26490 -44210 -34048 -3793 9714 -1303
41886 -1303 -11118 -11723 -18460 -23776 -1883 33150 33399 -5215 -31200 -21336 -14031 -35067 -54520 -50924
41872 -50924 -55500 -89615 -114826 -94836 -59127 -52409 -61085 -44320 -7122 10879 -1297 -19646
41860 -19646 -26446 -21151 -5414 12786 16199 2168 -10683 -15526 -27331 -43911 -35921 1069 25537
41847 25537 9777 -18284 -23210 -12618 -7450 -1367 14321 21506 6937 -10363 -14862 -21346 -36172
41834 -36172 -33740 -5071 14409 2190 -12414 -5850 -6704 -38495 -66727 -56624 -35621 -39622 -44021
41821 -44021 -15419 10336 -21554 -85902 -106058 -64244 -13216 8720 8259 -5479 -28906 -36540
41809 -36540 -6466 31427 27616 -13312 -43218 -44769 -41383 -42767 -36346 -26758 -30670 -37834 -27265
$$ packed form
41899F792n720j0899j0846r376m98J1816O828j4587j7720J0162L0255J3507j1017
41886a303r815o05o737n316K1893L5033K49l8614k5985R864P305k1036j9453L596
41872e0924m576l4115k5211J9990L5709O718q676J6765L7198J8001j2176j8349
41860a9646o800N295J5737J8200L413j4031j2851m843j1805j6580P990L6990K4468
41847B5537j5760k8061m926J0592N168O083J5688P185j4569j7300m499o484j4826
41834c6172K432K8669J9480j2219j4604O564q54l1791k8232J0103K1003m001m399
41821d4021K8602K5755l1890o4348k0156M1814N1028K1936m61j3738k3427p634
41809c6540L0074L7893l811m0928k9906j551L386j384O421R588l912p164J0569
$$ plain form
41796 -27265 -13364 -24901 -48625 -47277 -23506 -10932 -12472 -6045 -1201 -25218 -56891 -41995
41784 -41995 19996 68618 71921 63397 75658 93249 90489 69453 42774 17510 6869 20644
41772 20644 38535 30889 6966 1373 13832 8836 -23066 -50974 -54825 -45964 -33711 -16602 -8469
41759 -8469 -26158 -49277 -40517 -7928 2868 -20023 -44400 -56775 -76744 -100533 -91194 -41936
41747 -41936 6264 28221 42211 56513 45278 3659 -26106 -16060 4059 -3297 -28020 -37599
41735 -37599 -26242 -10940 -4173 -12024 -36355 -64012 -76025 -73694 -69936 -57521 -22786 12436
41723 12436 10207 -19095 -23377 11616 42884 43192 37266 45369 47126 29541 19603 36374 54943
41710 54943 49980 34547 25390 10447 -16798 -29348 -7990 21838 26436 7803 -15774 -41328
$$ packed form
41796b7265J3901j1537k3724J348K3771J2574j540O427M844k4017l1673J4896
41784d1995O1991M8622L303q524J2261J7591k760k1036k6679k5264j0641J3775
41772B0644J7891p646k3923n593J2459m996l1902k7908l851Q861J2253J7109Q133
41759h469j7689k3119Q760L2589J0796k2891k4377j2375j9969k3789R339M9258
41747d1936M8200K1957J3990J4302j1235m1619k9765J0046K0119p356k4723r579
41735c7599J1357J5302O767p851k4331k7657j2013K331L758J2415L4735L5222
41723A2436k229k9302m282L4993L1268L08n926Q103J757j7585r938J6771J8569
41710E4943m963j5433r157j4943k7245j2550K1358K9828M598j8633k3577k5554
$$ plain form
41698 -41328 -65930 -71817 -55646 -43620 -51188 -57342 -44453 -32076 -42828 -63741 -70258 -62875 -53939
41685 -53939 -43069 -29428 -23571 -25753 -17664 6412 27997 38400 50616 62467 48505 9381
41673 9381 -13501 927 19444 11636 -614 14020 42087 52445 45041 35443 21172 -225
41661 -225 -9282 2758 8186 -14199 -39196 -35150 -15077 -9135 -13213 -5125 12277 23116 29621
41648 29621 33860 15575 -30259 -61354 -41442 -2865 -4676 -45321 -70327 -56700 -35433 -31011
41636 -31011 -29763 -17431 -6174 -9554 -19635 -20930 -7809 16511 41599 50779 36731 14189
41624 14189 3788 8621 18132 24947 25363 15430 -535 -10217 -11489 -13023 -9640 16372 57116 74567
41610 74567 54705 33862 44608 66863 65577 47936 43397 48791 36950 8491 -5706 8985
$$ packed form
41698d1328k4602n887J6171J2026p568o154J2889J2377j0752k0913o517P383Q936
41685e3939J0870J3641N857k182Q089K4076K1585J0403J2216J1851j3962l9124
41673I381k2882J4428J8517p808j2250J4634K8067J0358p404r598j4271k1397
41661b25r057J2040N428k2385k4997M046K0073N942m078Q088J7402J0839O505
41648B9621M239j8285m5834l1095J9912L8577j811m0645k5006J3627K1267M422
41636c1011J248J2332J1257l380j0081j295J3121K4320K5088R180j4048k2542
41624A4189j0401M833R511O815M16r933j5965r682j272j534L383K6012M0744J7451
41610G4567j9862k0843J0746K2255j286j7641m539N394j1841k8459j4197J4691
$$ plain form
41598 8985 33779 44539 32563 1056 -37150 -61331 -59475 -40423 -21033 -11249 -16866 -38341
41586 -38341 -59019 -56074 -31195 -6741 12787 42902 77166 85059 65221 55171 67838 66178
41574 66178 27642 -14762 -28522 -30320 -40571 -38034 -6063 20481 6691 -21733 -21667 -2017 2346
41561 2346 -6950 -9216 -12929 -31705 -43066 -27782 -18894 -50709 -89443 -81193 -42341 -30902 -49447
41548 -49447 -52246 -34908 -38106 -65415 -73482 -49757 -31052 -35234 -37504 -26056 -23487 -39780 -54756
41535 -54756 -57494 -57308 -51162 -26634 1645 6468 -2577 5655 23416 14339 -18659 -36098 -32934
41522 -32934 -42456 -63766 -53743 -6409 26265 15949 -865 8782 21411 6760 -17019 -15376
41510 -15376 9504 29355 28350 8834 -18251 -33816 -24141 -2407 5680 -2619 -12359 -23122 -40497
$$ packed form
41598H985K4794J0760j1976l1507l8206k4181J856J9052J9390R784n617k1475
41586c8341k0678K945K4879K4454J9528L0115L4264P893j9838j0050J2667j660
41574F6178l8536m2404j3760j798j0251K537L1971K6544j3790k8424O6J9650M363
41561B346r296k266l713j8776j1361J5284Q888l1815l8734Q250L8852J1439j8545
41548d9447k799J7338l198k7309q067K3725J8705m182k270J1448K569j6293j4976
41535e4756k738J86O146K4528K8279M823r045Q232J7761r077l2998j7439L164
41522c2934r522k1310J0023M7334L2674j0316j6814R647J2629j4651k3779J643
41510a5376K4880J9851j005j9516k7085j5565R675K1734Q087q299r740j0763j7375
$$ plain form
41497 -40497 -46113 -20711 11584 11603 -10343 -13172 274 -8117 -32241 -24835 13321 25315 -3276
41484 -3276 -16155 15283 41700 22210 -9701 -12527 -5359 -18970 -33860 -21344 219 3515
41472 3515 5535 30897 58990 59576 48552 56989 72782 63601 34730 15886 9436 -3608 -22198
41459 -22198 -30619 -30704 -32464 -28401 -11265 131 -12633 -32805 -34893 -28449 -38499 -57436 -55818
41446 -55818 -32227 -14507 -14212 -13047 4171 30454 53592 70341 78608 70419 39659 -6063 -42572
41433 -42572 -44625 -14569 12153 8075 -8551 -2988 18587 18791 -6829 -21213 -8595 2310 -5560
41420 -5560 -6329 17809 37211 19855 -17605 -36895 -29170 -9010 17725 49822 73539 75373 58153
41407 58153 29931 -3962 -29449 -32326 -26931 -41557 -65563 -53778 -240 39090 22591 -22182
$$ packed form
41497d0497n616K5402L2295J9k1946k829J3446q391k4124P406L8156J1994k8591
41484c276j2879L1438K6417j9490l1911k826P168j3611j4890J2516K1563L296
41472C515K020K5362K8093N86j1024Q437J5793r181k8871j8844o450j3044j8590
41459b2198q421q5j760M063J7136J1396j2764k0172k088O444j0050j8937J618
41446e5818K3591J7720K95J165J7218K6283K3138J6749Q267q189l0760m5722l6509
41433d2572k053L0056K6722m078j6626N563K1575K04k5620j4384J2618J0905p870
41420e560p69K4138J9402j7356l7460j9290P725K0160K6735L2097K3717J834j7220
41407E8153k8222l3893k5487k877N395j4626k4006J1785N3538L9330j6499m4773
$$ plain form
41395 -22182 -48498 -51514 -46595 -30594 -4972 393 -30203 -62505 -59244 -34747 -24962 -31796 -35917
41382 -35917 -37831 -47678 -58498 -64157 -77065 -95229 -84056 -28845 27050 38072 19724 13220
41370 13220 18410 9754 -8830 -15979 -17393 -29592 -40503 -34400 -34016 -65902 -103334 -98779 -59357
41357 -59357 -34625 -37964 -34681 -5646 28234 47385 55116 54580 42494 28210 26065 29352 20694
41344 20694 2461 -11295 -22418 -38013 -46034 -34876 -23338 -35494 -58568 -61901 -44912 -29521
41332 -29521 -18415 336 19157 21487 17477 31051 58405 73370 65483 42984 12819 -11691
41320 -11691 -4353 36132 63772 41032 -4915 -24451 -19367 -24795 -40580 -38692 -23980 -27664 -47516
41307 -47516 -51223 -35479 -28171 -34614 -33179 -21943 -19618 -23077 -12835 4322 7561 8315 30769
$$ packed form
41395b2182k6316l016M919J6001K5622N365l0596l2302L261K4497R785o834m121
41382c5917j914r847j0820n659j2908j8164J1173N5211N5895J1022j8348o504
41370A3220N190q656j8584p149j414j2199j0911O103L84l1886l7432M555L9422
41357e9357K4732l339L283K9035L3880J9151P731n36j2086j4284k145L287q658
41344B0694j8233j3756j1123j5595q021J1158J1538j2156k3074l333J6989J5391
41332b9521J1106J8751J8821K330m010J3574K7354J4965p887k2499l0165k4510
41320a1691P338M0485K7640k2740m5947j9536N084n428j5785J888J4712l684j9852
41307d7516l707J5744P308o443J435J1236K325l459J0242J7157L239P54K2454
$$ plain form
41294 30769 55318 41528 1807 -12140 4583 5545 -20094 -27100 3450 29044 18144 -1856
41282 -1856 1764 17052 21212 20895 29484 39089 37882 25305 -2314 -47047 -82591 -72947 -27609
41269 -27609 3447 -918 -12314 -9439 -6236 -10134 -2648 18724 25734 8324 -3799 10060 29989
41256 29989 31900 19565 5386 -4461 4081 40745 76504 68336 27810 13112 40802 63556
41244 63556 54160 48931 77268 107005 99071 66557 39397 15274 -13862 -27665 -11266 12000
41232 12000 18955 23185 39095 47025 31368 16521 24696 32393 10525 -23980 -39290 -41626 -52587
41219 -52587 -59728 -37000 3346 22773 8138 -23883 -58989 -87287 -88377 -50711 2223 33659
41207 33659 33628 17409 -324 -9033 868 21482 25665 2809 -23049 -29376 -24905 -23070 -14328 9069
$$ packed form
41294C0769K4549j3790l9721j3947J6723R62k5639p006L0550K5594j0900k0000
41282a856L620J5288M160l17Q589R605j207j2577k7619m4733l5544R644M5338
41269b7609L1056m365j1396K875L203l898P486K1372P010j7410j2123J3859J9929
41256B9989J911j2335j4179r847Q542L6664L5759q168m0526j4698K7690K2754
41244F3556r396n229K8337K9737p934l2514k7160k4123k9136j3803J6399K3266
41232A2000O955M230J5910P930j5657j4847Q175P697k1868l4505j5310k336j0961
41219e2587p141K2728M0346J9427j4635l2021l5106k8298j090L7666N2934L1436
41207C3659l1j6219j7733q709R901K0614M183k2856k5858o327M471J835Q742K3397
$$ plain form
41193 9069 27789 23636 9646 5478 7018 5993 12641 30685 37380 18766 -2424 -4787 -5001 -22950
41179 -22950 -40437 -33720 -19034 -22575 -30120 -13373 13673 13674 -13168 -35462 -47526 -70980 -103619
41166 -103619 -114201 -91852 -60863 -41638 -31419 -26926 -32369 -39597 -31189 -11041 -5821 -27567
41154 -27567 -55503 -62372 -43541 -15630 2476 6197 9707 28878 55459 62079 40681 16615
41142 16615 11618 14358 5534 -9380 -14148 -8617 1105 19129 42112 46493 22197 -433 10107
41129 10107 36191 34690 1 -31615 -35808 -26364 -27885 -47610 -74876 -89997 -77007 -42750
41117 -42750 -15342 -9720 -7937 10305 34481 40731 26310 4892 -17047 -37236 -45932 -38441 -24433
41104 -24433 -7479 23497 63307 79017 56609 31020 35824 49314 30957 -10400 -30729 -19775
$$ packed form
41193I069J8720m153j3990m168J540j025O648J8044O695j8614k1190k363k14j7949
41179b2950j7487O717J4686l541p545J6747K7046Jk6842k2294j2064k3454l2639
41166a03619j0582K2349L0989J9225J0219M493n443p228Q408K0148N220k1746
41154b7567k7936o869J8831K7911J8106L721L510J9171K6581O620k1398k4066
41142A6615m997K740q824j4914m768N531R722J8024K2983M381k4296k2630J0540
41129A0107K6084j501l4689l1616m193R444j521j9725k7266j5121J2990L4257
41117d2750K7408N622J783J8242K4176O250j4421k1418k1939k0189q696P491J4008
41104b4433J6954L0976L9810J5710k2408k5589M804J3490j8357m1357k0329J0954
$$ plain form
41092 -19775 -10024 -22340 -44299 -61366 -73096 -77910 -72465 -64141 -57437 -36371 9669 53355 57983
41079 57983 31144 13116 16578 16401 -702 -15045 -9740 4000 6863 -6293 -29379 -51269 -58505
41066 -58505 -49141 -39734 -41321 -38264 -12435 23192 40839 38017 34822 40144 46958 52147 54860 45549
41052 45549 22782 7709 13534 17027 -5990 -34207 -31093 -8109 -9940 -41397 -58336 -36431
41040 -36431 -3946 5422 -6272 -20920 -32200 -38395 -33591 -20372 -12126 -13640 -15501 -11238 -3837
41027 -3837 4518 12479 12878 3806 -198 12342 28333 30647 29222 43857 64777 61868 30453 -1527
41013 -1527 -12730 -10221 -11408 -23956 -42430 -50598 -34640 -5750 6806 -1602 -758 22805 36996
41000 36996 16968 -8038 -1750 16757 6765 -23765 -35107 -22688 -11876 -3605 16242 27747
$$ packed form
41092a9775R751j2316k1959j7067j1730m814N445Q324O704K1066M6040M3686M628
41079E7983k6839j8028L462j77j7103j4343N305J3740K863j3156k3086k1890p236
41066e8505R364R407j587L057K5829L5627J7647k822l195N322O814N189K713r311
41052D5549k2767j5073N825L493k3017k8217L114K2984j831l1457j6939K1905
41040c6431L2485R368j1694j4648j1280o195M804J3219Q246j514j861M263P401
41027c837Q355P961L99r072m004J2540J5991K314j425J4635K0920k909l1415l1980
41013a527j1203K509j187j2548j8474q168J5958K8890J2556q408Q44K3563J4191
41000C6996k0028k5006O288J8507r992l0530j1342J2419J0812Q271J9847J1505
$$ plain form
40988 27747 610 -40885 -40424 5326 46615 63203 80087 98094 81805 32840 6385 28599
40976 28599 56569 48420 20300 4921 1939 -329 3536 13730 11637 -5895 -13093 3128 22548
40963 22548 29791 35423 41863 29184 -4087 -25976 -20589 -15047 -31639 -47929 -32390 7944 39828
40950 39828 41810 14517 -22962 -36824 -6627 42571 66172 60303 58203 65873 51981 12216
40938 12216 -11425 2309 18410 5135 -16300 -12322 12758 37541 58508 75253 74481 55893
40926 55893 42420 42052 33699 11224 949 11442 10316 -17918 -34728 -6841 35272 40930 11445
40913 11445 -12791 -13299 -1815 13365 32261 46815 48421 40975 27952 4369 -22384 -28097 -6700
40900 -6700 15316 17259 10133 7655 3004 -6166 -3893 9177 1413 -40791 -80373 -76313 -37225
$$ packed form
40988B7747k7137m1495M61M5750M1289J6588J6884J8007j6289m8965k6455K2214
40976B8599K7970q149k8120j5379k982k268L865J0194k093j7532p198J6221J9420
40963B2548P243N632O440j2679l3271k1889N387N542j6592j6290J5539M0334L1884
40950C9828J982k7293l7479j3862L0197M9198K3601n869k100P670j3892l9765
40938A2216k3641J3734J6101j3275k1435L978K5080K4783K0967J6745p72j8588
40926E5893j3473l68q353k2475j0275J0493j126k8234j6810K7887M2113N658k9485
40913A1445k4236n08J1484J5180J8896J4554J606p446j3023k3583k6753n713K1397
40900f700K2016J943p126k478m651r170K273J3070p764m2204l9582M060L9088
$$ plain form
40887 -37225 -401 18057 24963 23925 13762 -2405 -22382 -41936 -41844 -6847 38503 50649 29317
40874 29317 14685 16557 2064 -32942 -45537 -25136 -24058 -68763 -103839 -75280 -14548 16094
40862 16094 13649 10956 6250 -20174 -50909 -54025 -37342 -27827 -21353 -2107 14466 7662 -5521
40849 -5521 -1037 6905 -578 -537 30081 57479 37584 -4836 -8168 31375 60003 51158 30425
40836 30425 20701 17378 17476 26014 33336 25011 9896 5168 5596 342 1430 20278 38656 40181
40822 40181 42974 60293 62268 26358 -8846 849 27338 13865 -29661 -46612 -28995 -17207
40810 -17207 -17064 4033 40531 46089 14681 -7611 -3386 -8124 -37273 -54149 -34481 -7545 -6833
40797 -6833 -24503 -37244 -39294 -32661 -19218 -13732 -30490 -50495 -38600 1616 28170 20894 3285
$$ packed form
40887c7225L6824J8458O906j038j0163j6167j9977j9554R2L4997M5350J2146k1332
40874B9317j4632J872j4493l5006j2595K0401J078m4705l5076K8559O0732L0642
40862A6094k445k693m706k6424l0735l116J6683R515O474J9246J6573o804j3183
40849e521M484P942p483M1L0618K7398j9895m2420l332L9543K8628q845k0733
40836C0425r724l323R8Q538P322q325j5115m728M28n254J088J8848J8378J525
40822D0181K793J7319J975l5910l5204R695K6489j3473m3526j6951J7617J1788
40810a7207J43K1097L6498N558l1408k2292M225m738k9149j6876J9668K6936P12
40797f833j7670j2741k050O633J3443N486j6758k0005J1895M0216K6554p276j7609
$$ plain form
40784 3285 -921 4685 11096 18665 25058 27793 36223 51721 48455 11478 -22561 -10972 22993
40771 22993 20733 -17663 -34076 -8770 10534 -9153 -35603 -27283 8935 40734 51936 40858
40759 40858 11319 -17858 -23249 -6849 9911 21026 33145 35278 13231 -10087 3947 47405
40747 47405 71926 58830 35218 18095 -6157 -39746 -61293 -65581 -69679 -72989 -58585 -38995
40735 -38995 -48603 -82438 -95676 -74708 -55277 -57509 -58093 -43695 -36949 -47139 -45974 -17502 12686
40722 12686 21228 18305 15613 5316 -9475 -5401 19389 33375 20319 2434 -517 2851 3666
40709 3666 7094 6797 -13405 -41170 -42400 -17774 -7819 -29883 -55056 -58660 -47604 -28907 -799
40696 -799 16814 -2519 -36898 -34751 774 10338 -23569 -47152 -27989 -5575 -14656 -26545 -10809
$$ packed form
40784C285m206N606O411P569O393K735Q430J5498l266l6977l4039J1589L3965
40771B2993k260l8396j6413K5306J9304j9687k6450Q320L6218L1799J1202j1078
40759D0858k9539k9177n391J6400J6760J1115J2119K133k2047k3318J4034M3458
40747D7405K4521j3096k3612j7123k4252l3589k1547m288m098l310J4404J9590
40735c8995r608l3835j3238K0968J9431k232n84J4398O746j0190J165K8472L0188
40722A2686Q542k923k692j0297j4791M074K4790J3986j3056j7885k951L368Q15
40709C666L428k97k0202k7765j230K4626R955k2064k5173l604J1056J8697K8108
40696g99J7613j9333l4379K147L5525R564l3907k3583J9163K2414r081j1889J5736
$$ plain form
40683 -10809 5128 -12395 -41758 -44348 -23770 -4636 10418 25772 31002 25384 27293 34174 16156
40670 16156 -26691 -49713 -31851 -6075 4784 23759 59242 71438 40135 6226 1317 -4200
40658 -4200 -34184 -49191 -14410 29882 29929 4195 2932 22356 23574 2842 -19112 -47216 -91594
40645 -91594 -124821 -117050 -88625 -74776 -65748 -36416 -7502 -18379 -58692 -81572 -69693 -42097
40633 -42097 -13658 9165 12674 -3702 -13663 -5267 -5174 -26782 -34728 -4256 27592 21072 506
40620 506 4765 14101 -7900 -37651 -28997 3266 10994 -1562 5425 25825 20747 -801 6492
40607 6492 37933 41262 6547 -20324 -20522 -26774 -51206 -56415 -21996 17047 25680 17078 18924
40594 18924 28544 28703 21811 23094 32729 32094 6432 -31871 -46652 -18084 22097 22031 -19454 -49728
$$ packed form
40683a0809J5937j7523k9363k590K0578J9134J5054J5354N230n618J909O881j8018
40670A6156m2847k3022J7862K5776J0859J8975L5483J2196l1303l3909m909n517
40658d200k9984j5007L4781M4292M7k5734j263J9424J218k0732k1954k8104m4378
40645i1594l3227P771K8425J3849R028K9332K8914j0877m0313k2880J1879K7596
40633d2097K8439K2823L509j6376r961Q396R3k1608p946L0472L1848o520k0566
40620E06M259R336k2001k9751Q654L2263P728j2556O987K0400n078k1548P293
40607F492L1441L329l4715k6871j98o252k4432n209L4419L9043Q633q602J846
40594A8924R620J59o892J283R635o35k5662l8303j4781K8568M0181o6m1485l0274
$$ plain form
40580 -49728 -40315 -21758 -20354 -14277 11570 21140 -12085 -45930 -28729 18392 36410 15217
40568 15217 -10551 -24488 -32052 -27554 -10619 -9004 -34337 -45942 -10903 34844 41126 20646
40556 20646 10841 1243 -30297 -50470 -21109 17686 2571 -42218 -40262 11129 44316 38290
40544 38290 37646 58562 68102 60573 67709 86236 76718 40380 18944 15759 -2465 -24998 -4914
40531 -4914 46801 63428 29591 -651 -4131 -16075 -40896 -30575 19736 45066 15198 -17155
40519 -17155 -10140 4791 -5316 -16506 -6064 -149 -17294 -26424 -6398 8832 -12573 -48724
40507 -48724 -67118 -70517 -67009 -44516 -7140 11457 -181 -12632 -9752 -9720 -14302 3271 39665
40494 39665 54024 40408 39843 57949 47246 2075 -11051 38523 86345 73906 34437 19107
$$ packed form
40580d9728R413J8557J404O077K5847R570l3225l3845J7201M7121J8018k1193
40568A5217k5768j3937p564M498J6935J615k5333j1605L5039M5747O282k0480
40556B0646r805r598l1540k0173K9361L8795j5115m4789J956N1391L3187o026
40544C8290o44K0916R540p529P136J8527r518l6338k1436l185j8224k2533K0084
40531d914N1715J6627l3837l0242l480j1944k4821J0321N0311K5330k9868l2353
40519a7155P015J4931j0107j1190J0442N915j7145r130K0026J5230k1405l6151
40507d8724j8394l399L508K2493L7376J8597j1638j2451K880L2m582J7573L6394
40494C9665J4359j3616n65J8106j0703m5171j3126M9574M7822j2439l9469j5330
$$ plain form
40482 19107 9555 -26310 -53441 -22392 41834 76993 75330 72622 76441 68438 53965 52437 57102
40469 57102 50815 40752 37933 28893 5227 -9506 623 12234 8008 13483 45416 65336 36289
40456 36289 -10383 -19529 7045 28788 38126 57000 81270 84141 64487 44433 27447 688
40444 688 -28252 -34289 -11370 20142 36433 24715 -9342 -35673 -24911 8565 19217 -3330
40432 -3330 -20888 -13757 -10843 -29015 -36912 -13961 7522 2068 2818 43341 91098 93593 56179
40419 56179 21373 1695 -14774 -19628 2034 32123 39066 20503 -6969 -35539 -52410 -32692
40407 -32692 17205 45361 23191 -9442 -9499 2119 -11732 -33359 -26873 -9222 -19295 -43882
40395 -43882 -40032 -10740 5190 2964 9730 23960 16510 -12287 -29302 -21018 -6314 -1489 -8984
$$ packed form
40482A9107r552l5865k7131L1049O4226L5159j663k708L819q003j4473j528M665
40469E7102o287j0063k819r040k3666j4733J0129J1611m226N475L1933J9920k9047
40456C6289m6672r146K6574K1743R338J8874K4270K871j9654k0054j6986k6759
40444F88k8940o037K2919L1512J6291j1718l4057k6331J0762L3476J0652k2547
40432c330j7558P131K914j8172p897K2951K1483n454P50M0523M7757K495l7414
40419E6179l4806j9678j6469m854K1662L0089O943j8563k7472k8570j6871J9718
40407c2692M9897K8156k2170l2633n7J1618j3851k1627O486J7651j0073k4587
40395d3882L850K9292J5930k226O766J4230p450k8797j7015Q284J4704M825p495
$$ plain form
40382 -8984 -30265 -55820 -59124 -34794 -20190 -42342 -70988 -66042 -41081 -31009 -27688 -5102
40370 -5102 17568 2088 -35753 -42649 -10009 18385 17170 3899 -6056 -19040 -34583 -38865 -29029
40357 -29029 -12477 11707 41354 55078 38657 10368 -9529 -30071 -58095 -67806 -42550 -13761
40345 -13761 -11708 -11366 20100 56126 51983 24062 22093 44812 50776 35948 32411 41689 36042
40332 36042 19234 23211 49052 68627 76823 85163 75375 21355 -50981 -87252 -81031 -67951 -55400
40319 -55400 -23584 12406 12568 -16174 -25021 -2809 12827 5813 -240 1760 -10156 -37074 -53208
40306 -53208 -53053 -50582 -35602 9106 52238 41929 -11072 -44398 -37766 -26897 -24521 -4147 29459
40293 29459 31508 -4170 -29378 -22645 -17080 -29197 -30277 -10499 -2788 -18186 -24074 -11762 -18210
$$ packed form
40382h984k1281k5555l304K4330J4604k2152k8646M946K4961J0072L321K2586
40370e102K2670j5480l7841o896L2640K8394j215j3271r955j2984j5543m282R836
40357b9029J6552K4184K9647J3724j6421k8289j9897k0542k8024r711K5256K8789
40345a3761K053L42L1466L6026m143k7921j969K2719N964j4828l537R278n647
40332C6042j6808L977K5841J9575Q196Q340r788n4020p2336l6271O221J3080J2551
40319e5400L1816L5990J62k8742q847K2212J5636p014o053K000j1916k6918j6134
40306e3208J55K471J4980M4708M3132j0309n3001l3326O632J0869K376K0374L3606
40293B9459K049l5678k5208O733N565j2117j080J9778P711j5398n888J2312o448
$$ plain form
40280 -18210 -52368 -67965 -43033 -20660 -32890 -47519 -33457 -19186 -36128 -54793 -31761 17105
40268 17105 40773 23458 -10589 -39999 -58907 -65199 -62779 -59748 -50113 -19959 19845 38343
40256 38343 31498 29685 46971 58893 43742 12459 -13074 -20041 20 39240 57824 24295
40244 24295 -29393 -41275 -6476 23264 25153 26409 36376 28965 6083 5621 26111 17790 -24544
40231 -24544 -36980 7809 46021 23644 -16448 -7973 34709 50723 28359 2902 -11373 -28104
40219 -28104 -46165 -49186 -36957 -22810 -12181 -7075 -11954 -15814 5098 46920 69422 47500
40207 47500 2522 -33946 -55142 -62629 -51543 -29885 -17393 -11039 11072 41974 47126 23897
40195 23897 8429 9966 -4292 -40350 -55372 -31148 -8274 -14840 -21165 -2430 12786 -912
$$ packed form
40280a8210l4158j5597K4932K2373j2230j4629J4062J4271j6942j8665K3032M8866
40268A7105K3668j7315l4047k9410j8908o292K420L031R635L0154L9804J8498
40256C8343o845j813J7286J1922j5151l1283k5533o967K0061L9220J8584l3529
40244B4295n3688j1882L4799K9740J889J256R967p411k2882m62K0490q321m2334
40231b4544j2436M4789L8212k2377m0092Q475M2682J6014k2364k5457j4275j6731
40219b8104j8061l021J2229J4147J0629N106m879l860K0912M1822K2502k1922
40207D7500m4978l6468k1196p487J1086K1658J2492O354K2111L0902N152k3229
40195B3897j5468J537j4258l6058j5022K4224K2874o566o325J8735J5216j3698
$$ plain form
40183 -912 -15882 -3851 12123 4252 -9096 -5506 -5503 -29000 -47379 -28492 7982 26597 31416
40170 31416 40861 43199 22404 -3144 -9088 -2698 1695 10577 23598 18343 -5367 -10424 14733
40157 14733 26972 -221 -27451 -14235 17223 28547 25178 22398 3334 -36234 -51295 -12836
40145 -12836 35998 44907 31047 31554 31099 1992 -28706 -21768 3278 7943 7827 35973 69027
40132 69027 63251 33378 22954 25638 10493 -3206 22644 60747 49985 -130 -19160 12212
40120 12212 38096 21611 -7709 -14297 -4594 1542 1292 -1763 -4257 3064 18442 15747 -19540
40107 -19540 -57280 -62433 -48964 -53645 -76011 -87383 -80003 -63050 -30186 22497 64566 63347
40095 63347 32291 7569 -2579 -7170 -316 17009 14734 -19408 -43248 -20256 18588 26428
$$ packed form
40183i12j4970J2031J5974p871j3348L590Lk3497j8379J8887L6474J8615M819
40170C1416R445K338k0795k5548n944O390M393Q882J3021n255k3710n057K5157
40157A4733J2239k7193k7230J3216L1458J1324l369k780j9064l9568j5061L8459
40145a2836M8834Q909j3860N07m55k9107l0698O938K5046M665j16K8146L3054
40132F9027n776k9873j0424K684j5145j3699K5850L8103j0762n0115j9030L1372
40120A2212K5884j6485k9320o588R703O136k50l055k494P321J5378k695l5287
40107a9540l7740n153J3469m681k2366j1372P380J6953L2864N2683M2069j219
40095F3347l1056k4722j0148m591O854J7325k275l4142k3840K2992L8844P840
$$ plain form
40083 26428 15992 23246 34002 15588 -11885 -9458 4102 -14307 -46409 -38279 6951 39337
40071 39337 48486 62077 73168 50320 11476 6838 31007 29552 -7361 -32708 -25042 -11250
40059 -11250 -5088 7664 21492 15959 7018 25684 48870 23249 -43596 -89226 -93201 -92651 -100139
40046 -100139 -86102 -51619 -39347 -56538 -60875 -39186 -28506 -40960 -38605 -5660 19957 11665
40034 11665 -8082 -16888 -24146 -34721 -33059 -19882 -15780 -17707 -1589 25948 31449 14051 6035
40021 6035 12132 6444 -9206 -5836 12029 10155 -8768 -8110 11132 10588 -11161 -16577 -5079 -14957
40007 -14957 -43073 -42099 -8290 9055 -1226 4204 31486 30045 -9551 -26826 4653 28413
39995 28413 1191 -39537 -48142 -39014 -36687 -24826 7469 27705 12954 -12432 -28524 -52580
$$ packed form
40083B6428j0436P254J0756j8414k7473K427J3560j8409l2102Q130M5230L2386
40071C9337R149J3591J1091k2848l8844m638K4169j455l6913k5347P666J3792
40059a1250O162J2752J3828n533q941J8666K3186k5621o6845m5630l975N50p488
40046a00139J4037L4483J2272j7191m337K1689J0680j2454K355L2945K5617q292
40034A1665j9747q806p258j0575J662J3177M102j927J6118K7537N501j7398q016
40021F035O097n688j5650L370J7865j874j8923O58J9242n44k1749n416J1498r878
40007a4957k8116R74L3809J7345j0281N430K7282j441l9596j7275L1479K3760
39995B8413k7222m0728q605R128K327J1861L2295K0236j4751k5386j6092k4056
$$ plain form
39983 -52580 -85332 -85414 -37758 9268 15662 5813 15261 34569 43712 50771 60161 52468 29346 27449
39969 27449 56172 74172 57846 37498 35398 27752 2201 -8070 13558 29107 9779 -17591
39957 -17591 -25966 -33606 -55505 -65949 -49781 -35564 -38382 -26824 12327 35991 16141 -8961
39945 -8961 -2699 7561 -12787 -40517 -40901 -30880 -40405 -52947 -38717 -11545 -3233 -12173 -19197
39932 -19197 -24333 -33493 -40150 -45981 -62146 -71581 -39896 16395 32453 -8264 -44231 -32913 -8146
39919 -8146 -3543 7753 47838 77461 60726 26622 12051 929 -26630 -41688 -18606 12655
39907 12655 18338 13311 14870 1324 -34891 -52418 -29233 -5230 -8723 -7903 13670 9176 -42241
39894 -42241 -75683 -42115 3684 -4088 -31746 -14601 28543 41714 35610 49530 58801 18747
$$ packed form
39983e2580l2752q2M7656M7026O394r849R448J9308R143P059R390p693k3122j897
39969B7449K8723J8000j6326k0348k100p646k5551j0271K1628J5549j9328k7370
39957a7591q375p640k1899j0444J6168J4217k818J1558L9151K3664j9850k5102
39945h961O262J0260k0348k7730l84J0021r525j2542J4230K7172Q312q940p024
39932a9197n136r160o657n831j6165r435L1685N6291J6058m0717l5967J1318K4767
39919h146M603J1296M0085K9623j6735l4104j4571j1122k7559j5058K3082L1261
39907A2655N683n027J559j3546l6215j7527K3185K4003l493Q20K1573m494n1417
39894d2241l3442L3568M5799p772k7658J7145M3144J3171o104J3920R271m0054
$$ plain form
39882 18747 -37474 -40890 2504 30179 24679 15103 5481 -18459 -37400 -27881 -15687 -30868 -45114
39869 -45114 -24271 -1170 -19268 -47697 -35745 -8225 -15956 -31982 4048 69916 90734 62595
39857 62595 47535 61172 61151 36739 18264 4809 -30415 -68359 -60300 -11219 28244 43631
39845 43631 57230 62391 35100 -2080 -4745 17366 22474 16361 32569 53282 33121 -13852
39833 -13852 -33451 -23040 -22518 -30472 -14154 12139 5539 -21292 -20542 0 -5281 -25605 -10817
39820 -10817 27147 25750 -18746 -46929 -39628 -32664 -28691 9781 72440 98864 76836 58838
39808 58838 69720 77991 67601 60547 60494 46807 26937 24783 24242 -2133 -24063 4182 51296
39795 51296 50752 16712 17430 49595 50077 21881 27966 60522 43111 -24785 -51804 -5695 42732
$$ packed form
39882A8747n6221l416M3394K7675n500r576r622k3940j8941R519J2194j5181j4246
39869d5114K0843K3101j8098k8429J1952K7520p731j6026L6030O5868K0818k8139
39857F2595j5060J3637k1k4412j8475j3455l5224l7944Q059M9081L9463J5387
39845D3631J3599N161k7291l7180k665K2111N108o113J6208K0713k0161m6973
39833a3852j9599J0411N22p954J6318K6293o600k6831P50K0542n281k0324J4788
39820a0817L7964j397m4496k8183P301O964L973L8472O2659K6424k2028j7998
39808E8838J0882Q271j0390p054n3j3687j9870k154n41k6375k1930K8245M7114
39795E1296n44l4040P18L2165M82k8196O085L2556j7411o7896k7019M6109M8427
$$ plain form
39782 42732 55074 80860 138313 159984 110113 49979 32535 28825 9826 6415 34451 48988
39770 48988 25962 7086 16087 13813 -16640 -25464 12786 45669 32367 8791 11572 12725 -15848
39757 -15848 -41617 -27701 9692 41643 64903 69127 33216 -16932 -19734 25736 51914 35203
39745 35203 28905 56295 67665 41719 31313 62208 82779 63940 51758 67546 56250 -4408
39733 -4408 -44039 -18465 8979 -18649 -51433 -30553 2567 -11452 -37392 -13475 33844 40240
39721 40240 13321 258 -4804 -32350 -60221 -49498 -20961 -19861 -39692 -48601 -52841 -69751
39709 -69751 -79213 -63806 -52479 -64340 -59506 -9142 38838 32196 381 -2639 9816 -2740
39697 -2740 -24458 -18001 -572 -7366 -17340 7773 45050 46431 22423 17281 29031 24201 6497
$$ packed form
39782D2732J2342K5786N7453K1671m9871o0134j7444l710j8999l411K8036J4537
39770D8988k3026j8876R001k274l0453q824L8250L2883j3302k3576K781J153k8573
39757a5848k5769J3916L7393L1951K3260M224l5911n0148k802M5470K6178j6711
39745C5203o298K7390J1370k5946j0406L0895K0571j8839j2182J5788j1296o0658
39733d408l9631K5574K7444k7628l2784K0880L3120j4019k5940K3917M7319O396
39721D0240k6919j3063n062k7546k7871J0723K8537J100j9831q909m240j6910
39709f9751r462J5407J1327j1861M834N0364M7980o642l1815l020J2455j2556
39697b740k1718O457J7429o794r974K5113L7277J381k4008n142J1750m830j7704
$$ plain form
39684 6497 4520 14912 18119 24604 47647 58727 27186 -23600 -52565 -61857 -70888 -67088 -37226
39671 -37226 -10328 -13475 -21315 -3572 17342 12390 7385 37177 76432 77725 45057 12525 -15286
39658 -15286 -46348 -61042 -43745 -20262 -15478 -12605 2230 4499 -13322 -8191 38563 72753
39646 72753 51610 14138 5614 -744 -36502 -61835 -38034 -11641 -38068 -79992 -73533 -40756
39634 -40756 -40415 -56772 -37416 882 3858 -19554 -24067 -19221 -38531 -54826 -25366 12975 -4478
39621 -4478 -53157 -56344 -13337 11842 6566 10607 19681 -7775 -58717 -79362 -71761 -82169 -103930
39608 -103930 -87037 -36422 -7808 -11797 -10509 -441 -9984 -25261 -8695 18987 6069 -32262
39596 -32262 -35898 -8163 -6072 -31760 -33772 -12119 -19166 -52425 -47804 8532 55183 55597 36547
$$ packed form
39684F497j977J0392L207O485K3043J1080l1541n0786k8965r292r031L800K9862
39671c7226K6898l147p840J7743K0914m952n005K9792L9255J293l2668l2532k7811
39658a5286l1062j4694J7297K3483M784K873J4835K269j7821N131M6754L4190
39646G2753k1143l7472q524o358l5758k5333K3801K6393k6427m1924O459L2777
39634d0756L41j6357J9356L8298K976k3412m513M846j9310j6295K9460L8341j7453
39621d478m8679l187M3007K5179n276M041R074k7456n0942k0645P601j0408k1761
39608a03930J6893N0615K8614l989J288J0068r543j5277J6566K7682j2918l8331
39596c2262l636K7735K091k5688k012K1653p047l3259M621N6336M6651M14j9050
$$ plain form
39583 36547 16312 -19772 -60032 -64619 -36231 -19354 -23164 -16967 -384 -1705 -10972 5381 29543
39570 29543 15615 -19937 -20094 7449 1452 -39570 -54216 -31083 -24098 -45855 -45800 -10652 9661
39557 9661 -4063 -11416 3375 6539 -7122 1680 35219 46659 28535 28764 58862 69809 40184
39544 40184 8096 -3335 -13653 -23701 -7541 20863 15665 -13811 -9439 30749 44343 15643
39532 15643 548 20438 26886 -1203 -19009 -6029 -5460 -38402 -62765 -53142 -42078 -47424 -35635
39519 -35635 8017 45134 51852 52522 59529 48212 15403 -4811 -3792 -10165 -25746 -19301 7241
39506 7241 19563 20774 41201 61347 36474 -4113 13724 75713 87156 28222 -15529 -1570
39494 -1570 9641 -22040 -50002 -42477 -40470 -63748 -61674 -10769 32942 29021 10951 6316 -10235
$$ packed form
39583C6547k0235l6084m0260m587K8388J6877l810O197J6583j321r267J6353K4162
39570B9543j3928l5552j57K7543n997m1022j4646K3133O985k1757N5L5148K0313
39557I661j3724p353J4791L164j3661Q802L3539J1440j8124K29L0098J0947k9625
39544D0184l2088j1431j0318j0048J6160K8404n198k9476M372M0188J3594k8700
39532A5643j5095J9890O448k8089j7806J2980N69l2942k4363R623J1064n346J1789
39519c5635M3652L7117O718O70P007j1317l2809k0214J019o373j5581O445K6542
39506G241J2322J211K0427K0146k4873m0587J7837O1989J1443n8934m3751J3959
39494a570J1211l1681k7962P525K007k3278K074N0905M3711l921j8070m635j6551
$$ plain form
39481 -10235 -43317 -49573 -24705 -23456 -54792 -56428 -12247 10141 -18476 -38365 -19054 -15112
39469 -15112 -49710 -57024 -4410 38216 19781 -6387 11389 34093 21032 8373 25867 32393
39457 32393 6362 2469 45721 68746 30083 -6082 13016 34300 5030 -28707 -19116 -11674
39445 -11674 -47305 -66876 -16514 40973 26020 -26935 -42380 -30751 -39056 -47410 -19664 7868
39433 7868 -10848 -39702 -24117 12745 22969 19003 24493 11261 -32192 -46392 -812 33122
39421 33122 -1838 -45944 -31326 -3066 -24716 -52595 -22873 18546 -1308 -44443 -35019 -2461
39409 -2461 -19945 -60836 -49820 -4300 6960 -2131 26151 64569 43205 -15786 -33569 -11798
39397 -11798 -11000 -25577 -5080 30544 21988 -9584 3693 47174 49657 16229 13824 42546 41548
$$ packed form
39481a0235l3082o256K4868J249l1336j636M4181K2388k8617j9889J9311L942
39469a5112l4598p314N2614M2626j8435k6168J7776K2704j3061j2659J7494O526
39457C2393k6031l893M3252K3025l8663l6165J9098K1284k9270l3737R591P442
39445a1674l5631j9571N0362N7487j4953n2955j5445J1629q305q354K7746K7532
39433G868j8716k8854J5585L6862J0224l966N490j3232m3453j4200M5580L3934
39421C3122l4960m4106J4618K8260k1650k7879K9722M1419j9854m3135R424L2558
39409b461j7484m0891J1016M5520J1260r091K8282L8418k1364n8991j7783K1771
39397a1798P98j4577K0497L5624q556l1572J3277M3481K483l3428k405K8722r98
$$ plain form
39384 41548 9775 4775 31335 41020 31236 39073 51129 24433 -19529 -26481 -14913 -41712 -82992
39371 -82992 -64095 5156 40619 22406 11565 30735 35976 10418 -12982 -24467 -43077 -53457
39359 -53457 -23778 22485 36444 28608 39917 54005 29495 -8459 -5681 20404 17318 4098
39347 4098 35613 89604 99733 75242 76142 95730 83160 56485 72074 105159 86401 36311
39335 36311 32451 60125 34499 -35955 -50690 11877 61397 48587 22389 16298 1739 -23036
39323 -23036 -14680 20465 21017 -19820 -40989 -23201 -10688 -15038 -612 27410 24260 -589 5154
39310 5154 31231 18964 -21203 -20369 20349 29203 -5203 -20241 -811 4364 -7449 12072 51839
39297 51839 47976 7143 -89 26495 17611 -25339 -26069 19950 32755 -2506 -12813 16048 11710
$$ packed form
39384D1548l1773n000K6560R685r784P837J2056k6696m3962o952J1568k6799m1280
39371h2992J8897O9251L5463j8213j0841J9170N241k5558k3400j1485j8610j0380
39359e3457K9679M6263J3959p836J1309J4088k4510l7954K778K6085l086j3220
39347D098L1515N3991J0129k4491R00J9588j2570k6675J5589L3085j8758n0090
39335C6311l860K7674k5626p0454j4735O2567M9520j2810k6198o091j4559k4775
39323b3036Q356L5145N52m0837k1169J7788J2513m350J4426K8022l150k4849N743
39310E154K6077j2267m0167Q34M0718Q854l4406j5038J9430N175j1813J9521L9767
39297E1839l863m0833p232K6584q884m2950p30M6019J2805l5261j0307K8861m338
$$ plain form
39284 11710 -40156 -64465 -39467 -31119 -54291 -42600 8565 15132 -37451 -54852 -1309 37548
39272 37548 13798 -3191 32283 59727 38765 27510 63715 89709 65621 41836 53244 55263
39260 55263 26910 22068 56787 62666 15324 -8401 33214 69868 45499 7382 2465 -1476
39248 -1476 -24087 -16610 31751 44096 -14436 -64062 -38420 17904 44887 54082 57615 21056
39236 21056 -46480 -64351 -7863 43793 45142 53113 99129 119375 82334 59033 90382 109354
39224 109354 72801 43800 61753 60559 4051 -27520 18863 67067 52574 37823 81600 118918
39212 118918 85115 41510 60142 94823 83593 69966 104147 133155 112687 120577 226019
39201 226019 342798 349076 270280 213869 200750 186087 171456 173375 150433 76940 19532 34231
$$ packed form
39284A1710n1866k4309K4998Q348k3172J1691N1165O567n2583j7401N3543L8857
39272C7548k3750j6989L5474K7444k0962j1255L6205K5994k4088k3785J1408K019
39260E5263k8353m842L4719N879m7342k3725M1615L6654k4369l8117m917l941
39248a476k2611P477M8361J2345n8532m9626K5642N6324K6983R195L533l6559
39236B1056o7536j7871N6488N1656J349P971M6016K0246l7041k3301L1349J8972
39224A09354l6553k9001J7953j194n6508l1571M6383M8204j4493j4751M3777L7318
39212A18918l3803m3605J8632L4681j1230j3627L4181K9008k0468P890J05442
39201B26019J16779O278p8796n6411j3119j4663j4631J919k2942p3493n7408J4699
$$ plain form
39189 34231 63996 43019 17193 49504 92900 76546 36926 42718 66718 51547 27019 44030
39177 44030 65800 40283 5889 12522 17241 -26977 -62428 -26439 23347 6231 -41133 -44988
39165 -44988 -30549 -50090 -60645 -8461 46329 28009 -10633 16585 67267 49518 -9127 -20281
39153 -20281 4287 -1890 -17005 17905 64447 51063 14880 34075 76705 63642 23498 34119
39141 34119 66722 43164 -4287 12144 69138 77837 51477 69198 112221 94951 27243 -6699
39129 -6699 301 -4920 -5555 48022 107251 84748 12591 -7806 21201 20755 -3001 18066 64188
39116 64188 60446 28862 48887 96241 82235 24978 17356 50937 38650 -10762 -11113 28216
39104 28216 19812 -26167 -17384 39607 47887 5222 6213 57671 65121 13076 -8973 25680 47887
$$ packed form
39189C4231K9765k0977k5826L2311M3396j6354l9620N792K4000j5171k4528J7011
39177D4030K1770k5517l4394O633M719m4218l5451L5989M9786j7116m7364l855
39165d4988J4439j9541j0555N2184N4790j8320l8642K7218N0682j7749n8645j1154
39153b0281K4568o177j5115L4910M6542j3384l6183J9195M2630j3063m0144J0621
39141C4119L2603k3558m7451J6431N6994Q699k6360J7721M3023j7270o7708l3942
39129f699P000n221o35N3577N9229k2503p2157k0397K9007m46k3756K1067M6122
39116F4188l742l1584K0025M7354j4006n7257p622L3581j2287m9412l51L9329
39104B8216q404m5979Q783N6991Q280m2665R91N1458P450n2045k2049L4653K2207
$$ plain form
39091 47887 39982 59129 100938 93699 40648 18600 28867 1483 -49775 -35703 38511 71794
39079 71794 45304 42856 82626 89315 49583 36909 64133 65175 37738 50004 93850 88098
39067 88098 37813 30607 66310 56453 2888 3404 63551 79940 33794 23215 73730 94308
39055 94308 56710 42920 75249 73409 22917 13412 62955 74334 15752 -21224 6407 27410
39043 27410 11312 24659 80843 95870 47589 22506 54715 73997 57402 70288 113772 99925
39031 99925 25333 -1696 45042 63280 17899 699 40124 40507 -22661 -37418 36799 82644
39019 82644 33140 -13936 17662 57182 44777 45329 102001 136407 98140 62722 82022 84949
39007 84949 22827 -31826 -24018 -10495 -29178 -20566 37226 64891 35398 36858 100397 126431
$$ packed form
39091D7887p905J9147M1809p239n3051k2048J0267k7384n1258J4072P4214L3283
39079G1794k6490k448L9770O689l9732j2674K7224J042k7437J2266M3846n752
39067H8098n0285p206L5703r857n3565N16O0147J6389m6146j0579N0515K0578
39055I4308l7598j3790L2329j840n0492r505M9543J1379n8582l6976K7631K1003
39043B7410j6098J3347N6184J5027m8281k5083L2209J9282j6595J2886M3484j3847
39031I9925p4592k7029M6738J8238m5381j7200L9425L83o3168j4757P4217M5845
39019H2644m9504m7076L1598L9520j2405N52N6672L4406l8267l5418J9300K927
39007H4949o2122n4653P808J3523j8683Q612N7792K7665k9493J460O3539K6034
$$ plain form
38995 126431 69072 28444 65176 89029 33350 -22857 -12062 2038 -32749 -51434 -13002
38984 -13002 9123 -20749 -18515 48494 76138 16689 -14920 55390 122750 92556 39066 46518
38972 46518 58816 21337 8109 68175 103873 42989 -21542 -1122 34796 10302 -12220 21080
38960 21080 27999 -43811 -88189 -30367 20413 -31700 -86187 -31992 46203 29315 -22323 -3672
38948 -3672 32018 -3865 -46112 -2052 60310 39872 -5203 20789 60166 21031 -32854 -1580
38936 -1580 57294 43199 5983 35946 74971 29971 -35606 -16762 34424 17233 -19413 17657
38924 17657 69834 35950 -25006 -1219 60832 52757 13921 42937 95672 75745 33665 70324
38912 70324 132629 112069 58073 83970 146304 128713 63218 57286 82006 45339 -4178 36712
$$ packed form
38995A26431n7359m0628L6732K3853n5679n6207J0795J4100l4787j8685L8432
38984a3002K2125k9872K234O7009K7644n9449l1609P0310O7360l0194n3490P452
38972D6518J2298l7479j3228O0066L5698o0884o4531K0420L5918k4494k2522L3300
38960B1080O919p1810m4378N7822N0780n2113n4487N4195P8195j6888n1638J8651
38948c672L5690l5883m2247M4060O2362k0438m5075K5992L9377l9135n3885L1274
38936a580N8874j4095l7216K9963L9025m5000o5577J8844N1186j7191l6646L7070
38924A7657N2177l3884o0956K3787O2051q075l8836K9016N2735j9927m2080L6659
38912G0324O2305k0560n3996K5897O2334j7591o5495n932K4720l6667m9517M0890
$$ plain form
38900 36712 113123 102341 44208 63667 132818 128662 63164 40103 47348 6919 -34439 17602
38888 17602 101789 91793 24299 20993 55151 20461 -40780 -13904 51720 24916 -49978 -25580
38876 -25580 73054 97144 52044 71105 148050 151857 85434 79047 141177 156964 119711 127905
38864 127905 168578 138450 63299 62617 115661 98076 29267 41349 120568 126581 57337 47050
38852 47050 106258 110457 47503 33824 81336 84847 42130 52495 100399 76472 6551 19477
38840 19477 95740 93603 16161 938 52509 45344 -12176 14931 114141 130245 54847 38540
38828 38540 99059 94169 8924 -9525 62779 83048 22322 16123 91942 117758 68157 70811
38816 70811 139788 135223 41140 10593 77837 98580 35282 24996 97827 106899 14183 -28228
$$ packed form
38900C6712P6411j0782n8133J9459O9151m156o5498k3061P245m0429m1358N2041
38888A7602Q4187r996o7494l306L4158l4690o1241K6876O5624k6804p4894K4398
38876b5580R8634K4090m5100J9061P6945L807o6423o387O2130J5787l7253Q194
38864A27905M0673l0128p5151o82N3044j7585o8809J2082P9219O013o9244j0287
38852D7050N9208M199o2954j3679M7512L511m2717J0365M7904k3927o9921J2926
38840A9477P6263k137p7442j5223N1571p165n7520K7107R9210J6104p5398j6307
38828C8540O0519m890q5245j8449P2304K0269o0726o199P5819K5816m9601K654
38816G0811O8977m565r4083l0547O7244K0743o3298j0286P2831R072r2716m2411
$$ plain form
38804 -28228 37492 78152 37377 32394 100624 116690 48299 30274 97590 110839 35119 22521
38792 22521 121658 174740 105745 46229 71206 74090 10551 2848 89100 125793 51875 -974
38780 -974 34544 48118 -5252 -9988 62783 78673 10303 10297 112221 143280 46528 -2324 76937
38767 76937 121206 41454 -8837 64939 118706 54561 6249 71556 128335 85337 54642 109927
38755 109927 133148 63101 35094 114243 154899 82821 44050 112724 133418 24523 -47719
38744 -47719 22801 86965 37033 7203 84991 118265 18418 -37656 70097 168146 105338
38733 105338 24540 79820 156025 117013 70163 133547 191882 130762 67523 110206 137227
38722 137227 53054 3457 94104 160525 69868 -16373 58232 152558 105412 36855 90049
$$ packed form
38804b8228O5720M0660m0775m983O8230J6066o8391j8025O7316J3249p5720j2598
38792B2521R9137N3082o8995n9516K4977K884o3539p703Q6252L6693p3918n2849
38780i74L5518J3574n3370m736P2771J5890o8370oJ01924L1059r6752m8852P9261
38767G6937M4269p9752n0291P3776N3767o4145m8312O5307N6779m2998l0695N5285
38755A09927K3221p0047k8007P9149M0656p2078l8771O8674K0694j08895p2242
38744d7719P0520O4164m9932k9830P7788L3274r9847n6074J07753R8049o2808
38733A05338q0798N5280P6205l9012m6850O3384N8335o1120o3239M2683K7021
38722A37227q4173m9597R0647O6421r0657q6241P4605R4326m7146o8557N3194
$$ plain form
38711 90049 138085 43776 -45609 32522 140476 101126 31213 100995 198608 155023 76184
38700 76184 127556 207193 157100 85215 150992 240303 181229 79500 113318 196135 167429
38689 167429 114489 177238 239741 150404 44501 107340 217951 172886 64902 88660 166183
38678 166183 122222 41586 92156 177230 123457 31391 80207 170536 125063 52819 138456
38667 138456 259050 198442 60964 77255 174038 138374 40990 86851 201020 173297 69083
38656 69083 91606 178461 137142 38794 75658 170932 131679 41502 96291 202718 153257
38645 153257 45149 102561 236550 212660 101838 125202 206213 130663 167 59617 216495
38634 216495 205970 95838 143495 283893 256229 118148 130337 241186 194678 47502
$$ packed form
38711I0049M8036r4309q9385P8131J07954l9350o9913O9782R7613m3585p8839
38700G6184N1372P9637n0093p1885O5777Q9311n9074j01729L3818Q2817k8706
38689A67429n2940O2749O2503q9337j05903O2839J10611m5065j07984K3758P7523
38678A66183m3961q0636N0570Q5074n3773r2066M8816R0329m5473p2244Q5637
38667A38456J20594o0608j37478J6291R6783l5664r7384M5861J14169k7723j04214
38656F9083K2523Q6855m1319r8348L6864R5274l9253r0177N4789J06427m9461
38645A53257j08108N7412J33989k3890j10822K3364Q1011p5550j30496N9450J56878
38634B16495j0525j10132M7657J40398k7664j38081J2189J10849m6508j47176
$$ plain form
38624 47502 64743 195088 167037 21787 32311 172264 183764 94409 143946 274961 227588
38613 227588 67097 81097 223892 206225 65353 89808 243876 234227 90537 105937 253951
38602 253951 246233 118086 162929 332719 310915 140306 158894 347236 372148 248115 304998
38591 304998 520158 549069 408255 449127 662201 706520 622884 790120 1184031 1461318
38581 1461318 1773626 2606746 3704999 4087512 3395074 2380200 1768730 1447153 1109225
38572 1109225 897763 956815 1025853 933364 939948 1220810 1524952 1644703 1699049 1709242 1458674
38561 1458674 1007965 763801 807873 753621 473574 325009 435332 446382 225428 138719
38551 138719 331805 427956 249362 151054 314861 398014 223645 137624 323068 434627
$$ packed form
38624D7502J7241J30345k8051j45250J0524J39953J1500q9355M9537J31015m7373
38613B27588j60491J4000J42795j7667j40872K4455J54068r649j43690J5400J48014
38602B53951p718j28147M4843J69790k1804j70609J8588J88342K4912j24033N6883
38591C04998K15160K8911j40814M0872K13074M4319q3636J67236L93911K77287
38581A461318L12308Q33120J098253L82513o92438j014874o11470l21577l37928
38572A109225k11462N9052O9038r2489O584K80862L04142J19751N4346J0193k50568
38561A458674m50709k44164M4072n4252k80047j48565J10323J1050k20954q6709
38551A38719J93086R6151j78594r8308J63807Q3153j74369q6021J85444J11559
$$ plain form
38541 434627 277870 183139 336876 411124 230524 135716 304398 385233 191542 81219
38531 81219 256865 370903 220414 142787 320960 399365 200357 107969 319972 444680
38521 444680 269472 186001 407871 528283 322086 212209 447863 602564 402232 261551
38511 261551 463334 604390 413353 310400 571595 749553 530012 348840 535287 668118
38501 668118 428304 253621 472160 629830 379554 187466 427367 632284 404591 206059
38491 206059 453414 694457 502871 325405 591467 846488 643328 430207 663249 911846
38481 911846 751864 645157 989108 1218854 847771 466701 672555 947749 687328 382030
38471 382030 634566 950523 707557 393147 641322 965224 720202 400683 668969 1023873
$$ packed form
38541D34627j56757r4731J53737P4248j80600r4808J68682Q0835j93691j10323
38531H1219J75646J14038j50489p7627J78173P8405j99008r2388K12003J24708
38521D44680j75208q3471K21870J20412k06197j09877K35654J54701k00332j40681
38511B61551K01783J41056j91037j02953K61195J77958k19541j81172J86447J32831
38501F68118k39814j74683K18539J57670k50276j92088K39901K04917k27693j98532
38491B06059K47355K41043j91586j77466K66062K55021k03160k13121K33042K48597
38481I11846j59982j06707L43951K29746l71083l81070K05854K75194k60421l05298
38471C82030K52536L15957k42966l14410K48175L23902k45022l19519K68286L54904
$$ plain form
38461 1023873 784497 460343 750436 1129265 870817 517237 830759 1258747 1001052
38452 1001052 619856 960445 1459959 1223930 790977 1066421 1506156 1196142 721667
38443 721667 1047619 1566630 1259268 752441 1131941 1767995 1517571 1011219 1432496 2117995
38433 2117995 1813180 1209785 1653694 2441462 2127987 1401113 1773229 2554354 2191318
38424 2191318 1460930 2058273 3171051 2951545 2217980 2942819 4258824 4030057 3199713
38415 3199713 4165009 6003705 6114523 5450518 6874705 9441251 10088630 9906852 12278757
38406 12278757 15884417 16899808 17200963 21941292 29708473 34986059 40014647 52249350
38398 52249350 69970025 86506053 111915443 168715230 252035663 312621763 302786183
$$ packed form
38461A023873k39376l24154K90093L78829k58448l53580L13522M27988k57695
38452A001052l81196L40589M99514k36029m32953K75444M39735l10014m74475
38443G21667L25952N19011l07362n06827L79500O36054k50424n06352M21277O85499
38433B117995l04815o03395M43909P87768l13475p26874L72116P81125l63036
38424B191318p30388N97343J112778k19506p33565P24839J316005k28767q30344
38415C199713R65296J838696J10818o64005J424187K566546O47379j81778K371905
38406A2278757L605660J015391L01155M740329P767181N277586N028588J2234703
38398E2249350J7720675J6536028K5409390N6799787Q3320433O0586100r835580
$$ plain form
38391 302786183 231780553 154351180 108620169 87220720 68538057 49912546 39445510
38384 39445510 35130425 28783561 20776282 16992799 16748516 14732871 10970726 9470628
38376 9470628 9854858 8471979 5682188 4869537 5827308 5461912 3767114 3374997 4223963
38367 4223963 3909995 2514298 2289462 3196119 3144332 2127666 2043554 2860370 2772080 1800947
38357 1800947 1700929 2588300 2966585 2765893 3193929 3898723 3379346 1979113 1498829
38348 1498829 2016653 1948228 1106708 882661 1437529 1460070 783097 643120 1199855 1263812
38338 1263812 668931 562349 1122042 1236810 696410 546030 1003883 1095945 636406 576330
38328 576330 1090864 1242575 848352 817138 1316806 1419880 911840 696417 1045497 1144925
$$ packed form
38391C02786183p1005630p7429373m5731011k1399449j8682663j8625511j0467036
38384C9445510m315085o346864q007279l783483k44283k015645l762145j500098
38376I470628L84230j382879k789791q12651R57771l65396j694798l92117Q48966
38367D223963l13968j395697k24836R06657n1787j016666q4112Q16816q8290r71133
38357A800947j00018Q87371L78285k00692M28036P04794n19377j400233m80284
38348A498829N17824o8425q41520k24047N54868K2541o76973j39977N56735O3957
38338A263812n94881j06582N59693J14768n40400j50380M57853R2062m59539o0076
38328E76330N14534J51711l94223l1214M99668J03074n08040k15423L49080R9428
$$ plain form
38318 1144925 749931 639789 1036581 1170219 818320 732517 1128152 1258379 904857 817315
38308 817315 1240593 1443512 1157954 1080822 1480647 1677350 1397090 1314823 1739196 2039348
38298 2039348 1900960 1915273 2390305 2772472 2784464 2980723 3635029 4199833 4412249 4847579
38288 4847579 5834040 6882600 7737347 8946689 10841432 12975261 15133243 17828204
38280 17828204 21108687 23813965 24741859 23828029 21658107 18664468 15370742 12571176
38272 12571176 10578729 8923861 7276999 5973257 5212740 4554667 3707432 3042817 2811190
38263 2811190 2605385 2125894 1732584 1702381 1666538 1330674 1047872 1120021 1206559 985216
38253 985216 749714 796512 847757 636795 457384 578334 698214 527302 344462 439178
$$ packed form
38318A144925l94994j10142L96792J33638l51899q5803L95635J30227l53522q7542
38308H17315M23278K02919k85558p7132L99825J96703k80260q2267M24373L00152
38298B039348j38388J4313M75032L82167J1992J96259O54306N64804K12416M35330
38288D847579R86461J048560Q54747J209342J894743K133829K157982K694961
38280A7828204L280483K705278R27894r13830k169922k993639l293726k799566
38272A2571176j992447j654868j646862j303742p60517o58073q47235o64615k31627
38263B811190k05805m79491l93310l0203l5843l35864k82802P2149Q6538k21343
38253I85216k35502M6798N1245k10962j79411J20950J19880j70912j82840R4716
$$ plain form
38243 439178 554777 418218 280768 402104 525495 391802 258250 383307 503959 350229
38233 350229 183453 294689 448024 352494 225141 354598 546896 533340 512536 769313
38223 769313 1142275 1351159 1462513 1576808 1476782 1063550 726223 789111 981794 924381
38213 924381 735298 684997 659058 466102 292836 349847 425705 278545 112215 185064
38203 185064 308439 217997 83874 160586 281594 198493 80482 176242 312419 232532
38193 232532 109865 212452 370400 293313 121496 143892 249544 178103 49276 123790
38183 123790 283384 257505 135432 159499 241439 173478 86344 202234 358707 276982 88128
38172 88128 93997 214003 173811 46313 91553 232451 200730 56735 69713 213020 251852
$$ packed form
38243D39178J15599j36559j37450J21336J23391j33693j33552J25057J20652j53730
38233C50229j66776J11236J53335r5530j27353J29457J92298j3556k0804K56777
38223G69313L72962K08884J11354J14295j00026m13232l37327O2888J92683n7413
38213I24381j89083n0301k5939j92956j73266N7011P5858j47160j66330P2849
38203A85064J23375r0442j34123P6712J21008q3101j18011R5760J36177p9887
38193B32532j22667J02587J57948p7087j71817K2396J05652p1441j28827P4514
38183A23790J59594k5879j22073K4067Q1940o7961q7134J15890J56473q1725j88854
38172H8128N869J20006m0192j27498M5240J40898l1721j43995J2978J43307L8832
$$ plain form
38161 251852 203573 250798 326994 241805 91574 102501 195074 139472 5149 16144 101332
38150 101332 38384 -90774 -45165 101218 89373 -35916 -25962 87789 68784 -55904 -56769
38139 -56769 44615 29085 -79528 -62923 61540 82619 10267 35218 131192 105889 -6507
38128 -6507 -4709 86157 75506 -3341 37724 150598 131449 26577 51330 166315 147506
38117 147506 23905 26676 145612 156650 60375 73649 200590 224923 127320 110150 201230
38106 201230 220048 148656 163266 283472 343366 320265 363642 512530 695900 947979 1281037
38095 1281037 1437168 1163917 669922 397154 398713 365907 211261 153079 234066 238069 127077
38084 127077 109990 217672 236727 127694 93560 168599 150492 11764 -28787 75783 110657
$$ packed form
38161B51852m8279M7225P6196q5189j50231J0927R2573n5602j34323J0995Q5188
38150A01332o2948j29158M5609J46383j1845j25289R954J13751j9005j24688q65
38139e6769J01384j5530j08613J6605J24463K1079p2352K4951R5974k5303j12396
38128f507J798R0866j0651p8847M1065J12874j9149j04872K4753J14985j8809
38117A47506j23601K771J18936J1038r6275J3274J26941K4333r7603j7170R1080
38106B01230J8818p1392J4610J20206N9894k3101M3377J48888J83370K52079L33058
38095A281037J56131k73251m93995k72768J559l2806j54646n8182Q0987M003j10992
38084A27077j7087J07682J9055j09033l4134P5039j8107j38728m0551J04570L4874
$$ plain form
38073 110657 11833 -24268 64970 90858 -9967 -55525 22029 59328 3544 13193 118491
38062 118491 136563 27032 -18357 58838 78715 -17296 -54156 24481 43799 -50641 -77651
38051 -77651 26061 81127 14957 -4694 89751 129203 41706 -8833 50007 59971 -45148
38040 -45148 -98989 -20926 38700 1992 -1124 73728 75644 -30837 -67575 16510 35311 -72328
38028 -72328 -109381 5568 74261 -10323 -68443 16769 87194 32034 -2963 78890 127978
38017 127978 54782 22360 128743 201572 118408 33831 75604 110750 32864 -11357 87809
38006 87809 171118 104294 30495 91712 166156 126267 95801 197706 297143 253135 187600
37995 187600 245090 313600 246107 143304 154437 200614 152443 86519 113371 141639 62605
$$ packed form
38073A10657r8824l6101Q9238K5888j00825m5558P7554L7299n5784R649J05298
38062A18491J8072j09531m5389P7195J9877r6011l6860P8637J9318r4440k7010
38051g7651J03712N5066o6170j9651R4445L9452q7497n0539N8840R964j05119
38040d5148n3841P8063N9626l6708l116P4852J916j06481l6738Q4085J8801j07639
38028g2328l7053J14949O8693q4584n8120Q5212P0425n5160l4997Q1853M9088
38017A27978p3196l2422J06383P2829q3164q4577M1773L5146p7886m4221R9166
38006H7809Q3309o6824p3799O1217P4444l9889l0466J01905R9437m4008o5535
37995A87600N7490O8510o7493j02803J1133M6177m8171o5924K6852K8268p9034
$$ plain form
37984 62605 -17760 22444 75415 3482 -96078 -74369 -5290 -28413 -83293 -47158 19066 3061
37972 3061 -32200 13307 63172 16764 -38628 6316 60921 5635 -71192 -37772 34200 18239
37960 18239 -24510 15391 66389 22724 -29291 27654 100797 51685 -39332 -20492 54535 46744
37948 46744 -185 35405 99546 65588 -16797 -18730 25479 7478 -30441 7414 56674 9919
37936 9919 -60738 -30888 35791 9437 -53800 -21181 62254 70961 44820 91548 147327 89168
37924 89168 -9500 6401 90658 86099 16856 28516 106886 118462 73315 91148 154711 146943
37912 146943 91146 112560 199656 237179 239245 322695 482502 605978 667901 708831 680888
37901 680888 528283 356733 305446 317977 257705 167665 176745 230214 175788 53811 32775
$$ packed form
37984F2605q0365M0204N2971p1933r9560K1709O9079k3123n4880L6135O6224j6005
37972C061l5261M5507M9865m6408n5392M4944N4605n5286p6827L3420P1972j5961
37960A8239m2749L9901N0998m3665n2015N6945P3143m9112r1017J8840P5027p791
37948D6744m6929L5590O4141l3958q2385j933M4209j8001l7919L7855M9260m6755
37936I919p0657K9850O6679k6354o3237L2619Q3435Q707k6141M6728N5779n8159
37924H9168r8668J5901Q4257m559o9243J1660P8370J1576m5147J7833O3563p768
37912A46943n5797K1414Q7096L7523K066Q3450J59807J23476O1923M0930k7943
37901F80888j52605j71550n1287J2531o0272r0040R080N3469n4426j21977k1036
$$ plain form
37890 32775 104355 112301 47616 43675 102017 93128 19365 13807 78757 79985 4663 -21948 18392
37877 18392 16697 -34554 -31406 19102 5166 -56469 -34391 61613 82028 11228 -3775 75713
37865 75713 119702 75584 44276 69441 70636 28990 28890 74580 68540 7381 -552 58173 77889
37852 77889 39541 36859 75984 59221 -6965 -2750 76146 96143 27789 -5554 38756 56920
37840 56920 14086 10534 74760 97022 33438 -17990 -6389 -5312 -43748 -44414 12166 39669
37828 39669 13377 12590 54243 59839 23339 31496 87047 99225 75451 121919 225717 249698
37816 249698 180869 162341 230802 250500 170135 115287 147270 155331 80149 28407 64717 94672
37804 94672 57965 40235 87874 104316 39396 -3755 39570 77646 45935 31687 101046 172065
$$ packed form
37890C2775P1580P946o4685l941N8342q889p3763n558O4950J228p5322k6611M0340
37877A8392j695n1251L148N0508j3936o1635K2078R6004K0415p0800j5003P9488
37865G5713M3989m4118l1308K5165J195m1646j00M5690o040o1159p933N8725J9716
37852G7889l8348k682L9125j6763o6186M215P8896J9997o8354l3343M4310J8164
37840E6920m2834l552O4226K2262o3584n1428J1601J077l8436o66N6580K7503
37828C9669k6292p87M1653N596l6500Q157N5551J2178k3774M6468J03798K3981
37816B49698o8829j8528O8461J9698q0365n4848L1983Q061p5182n1742L6310K9955
37804I4672l6707j7730M7639J6442o4920m3151M3325L8076l1711j4248O9359P1019
$$ plain form
37792 172065 177113 190234 276009 365583 398915 444844 566775 703539 784159 827407 839066
37781 839066 754553 576330 426744 373704 341253 271560 225739 241475 244826 191625 147666
37770 147666 146858 123319 61625 50482 106292 115349 37980 -8112 38535 71148 20703 -13421
37758 -13421 42219 92457 54958 11589 44843 88589 76051 73318 128727 151214 79973 16666
37746 16666 44976 76420 23870 -29641 8175 63903 48439 33201 104029 178447 148226 78903
37734 78903 87360 133957 113755 51441 33237 40072 12847 -8714 29643 66173 29715 -17365
37722 -17365 7223 47685 18341 -29564 -6833 43793 36783 11607 50347 112634 111476 73555
37710 73555 71367 77874 39351 7521 46267 92747 65293 21275 49456 95554 62104 -3654
$$ packed form
37792A72065N048J3121Q5775Q9574L3332M5929J21931J36764Q0620M3248J1659
37781H39066q4513j78223j49586n3040l2451o9693m5821J5736L351n3201m3959
37770A47666q08k3539o1694j1143N5810R057p7369m6092M6647L2613n0445l4124
37758a3421N5640N0238l7499m3369L3254M3746j2538k733N5409K2487p1241o3307
37746A6666K8310L1444n2550n3511L7816N5728j5464j5238P0828P4418l0221o9323
37734G8903Q457M6597k0202o2314j8204O835k7225k1561L8357L6530l6458m7080
37722a7365K4588M0462k9344m7905K2731N0626p010k5176L8740O2287j158l7921
37710G3555k188O507l8523l1830L8746M6480k7454m4018K8181M6098l3450o5758
$$ plain form
37698 -3654 4640 57111 53820 15804 32797 82156 75256 30033 27396 48103 20392 -21689 4329
37685 4329 62115 53741 -742 -6051 29450 23066 -14085 -4579 33536 16832 -38692 -41017 12654
37672 12654 43202 37057 43400 54649 32178 17090 71167 142337 133741 70181 49782 69656
37660 69656 52107 6626 7206 38627 23881 -19844 -8198 49884 71698 58401 80283 125632
37648 125632 118350 68989 55866 70913 35789 -41331 -74388 -53428 -45424 -56001 -35265 -4324
37636 -4324 -27409 -73471 -55493 7136 16973 -26359 -35502 -6897 -20862 -74268 -76077 -16218
37624 -16218 17856 3575 10526 52802 61371 20429 -6511 496 134 -1474 41946 101033 98673
37611 98673 51661 46857 82744 79349 38666 41330 85021 84786 39905 40165 93419 106516 56793
$$ packed form
37698c654Q294N2471l291l8016J6993M9359o900m5223k637K0707k7711m2081K6018
37685D329N7786q374n4483n309L5501o384l7151R506L8115j6704n5524k325N3671
37672A2654L0548o145O343J1249k2471j5088N4077P1170q596o3560k0399J9874
37660F9656j7549m5481N80L1421j4746m3725J1646N8082K1814j3297K1882M5349
37648A25632p282m9361j3123J5047l5124p7120l3057K0960Q004j0577K0736L0941
37636d324k3085m6062J7978O2629R837m3332r143K8605j3965n3406j809N9859
37624a6218L4074j4281O951M2276Q569m0942k6940P007l62j608M3420N9087k360
37611I8673m7012m804L5887l395m0683K664M3691k35m4881K60N3254J3097m9723
$$ plain form
37598 56793 26873 46997 54788 33045 35806 56635 25286 -41636 -43642 23084 45586 -13540
37586 -13540 -60286 -41578 -18039 -24153 -9781 32884 33340 -17649 -35895 2293 16137 -24662
37574 -24662 -45062 -12524 4667 -21343 -21117 32067 63614 35969 12315 27934 30546 817
37562 817 -2810 27744 15223 -53936 -83982 -33001 15647 6867 898 40483 67381 43151 22533
37549 22533 35356 24881 -25323 -35476 23441 58427 12432 -34288 -8378 33840 20812 -11300
37537 -11300 -6307 4244 -24534 -59271 -56662 -40305 -36930 -20681 15946 25136 -4559 -13480 20047
37524 20047 37277 14885 11722 47557 54718 9757 -10311 30894 56866 18710 -17276 410
37512 410 15878 -13618 -27033 21834 71651 68284 58558 82395 87040 38721 4063 27727 44413
$$ packed form
37598E6793k9920K0124P791k1743K761K0829l1349o6922k006O6726K2502n9126
37586a3540m6746J8708K3539o114J4372M2665M56n0989j8246L8188J3844m0799
37574b4662k0400L2538J7191k6010K26N3184L1547k7645k3654J5619K612k9729
37562H17l627L0554j2521o9159l0046N0981M8648q780n969L9585K6898k4230k0618
37549B2533J2823j0475n0204j0153N8917L4986m5995m6720K5910M2218j3028l2112
37537a1300M993J0551k8778l4737K609J6357L375J6249L6627R190k9695q921L3527
37524B0047J7230k2392l163L5835P161m4961k0068M1205K5972l8156l5986J7686
37512D10J5468k9496j3415M8867M9817l367r726K3837M645m8319l4658K3664J6686
$$ plain form
37499 44413 6856 -16344 30198 79989 69315 53182 86857 108622 59724 9474 33395 69102
37487 69102 25178 -57664 -84634 -63129 -54684 -48880 -9038 29026 22828 17159 59309 94556
37475 94556 59914 6805 13138 45608 28712 -16749 -22758 568 2285 -6797 4180 4943 -31482
37462 -31482 -50821 -8017 36221 15156 -24300 -12399 13015 -12801 -47631 -18222 38172 39068
37450 39068 3111 2372 24399 9019 -29004 -37230 -34403 -62937 -86512 -54414 -11899 -25188
37438 -25188 -54816 -29239 14658 -2947 -54830 -59558 -33789 -50893 -91746 -80272 -32006 -25019
37426 -25019 -51679 -39070 5560 5491 -45840 -82047 -83879 -84675 -79390 -44286 -18429 -47930 -82557
37413 -82557 -49648 6589 -9780 -77783 -94237 -47800 -16281 -13274 16869 65096 64178 23927
$$ packed form
37499D4413l7557k3200M6542M9791j0674j6133L3675K1765m8898n0250K3921L5707
37487F9102m3924q2842k6970K1505Q445N804L9842L8064o198n669M2150L5247
37475I4556l4642n3109O333L2470j6896m5461o009K3326J717r082J0977P63l6425
37462c1482j9339M2804M4238k1065l9456J1901K5414k5816l4830K9409N6394Q96
37450C9068l5957p39K2027j5380l8023q226K827k8534k3575L2098M2515j3289
37438b5188k9628K5577M3897j7605n1883m728K5769j7104m0853J1474M8266O987
37426b5019k6660J2609M4630o9n1331l6207j832p96N285L5104K5857k9501l4627
37413h2557L2909N6237j6369o8003j6454M6437L1519L007L0143M8227r18m0251
$$ plain form
37401 23927 19832 48911 34827 -22483 -40413 -3831 13039 -12866 -21080 7696 18735 -4798
37389 -4798 -13259 6246 7489 -16243 -15477 17757 34178 19979 10612 8181 -19411 -57162 -56773
37376 -56773 -27279 -16419 -14558 20478 60078 39454 -18053 -29096 7954 20672 2521 16388
37364 16388 59744 58096 2189 -34646 -28071 -28499 -43865 -21869 33371 49734 14097 -5062
37352 -5062 17897 32804 23120 32802 63052 56227 6502 -21627 -5908 7799 5863 24012 52684
37339 52684 39535 -67 7969 61795 77219 33711 4934 20927 22546 -16717 -41288 -20188
37327 -20188 4662 7020 12516 25736 20572 12721 37575 58144 12902 -52270 -35935 39264
37315 39264 51020 -12643 -33320 26016 61769 22566 -9953 11606 19120 -18550 -23275 35092
$$ packed form
37401B3927m095K9079j4084n7310j7930L6582J6870k5905q214K8776J1039k3533
37389d798q461J9505J243k3732P66L3234J6421j4199r367k431k7592l7751L89
37376e6773K9494J0860J861L5036L9600k0624n7507j1043L7050J2718j8151J3867
37364A6388M3356j648n5907l6835O575m28j5366K1996N5240J6363l5637j9159
37352e062K2959J4907r684R682L0250o825m9725k8129J5719J3707j936J8149K8672
37339E2684j3149l9602Q036N3826J5424m3508k8777J5993J619l9263k4571K1100
37327b0188K4850K358N496J3220n164p851K4854K0569m5242o5172J6335P5199
37315C9264J1756o3663k0677N9336L5753l9203l2519K1559P514l7670m725N8367
$$ plain form
37303 35092 63078 9834 -36593 -8227 26692 9 -35769 -20678 1583 -16766 -31456 -3944
37291 -3944 14621 -12201 -26778 9299 32778 -1370 -28872 3414 37189 17787 -910 33864
37279 33864 67289 44039 18121 48955 87033 71793 47868 72992 101636 73657 32805 43134
37267 43134 67913 44399 2861 527 10813 -12819 -35386 -10799 18345 -684 -24429 5331
37255 5331 45631 30763 -2355 16027 57361 52049 20018 25642 54385 51356 34701 54145
37243 54145 79929 48925 -14777 -36363 -15234 -8825 -22656 -17758 542 -2743 -15320 -2933
37231 -2933 17571 11602 -1991 9083 20973 1503 -19803 -7616 6692 -11587 -25313 704
37219 704 17830 -18777 -50080 -8292 54118 47948 -882 -8372 13270 -6490 -47357 -29102
$$ packed form
37303C5092K7986n3244m6427K8366L4919k6683l5778J5091K2261j8349j4690K7512
37291c944J8565k6822j4577L6077K3479l4148k7502L2286L3775j9402j8697L4774
37279C3864L3425k3250k5918L0834L8078j5240k3925K5124K8644k7979m0852J0329
37267D3134K4779k3514m1538k334J0286k3632k2567K4587K9144j9029k3745K9760
37255E331M0300j4868l3118J8382M1334n312l2031N624K8743l029j6655J9444
37243E4145K5784l1004o3702k1586K1129O409j3831M898J8300l285j2577J2387
37231b933K0504n969j3593J1074J1890j9470k1306J2187J4308j8279j3726K6017
37219G04J7126l6607l1303M1788O2410o170m8830p490K1642j9760m0867J8255
$$ plain form
37207 -29102 33613 47051 -1170 -28703 -4828 12168 -8986 -30110 -27857 -22728 -15827 14871
37195 14871 51806 53379 29643 25096 36229 23937 -7024 -20334 -21780 -40943 -60566 -45154
37183 -45154 -16023 -15499 -24323 -640 30154 17035 -16264 -10422 18852 12068 -17628 -6753 38213
37170 38213 50413 20696 2762 10543 10949 8330 35848 72208 65838 32186 30052 54407 51766
37157 51766 26107 25493 39158 16873 -23317 -20466 7989 -9812 -60546 -55038 17999 71677
37145 71677 67345 60090 79066 82135 57394 55706 87062 89060 35839 -15991 -23897 -13404 -7378
37132 -7378 10761 36220 31562 2274 -52 27669 27513 -15318 -42331 -20532 11911 23138 29680
37119 29680 38381 26331 1152 3934 33080 41852 25813 31698 65476 76650 51366 36878
$$ packed form
37207b9102O2715J3438m8221k7533K3875J6996k1154k1124K253N129O901L0698
37195A4871L6935J573k3736m547J1133j2292l0961j3310j446j9163j9623J5412
37183d5154K9131N24q824K3683L0794j3119l3299N842K9274o784k9696J0875M4966
37170C8213J2200k9717j7934P781M06k619K7518L6360o370l3652k134K4355k641
37157E1766k5659o14J3665k2285m0190K851K8455j7801n0734N508P3037N3678
37145G1677m332p255J8976L069k4741j688L1356J998n3221n1830p906J0493O026
37132g378J8139K5459m658k9288k326K7721j56m2831k7013K1799L2443J1227O542
37119B9680Q701j2050k5179K782K9146Q772j6039N885L3778J1174k5284j4488
$$ plain form
37107 36878 54174 67607 58748 50060 41063 3355 -47474 -57874 -26003 -3869 -5397 168 3731
37094 3731 -34650 -87901 -80680 -18018 13648 -10868 -25089 -3112 -3401 -48507 -77038 -55941
37082 -55941 -32446 -33876 -21635 14655 22924 -10092 -27509 -11056 -13043 -40722 -25166 46773
37070 46773 88241 56511 23481 38892 42074 -14347 -66039 -48426 -5547 786 -1899 29998
37058 29998 60571 43011 10596 14150 35313 38405 41281 62260 65260 28146 -3210 4418 9997
37045 9997 -17780 -34385 -6607 17304 469 -3703 50988 107680 97679 53074 37238 35065
37033 35065 7732 -11447 22957 70894 68811 38188 37084 52741 37595 7183 7996 27407
37021 27407 24541 12274 23683 37117 18408 -4240 8119 22391 -9832 -54595 -46261 376
$$ packed form
37107C6878J7296J3433q859q688q997l7708n0829j0400L1871K2134j528N565L563
37094C731l8381n3251P221O2662L1666k4516j4221K1977k89m5106k8531K1097
37082e5941K3495j430J2241L6290Q269l3016j7417J6453j987k7679J5556P1939
37070D6773M1468l1730l3030J5411L182n6421n1692J7613M2879O333k685L1897
37058B9998L0573j7560l2415L554K1163L092K876K0979L000l7114l1356P628N579
37045I997k7777j6605K7778K3911j6835m172N4691N6692j0001m4605j5836k173
37033C5065k7333j9179L4404M7937k083l0623j104J5657j5146l0412Q13J9411
37021B7407k866j2267J1409J3434j8709k2648J2359J4272l2223m4763Q334M6637
$$ plain form
37009 376 19912 5925 778 5487 -10078 -31108 -18858 12191 18404 6936 15026 33318 26366
36996 26366 5729 7636 23165 24224 29157 64672 93486 63880 4468 -16936 -5256 -18772
36984 -18772 -55706 -54215 -1222 46358 53578 44361 40435 30768 9455 -10768 -24608 -29515 -7354
36971 -7354 43601 79273 62288 20206 1437 3748 764 2619 25997 39412 9709 -27332
36959 -27332 -15928 27739 46153 36995 43025 67269 73896 56963 39028 20455 -4616 -8245
36947 -8245 26667 52171 19636 -33034 -36820 -1694 12789 4298 12162 22915 -8120 -58761
36935 -58761 -64426 -29766 -16642 -29100 -12413 35368 54820 34830 30437 57869 67826 41406
36923 41406 21270 25517 16597 -19592 -43362 -33987 -19238 -12127 9522 42482 50139 32985 34263
$$ packed form
37009C76J9536j3987n147M709j5565k1030J2250L1049O213j1468Q090J8292o952
36996B6366k0637J907J5529J059M933L5515K8814k9606n9412k1404J1680j3516
36984a8772l6934J491N2993M7580P220r217l926r667k1313k0223j3840m907K2161
36971g354N0955L5672j6985m2082j8769K311k984J855K3378J3415k9703l7041
36959b7332J1404M3667J8414r158O030K4244O627j6933j7935j8573k5071l629
36947h245L4912K5504l2535n2670l786L5126J4483q491P864J0753l1035n0641
36935e8761n665L4660J3124j2458J6687M7781J9452j9990m393K7432R957k6420
36923D1406k0136M247q920l6189k3770R375J4749P111K1649L2960P657j7154J278
$$ plain form
36910 34263 57612 53946 11690 -15060 4417 30405 24417 4059 -3391 -4108 -6832 -1796 6579
36897 6579 -3736 -25820 -25062 -932 5929 -18589 -41349 -40968 -33558 -29346 -18270 -6859 -13319
36884 -13319 -21121 1743 34041 20288 -34065 -59912 -31688 -2713 -11258 -24883 -9708 11546
36872 11546 7896 -8848 -16070 -16625 -15346 -3500 11072 2765 -24218 -32086 -8976 13802 17414
36859 17414 20031 32393 37378 27300 15439 1526 -26761 -53554 -48260 -22433 -17224 -32122
36847 -32122 -27243 721 11609 -3090 -8239 2428 -5202 -30761 -28457 8802 29027 10120
36835 10120 -3352 18159 40348 30831 9297 -1218 -12241 -27389 -21443 6952 19178 2391
36823 2391 -5767 14689 32528 26992 22032 29917 22386 -10609 -33663 -28705 -25064 -36373 -30386
$$ packed form
36910C4263K3349l666m2256k6750J9477K5988n988k0358p450p17k724N036Q375
36897F579j0315k2084P58K4130O861k4518k2760L81P410M212J1076J1411o460
36884a3319p802K2864L2298j3753n4353k5847K8224K8975q545j3625J5175K1254
36872A1546l650j6744p222n55J279J1846J4572q307k6983p868K3110K2778L612
36859A7414K617J2362M985j0078j1861j3913k8287k6793N294K5827N209j4898
36847c2122M879K7964J0888j4699n149J0667p630k5559K304L7259K0225j8907
36835A0120j3472K1511K2189r517k1534j0515j1023j5148N946K8395J2226j6787
36823B391q158K0456J7839n536m960P885p531l2995k3054M958L641j1309N987
$$ plain form
36810 -30386 4302 24425 2826 -26174 -29572 -25413 -32669 -30678 -8408 2992 -12462 -20603 1067
36797 1067 21089 12502 -1351 1674 1620 -12864 -10945 18912 30794 -6380 -50379 -49210 -15859
36784 -15859 8628 21130 36348 41818 21978 -5267 -15953 -13690 -7267 8797 27759 27733 15765
36771 15765 24698 47706 36683 -11543 -36406 -11052 14392 4543 -2554 23966 43632 19267
36759 19267 -11595 -2711 22535 20829 3052 -960 -434 -8726 -912 37360 67571 57591 32806
36746 32806 19853 -1713 -39928 -48134 -2999 39058 28384 1804 8404 22416 6299 -5453
36734 -5453 27731 62615 41968 2756 16270 62997 68409 30833 12072 22805 16619 -12677
36722 -12677 -19425 10608 43275 59318 67406 63458 40247 22997 34277 43839 15693 -20739
$$ packed form
36810c0386L4688K0123k1599k9000l398M159p256J991K2270J1400j5454q141K1670
36797A067K0022q587j3853L025n4j4484J919K9857J1882l7174m3999J169L3351
36784a5859K4487J2502J5218N470j9840k7245j0686K263O423J6064J8962k6j1968
36771A5765Q933K3008j1023m8226k4863K5354K5444r849p097K6520J9666k4365
36759A9267l0862Q884K5246j706j7777m012N26q292P814L8272L0211r980k4785
36746C2806j2953k1566l8215q206M5135M2057j0674k6580O600J4012j6117j1752
36734e453L3184L4884k0647l9212J3514M6727N412l7576j8761J0733o186k9296
36722a2677o748L0033L2667J6043Q088l948k3211j7250J1280R562k8146l6432
$$ plain form
36710 -20739 -13991 21657 33401 19543 17255 24123 9590 -14171 -9948 11831 12418 123 12670
36697 12670 41955 50787 45236 53417 53931 9328 -47719 -51059 -11173 2014 -22482 -29473 -5460
36684 -5460 3135 -14300 -14171 9914 9053 -26925 -44481 -21515 -5898 -28052 -50166 -37328 -12655
36671 -12655 -6112 -7044 -1584 -4962 -24294 -34232 -17400 9629 29634 44909 50924 31946 -3602
36658 -3602 -23347 -17098 -5573 551 9594 16623 7209 -6052 3097 25424 28310 15013 20491
36645 20491 48860 67718 65046 58694 49540 20516 -16387 -27172 -11326 2377 11103 31113
36633 31113 43498 14771 -30769 -32723 7660 27698 10169 8803 47660 76800 60499 34597
36621 34597 35589 39464 17353 -5300 4310 25064 16864 -15125 -33779 -24193 -1030 19506 29846
$$ packed form
36710b0739O748L5648J1744j3858k288O868j4533k3761M223K1779N87j2295J2547
36697A2670K9285Q832n551Q181N14m4603n7047l340L9886J3187k4496o991K4013
36684e460Q595j7435J29K4085q61l5978j7556K2966J5617k2154k2114J2838K4673
36671a2655O543r32N460l378j9332r938J6832K7029K0005J5275O015j8978l5548
36658c602j9745O249J1525O124R043P029r414j3261R149K2327K886j3297N478
36645B0491K8369J8858k672o352r154k9024l6903j0785J5846J3703Q726K0010
36633C1113J2385k8727m5540j954M0383K0038j7529j366L8857K9140j6301k5902
36621C4597R92L875k2111k2653R610K0754q200l1989j8654R586K3163K0536J0340
$$ plain form
36608 29846 28187 20251 10107 -11170 -45148 -61799 -31526 22400 44448 19724 -15032 -31896
36596 -31896 -37390 -36717 -20987 3013 14303 14684 24147 39781 41761 35502 40538 44503 21630 -9670
36582 -9670 -7297 20575 25767 3324 -3317 16077 22843 5216 -1022 16586 23927 6886 -3639
36569 -3639 7140 14614 11065 21687 45379 44872 17508 10159 39214 61103 49385 35967 44794
36556 44794 48233 25172 4305 11845 26956 23983 13105 9187 4214 -4563 -2584 7242 3476
36543 3476 -6972 7820 43215 55654 33024 8967 -919 -13182 -22129 -5491 9138 -31962
36531 -31962 -105660 -124477 -72159 -28904 -33952 -30141 12768 32121 -7269 -32504 17339 81389
36519 81389 75621 25256 7930 28091 38309 33928 39348 40859 12133 -26988 -43078 -43831 -44432
$$ packed form
36608B9846j659p936j0144k1277l3978j6651L0273N3926K2048k4724l4756j6864
36596c1896n494O73J5730K4000J1290L81R463J5634J980o259N036L965k2873l1300
36582i670K373K7872N192k2443o641J9394O766j7627o238J7608P341j7041j0525
36569c639J0779P474l549J0622K3692n07k7364p349K9055K1889j1718j3418Q827
36556D4794L439k3061k0867P540J5111k973j0878l918m973q777J979R826l766
36543C476j0448J4792L5395J2439k2630k4057r886j2263q947J6638J4629m1100
36531c1962p3698j8817N2318M3255n048L811M2909J9353l9390k5235M9843O4050
36519H1389n768n0365j7326K0161J0218m381N420J511k8726l9121j6090p53o01
$$ plain form
36506 -44432 -27304 7008 6033 -50036 -87575 -40507 39815 58324 14737 -17769 -14903 -12923
36494 -12923 -22915 -18944 243 9661 8574 14550 23731 28146 46102 83056 95458 51500 -5199
36481 -5199 -12278 23574 53464 63861 65794 46166 -1792 -35535 -20497 4031 -14091 -50330
36469 -50330 -49829 -25718 -27715 -44173 -24852 19981 32023 3410 -20991 -29049 -46951 -66944
36457 -66944 -51372 -8217 12799 963 -7306 409 28 -12655 -17252 -16293 -25746 -26973 7478
36444 7478 51360 56363 35310 40926 70215 67733 22875 -13619 -15364 -9205 -11303 -5345 6091
36431 6091 -3122 -24684 -18262 16674 34419 19379 6151 11003 6667 -16878 -25961 -545 30943
36418 30943 34912 11327 -22247 -47809 -44312 -7355 28751 27918 4558 -2606 6019 4653 1450
$$ packed form
36506d4432J7128L4312r75n6069l7539M7068Q0322J8509m3587l2506K866J980
36494a2923r992L971J9187R418j087N976R181M415J7956L6954J2402m3958n6699
36481e199p079L5852K9890J0397J933j9628m7958l3743J5038K4528j8122l6239
36469e0330N01K4111j997j6458J9321M4833J2042k8613k4401q058j7902j9993
36457f6944J5572M3155K1016j1836q269P715l81j2683m597R59r453j227L4451
36444G478M3882N003k1053N616K9289k482m4858l6494j745O159k098N958J1436
36431F091r213k1562O422L4936J7745j5040j3228M852m336k3545r083K5416L1488
36418C0943L969k3585l3574k5562L497L6957L6106q33k3360p164Q625j366l203
$$ plain form
36405 1450 21535 43836 25323 -17079 -22792 11559 22626 -17159 -59938 -63847 -47279 -38996
36393 -38996 -34734 -29115 -37226 -58403 -64046 -43601 -22621 -19049 -20095 -14283 -8608 -6014 -2413 -8058
36379 -8058 -33572 -57886 -52216 -29939 -26865 -40410 -38520 -19173 -5993 5113 34510 62891
36367 62891 51998 16072 5517 22567 23103 1234 -1716 23468 39856 36886 43233 58197 45653
36354 45653 9428 -18 29619 53348 50332 51617 69674 73974 55499 42614 35406 810 -48575
36341 -48575 -53041 -7279 20046 -2894 -25585 -14306 -9074 -37299 -55217 -29054 1531 -2825
36329 -2825 -14725 -4302 -1430 -31274 -50843 -17856 29977 33006 4251 539 32810 64622
36317 64622 73337 62495 37655 11672 8810 29301 38360 19038 1507 12483 34270 41989
$$ packed form
36405A450K0085K2301j8513m2402n713L4351J1067l9785m2779l909J6568Q283
36393c8996M262N619q111k1177n643K0445K0980L572j046N812N675K594L601n645
36379h058k5514k4314N670K2277L074j3545J890J9347J3180J1106K9397K8381
36367F2891j0893l5926j0555J7050N36k1869k950K5184J6388k970O347J4964j2544
36354D5653l6225r446K9637K3729l016J285J8057M300j8475j2885p208l4596m9385
36341d8575m466M5762K7325k2940k2691J1279N232k8225j7918K6163L0585m356
36329b825j1900J0423K872k9844j9569L2987M7833L029k8755l712L2271L1812
36317F4622Q715j0842k4840k5983k862K0491R059j9322j7531J0976K1787P719
$$ plain form
36305 41989 41447 43062 39314 32530 41277 57973 49137 16792 2865 12735 569 -43434 -64543
36292 -64543 -37750 -15286 -34931 -54583 -31574 2738 6810 2214 20250 35534 18370 -1919
36280 -1919 7904 18163 -9303 -48083 -53846 -37996 -31389 -21978 6386 20876 -5867 -33503 -16258
36267 -16258 16077 10967 -15764 -16801 -1925 -11237 -33395 -29713 -12150 -19946 -42105 -38190 -15920
36254 -15920 -15733 -35927 -41453 -29567 -22315 -13977 10509 27667 10270 -14961 -9688 4615 -11944
36241 -11944 -35030 -14605 28140 28439 -12267 -31294 -13667 -10251 -42785 -70811 -65769 -48621
36229 -48621 -39577 -30230 -17853 -15152 -18233 -11067 -1577 -7762 -15352 1342 26800 26039 8871 16292
36215 16292 50543 74304 72729 62720 49205 25597 7324 11896 18694 1366 -18690 -8146
$$ packed form
36305D1989n42J615l748o784Q747J6696q836l2345j3927R870j2166m4003k1109
36292f4543K6793K2464j9645j9652K3009L4312M072m596J8036J5284j7164k0289
36280a919R823J0259k7466l8780n763J5850O607R411K8364J4490k6743k7636J7245
36267a6258L2335n110k6731j037J4876r312k2158L682J7563p796k2159L915K2270
36254a5920J87k0194n526J1886P252Q338K4486J7158j7397k5231N273J4303j6559
36241a1944k3086K0425M2745K99m0706j9027J7627L416l2534k8026N042J7148
36229d8621R044R347J2377K701l081P166R490o185p590J6694K5458p61j7168P421
36215A6292L4251K3761j575j0009j3515k3608j8273M572O798j7328k0056J0544
$$ plain form
36203 -8146 13041 7358 -4526 21210 61861 56695 11435 -13017 -8890 -26620 -69743 -79359 -39172
36190 -39172 -7415 -19605 -38667 -28418 -4286 15406 40768 67271 65036 34566 12904 6897
36178 6897 -15161 -49553 -47041 67 33346 20333 1542 12516 27704 20806 15413 30551
36166 30551 34519 1474 -36234 -40077 -26200 -29032 -43198 -45689 -42042 -48604 -56729 -50762 -36932
36153 -36932 -25004 -7339 18081 31382 21788 7453 2557 -7112 -34715 -65868 -80598 -76284
36141 -76284 -55540 -19998 13290 21829 14366 23102 50158 59720 33708 -4282 -31014 -48379
36129 -48379 -56020 -43207 -20463 -15248 -24244 -15078 14239 27566 13552 2044 3623 -8054 -34111
36116 -34111 -33065 6834 38123 28777 7848 2580 -8877 -40436 -54028 -23527 10546 5288
$$ packed form
36203h146K1187n683j1884K5736M0651n166m5260k4452M127j7730m3123r616M0187
36190c9172L1757j2190j9062J0249K4132J9692K5362K6503k235l0470k1662o007
36178F897k2058l4392K512M7108L3279j3013j8791J0974J5188o898n393J5138
36166C0551L968l3045l7708l843J3877k832j4166k491L647o562q125N967J3830
36153c6932J1928J7665K5420J3301r594j4335m896r669k7603l1153j4730M314
36141g6284K0744L5542L3288Q539p463Q736K7056R562k6012l7990k6732j7365
36129d8379p641J2813K2744N215q996R166K9317J3327j4014j1508J579j1677k6057
36116c4111J046L9899L1289r346k0929n268j1457l1559j3592L0501L4073n258
$$ plain form
36104 5288 -12935 814 30585 34538 25214 46888 93747 115439 94049 58513 28528 -2513
36092 -2513 -28927 -26451 6541 38610 45608 34535 21328 9038 -3701 -9934 -1119 17725 25408
36079 25408 3671 -35732 -53581 -28009 14333 33977 31975 35319 42058 26151 -6504 -17748
36067 -17748 763 14859 7898 3213 12463 14002 2388 6120 30106 32916 -5944 -44677 -42517
36054 -42517 -20596 -18663 -29037 -18122 14056 36818 32398 6067 -28495 -51431 -46564 -26720
36042 -26720 -23191 -37227 -35514 -5884 23773 37120 53063 78035 84465 62485 44248 49178
36030 49178 53776 42541 35384 35813 12823 -29287 -29089 35087 89918 68391 9770 -7039 20859
36017 20859 42385 46141 55903 65654 54490 41403 53891 64371 29436 -26046 -37197 -298
$$ packed form
36104E288j8223J3749K9771L953r324K1674M6859K1692k1390l5536k9985l1041
36092b513k6414K476L2992L2069O998j1073j3207j2290j2739o233Q815J8844P683
36079B5408k1737l9403j7849K5572M2342J9644k002L344O739j5907l2655j1244
36067a7748J8511J4096o961m685R250J539j1614L732K3986K810l8860l8733K160
36054d2517K1921J933j0374J0915L2178K2762m420k6331l4562k2936M867J9844
36042b6720L529j4036J713K9630K9657J3347J5943K4972O430k1980j8237M930
36030D9178M598j1235p157M29k2990m2110J98O4176N4831k1527n8621j6809K7898
36017B0859K1526L756R762R751j1164j3087J2488J0480l4935n5482j1151L6899
$$ plain form
36005 -298 25144 10977 -9807 -8920 3050 14110 28992 42568 40137 28782 29764 40536 41149
35992 41149 33112 34233 41481 36468 20772 10375 4307 -7119 -15366 -8760 1131 2068 9984 39097
35978 39097 66770 68272 60632 67155 66417 29669 -15591 -18168 18271 46626 50371 47812 38334
35965 38334 8663 -16519 3608 53943 74417 46535 12854 6445 15076 21229 26811 30816 27098
35952 27098 27604 45921 60747 40644 -301 -19397 -11045 -4169 -1845 18695 49296 55252 38528
35939 38528 35594 47035 32469 -12787 -38926 -19623 7273 1187 -26660 -43506 -39215 -20968
35927 -20968 -73 2639 -25800 -59915 -60989 -36475 -30186 -50250 -58286 -38908 -25385 -39241
35915 -39241 -55597 -49727 -32237 -17107 1943 23367 28861 22235 34322 68080 81713 50658
$$ packed form
36005b98K5442j4167k0784Q87J1970J1060J4882J3576k431j1355R82J0772O13
35992D1149q037J121P248n013j5696j0397o068j1426q247O606R891R37P916K9113
35978C9097K7673J502p640O523p38l6748m5260k577L6439K8355L745k559r478
35965C8334k9671k5182K0127N0335K0474k7882l3681o409Q631O153N582M005l718
35952B7098N06J8317J4826k0103m0945j9096Q352O876K324K0540L0601N956j6724
35939C8528k934J1441j4566m5256k6139J9303K6896o086k7847j6846M291J8247
35927b0968K0895K712k8439l4115j074K4514O289k0064q036J9378J3523j3856
35915c9241j6356N870J7490J5130J9050K1424N494o626J2087L3758J3633l1055
$$ plain form
35903 50658 5957 -15059 -18617 -27800 -40816 -45293 -45618 -47943 -40814 -15287 14215 28000 23711
35890 23711 8919 -10419 -25549 -28783 -27751 -36359 -50625 -55321 -50562 -45492 -33298 -5718 15808
35877 15808 3250 -29214 -42132 -32135 -29973 -40406 -35895 -12539 947 -3055 -272 15102 21671
35864 21671 19869 34312 58322 55226 26808 17507 34216 29328 -12473 -40117 -22373 -569
35852 -569 -12498 -26880 -5488 23919 14541 -22099 -42019 -38041 -30765 -20352 1500 16271 3842
35839 3842 -17005 -16926 -5604 -11494 -29777 -31464 -11034 11650 25355 31212 24444 2487 -18691
35826 -18691 -22065 -13730 -9863 -12255 -13707 -12267 -5305 12860 35163 44537 41885 45518 54939 48379
35812 48379 26845 21395 40413 51171 35108 19004 24830 30764 13936 -6924 -6554 3838 3873
$$ packed form
35903E0658m4701k1016l558r183j3016m477l25k325P129K5527K9502J3785m289
35890B3711j4792j9338j5130l234J032q608j4266m696M759N070J2194K7580K1526
35877A5808j2558l2464j2918R997K162j0433M511K3356J3486m002K783J5374O569
35864B1671j802J4443K4010l096k8418r301J6709m888m1801k7644J7744K1804
35852e69j1929j4382K1392K9407r378l6640j9920L978P276J0413K1852J4771j2429
35839C842k0847P9J1322n890j8283j687K0430K2684J3705N857o768k1957k1178
35826a8691l374Q335L867k392j452J440O962J8165K2303R374k652L633R421o560
35812D8379k1534n450J9018J0758j6063j6104N826N934j6828k0860L70J0392L5
$$ plain form
35799 3873 2496 14233 26333 23273 16549 19285 19920 10353 8644 23209 27651 4001 -21867 -21275
35785 -21275 -6068 1645 6973 14739 3836 -30891 -50209 -28458 -2019 -11060 -30265 -13867
35773 -13867 21835 23224 -13944 -42593 -37069 -14639 5721 17667 10226 -18658 -40981 -31950
35761 -31950 -11711 -14572 -34135 -41750 -40208 -50758 -63005 -49315 -18628 -6042 -16170 -23877
35749 -23877 -23910 -32392 -44491 -37430 -13188 4861 14413 31264 48001 38588 3599 -27447 -36929
35736 -36929 -27945 -1002 39233 62633 41514 -4576 -31363 -30553 -28174 -31339 -22608 -3478 3130
35723 3130 -4486 -3949 9170 15689 10833 10284 17195 19094 17157 22955 28153 13826 -11995 -21856
35709 -21856 -10903 3200 15568 31905 39947 25101 7034 15329 34552 22649 -18021 -39617
$$ packed form
35799C873j377J1737J2100l060o724K736O35r567j709J4565M442k3650k5868N92
35785b1275J5207P713N328P766j0903l4727j9318K1751K6439r041j9205J6398
35773a3867L5702J389l7168k8649N524K2430K0360J1946p441k8884k2323R031
35761c1950K0239k861j9563p615J542j0550j2247J3690L0687J2586j0128p707
35749b3877l3q482j2099P061K4242J8049R552J6851J6737r413l4989l1046r482
35736c6929Q984K6943M0235K3400k1119m6090k6787Q10K379l165Q731J9130O608
35723C130p616N37J3119O519m856n49O911J899j937N798N198j4327k5821r861
35709b1856J0953J4103J2368J6337Q042j4846j8067Q295J9223j1903m0670k1596
$$ plain form
35697 -39617 -22410 1144 4018 -2300 -4118 -9249 -18990 -16383 2144 18238 26290 42398 68712
35684 68712 83201 75132 58279 40836 15536 -12310 -20736 -5233 12215 15314 8227 -2507
35672 -2507 -11919 -5940 20164 38610 22070 -7776 -9017 10838 7216 -21855 -29551 -2232 14874
35659 14874 -6864 -37257 -46539 -51366 -68745 -74759 -49848 -24285 -34724 -65222 -73151 -52423
35647 -52423 -33230 -32831 -38535 -31642 -5914 30740 59023 62269 45470 27789 15251 1099 -8537
35634 -8537 887 19938 21311 4757 -96 15351 24059 12796 4831 13385 13051 -15486 -47791
35621 -47791 -52937 -38462 -27888 -20592 -5858 7089 6838 8669 31491 59034 57676 26843 1702
35608 1702 5680 23971 27898 8872 -17144 -29232 -20000 2667 26971 43610 41597 12676 -31270
$$ packed form
35697c9617J7207K3554K874o318j818n131r741K607J8527J6094Q052J6108K6314
35684F8712J4489q069j6853j7443k5300k7846q426J5503J7448L099p087j0734
35672b507r412N979K6104J8446j6540k9846j241J9855l622k9071p696K7319J7106
35659A4874k1738l0393r282m827j7379o014K4911K5563j0439l0498p929K0728
35647e2423J9193L99n704O893K5728L6654K8283L246j6799j7681j2538j4152r636
35634h537R424J9051J373j6554m853J5447Q708j1263p965Q554l34k8537l2305
35621d7791n146J4475J0574P296J4734J2947k51J831K2822K7543j358l0833k5141
35608A702L978J8291L927j9026k6016j2088R232K2667K4304J6639k013k8921m3946
$$ plain form
35595 -31270 -61820 -69553 -76986 -95995 -96933 -53722 1947 17423 -1607 245 41788 80140 79835
35582 79835 56625 36624 17644 -6777 -22738 -18444 -2279 17864 44480 67480 63695 33273
35570 33273 5776 -2135 -3382 -5099 6257 30104 39265 21349 95 -2649 3855 3912 -667 -5675
35556 -5675 -14420 -20712 -11596 5235 10004 11265 37047 78821 90997 59046 20882 4980 -3605
35543 -3605 -17137 -17572 -506 3285 -19948 -38895 -30779 -18270 -23565 -31202 -27307 -29301 -44014
35530 -44014 -44223 -22502 -19168 -56018 -90462 -80449 -49107 -37287 -37440 -27544 -27356 -60672 -96295
35517 -96295 -88348 -49095 -23605 -15566 4094 34767 49956 49970 57747 71021 64399 30879 -15345
35504 -15345 -62202 -92210 -76138 -13390 46727 64363 60823 68990 69249 30211 -20511 -32136
$$ packed form
35595c1270l0550p733p433j9009r38M3211N5669J5476j9030J852M1543L8352l05
35582G9835k3210k0001j8980k4421j5961M294J6165K0143K6616K3000l785l0422
35570C3273k7497p911j247j717J1356K3847R161j7916k1254k744O504N7m579n008
35556e675q745o292R116J6831M769J261K5782M1774J2176l1951l8164j5902q585
35543c605j3532m35J7066L791k3233j8947Q116J2509n295p637L895j994j4713
35530d4014k09K1721L334l6850l4444J0013L1342J1820j53R896J88l3316l5623
35517i6295P947L9253K5490Q039J9660L0673J5189J4P777J3274o622l3520m6224
35504a5345m6857l0008J6072O2748O0117J7636l540Q167K59l9038n0722j1625
$$ plain form
35492 -32136 -13668 -13704 -34660 -36427 -15052 -7687 -20952 -21207 -484 10107 1347 3786 33452
35479 33452 68590 89148 94984 81512 43818 7826 9563 39771 55961 50321 53690 69127
35467 69127 59626 15041 -23663 -26694 -13608 -8665 -3461 12267 23121 16641 5305 -2631 -21626
35454 -21626 -54921 -72573 -49751 -4340 27631 36611 38791 44249 45018 30168 3007 -15523 -3797
35441 -3797 33036 61249 56736 33470 18058 12033 2345 -7549 -7273 -7134 -23164 -43364 -40772 -12472
35427 -12472 23752 59407 89438 92004 54343 7549 -6726 4792 4547 -9871 -7421 13844
35415 13844 20382 3517 -5481 9559 26798 30097 31700 38536 36794 23186 14292 14274 9468 1779
35401 1779 7776 18331 3393 -32835 -47359 -24000 970 -2797 -18510 -21289 -18500 -25106 -32199
$$ packed form
35492c2136J8468l6k0956j767K1375P365j3265k55K0723J0591q760K439K9666
35479C3452L5138K0558N836j3472l7694l5992J737L0208J6190n640L369J5437
35467F9127r501m4585l8704l031J3086M943N204J5728J0854o480j1336p936j8995
35454b1626l3295j7652K2822M5411L1971Q980K180N458P69j4850k7161j8530J1726
35441c797L6833K8213m513k3266j5412o025r688r894K76J39j6030k0200K592K8300
35427a2472L6224L5655L0031K566l7661m6794j4275J1518k45j4418K450K1265
35415A3844O538j6865q998J5040J7239L299J603O836j742j3608q894j8m806p689
35401A779N997J0555j4938l6228j4524K3359K4970l767j5713k779K789o606p093
$$ plain form
35388 -32199 -26086 -12219 744 15769 29710 26872 5655 -13732 -20510 -25080 -29406 -17686 9231
35375 9231 22292 5615 -17629 -18266 3351 28253 41535 33048 578 -35987 -47184 -30449
35363 -30449 -12904 -13926 -28751 -48573 -66877 -66665 -36352 588 8508 -7767 -13781 -7983 -23880
35350 -23880 -63758 -84291 -64392 -36803 -31232 -33362 -23838 -13283 -12626 -8938 4407 11387 8550
35337 8550 17141 40000 48966 36033 30864 43715 41192 9244 -10551 14082 50935 55138 35283
35324 35283 24412 22743 14623 9616 21710 36334 38945 45500 63370 57104 2249 -58434 -67636
35311 -67636 -37909 -26559 -44689 -51314 -29846 -11411 -18235 -34129 -41367 -46139 -54623 -55236 -37952
35298 -37952 -10374 13993 29282 36525 40150 43631 42594 30700 16005 14558 22346 16809 -5469
$$ packed form
35388c2199O113J3867J2963J5025J3941k838k1217j9387o778m570m326J1720K6917
35375I231J3061j6677k3244o37K1617K4902J3282q487l2470l6565j1197J6735
35363c0449J7545j022j4825j9822j8304K12L0313L6940P920j6275o014N798j5897
35350b3880l9878k0533J9899K7589N571k130R524J0555O57L688J3345O980k837
35337H550Q591K2859Q966j2933n169J2851k523l1948j9795K4633L6853M203j9855
35324C5283j0871j669q120n007J2094J4624K611O555J7870o266n4855o0683r202
35311f7636K9727J1350j8130o625K1468J8435o824j5894p238m772q484o13J7284
35298c7952K7578K4367J5289P243L625L481j037j1894j4695j447P788n537k2278
$$ plain form
35285 -5469 -20729 -18943 -19228 -27674 -17860 20640 51651 44142 22166 25223 46525 51264 34058
35272 34058 17481 10373 5118 1184 -3069 -25475 -72338 -112042 -111255 -82496 -62285 -58364 -53078
35259 -53078 -42214 -33240 -18948 9713 35330 32885 6854 -20490 -43024 -61810 -60732 -28447
35247 -28447 9769 19704 6293 -457 5706 7854 1616 -5441 -16428 -31466 -27462 9863 49701
35234 49701 53137 30931 20686 22441 7398 -20437 -26999 -10820 -8688 -32376 -49346 -38020
35222 -38020 -18314 -12059 -9994 5315 31751 55416 64651 51707 21777 -481 3417 17656
35210 17656 14067 -5813 -19260 -23346 -33309 -46686 -45894 -34074 -32592 -43001 -45164 -33513 -23748
35197 -23748 -24377 -31220 -45893 -69195 -83237 -73136 -57276 -59932 -65809 -45000 -12354 -10380 -36720
$$ packed form
35285e469j5260J786k85q446R814L8500L1011p509k1976L057K1302M739j7206
35272C4058j6577p108n255l934m253k2406m6863l9704P87K8759K0211L921N286
35259e3078J0864Q974J4292K8661K5617k445k6031k7344k2534j8786J078L2285
35247b8447L8216R935j3411o750O163K148o238p057j0987j5038M004L7325L9838
35234D9701L436k2206j0245J755j5043k7835o562J6179K132k3688j6970J1326
35222c8020J9706O255K065J5309K6436K3665R235j2944k9930k2258L898J4239
35210A7656l589j9880j3447m086r963j3377P92J1820J482j0409k163J1651R765
35197b3748o29o843j4673k3302j4042J0101J5860k656n877K0809L2646J974k6340
$$ plain form
35184 -36720 -44568 -20851 -7841 -31706 -61490 -61918 -42804 -29737 -22432 -9946 955 -1267 -11047
35171 -11047 -15457 -10406 3262 23402 41352 51000 62375 84504 100114 86643 57747 49038
35159 49038 64464 74880 69804 67745 70275 52374 12322 -12524 -164 22995 25088 12258
35147 12258 7377 14191 25093 40738 60968 74817 75625 69904 61106 42659 14843 -9651 -21788
35134 -21788 -20500 -3552 23274 34544 13283 -15149 -13445 8833 10311 -10133 -8385 28958
35122 28958 57029 41040 4658 -14388 -14556 -10326 -1808 7094 -3241 -32123 -44261 -22278 -1310
35109 -1310 -17808 -52877 -63768 -48633 -40728 -52718 -64317 -59697 -45977 -33938 -22912 -8326
35097 -8326 8360 19742 19455 11517 9028 15116 14046 -3034 -16519 -7797 3504 -12177 -39295
$$ packed form
35184c6720p848K3717J3010k3865k9784m28J9114J3067P305J2486J0901k222r780
35171a1047m410N051J3668K0140J7950R648J1375K2129J5610j3471k8896q709
35159D9038J5426J0416n076k059K530j7901m0052k4846J2360K3159K093j2830
35147A2258m881O814J0902J5645K0230J3849Q08n721q798j8447k7816k4494j2137
35134b1788J288J6948K6826J1270k1261k8432J704K2278J478k0444J748L7343
35122B8958K8071j5989l6382j9046j68M230Q518Q902j0335k8882j2138K1983K0968
35109a310j6498l5069j0891J5135P905j1990j1599M620J3720J2039J1026J4586
35097h326J6686J1382k87p938k489O088j070j7080j3485Q722J1301j5681k7118
$$ plain form
35084 -39295 -36723 -9606 -7795 -43588 -66992 -44146 -8041 -945 -13150 -15975 -15822 -32345 -51692
35071 -51692 -45196 -18187 -3546 -16372 -42013 -59863 -59010 -40785 -20024 -11766 -10387 -1176 6342
35058 6342 -11316 -43094 -46604 -14586 5657 -16782 -47704 -40533 -931 34580 51105 51253 29501
35045 29501 -10637 -38396 -32214 -14649 -17643 -33381 -32856 -14069 1367 3141 -5831 -24682 -43587
35032 -43587 -37401 509 38243 48671 50642 74037 105796 109814 85085 63957 60192 54819 31440
35019 31440 -2942 -30932 -38270 -20692 5958 13864 -2745 -17923 -14639 -12738 -33425 -58079
35007 -58079 -52115 -15248 19772 28918 16216 1873 7416 39235 74165 78212 48255 12033
34995 12033 -17663 -52448 -83267 -74907 -28757 -251 -18448 -36631 -7705 36619 37493 3264
$$ packed form
35084c9295K572K7117J811l5793k3404K2846L6105P096j2205k825J53j6523j9347
35071e1692O496K7009J4641j2826k5641j7850Q53J8225K0761Q258J379R211P518
35058F342j7658l1778l510L2018K0243k2439l0922P171L9602L5511J6525J48k1752
35045B9501m0138k7759O182J7565k994j5738N25J8787J5436J774q972j8851j8905
35032d3587O186L7910L7734J0428J971K3395L1759M018k4729k1128l765n373k3379
35019C1440l4382k7990p338J7578K6650P906j6609j5178L284J901k0687k4654
35007e8079N964L6867L5020R146j2702j4343N543L1819L4930M047k9957l6222
34995A2033k9696l4785l0819Q360M6150K8506j8197j8183K8926M4324Q74l4229
$$ plain form
34983 3264 -10243 10148 26865 20159 6860 -2773 -14267 -17639 5677 44233 65364 62126 56136
34970 56136 57549 56535 50235 46261 44370 42162 49063 68032 78399 65499 49053 51201 57469
34957 57469 44399 24166 22968 35058 37541 30760 24441 6508 -30915 -57487 -43623 -12111
34945 -12111 -3068 -10274 -3584 10009 6376 3324 34247 77573 80139 42585 14501 9876 -3506
34932 -3506 -30743 -36669 -13872 2656 208 4693 19845 13511 -17446 -28732 1735 38371 44604
34919 44604 27854 8320 -11385 -26513 -22841 -5836 2116 2928 17519 33742 12452 -42580
34907 -42580 -75723 -58407 -25219 -12386 -12942 -14945 -30738 -59494 -68835 -44855 -18677 -15163 -16096
34894 -16096 -1680 12450 9299 3384 9736 15044 8368 7179 24448 41055 38466 29832 32753
$$ packed form
34983C264j3507K0391J6717o706j3299r633j1494l372K3316L8556K1131l238n990
34970E6136J413j014o300l974j891k208O901J8969J0367j2900j6446K148O268
34957E7469j3070k0233j198J2090K483o781o319j7933l7423k6572J3864L1512
34945a2111R043p206O690J3593l633l052L0923M3326K566l7554k8084m625j3382
34932c506k7237n926K2797J6528k448M485J5152o334l0957j1286L0467L6636O233
34919D4604j6750j9534j9705j5128L672J7005P952Q12J4591J6223k1290n5032
34907d2580l3143J7316L3188J2833n56k003j5793k8756r341K3980K6178L514r33
34894a6096J4416J4130l151n915O352N308o676j189J7269J6607k589q634K921
$$ plain form
34881 32753 38628 33457 23351 17460 10406 994 3575 23066 41590 43534 31644 11590 -12441
34868 -12441 -23621 -6397 22754 33355 28684 34592 44930 30383 1647 2706 33127 42323
34856 42323 16518 3159 25597 43478 29829 17885 30468 30329 -8632 -41497 -21142 24204
34844 24204 40680 31433 30324 32630 14543 -7618 1649 35611 55889 49685 35431 27980 31737
34831 31737 48050 61944 48541 15996 4906 21177 18284 -22260 -50071 -29388 -4477 -24996
34819 -24996 -61125 -59831 -37318 -41402 -61966 -57255 -37606 -43223 -63157 -56561 -35782 -47359 -82615
34806 -82615 -87790 -57251 -37571 -39873 -26829 7269 20313 -616 -17027 -11117 -13356 -36305
34794 -36305 -42954 -9334 32713 43709 26407 5270 -6669 -2791 19535 41048 32940 -2086
$$ packed form
34881C2753N875n171j0106n891p054r412K581J9491J8524J944j1890k0054k4031
34868a2441j1180J7224K9151J0601m671N908J0338j4547k8736J059L0421R196
34856D2323k5805j3359K2438J7881j3649j1944J2583j39l8961l2865K0355M5346
34844B4204J6476r247j109K306j8087k2161R267L3962K0278o204j4254p451L757
34831C1737J6313J3894j3403l2545j1090J6271k893m0544k7811K0683K4911k0519
34819b4996l6129J294K2513m084k0564M711J9649n617j9934O596K0779j1577l5256
34806h2615n175L0539J9680k302J3044L4098J3044k0929j6411N910k239k2949
34794c6305o649L3620M2047J0996j7302k1137j1939L878K2326K1513q108l5026
$$ plain form
34782 -2086 -32309 -44086 -50183 -49594 -22790 25299 60089 65391 57893 47156 24105 -1950 -1176
$$ packed form
34782b086l0223j1777o097N89K6804M8089L4790N302p498j0737k3051k6055P74
$$ [...]
##END NTUPLES=NMR SPECTRUM
##END=
