##TITLE=31Pdec_IPEM21
 CDCl3, 24 sc
 24.7.2019
##JCAMPDX= 6.0         $$ Bruker NMR JCAMP-DX V2.0
##DATA TYPE= NMR SPECTRUM
##DATA CLASS= NTUPLES
##ORIGIN= UXNMR, Bruker Analytische Messtechnik GmbH
##OWNER= root
$$ XWIN-NMR		Version 3.5
$$ Wed Jul 24 14:29:05 2019 Russian Standard Time (UT+4h)  she@DPX200
##.OBSERVE FREQUENCY= 81.013821
##.OBSERVE NUCLEUS= ^31P
##.ACQUISITION MODE= SIMULTANEOUS
##.ACQUISITION SCHEME= undefined
##.AVERAGES= 24
##.DIGITISER RES= 17
##SPECTROMETER/DATA SYSTEM= spect
##.PULSE SEQUENCE= zgpg30
##.SOLVENT NAME= CDCl3
##.SHIFT REFERENCE= (INTERNAL, CDCl3, 0, 182.463)
##AUDIT TRAIL= $$ (NUMBER, WHEN, WHO, WHERE, WHAT)
$$ ##TITLE= Audit trail, XWIN-NMR		Version 3.5
$$ ##JCAMPDX= 5.01
$$ ##ORIGIN= Bruker BioSpin GmbH
$$ ##OWNER= she
$$ F:/spectra/data/she/nmr/P31/1/pdata/1/auditp.txt
$$ ##AUDIT TRAIL=  $$ (NUMBER, WHEN, WHO, WHERE, WHAT)
(   1,<2019-07-24 14:27:59.84 +0400>,<she>,<DPX200>,
      <created by zg, POWCHK disabled, PULCHK disabled
       configuration hash MD5:
       00 E9 B6 7A A2 85 ED C7 34 08 36 98 17 FE 4E 26
       data hash MD5: 32K
       20 B5 B9 05 D8 BA D4 3C E0 20 9E 5E 3B E5 60 69>)
(   2,<2019-07-24 14:28:03.21 +0400>,<she>,<DPX200>,
      <Start of raw data processing
       efp BC_mod = 2 LB = 1 FT_mod = 6 PKNL = 1 PHC0 = -2578.264 PHC1 = 168.5993 SI = 64K 
       data hash MD5: 64K
       A6 32 1F 75 A7 10 BD A5 A3 F7 B4 02 8E 3B 8F 6B>)
(   3,<2019-07-24 14:28:37.62 +0400>,<she>,<DPX200>,
      <pk PHC0 = 83.98027 PHC1 = -197.2 
       data hash MD5: 64K
       81 9B 2E 52 32 42 9F 7B 6E 75 A2 CA 23 0D 54 33>)
$$ ##END=
$$ 
$$ hash MD5
$$ E6 59 61 90 BB 99 9E 70 90 C5 7B 77 91 A5 A2 05
##$RELAX= 
##$RELAX= 
##$RELAX= 
##$RELAX= 
##$RELAX= 
##$RELAX= 
##$RELAX= 
##$RELAX= 
$$ Bruker specific parameters
$$ --------------------------
##$DU= <F:/spectra>
##$EXPNO= 1
##$NAME= <P31>
##$PROCNO= 1
##$TYPE= <nmr>
##$USER= <she>
##$AMP= (0..31)
100 100 100 100 100 100 100 100 100 100 100 100 100 100 100 100 100 100 
100 100 100 100 100 100 100 100 100 100 100 100 100 100 
##$AQSEQ= 0
##$AQ_mod= 1
##$AUNM= <au_zg>
##$AUTOPOS= <>
##$BF1= 81.014009
##$BF2= 200.13
##$BF3= 200.13
##$BF4= 200.13
##$BF5= 200.13
##$BF6= 200.13
##$BF7= 200.13
##$BF8= 200.13
##$BYTORDA= 1
##$CFDGTYP= 0
##$CFRGTYP= 5
##$CHEMSTR= <none>
##$CNST= (0..31)
1 1 145 1 1 1 1 1 1 1 1 1 1 1 1 1 1 1 1 1 1 1 1 1 1 1 1 1 1 1 1 1 
##$CPDPRG= <waltz16>
##$CPDPRG1= <>
##$CPDPRG2= <waltz16>
##$CPDPRG3= <>
##$CPDPRG4= <mlev>
##$CPDPRG5= <mlev>
##$CPDPRG6= <mlev>
##$CPDPRG7= <mlev>
##$CPDPRG8= <mlev>
##$CPDPRGB= <>
##$CPDPRGT= <>
##$D= (0..31)
0 1 0 0 0 0 0 0 0 0 0 0.03 2e-05 3e-06 0 0 0 0 0 0 0 0 0 0 0 0 0 0 0 0 
0 0 
##$DATE= 1563964079
##$DBL= (0..7)
120 120 120 11 120 120 24 19 
##$DBP= (0..7)
150 150 150 150 150 150 150 150 
##$DBP07= 0
##$DBPNAM0= <>
##$DBPNAM1= <>
##$DBPNAM2= <>
##$DBPNAM3= <>
##$DBPNAM4= <>
##$DBPNAM5= <>
##$DBPNAM6= <>
##$DBPNAM7= <>
##$DBPOAL= (0..7)
0.5 0.5 0.5 0.5 0.5 0.5 0.5 0.5 
##$DBPOFFS= (0..7)
0 0 0 0 0 0 0 0 
$$ [...]
##$SUBNAM2= <"">
##$SUBNAM3= <"">
##$SUBNAM4= <"">
##$SUBNAM5= <"">
##$SUBNAM6= <"">
##$SUBNAM7= <"">
##$SUBNAM8= <"">
##$SUBNAM9= <"">
##$SW= 369.568048894756
##$SWIBOX= (0..15)
0 1 3 0 0 0 0 0 0 0 0 0 0 0 0 0 
##$SW_h= 29940.119760479
##$TD= 32768
##$TD0= 1
##$TE= 0
##$TE2= 300
##$TE3= 300
##$TEG= 300
##$TL= (0..7)
0 120 53 12 22 120 120 120 
##$TP= (0..7)
150 150 150 150 150 150 150 150 
##$TP07= 0
##$TPNAME0= <>
##$TPNAME1= <>
##$TPNAME2= <>
##$TPNAME3= <>
##$TPNAME4= <>
##$TPNAME5= <>
##$TPNAME6= <>
##$TPNAME7= <>
##$TPOAL= (0..7)
0.5 0.5 0.5 0.5 0.5 0.5 0.5 0.5 
##$TPOFFS= (0..7)
0 0 0 0 0 0 0 0 
##$TUNHIN= 0
##$TUNHOUT= 0
##$TUNXOUT= 0
##$USERA1= <user>
##$USERA2= <user>
##$USERA3= <user>
##$USERA4= <user>
##$USERA5= <user>
##$V9= 5
##$VALIST= <valist>
##$VCLIST= <CCCCCCCCCCCCCCC>
##$VD= 0
##$VDLIST= <DDDDDDDDDDDDDDD>
##$VPLIST= <PPPPPPPPPPPPPPP>
##$VTLIST= <TTTTTTTTTTTTTTT>
##$WBST= 1024
##$WBSW= 4
##$XGAIN= (0..3)
0 0 0 0 
##$XL= 0
##$YL= 0
##$YMAX_a= 69246
##$YMIN_a= -73779
##$ZGOPTNS= <>
##$ZL1= 120
##$ZL2= 120
##$ZL3= 120
##$ZL4= 120
##$ABSF1= 0
##$ABSF2= 0
##$ABSG= 0
##$ABSL= 0
##$ALPHA= 0
##$AQORDER= 0
##$ASSFAC= 0
##$ASSFACI= 0
##$ASSFACX= 0
##$ASSWID= 0
##$AUNMP= <proc_1d>
##$AZFE= 0.1
##$AZFW= 0.5
##$BCFW= 0
##$BC_mod= 2
##$BYTORDP= 0
##$COROFFS= 0
##$CY= -3
##$DATMOD= 1
##$DC= 0
##$DFILT= <>
##$DTYPP= 0
##$F1P= 0
##$F2P= 0
##$FCOR= 1
##$FTSIZE= 65536
##$FT_mod= 6
##$GAMMA= 0
##$GB= 0
##$INTBC= 1
##$INTSCL= 5.30512e-09
##$ISEN= 30
##$LB= 1
##$LEV0= 0
##$LPBIN= 0
##$MAXI= 10000
##$MC2= 0
##$MEAN= 0
##$ME_mod= 0
##$MI= 50
##$NCOEF= 0
##$NC_proc= -4
##$NLEV= 6
##$NOISF1= 182.463
##$NOISF2= 159.3651
##$NSP= 0
##$NTH_PI= 0
##$NZP= 0
##$OFFSET= 182.463
##$PC= 4
##$PHC0= -2494.284
##$PHC1= -28.60069
##$PH_mod= 1
##$PKNL= yes
##$PPARMOD= 0
##$PSCAL= 0
##$PSIGN= 0
##$REVERSE= no
##$SF= 81.0140089999434
##$SI= 65536
##$SIGF1= 159.3651
##$SIGF2= -187.1042
##$SINO= 113.3802
##$SIOLD= 16384
##$SREGLST= <1H.CDCl3>
##$SSB= 0
##$STSI= 65536
##$STSR= 0
##$SW_p= 29940.119760479
##$SYMM= 0
##$S_DEV= 0
##$TDeff= 32768
##$TDoff= 0
##$TI= <>
##$TILT= no
##$TM1= 0
##$TM2= 0
##$TOPLEV= 0
##$USERP1= <user>
##$USERP2= <user>
##$USERP3= <user>
##$USERP4= <user>
##$USERP5= <user>
##$WDW= 1
##$XDIM= 65536
##$YMAX_p= 480172781
##$YMIN_p= -4350696
$$ End of Bruker specific parameters
$$ ---------------------------------
##NTUPLES= NMR SPECTRUM
##VAR_NAME=  FREQUENCY,     SPECTRUM/REAL,   SPECTRUM/IMAG
##SYMBOL=    X,             R,               I
##VAR_TYPE=  INDEPENDENT,   DEPENDENT,       DEPENDENT
##VAR_FORM=  AFFN,          ASDF,            ASDF
##VAR_DIM=   65536,         65536,           65536
##UNITS=     HZ,            ARBITRARY UNITS, ARBITRARY UNITS
##FACTOR=    0.456856943014862, 1,           1
##FIRST=     14782.0589164792, 0,            0
##LAST=      -15158.0608439998, 0,           0
##MIN=       -15158.0608439998, -4350696,    0
##MAX=       14782.0589164792, 480172781,    0
$$ Real data points
##PAGE= N=1
##DATA TABLE= (X++(R..R)), XYDATA
$$ [...]
40804c44945O87385M23745k53619p73263p93896m43920K0754M27532N76314L29438
40794a44475j08887l36063k39697n6611M4462R1928M5964j74233l69354k14184
40784a461150J93637L92992K57107J38527J91202J11782k00279l02626P5700M73710
40774a29398L45665j03095k62839n1714M9254k10741n24337n23069k31266O8207
40764a573333J91532J84049J88196K32947J95657L5959n6266M3941J00185j28662
40754e85795l66123j69621K52533K41141k18426l72086P6918M40146J93254j62153
40744f70212l8611J82758j16163o06538n38589l5518J64288j706O2657M12085
40734a185549M32400j6982l10733j00515K09055K52779J84767J29878q3282l68576
$$ plain form
40804 -344945 342440 766185 512566 -260697 -1054593 -1498513 -1477759 -1050227 -473913 -144475
40794 -144475 -253362 -589425 -829122 -885733 -841271 -749343 -703379 -877612 -1246966 -1461150
40784 -1461150 -1267513 -874521 -617414 -478887 -287685 -175903 -376182 -678808 -603108 -129398
40774 -129398 216267 113172 -149667 -201381 -152127 -362868 -887205 -1410274 -1641540 -1573333
40764 -1573333 -1381801 -1197752 -1009556 -776609 -580952 -544993 -601259 -557318 -457133 -585795
40754 -585795 -951918 -1121539 -869006 -627865 -846291 -1218377 -1141459 -701313 -508059 -670212
40744 -670212 -708823 -526065 -642228 -1248766 -1787355 -1822873 -1658585 -1660291 -1597634 -1185549
40734 -1185549 -753149 -770131 -1080864 -1181379 -972324 -719545 -534778 -404900 -488182 -856758
40724h56758k87467J84756M72027K82120K3337L7446R1870k6207r0319J1246k1495
40713a79444k36091j72424K55765L66796j97707p05703m06458K61491L98574O7332
40703e47869J6074L19592L32230j01311l65411j08486K55935K79044N4818j40680
40693f064k57903l24668l03314k35128k00842j17785R2919K23814P8456p5526
40683a126041J35212M87954M33575K7908r7549K23234L91836J0634n05454o00759
40673f19450l07991L3904K95919M38047L18098r966j87218o5731M6740m7823p3917
40662a79388J61429L23036J11229j68876j28046J6483j27116l50228j98092J44199
40652c95370R1606l10131l87408O1709M29220K65793r7601k11799j84883k71117
$$ plain form
40724 -856758 -1144225 -959469 -487442 -205322 -181985 -144539 -52669 -78876 -169195 -157949 -179444
40713 -179444 -415535 -587959 -332194 34602 -163105 -868808 -1275266 -1013775 -615201 -547869
40703 -547869 -531795 -212203 120027 18716 -346695 -455181 -199246 79798 134616 -6064
40693 -6064 -263967 -588635 -891949 -1127077 -1327919 -1445704 -1352785 -1128971 -1050515 -1126041
40683 -1126041 -990829 -502875 -69300 -41392 -138941 84293 476129 486763 -18691 -619450
40673 -619450 -927441 -893537 -597618 -159571 158527 148561 -38657 -104388 -57648 -105471 -179388
40662 -179388 -17959 305077 416306 247430 119384 135867 8751 -341477 -539569 -395370
40652 -395370 -303764 -613895 -1001303 -939594 -510374 -244581 -342182 -553981 -738864 -1009981
40642a009981k81566O9688N46532O48314L34897L3251j6505m813j17398k21198
40632a8779j25437P5633J09571r4251k78388j70042J32593K32093k7213k63134
40622d27354m6358M25091N24385R2052l13565k42726J9610r02j88365j05148K07424
40611e5856K85826L3882j29084R830J25050n6291k94860k67711r5462q8371k15381
40600g48428k03847m0352j1052k42286m71112l55246J09737N36668N06508L1461
40590h87949l75720k55605J93633L36407k4158l60945k15626J18411R7113j96434
40580a570873k15906J34011L38038R8945k05089j18752K35110L91744J77012j71320
40570i07080l49434k33069R3562L74086L60760J04671n9180N9942K58481K66675
$$ plain form
40642 -1009981 -1291547 -1221859 -675327 -27013 307884 341135 324630 319817 202419 -18779
40632 -18779 -144216 -68583 40988 -53263 -331651 -501693 -369100 -137007 -164220 -427354
40622 -427354 -473712 -48621 475764 567816 254251 11525 31135 30233 -158132 -263280 -55856
40611 -55856 229970 263852 134768 144598 269648 213357 -81503 -349214 -444676 -533047 -748428
40600 -748428 -952275 -992627 -1003679 -1245965 -1717077 -2072323 -1962586 -1425918 -919410 -887949
40590 -887949 -1263669 -1519274 -1325641 -989234 -1013392 -1374337 -1589963 -1471552 -1374439 -1570873
40580 -1570873 -1786779 -1652768 -1314730 -1215785 -1420874 -1539626 -1304516 -912772 -735760 -907080
40570 -907080 -1256514 -1489583 -1396021 -1021935 -661175 -556504 -615684 -555742 -297261 -30586
40560c0586J39902J02502J49292P7029j49170l28205l31600k53966k04277j33281
40550i62360L9380K48309L38144K52651R8980K1839L7712J9449j30612l24400
40540c60908l79785k55008q3403L4776J37925K57427L16698K58182J37703J1051
40530G4658j25542k01531q4677J34277J17076k15557l90535K2141O60724P03755
40520F94789j3731p01649o34050n0686K92846J64097q931R1739K57360J95959
40510B87743l667q2678l5439m0475j01155n9438N3864o583k74757l97052j02799
40499g62436L35900M12288P5541k16743j64311J453l9800j92099j55174P0350
40489f35031K26267K40023K70001L21312J79321j79329m38400l85954k33772k50114
$$ plain form
40560 -30586 109316 211818 361110 438139 288969 -39236 -370836 -624802 -829079 -962360
40550 -962360 -922980 -674671 -336527 -83876 15104 36943 74655 94104 -36508 -360908
40540 -360908 -740693 -995701 -1079104 -1044328 -906403 -648976 -332278 -74096 63607 74658
40530 74658 -50884 -252415 -337092 -202815 -85739 -301296 -691831 -669690 -8966 694789
40520 694789 681058 -20591 -654641 -705327 -412481 -248384 -257315 -165576 91784 287743
40510 287743 284076 201398 165959 125484 24329 -35109 18755 12172 -262585 -659637 -762436
40499 -762436 -426536 -14248 61293 -155450 -319761 -318308 -358108 -550207 -705381 -635031
40489 -635031 -408764 -168741 101260 422572 601893 422564 -15836 -401790 -635562 -885676
40479h85676l01951r7685K47771L05860J8741j32663J53780M77182K92311k32484
40469a54814l97092K0328M43132L49094k6267j74884j16338k10204m00027k62017
40459i29089K01167M31813J64711j40817l2652K32568J57577j67434k35087N0338
40449b66905K52965J09201j22136j25974K1898M8103j22725l29621l82857k03624
40439a121675J27689L95235M09988J77956j48370m23381n19508l22228Q3958L38965
40429a001371J84912j45286k07122L4476J98944R9334k9115J0186Q2955O6372
40419g05715J12514L07793L80568Q5495l29891m02535r1602J96949J88963L3510
40409b23951k3697J0854k4807j75481l33383l92494l16171q3951K94051O52577
$$ plain form
40479 -885676 -1187627 -1285312 -1037541 -731681 -712940 -845603 -691823 -214641 77670 -154814
40469 -154814 -551906 -531578 -88446 260648 234381 59497 -56841 -267045 -667072 -929089
40459 -929089 -727922 -296109 -131398 -272215 -304867 -72299 85278 -82156 -317243 -266905
40449 -266905 -13940 95261 -26875 -152849 -130951 -82848 -205573 -535194 -918051 -1121675
40439 -1121675 -993986 -598751 -188763 -10807 -159177 -582558 -1102066 -1424294 -1340336 -1001371
40429 -1001371 -816459 -961745 -1168867 -1134391 -935447 -836113 -865228 -855042 -772087 -705715
40419 -705715 -593201 -285408 95160 180655 -149236 -551771 -643373 -446424 -257461 -223951
40409 -223951 -247648 -236794 -261601 -437082 -770465 -1162959 -1479130 -1563081 -1269030 -616453
40399f16453O76431K08828m40442p03869l88609Q3960K38211J37133J39672K54878
40389d10260J66274j46057k86920n9900K28369K66723J59166J09762N2029r8817
40379a9631j41151Q8013L18125J84996j78017k93514k1632K83362K89882L5672
40369E46105k61222m42978m18186j85606Q3354J89170J66412K00912K70633J27848
40359B76442k59583m91835j86665M44406P06384J96486o50898r75418m72409K39271
40349a173819L91222M279k76491j56296O145o1146p6979K02315M26474J86486
40339e27810k35863k36212J75173L96855J54288j66633j79421j372O3346l2674
40329e90323j40938j61860q2267N6712J62703J93934K15675K14477K4472l22445
$$ plain form
40399 -616453 59978 268806 -171636 -875505 -1264114 -1180154 -941943 -804810 -665138 -410260
40389 -410260 -243986 -390043 -676963 -736863 -508494 -241771 -82605 27157 79186 -19631
40379 -19631 -160782 -72769 245356 430352 252335 -41179 -62811 220551 510433 546105
40369 546105 284883 -158095 -576281 -761887 -678533 -489363 -322951 -122039 148594 276442
40359 276442 16859 -474976 -661641 -217235 489149 685635 34737 -940681 -1413090 -1173819
40349 -1173819 -782597 -778318 -1054809 -1211105 -1204960 -1266106 -1343085 -1140770 -714296 -527810
40339 -527810 -763673 -999885 -824712 -427857 -273569 -440202 -619623 -620995 -557649 -590323
40329 -590323 -731261 -893121 -975388 -918676 -755973 -562039 -346364 -131887 -107415 -429860
40319d29860m16728k8979L86469K64777j77307k61003M7890J15569k28570l73391
40309a101133Q619L81811K56691l4153l951J59863N1657j75496j53318j4444q1837
40298g05691j69220R2340M61765L61450j64591m68455k60446Q2561J99601J43971
40288d26715L4266j39117k57190j18852J53504K08426L6038j8090J32243J85540
40278b09947K6140r7328r1630j71814l22953j85978K58726M67347J49577k25660
40268d03520j79101K2664r4467l34890j58636L60012N92230L13231l0476p2380
40258A4667K1556J4123J6806J71323K70509M1447l77875n65792l73102r5154m0810
40247i02302j24302l9998K38170L64294J23212j88055j46877J37280J35660k75347
$$ plain form
40319 -429860 -846588 -875567 -489098 -224321 -401628 -662631 -614741 -499172 -727742 -1101133
40309 -1101133 -1092514 -710703 -454012 -488165 -492116 -332253 -280596 -456092 -609410 -623854 -705691
40298 -705691 -874911 -782571 -320806 40644 -123947 -592402 -852848 -770287 -570686 -426715
40288 -426715 -392449 -531566 -788756 -907608 -754104 -545678 -509640 -527730 -395487 -209947
40278 -209947 -183807 -281135 -372765 -544579 -867532 -1053510 -794784 -327437 -177860 -403520
40268 -403520 -582621 -559957 -654424 -989314 -1147950 -787938 -195708 117523 87047 14667
40258 14667 36223 50346 67152 238475 508984 550431 172556 -393236 -766338 -861492 -902302
40247 -902302 -1026604 -1066602 -828432 -464138 -340926 -528981 -675858 -538578 -402918 -678265
40237f78265n23920j23461N91758Q74309N05108n3543l33229l00193j45922p945
40227a95303K8309o7229j72855j29265J222o893j88760l09033j89880Q0172L19766
40216h29749M40907M02955J81089j30459l43486l72686k69975n8921K52250M70703
40206b57372L19198j39946m45358k93297N4721J37463r8980k97567j85039J57018
40196a049159M48518M42440P0312m40090o49390l28851K20245M72824K90864J0519
40186e11768p5498m3988o0600n5589R9283K72622K15478l4334j60451j5514J76908
40175a93451J66342J2835q1200j04677j74410k48361j81758l3136m937n1409J00645
40164g93517M21811M68577O5587k82798q5562L30180K64764k70809n68424l20571
$$ plain form
40237 -678265 -1202185 -1325646 -733888 140421 645529 591986 258757 -41436 -187358 -195303
40227 -195303 -166994 -234223 -407078 -536343 -535121 -542014 -730774 -1039807 -1229687 -1149515 -829749
40216 -829749 -388842 14113 195202 64743 -278743 -651429 -921404 -980325 -728075 -257372
40206 -257372 61826 -78120 -523478 -816775 -762054 -624591 -723571 -1021138 -1206177 -1049159
40196 -1049159 -600641 -158201 -87889 -527979 -1177369 -1506220 -1285975 -813151 -522287 -511768
40186 -511768 -587266 -631254 -691854 -747443 -648160 -375538 -160060 -194394 -354845 -370359 -193451
40175 -193451 -27109 -14274 -95474 -200151 -374561 -622922 -804680 -837816 -842753 -894162 -793517
40164 -793517 -371706 96871 162458 -120340 -205902 124278 389042 118233 -450191 -770762
40154g70762j4643m9266j32707P2352K98054J76076p0436k7629J58133O3896k05575
40143e02507j65689J98530L88485J99265m7632j37811k23291l27401j92989J72203
40133f38837L63516K40113J66242L03964K50522k09713n62599l35780N9525o2553
40123d25600n43938o28523j65646K10781J29992k4692J34513L89456L70476J41371
40113d11810k7001j19898k58282l53248k14909J22679M32825N54275M50263J48761
40103C23655j98896l34552j64314P5875R3035r9272k37013j55483O1288K39342
40093c96335L00888K95676L02047K92618J36486j77722l96530k81592n20M5422
40083A20438j82274k80224n0496J55956J1052k30690j49606J20422R2597k69886
$$ plain form
40154 -770762 -785405 -834671 -967378 -895026 -596972 -420896 -491332 -518961 -360828 -296932 -502507
40143 -502507 -668196 -469666 -81181 118084 70452 -67359 -290650 -618051 -811040 -638837
40133 -638837 -275321 -35208 131034 434998 685520 475807 -86792 -422572 -363047 -425600
40123 -425600 -969538 -1598061 -1763707 -1552926 -1422934 -1447626 -1313113 -923657 -553181 -411810
40113 -411810 -438811 -558709 -816991 -1170239 -1385148 -1262469 -829644 -275369 174894 323655
40103 323655 124759 -209793 -374107 -298232 -205197 -304469 -541482 -696965 -635677 -396335
40093 -396335 -95447 200229 502276 794894 931380 753658 357128 75536 75016 120438
40083 120438 -61836 -342060 -392556 -236600 -225548 -456238 -605844 -485422 -392825 -662711
40073f62711m79877k75504N9248K39573L57780M86650L61091j56545o13071m49940
40063a133306J71898M97206J56423l76023m43830k0825L66223L41144L9443j88943
40053e90590j99684r3480K2459J54213K98628L32686J48947j21297j76011P6535
40043a47594L25405K18051j42874l00046q3346J18417q0799m51649m31554N8391
40033i17598M69763L87156O1161n2069J8938r6621m26981n41666j69605L96283
40023h71239O45600L92488j28408n24634n21049j57739J95151J90757o3332j39540
40013i81945Q3617K37703O9321j19288M2463L45704K89878j21555l63884j71351
40003f89337J35290K05717J04552M682j53314l86542l85092Q5226O73616P60832
$$ plain form
40073 -662711 -1142588 -1418092 -1358844 -1119271 -761491 -274841 86250 -70295 -683366 -1133306
40063 -1133306 -961408 -464202 -307779 -683802 -1127632 -1148457 -782234 -441090 -401647 -590590
40053 -590590 -790274 -883754 -861295 -707082 -408454 -75768 73179 -48118 -224129 -147594
40043 -147594 177811 395862 252988 -47058 -130404 -11987 -92786 -544435 -975989 -917598
40033 -917598 -447835 -60679 482 -51587 -32649 -129270 -556251 -1097917 -1267522 -871239
40023 -871239 -225639 166849 38441 -486193 -1007242 -1164981 -969830 -779073 -842405 -981945
40013 -981945 -898328 -660625 -591304 -710592 -668129 -322425 -32547 -154102 -517986 -689337
40003 -689337 -554047 -348330 -243778 -239096 -392410 -778952 -1164044 -1078818 -405202 355630
39993C55630K39347l84924o59149n82315l02102J50077O08256O40679O1410o25407
39983d98498p23164k38416J35960j2943k99808j94747J96603L83136K65755J88542
39973g97580K85216K64255n2142l93391m49683k86764j13260P1166K95526L43485
39963h33172N4144k57102j27091L29558M80583P4582l46026j91010L43113N61710
39953H9289K31142j80551k44407j34144k17829l90284k23182K93409O11981L81224
39943B16648m4911j49897L456M463j45714p2413K17509K46770j22081l93082k30303
39932d69555K9940L9281L4817K52736K93728k10385p23707m68072K83657N17272
39922d20288K3395l39371o0832L07250J95620j00435r3183O5413J5349j13137
$$ plain form
39993 355630 594977 210053 -449096 -1031411 -1333513 -1183436 -575180 65499 126909 -498498
39983 -498498 -1221662 -1460078 -1324118 -1337061 -1636869 -1831616 -1635013 -1251877 -986122 -797580
39973 -797580 -512364 -248109 -300251 -693642 -1143325 -1430089 -1543349 -1472183 -1176657 -833172
39963 -833172 -779028 -1036130 -1163221 -833663 -353080 -278498 -624524 -815534 -472421 89289
39953 89289 320431 139880 -104527 -238671 -456500 -846784 -1069966 -776557 -164576 216648
39943 216648 171737 21840 25296 29759 -115955 -188368 29141 275911 153830 -239252 -469555
39932 -469555 -439615 -400334 -365517 -112781 180947 -29438 -753145 -1221217 -937560 -420288
39922 -420288 -396893 -736264 -797096 -489846 -294226 -394661 -487844 -422431 -407082 -520219
39912e20219l0317J34777J46157J45635K88558K98284m7735l67128k14052J69255
39902C215K68277J33234J20156J11567k14179n60406l37855K62267M16392m5922
39892A56746l82784j55454J46564K4571k56450k61528j06019p7540o6405R8995
39882h79304J77232q5469m06078l41693J7825K14187J01873o9447j11059l3549
39872a415482J51667L94698M70420K33098p3200r2444J23922J98488k0889l00950
39862c30672l87691k50572J2674K49595K59974m046k65668k17910K8505Q2122
39852h23689j34333k47597J2621M13461N41481L18236Q264j45557j06560M8337
39842a15336K12287K53469J04009j09443j49602L2255J77555L7772k44285k77565
$$ plain form
39912 -520219 -550536 -415759 -269602 -123967 164591 462875 415140 48012 -166040 3215
39902 3215 271492 404726 524882 636449 422270 -138136 -475991 -213724 202668 156746
39892 156746 -226038 -381492 -234928 -210357 -466807 -728335 -834354 -911894 -978299 -879304
39882 -879304 -702072 -787541 -1193619 -1535312 -1517487 -1303300 -1201427 -1270874 -1381933 -1415482
39872 -1415482 -1263815 -869117 -398697 -165599 -238799 -331243 -207321 -8833 -29722 -330672
39862 -330672 -718363 -968935 -956261 -706666 -446692 -450738 -716406 -934316 -905811 -823689
39852 -823689 -958022 -1205619 -1192998 -779537 -238056 80180 88444 -57113 -163673 -115336
39842 -115336 96951 350420 454429 344986 195384 227639 405194 442966 198681 -78884
39832g8884J4188K21593J6237l35213l30412K5347K31206N1318j57779l3758K47192
39821a28965K82217M0892j58926j36744k5693j1748j13038k13358j87183j4461
39811f67007J64438J81018O0365j9563j8719q7905k66324l62793k55766p4296
39801a346552N9151K11064L91044L99253J51107r7264j07811j2583l7300j11848
39791e01739o2678L3157K2833k572Q5716J40623J5611o5621J35862L48703J43804
39780B93699l24310m99920k83767j02537j14698n35L19330M01805J312m67603
39770g77224n29307k66832l679K15899M37250M54729J24539k32044k00254J11189
39760f65734K56428J41716P7904J74541J49805j37669l71584k42009M9620P8975
$$ plain form
39832 -78884 -64696 156897 173134 -162079 -492491 -467144 -235938 -184620 -342399 -376157 -128965
39821 -128965 153252 194144 35218 -101526 -127219 -138967 -252005 -465363 -652546 -667007
39811 -667007 -502569 -321551 -261186 -280749 -299468 -387373 -653697 -1016490 -1272256 -1346552
39801 -1346552 -1287401 -1076337 -685293 -286040 -134933 -232197 -340008 -352591 -389891 -501739
39791 -501739 -564417 -531260 -508427 -510999 -425283 -284660 -269049 -334670 -198808 149895 293699
39780 293699 -30611 -530531 -814298 -916835 -1031533 -1032068 -712738 -310933 -309621 -777224
39770 -777224 -1306531 -1573363 -1577042 -1361143 -923893 -469164 -344625 -576669 -776923 -665734
39760 -665734 -409306 -267590 -189686 -15145 134660 -3009 -374593 -616602 -566982 -488007
39750d88007j39877j66022J47360L35096q608n34402n63063q3771K27356M6843
39740a227095j54677K7353K61403J55875L0225L06196N68807J22622p37025r75761
39730a622077l45289K89877L10664J06351J72609L23813K62257J67098J90695
39721a44002M7170l45542m65812m3009L14199N0318l48356j17607M91401N95297
39711C4057P0648l55817k85503n2132M1605R3707J27393m7832l59092m41562k10985
39700a385513L8488J62167K82734L60223J91036j14470j96705m9728k2146j65052
39690h98966j53800N8326J14815p2432j27704J10054K85410J46541o4440j00551
39680g02747q6594j41194j12897K5392j282k48563l14274N0572N11663O46019
$$ plain form
39750 -488007 -627884 -793906 -646546 -311450 -320058 -854460 -1417523 -1501294 -1273938 -1227095
39740 -1227095 -1381772 -1354419 -1093016 -937141 -906916 -600720 -31913 90709 -646316 -1622077
39730 -1622077 -1967366 -1677489 -1366825 -1260474 -1087865 -764052 -501795 -334697 -144002
39721 -144002 -96832 -442374 -908186 -951195 -636996 -586678 -935034 -1052641 -561240 34057
39711 34057 104705 -251112 -536615 -588747 -547142 -453435 -326042 -373874 -732966 -1174528 -1385513
39700 -1385513 -1347025 -1184858 -902124 -541901 -350865 -465335 -662040 -711768 -733914 -898966
39690 -898966 -1052766 -994440 -879625 -952057 -1079761 -969707 -684297 -537756 -602196 -702747
39680 -702747 -789341 -930535 -1043432 -1018040 -1019322 -1267885 -1582159 -1531587 -1019924 -373905
39670c73905M63177J54858k18719m83818k97988K61456N31801J49312l37006k43326
39660c94158K49192M31354R4100l44764n16172l85697n9624K29710J57245k39995
39650g78809m10303n0322L16296Q9550m23671m84434j05421P4814l3487J52932
39640a652855P56559J079272O69383j347l06246k87546k97658l42048k36110k9316
39630f47912J42033L16657M79219L87114k5126l72055l18848q9837r2260k68103
39620d89118k43825L1367K27108J54917k2168j03425p3234Q908R9809J33225P2847
39609b03589k135j4134l2565j34972k04396p6493J69124K93452K40504J51768
39599A86564M8459k12145n79298o87031k98657K88393N27964K74970p0714j07615
$$ plain form
39670 -373905 89272 244130 25411 -458407 -756395 -494939 36862 186174 -150832 -394158
39660 -394158 -144966 286388 380488 35724 -480448 -866145 -925769 -696059 -538814 -778809
39650 -778809 -1189112 -1239434 -923138 -833588 -1257259 -1741693 -1847114 -1772300 -1805787 -1652855
39640 -1652855 -896296 182976 852359 851012 544766 257220 -40438 -382486 -618596 -647912
39630 -647912 -505879 -189222 289997 677111 651985 279930 -38918 -128755 -221015 -489118
39620 -489118 -732943 -701576 -474468 -319551 -341719 -445144 -518378 -509470 -409661 -276436 -203589
39609 -203589 -205724 -219858 -252423 -387395 -591791 -668284 -499160 -205708 34796 186564
39599 186564 235023 22878 -556420 -1243451 -1542108 -1253715 -725751 -450781 -521495 -629110
39589f29110Q8574J73589O9575K9462J69978K33022j8925l83322m57004j86839
39579i11000J05379K09613K33575K91313K99966K02822J19472J14584N7402j09442
39569F13684j92750n9645Q1966k6779k90219m17638l49431k27433o1413K23209
39559g06449M63819L75374K5122j73271m3777J12083J2792j87900k08755q7099
39549d18061k3811J3872J87997L87371K90884j37042n11282m89146j59311J42543
39539g15986K39506K02640J49315J03049L0372p6496j71171j99365j89043k50787
39529h77966m02111m32413j05743M72127Q65759P86443M10713J03203k9652j29816
39519F60544k49967k77025j84288j27194k08270l00445k03660R8244M02130M76312
$$ plain form
39589 -629110 -540536 -366947 -297372 -267910 -97932 135090 116165 -267157 -724161 -911000
39579 -911000 -805621 -596008 -362433 -71120 228846 431668 551140 665724 723126 613684
39569 613684 420934 361289 443255 416476 126257 -291381 -640812 -868245 -929658 -706449
39559 -706449 -242630 132744 157866 -15405 -59182 52901 65693 -122207 -330962 -418061
39549 -418061 -441872 -428000 -240003 147368 438252 301210 -210072 -699218 -858529 -715986
39539 -715986 -476480 -273840 -124525 -21476 8896 -67600 -238771 -438136 -627179 -877966
39529 -877966 -1280077 -1712490 -1818233 -1346106 -480347 306096 716809 820012 790360 660544
39519 660544 410577 133552 -50736 -177930 -386200 -686645 -890305 -792061 -389931 86381
39509H6381K81061K4292n2638J8349l7930l07488m74046k63387P7255J02385j27082
39498f72848j22535K19181L98832J08883k45782j65716K03119L73301K52480J02635
39488D51550r233k03754l63844k40811N3484J50973K4026J7J58966K21281J10021
39477C52676R5160K26863J64413j84929l77917j30466J64732L8930l27049m55910
39467d33497l28004k47898k00172O4725M12149L96478j5369l32200k58459m6082
39457i88329K3544M5365J42931J33481j20613l32222j51612K67595M44033K31181
39447c04646n0842j38974j33004j79986j59805R8641M69761O47428N37717L12531
39437A098821R7150j51330m03903m54966k21767M5071P0928o0218q4713r577o1020
$$ plain form
39509 86381 367442 391734 339096 357445 319515 12027 -462019 -725406 -648151 -545766 -672848
39498 -672848 -795383 -576202 -177370 -68487 -314269 -479985 -276866 96435 348915 451550
39488 451550 442317 238563 -125281 -366092 -312608 -161635 -137609 -137592 21374 242655 352676
39477 352676 447836 674699 839112 654183 276266 145800 310532 349462 22413 -433497
39467 -433497 -761501 -1009399 -1209571 -1144846 -732697 -336219 -351588 -683788 -942247 -988329
39457 -988329 -964785 -919420 -776489 -643008 -763621 -1095843 -1247455 -979860 -535827 -304646
39447 -304646 -355488 -494462 -627466 -807452 -967257 -868616 -398855 248573 786290 1098821
39437 1098821 1195971 1044641 640738 185772 -35995 9076 80004 19786 -64927 -74504 -135524
39426a35524k22814k06950L8912J74049m384k11382j16142J43187K03130L2955
39416c04963q7219k2359R9240J45525Q3367r7753l08380l13699l9755K08852J54947
39405d82197J1783J28414L19619J04263m08957n18923L864M65663K26702l66354
39395e16123n08679o4762L57617L01367n5414k89797k33265k5745R7134L6228
39385i01439m2052J11121M26764N05174J72485j99023j90762P8325J98091Q5627
39375B44311l2777q4573j55639j55426M8826K42502J13294j54968r6890K20513
39365A89173K34264j54633l52064o2705J90247l4472l28910j59283J93165J36229
39355a48989j95431k13421O6098R4517j69807j72274K02563L56902q20l28392
$$ plain form
39426 -135524 -358338 -565288 -526376 -352327 -356711 -568093 -684235 -541048 -337918 -304963
39416 -304963 -392182 -414541 -315301 -169776 -86409 -184162 -492542 -806241 -845996 -637144 -482197
39405 -482197 -470414 -342000 -22381 81882 -327075 -845998 -842134 -376471 -149769 -516123
39395 -516123 -1024802 -1089564 -731947 -430580 -485994 -775791 -1009056 -1034801 -937667 -901439
39385 -901439 -943491 -832370 -405606 99568 272053 73030 -117732 -39407 158684 244311
39375 244311 211534 126961 -28678 -184104 -135278 107224 220518 65550 -31340 189173
39365 189173 423437 268804 -83260 -145965 44282 9810 -319100 -478383 -285218 -148989
39355 -148989 -344420 -557841 -491743 -397226 -567033 -739307 -536744 -179842 -180662 -509054
39345e09054j36324K42470K47183o0293k45452j97110p3257J12458L54723L96673
39335A32017J05335j48379R23K60071J01971l43856m67127j64466K7957j51065
39325f46619l05212j13117J50690J39031q010J367Q8067J5243j34361q7896J56531
39314g44286L33263K96799J47852L0479N023O6114J30228P6407p7296j42957l1477
39303I0149P6797k2589k60643l97598l23689j17305R6558K10862J61442K1546
39293d64470k3066Q9457J91535J25065m2093j54782j81462j52077l6488J53872
39283d94509K75778K28381J00409P145p3710j64719j70482o9637k7187j08995
39273d97526j00630J27415K94937R7364k57109l04499k7064J42120J8895p4477
$$ plain form
39345 -509054 -645378 -402908 -155725 -216018 -461470 -658580 -731837 -619379 -264656 132017
39335 132017 237352 88973 89896 349967 451938 108082 -359045 -523511 -495554 -646619
39325 -646619 -951831 -1064948 -914258 -775227 -783237 -781870 -693803 -678560 -812921 -900817 -744286
39314 -744286 -411023 -114224 33628 64107 69130 135244 265472 341879 264583 121626 90149
39303 90149 166946 144357 -116286 -513884 -837573 -954878 -858320 -647458 -486016 -464470
39293 -464470 -487536 -398079 -206544 -81479 -123572 -278354 -459816 -611893 -648381 -494509
39283 -494509 -218731 9650 110059 117204 43494 -121225 -291707 -361344 -388531 -497526
39273 -497526 -598156 -470741 -175804 -78440 -335549 -640048 -667112 -524992 -506097 -580574
39263e80574J22791L68183K74000j32661m49166l93071q4187J45480J28389J1517
39253e89299J6956J16344J04853p994L2668K54918L08197L5648j72502Q83J78771
39242B79443j37189o29867n32238J42456N31152K13112k06131j13489K22731K55267
39232B5247N4508Q923O2988r3146l34942k56099Q8519J82878j74296n73126n70978
39221a579524k02649J95824L90579L68199K53131J93984K12350J62200m3289k28137
39211b77332j54265J14447K48323P3770j91186j79068K01609O02114N35726o3422
39201I10716o46419o25409j12039K31359R9846j23083q7350j8107j86422l09791
39191h66699j2709M43254M96223J56389p4120m3217p0553k44460k56368m0593
$$ plain form
39263 -580574 -457783 -89600 184400 51739 -397427 -790498 -874685 -729205 -600816 -589299
39253 -589299 -572343 -455999 -351146 -359140 -326472 -71554 236643 272291 99789 100672 279443
39242 279443 142254 -487613 -1019851 -877395 -346243 -133131 -339262 -452751 -230020 25247
39232 25247 79755 88678 151666 58520 -276422 -532521 -444002 -261124 -435420 -1008546 -1579524
39221 -1579524 -1782173 -1586349 -1195770 -827571 -574440 -380456 -168106 -5906 -49195 -277332
39211 -277332 -431597 -317150 -68827 4943 -186243 -365311 -163702 438412 974138 910716
39201 910716 264297 -361112 -473151 -241792 -141946 -265029 -352379 -370486 -556908 -866699
39191 -866699 -879408 -436154 60069 216458 142338 99121 28568 -215892 -472260 -512853
39181e12853M9827r4449q8144K52233M95871K61426j41306j72324J39132K89489
39171D78902J5625m44018o84159m68538J24512O73398P10689K57804j53002j92285
39161C18928j62391m13459o75205m51600J37813M71243L15608N7311k809m7983
39151d52544k57147l87726j61996K37191L95392K28172K3389L075Q8595R4697
39141a88902j9283j32165j15052K2780J34296J02349j9528j03835j42071k09232
39131f70643k63246j65854P3426K73723L57688M30693M95258L46878n7874l70512
39121D49537k71621M0908J14181r8459k03797k523K13649J17227k07102m39105
39111b87105m09362j42203K56092N53216M58289j0362m02864l67000j44150j99593
$$ plain form
39181 -512853 -463026 -557475 -645619 -393386 102485 363911 222605 50281 189413 478902
39171 478902 494527 50509 -633650 -1102188 -977676 -304278 406411 664215 511213 318928
39161 318928 156537 -256922 -932127 -1383727 -1245914 -774671 -459063 -401752 -404561 -452544
39151 -452544 -709691 -1097417 -1259413 -1022222 -626830 -398658 -375269 -372194 -283599 -188902
39141 -188902 -208185 -340350 -455402 -432622 -298326 -195977 -215505 -319340 -461411 -670643
39131 -670643 -933889 -1099743 -1026317 -752594 -394906 35787 531045 877923 820049 449537
39121 449537 177916 218824 333005 234546 30749 28226 241875 359102 152000 -287105
39111 -287105 -696467 -838670 -582578 -29362 428927 418565 15701 -351299 -495449 -695042
39101f95042m80863m82296n6274L13417K26189n5252m3795K44827L81915J95312
39091d51862l7367n8842L4513L0424n5865l3882J58886L37552K73395j6927k41272
39080f1247j57617J06255K01571L3423j22943o1738N1502O828o9052M0836K05320
39069A73138J34314j01566j72887q5194j85023m85174n00267n045N04404M85160
39059b38140J22073k8176R6587Q8108j62585k83145o2065K16142K36443O7472
39049E2714p2455j34626j30355j072J87957K00025L677p7994J37697L33049J71629
39038F70246j26100j40403J5336j15298m75383m67305Q7401N68932M34625m4908
39028D07143l13546l35268l70904l23329N8076N12303M87034K1359k26740M0944
$$ plain form
39101 -695042 -1175905 -1658201 -1714475 -1401058 -1174869 -1230121 -1273916 -1029089 -647174 -451862
39091 -451862 -489229 -548071 -513558 -483134 -538999 -572881 -413995 -76443 196952 180025 -61247
39080 -61247 -218864 -112609 88962 122385 -558 -62296 -10794 -3966 -73018 -32182 173138
39069 173138 307452 205886 32999 -52195 -237218 -722392 -1222659 -1227704 -723300 -238140
39059 -238140 -116067 -144243 -47656 40452 -122133 -405278 -467343 -251201 -14758 52714
39049 52714 -19741 -154367 -284722 -285794 -97837 102188 105865 27871 165568 498617 670246
39038 670246 544146 403743 419079 303781 -171602 -638907 -551506 17426 452051 407143
39028 407143 93597 -241671 -612575 -935904 -877828 -365525 121509 142868 -83872 -42928
39018d2928L42600K08425j35283k22306o2824K0856k1243L173Q3587J9954j82100
39007A1911k91100k12842p8228K2428J20516J83772J16290k1723l5601J01784
38997h2793J80512O7620q7211o5738J20862K55464J79782l8010j92035j72636
38987A65817q5813q5280j13490L7657L62120N32272L02727j37188m02714l78780
38977A97328k36122r2136Q6912K76868L27294J42379k01341n11887n81058l31845
38967i23608K4515J39320j7471o8701J90051M03508K00712j44228r7588K60253
38957c3237L47089K4597k12784r3463K9921j33609l26322k80987k12331l43506
38947a234632m00332q0804L23618L16509k9796k11868n1473J76798K65818K49256
$$ plain form
39018 -42928 299672 508097 372814 150508 87684 108540 87297 90470 174057 194011 11911
39007 11911 -279189 -492031 -570259 -547831 -427315 -243543 -127253 -148976 -184577 -82793
38997 -82793 97719 165339 78128 12390 133252 388716 568498 530488 338453 165817
38987 165817 80004 -5276 -118766 -81109 281011 813283 1116010 978822 576108 197328
38977 197328 -38794 -130930 -44018 232850 560144 702523 501182 -10705 -591763 -923608
38967 -923608 -899093 -759773 -777244 -845945 -655894 -252386 -51674 -195902 -293490 -33237
38957 -33237 313852 338449 125665 32202 62123 -71486 -397808 -678795 -891126 -1234632
38947 -1234632 -1634964 -1715768 -1392150 -1075641 -1105437 -1317305 -1368778 -1191980 -926162 -676906
38937f76906J20043j58037l66448k00684K31798M69110L10629K8961q7036n8407
38927c86977q325M9690J10379J28107J44993K23886K29988l0061m21633n60969
38917e20922l39103l2980J63544L29284M38185K51791j91050m20812j93560R2115
38907d23508J5871j90721o6897K75878L46019R9819k8665J07335J70087j0556
38897B94662j50901o6066m587j67435l29301k53091j05499j09594j15134Q7507
38887i19439L01228K14869l4536n5268J62913K64408J20616l6702n9722l9038
38877h0671j3819N3746K4165k35106m16865q9866M79429M82462k18924p22643
38867g38092l50805L52156M75273O0254j71958l5421K1567j31870j06230K11679
$$ plain form
38937 -676906 -556863 -714900 -1081348 -1282032 -1050234 -581124 -270495 -241534 -328570 -386977
38927 -386977 -395302 -345612 -235233 -107126 37867 261753 491741 461680 40047 -520922
38917 -520922 -860025 -893005 -729461 -400177 38008 289799 98749 -322063 -515623 -423508
38907 -423508 -407637 -598358 -665255 -389377 -43358 56461 27796 135131 305218 294662
38897 294662 143761 77695 73108 -94327 -423628 -676719 -782218 -891812 -1006946 -919439
38887 -919439 -618211 -403342 -437878 -493146 -330233 -65825 54791 18089 -41633 -80671
38877 -80671 -94490 -40744 -16579 -251685 -668550 -758416 -278987 203475 -15449 -738092
38867 -738092 -1088897 -736741 -261468 -201214 -373172 -408593 -387026 -518896 -625126 -413447
38857d13447M04221K30318l2105j35496j95588k77189j79721J25244L22474K61612
38847A10323J87476K36543J82761n1718j37678O8353J65653j31750m29337k51918
38837e1292J66980K59479L049j67160j32433j65886l18737l21728j16874L6174
38827h08428M6464J07913K45598K12622k1286j23674M9160J56074q6224l89497
38817f11278k89484J35328L35750N8300l07240k69194J14744L54017K04296m4804
38807c19565m4284J05409P0795j42206j94265J8231J93288J37281O3997J65646
38797E4327K49489J13826l3842O5850J99368j2497m27406n10914j31263K60870
38787a72192L15355J92091J35878N6156k01553m56278l93047m8683J81968L7761
$$ plain form
38857 -413447 -9226 221092 188987 53491 -142097 -419286 -599007 -473763 -151289 110323
38847 110323 297799 534342 717103 665385 527707 596060 761713 629963 200626 -51292
38837 -51292 115688 375167 378216 211056 78623 -87263 -406000 -727728 -844602 -808428
38827 -808428 -761964 -654051 -408453 -195831 -217117 -340791 -291631 -135557 -221781 -611278
38817 -611278 -900762 -765434 -429684 -371384 -678624 -947818 -833074 -479057 -274761 -319565
38807 -319565 -363849 -258440 -187645 -329851 -524116 -505885 -312597 -175316 -111319 54327
38797 54327 303816 417642 383800 449650 649018 636521 209115 -301799 -433062 -172192
38787 -172192 143163 335254 471132 527288 325735 -130543 -523590 -572273 -390305 -352544
38777c52544k89847m09732k19059j265L619m3975J27035L63687K33774k38519
38767h26826m44546m7768M67339M93483J60825j3323n135j54526l50737j18923
38757h40137M64563P06622L34841r3709j13186k4605k30450m76499l26611K8529
38747e70642Q3277j01694R541M99939P64398L46051m28152q65305o94066k32066
38737a188719Q2317J43948J84111L92445N91812M08293j77124o33120m60639J23500
38727e33176L87413P788m99615m39793J83432P00762O00317N0768m19184n14321
38717d75609l18476l5646K00670L19700K98709J71364k5563k49800l28604k8230
38707d71485N33748P47805J78587p12233r88768m32628J97950K52204k4627r6713
$$ plain form
38777 -352544 -642391 -1052123 -1271182 -1272447 -1268828 -1312803 -1185768 -822081 -588307 -826826
38767 -826826 -1271372 -1319140 -851801 -358318 -197493 -210816 -215951 -370477 -721214 -840137
38757 -840137 -375574 331048 665889 572180 458994 434389 203939 -272560 -599171 -570642
38747 -570642 -487365 -589059 -579518 -79579 684819 1030870 602718 -262587 -956653 -1188719
38737 -1188719 -1106402 -962454 -778343 -385898 205914 614207 437083 -196037 -656676 -533176
38727 -533176 -145763 -137975 -637590 -1077383 -893951 -193189 407128 457896 38712 -475609
38717 -475609 -794085 -829731 -629061 -309361 -10652 160712 135149 -114651 -443255 -471485
38707 -471485 62263 810068 988655 276422 -712346 -1144974 -947024 -694820 -719447 -816160
38697h16160J7281J3019o342K60336O40006O57588K90412k7345j19926k24579
38687F84290m05326l81721p7529J64588J19360J0073Q0851J99091J37575l0760
38677E00492q7174l2104n8368k45200m34999l95766p5453K76962L22102N1146
38667a78362j47033k686K33714J63860j57053l28066j94829K7658J50778J67028
38657b64991O1975j60844l00167j65244O2662M0458j90080k43840J8532L09234
38647h32305L42476J21788j97287m27098l68701j2845L41511M33329L57087K72300
38637C0255Q2867k21231k72510R1379L26590n8250n79652m29432K14786M64050
38627c51148J56348l917K49087L60498O7762j07702J78753M95610L75174l1088
$$ plain form
38697 -816160 -798879 -785860 -792202 -531866 108140 765728 1056140 1028795 908869 684290
38687 684290 278964 -102757 -180286 -15698 103662 113735 194586 393677 531252 500492
38677 500492 413318 381214 322846 77646 -357353 -753119 -828572 -551610 -229508 -178362
38667 -178362 -325395 -328081 -94367 69493 -87560 -415626 -610455 -582797 -432019 -264991
38657 -264991 -203016 -363860 -664027 -829271 -766609 -726151 -916231 -1160071 -1141539 -832305
38647 -832305 -489829 -368041 -565328 -992426 -1361127 -1373972 -1032461 -599132 -242045 30255
38637 30255 113122 -108109 -380619 -289240 37350 -20900 -600552 -1029984 -815198 -351148
38627 -351148 -194800 -198717 50370 410868 478630 370928 549681 1045291 1420465 1389377
38617A389377l23963k92265J45025Q20563J175111R26196O88166J100583J785927
38608G414720K366912L832348O842234Q947168O314149q72276p296287q415520
38600A9133448n459706k765146k094858k006614j420487r09450q20339o16004
38592C040844k53456l21326o63936m95098O0222R1764l92187m34779J06638L15657
38582A054343p4031k43259J25716K79588j50836m63624j83180J48755M5589j23329
38572D15732J8791J49997l1839j96952k6262K23657K43361J46028R0089J6731
38562A049333j7727J32858K21166j49272p01349o98001j05561K95138J24649j39587
38552A1647j30721j08869k16097j02245L23323N65735L66380J26220J42618J28380
$$ plain form
38617 1389377 1065414 773149 918174 1738737 2913848 3840044 4528210 5628793 7414720
38608 7414720 9781632 13613980 20456214 29403382 35717531 34845255 27548968 19133448
38600 19133448 13673742 10908596 8813738 6807124 5386637 4477187 3656848 3040844
38592 3040844 2787388 2466062 1802126 1307028 1367250 1459014 1066827 632048 738686 1054343
38582 1054343 980312 737053 862769 1142357 991521 527897 344717 493472 539061 415732
38572 415732 434523 584520 552681 355729 329467 553124 796485 942513 1032602 1049333
38562 1049333 1031606 1164464 1385630 1236358 535009 -162992 -268553 26585 151234 11647
38552 11647 -119074 -227943 -444040 -546285 -222962 342773 709153 835373 977991 1106371
38542A106371j32267l12386j22785J95767K95532J63690o4950k77774k94418r6872
38532D59908p0672m21192n75057J1948P04717M44290m69289o49659K05654P99069
38522D39717K77286n28368n36739L4722L06216M8874l39184n03020k59420L33883
38512g26033P19856L45144l85553m88858J20279N19924L09694R4612J80669N8851
38502G48585l86799m50703O4035L55798P9572P033N34984Q45364L80631j26831
38492B051669l2843O1571m22907q13699l98106J99202R1134l43864k58585J46909
38482B80481J46822j65798k46678k06748m31564o40952l65088J41442L66744L82035
38472g39304M24315L00164k5671j7503M64327O43719J04761l64489j05996K63048
$$ plain form
38542 1106371 974104 661718 538933 734700 1030232 1193922 1128972 851198 556780 459908
38532 459908 389236 -31956 -607013 -595065 109652 553942 84653 -565006 -359352 439717
38522 439717 717003 188635 -348104 -313382 -7166 41708 -297476 -800496 -1059916 -726033
38512 -726033 -6177 338967 -46586 -535444 -415165 104759 414453 509065 689734 748585
38502 748585 361786 -88917 -24882 330916 410488 417521 952505 1797869 2178500 2051669
38492 2051669 2018826 2080397 1657490 843791 445685 644887 736021 392157 133572 280481
38482 280481 427303 261505 14827 -191921 -623485 -1264437 -1629525 -1488083 -1121339 -739304
38472 -739304 -314989 -14825 -40496 -57999 406328 1050047 1154808 790319 684323 947371
38462I47371N3820k24218M5227K90384j52995o37449k80720M30455N05330J07019
38452A084224k0497K0498k09229l58130k9130J84993k19779m66572J62243P82765
38442I31386L22522m92746l36025M14692M50040j37643k33554J81253K00427j90963
38432A109389k70550r8861j97492k35434L14630Q28897M90737j23367p3509J97740
38422A942180j13693m29032M3077N08300Q769n52724j4124P19263L44510k45713
38412B210813L30643J136514P02612N0019P59372J694970J144332M10167J382295
38403I821737K544897J842321J285106L496394O089149N681092M944184Q176020
38395D3880900J2746459J4769275K0476525L7613105N4472904M5100724M014312
$$ plain form
38462 947371 1001191 776973 822200 1112584 959589 322140 41420 471875 977205 1084224
38452 1084224 1063727 1084225 874996 516866 487736 672729 452950 -13622 148621 931386
38442 931386 1253908 761162 425137 839829 1289869 1152226 918672 1099925 1300352 1109389
38432 1109389 838839 739978 542486 307052 621682 1450579 1941316 1817949 1744440 1942180
38422 1942180 1828487 1399455 1442532 1950832 1959601 1406877 1392753 2112016 2456526 2210813
38412 2210813 2541456 3677970 4380582 4430601 5189973 6884943 8029275 8439442 9821737
38403 9821737 12366634 14208955 15494061 18990455 25079604 30760696 35704880 43880900
38395 43880900 56627359 71396634 91873159 129486264 183959168 229059892 233074204
38388B33074204l9054132n1986956l6965484k0119045j4122436r874384j303834
38381E9647933K771006l899664j2456528j2456898o686291l830929m670184m240269
38373A4178176j945849j114179j843904j443441n4818p1579j293380j421580l43306
38364D646140P6961m20278n32737j77269k60446m91979l2884N14580R0873p30300
38354B682661p35102j99036q2686j47619K41114N20755J456n41853j59074M56668
38344B037284K01017m55433m40346J5092J24345J32528N18401P14600K34392q9070
38334B992810M38915J015749J076259J756889L580175M347070J960502j887934
38326A5280435l672358k827670j744116j589948j222449j99147J82822n65160
$$ plain form
38388 233074204 194020072 142033116 105067632 84948587 70826151 60951767 59647933
38381 59647933 62418939 58519275 46062747 33605849 26919558 23088629 18418445 14178176
38373 14178176 12232327 11118148 9274244 7830803 7775985 7704406 6411026 4989446 4646140
38364 4646140 4723101 4302823 3770086 3592817 3332371 2840392 2807508 3322088 3412961 2682661
38354 2682661 1947559 1748523 1665837 1518218 1759332 2280087 2281543 1739690 1580616 2037284
38344 2037284 2238301 1782868 1342522 1357614 1481959 1614487 2132888 2847488 3081880 2992810
38334 2992810 3431725 4447474 5523733 7280622 10860797 15207867 17168369 15280435
38326 15280435 11608077 8780407 7036291 5446343 4223894 4024747 4207569 3642409
38318C642409j111686o50465j14506k38133l28880J48720M64124M4096m15119
38309A440560j80775L38158M59256K75252J43827K0175j23227l1142K21524J61335
38299B724943j76045j32334M25006P44427L95877l9727M0708L89047N31354N50592
38289E453848P04558Q48265P64444O41849P91610J181845J509199J478723R59526
38280A4333867J91942k46463j37451j18190q61343j923470k202988j498663p43671
38271F793570o11809p82548p85222o84525n97145l39800K5987J3106m76360p86822
38261A768432m33508J60374L37281J33277J5051P1710J5384k22056l68926k31878
38251A245141P5238L03419L02775J11716j20138l16713n16336o61908n40366j12629
$$ plain form
38318 3642409 2530723 1880258 1765752 1527619 1198739 1347459 1811583 1855679 1440560
38309 1440560 1259785 1597943 2057199 2332451 2476278 2496453 2373226 2342084 2563608 2724943
38299 2724943 2548898 2416564 2841570 3585997 3981874 3942147 3982855 4371902 4903256 5453848
38289 5453848 6158406 7006671 7771115 8412964 9204574 10386419 11895618 13374341 14333867
38280 14333867 14525809 14279346 14141895 14023705 13162362 11238892 9035904 7537241 6793570
38271 6793570 6181761 5399213 4613991 3929466 3332321 2992521 3018508 3031614 2555254 1768432
38261 1768432 1334924 1495298 1832579 1965856 1980907 2052617 2068001 1845945 1477019 1245141
38251 1245141 1320379 1623798 1926573 2038289 1918151 1601438 1085102 423194 -117172 -229801
38241b29801L12417M66563M29724K98216p2259o04389p18876p9762P57579J065193
38231A624605R20962P92193O54519M48340Q65754K345199L553123K500047n83443
38222A3121299l029133k969711j435170m72691m98547o12629m78711m96620o44501
38213B483586m56390L797J66998q5738k97518k30824j05083o5285l390R8750J23208
38202A632111P4367K2935o6528j38625M5645M45176N57952J62888j79299N6778
38192B613400M71564L76018p1515k02713j4315n9811l42423l32224m1446k0974
38182B375561k18227L0911O62219P47917J15966j54541M69997R45018L99070k48156
38172E125735K72048J513790K323635L107478M950806O685700N327893K76992
$$ plain form
38241 -229801 82616 549179 978903 1277119 1204860 600471 -118405 -198167 559412 1624605
38231 1624605 2545567 3337760 3992279 4440619 5306373 7651572 11204695 13704742 13121299
38222 13121299 10092166 7122455 5687285 5214594 4716047 4103418 3624707 3128087 2483586
38213 2483586 2027196 2030993 2197991 2112253 1814735 1583911 1478828 1413543 1410153 1508903 1632111
38202 1632111 1706478 1729413 1662885 1524260 1569905 2015081 2573033 2735921 2556622 2613400
38192 2613400 3084964 3460982 3389467 3186754 3172439 3112628 2770205 2437981 2396535 2375561
38182 2375561 2157334 2188245 2850464 3598381 3714347 3559806 4029803 4974821 5373891 5125735
38172 5125735 5397783 6911573 9235208 12342686 17293492 23979192 29307085 29584077
38164B9584077m959104o635036m933228k791099j831597j376895p75164m67852
38156E814102n86593l85774L03311N24977j30814n76151Q2187R22948M91036r48238
38146E510991j733185j148287k12331j2604l36375m01114j33782m8227k61577
38137A223509l23030J8321L89895L11542j50221m76949l41286O6454L64640M30344
38127A513219M06995M02544L64430K32361R0789J55786O09578J320379J706852
38118F802933J163254j74221j330577j465386p75375j25812K0428q5475q4364
38109C945405M2321J27905Q1231K4006L78702J514948K906529L084867J215138
38100A3321052j499674k892287k301771j083435n90475o73918n33823p5345K59233
$$ plain form
38164 29584077 24624973 17989937 13056709 10265610 8434013 7057118 6281954 5814102
38156 5814102 5227509 4841735 5145046 5670023 5539209 4963058 5045245 5968193 6459229 5510991
38146 5510991 3777806 2629519 2417188 2404584 2068209 1667095 1533313 1485086 1223509
38137 1223509 900479 918800 1308695 1620237 1470016 993067 651781 718235 1082875 1513219
38127 1513219 1920214 2322758 2687188 2919549 3010338 3166124 3775702 5096081 6802933
38118 6802933 7966187 7791966 6461389 4996003 4220628 4094816 4115244 4029769 3945405
38109 3945405 3987726 4115631 4196862 4220868 4599570 6114518 9021047 12105914 13321052
38100 13321052 11821378 8929091 6627320 5543885 4953410 4279492 3745669 3670324 3929557
38091C929557L93990O92779J393869K279539K648135J667561o17956k676665k808877
38082F901932j254615N219j75504q62974q24624k72651M002Q6065L86215N58731
38072D551796J37613m11432m32111k81664o22489j031825n81625N22722J115939
38063B966924P26697k9138n64876q01509o60813j00022L97975K82058j84058l13638
38053A719600r5358m3516j76421q2820J76902J91586O2091J98867M31193K80482
38043B662606o8477o5748J48394M1813j88712M8732N01634M49762J81066O72118
38033D383188J755786K071503J098889j07392n18629j72000O71312J973238L018473
38024A4174368K481279K02655k169983l066261k617546j829297j155440o20362
$$ plain form
38091 3929557 4323547 5016326 6410195 8689734 11337869 13005430 12387474 9710809 6901932
38082 6901932 5647317 5652536 5477032 4614058 3789434 3516783 3520785 3606850 3993065 4551796
38072 4551796 4689409 4277977 3845866 3564202 2941713 1909888 1328263 1850985 2966924
38063 2966924 3693621 3664483 3099607 2298098 1637285 1537263 1935238 2217296 2033238 1719600
38053 1719600 1624242 1580726 1404305 1321485 1498387 1689973 1752064 1950931 2382124 2662606
38043 2662606 2594129 2528381 2676775 2718588 2529876 2578608 3080242 3530004 3711070 4383188
38033 4383188 6138974 8210477 9309366 9201974 8683345 8511345 9182657 11155895 14174368
38024 14174368 16655647 16858302 14688319 11622058 9004512 7175215 6019775 5399413
38016E399413m31446o16098o88436l65852o7741j82207m30911m28909k68069j17833
38006A801911J38493M76296N52251L02878J12359J10998k9676l59115m30317q8473
37996B587605K29856K23350O8617r3059k63177j42426N36642J209513J019113
37987E376034J98982j90671L7771J8889n15719p91046m78017k23940l07886j75256
37977B949141K39035J68914m71176o88153j22095K99751N6717j12789K43758M21744
37967B984847K3383k25118M7085R5392l58335l91042L24881O54977O790m78089
37957B684771O9869P15912M93404O6485K29770L55340j84324n88462j29127M18453
37947D132091L10744K47118P87806J028518L84406n8742M32173P51506J81690
$$ plain form
38016 5399413 4967967 4351869 3663433 3297581 3229840 3047633 2616722 2187813 1919744 1801911
38006 1801911 1940404 2416700 2968951 3271829 3384188 3495186 3465510 3106395 2676078 2587605
37996 2587605 2817461 3040811 3109428 3016369 2753192 2610766 3147408 4356921 5376034
37987 5376034 5575016 5384345 5422116 5441005 4925286 4134240 3656223 3432283 3124397 2949141
37977 2949141 3188176 3357090 2885914 2197761 2075666 2375417 2432134 2319345 2563103 2984847
37967 2984847 3008230 2783112 2830197 2925589 2567254 2176212 2501093 3156070 3162860 2684771
37957 2684771 2754640 3470552 3963956 4030441 4260211 4615551 4431227 3842765 3713638 4132091
37947 4132091 4442835 4689953 5477759 6506277 6890683 6831941 7264114 8015620 8197310
37938H197310M1205J209726K177406J681112J058192J697429K510896K415975
37930B0989251K763173M531630N898285N713598O332794R415044J2340245J3069193
37922H1053213J4762668K0478315K7827234L5543753M9448992P0513916Q0542219
37915C80170310N5763345j138116n5842134p6964943o6374000m7830229l5933423
37908A51850810k8096519k0221133j5011898j4080627j3356111r967877o493207
37901D4623438n465973n273015m037889k900587k996136k973479j732316n35646
37893A8708397n50629r38758q70596r66242j458786j297528k80325J51400o23756
37884A1873177j254092p88605j75348l19142n74280k88449o8812l74041m49932
$$ plain form
37938 8197310 8238515 9448241 11625647 13306759 14364951 16062380 18573276 20989251
37930 20989251 23752424 28284054 34182339 39895937 46228731 55643775 67984020 81053213
37922 81053213 95815881 116294196 144121430 179665183 229114175 299628091 380170310
37915 380170310 435933655 434795539 378953405 301988462 235614462 187784233 151850810
37908 151850810 123754291 103533158 88521260 74440633 61084522 51116645 44623438
37901 44623438 39157465 33884450 29846561 26945974 23949838 20976359 19244043 18708397
37893 18708397 18157768 17219010 16348414 15382172 13923386 12625858 12345533 12496933 11873177
37884 11873177 10619085 9830480 9655132 9335990 8761710 8473261 8404449 8030408 7580476
37875G580476K16239Q09649N95388J14067K7024N271l15655m40797q28L95384
37865H986218J72948k31525j93529Q8190J18914l0927j2010J99087M25846N56743
37855A0079955M63673J52785L4434M52016J013117J066767O94444M73642M92925
37846A4923758M62574N20710R54932J399847J345074J148459J461853J989297
37838B4206504J989968J666682J800714K338789K619286K637630K803918K930908
37830D2994399K830221L279831M855390O534064P199638P713299R558268J2422524
37822I7387634J5374836J9278904K5429272L3282941M2662158N5538849O9698666
37815C58653260P2203857M8363164R52500m6303778p0036763o8147073n5443253
$$ plain form
37875 7580476 7796715 8606364 9201752 9315819 9342843 9348114 9032459 8591662 8590834 8986218
37865 8986218 9159166 8927641 8734112 8822302 8941216 8910289 8898279 9097366 9523212 10079955
37855 10079955 10543628 10696413 10730847 11182863 12195980 13262747 13957191 14430833 14923758
37846 14923758 15386332 15907042 16861974 18261821 19606895 20755354 22217207 24206504
37838 24206504 26196472 27863154 29663868 32002657 34621943 37259573 40063491 42994399
37830 42994399 45824620 49104451 53959841 60493905 67693543 75406842 84965110 97387634
37822 97387634 112762470 132041374 157470646 190753587 233415745 288954594 358653260
37815 358653260 430857117 479220281 480172781 433869003 363832240 295685167 240241914
37808B40241914m3989249l4969046k6510899j9918809j6348826j3856759j0803889
37801G3844437q385733p658687p239199n847467m426367l980328l662162k654108
37793B9990386j846308k024375k239740j570532q68591j174144j802133j577255
37785A6887308q14432n60303p90902p73599m95393m48042n45928l75899q9656
37776A1993154j15797l68882m98647n15986n40029l90535q820K13100M9347j41613
37766I675292p7902k1422j26025k9512L68150M79231K9040k68913J89260Q02110
37756A1019309O39779j23664n57983l51410L4953K72772L86072K97874m6998k60871
37746A1309833P2777O95914J017192R77218R38700R20633O49927K44611J28497
$$ plain form
37808 240241914 196252665 161283619 134772720 114853911 98505085 84648326 73844437
37801 73844437 65458704 57800017 50560818 44713351 40286984 36306656 32644494 29990386
37793 29990386 28144078 26119703 23879963 22309431 21440840 20266696 18464563 16887308
37785 16887308 16072876 15512573 14721671 13948072 13452679 13004637 12458709 12082810 11993154
37776 11993154 11877357 11508475 11009828 10493842 9953813 9563278 9554458 9767558 9816905 9675292
37766 9675292 9597390 9575968 9449943 9420431 9788581 10267812 10296852 10027939 10217199 11019309
37756 11019309 11659088 11535424 10977441 10626031 10660984 10933756 11319828 11617702 11570704 11309833
37746 11309833 11382610 12078524 13095716 14072934 15011634 15932267 16582194 16826805 16955302
37737A6955302L10377M08434L58403M47155O62353O87304N80728P63107J189430
37728B2362593J214967N46599k48048n02421k63028k0954j9952j73220l84375
37719B2512161o18893q12940r39916j056350j168811j207649j194237j232062
37711A4281303j280692j176325r33335p65350p43802p15008o21560n89015o02090
37702F854126m49448j39237p302k02899m11184l43144j80299k32243m38687n47452
37692C902231n44632n53309n06242k84917k6860N7308L2263O6389P4080r5971
37682B120340k73612k00290l1430j26365l92429l60018M2301L05016Q7219k97814
37672H72918l73270j24547J15560J56229Q3715N0064J00606J63997J70713J92470
$$ plain form
37737 16955302 17265679 17674113 18032516 18479671 19142024 19829328 20410056 21173163 22362593
37728 22362593 23577560 24124159 23876111 23373690 23110662 23089708 23069756 22896536 22512161
37719 22512161 21893268 21080328 20140412 19084062 17915251 16707602 15513365 14281303
37711 14281303 13000611 11824286 10890951 10125601 9381799 8666791 8045231 7456216 6854126
37702 6854126 6404678 6265441 6258139 6055240 5644056 5300912 5120613 4888370 4449683 3902231
37692 3902231 3357599 2804290 2298048 2013131 1986271 2043579 2075842 2142231 2216311 2120340
37682 2120340 1846728 1646438 1615008 1488643 1096214 736196 778497 1083513 1170732 872918
37672 872918 499648 375101 490661 646890 730605 780669 881275 1045272 1215985 1408455
37662A408455L36244M43882J99112k76118l67082J00705L76481j30183p70508
37653A320988n70133J63319L08130j82660k33717M12439P10534K19170j2392P19463
37643B855141J401086Q64217l62299r64921p59222m91915m31512l38600k74253
37634A497722l51183k09795L05105N98939L59605K57630O39659O82386O5107L2229
37624C877404J137916J666099P11528J014605N064584R424447P622818p07200
37616B9812201q107200q514358m271692j420712j562028j950462j157092m44739
37608B383918m75850l53742J06358K6019m96069l76330L08310L21620m42009o89137
37598C13088J6286N99088L95894L4203M0350J19329J59888N01295Q75139M82611
$$ plain form
37662 1408455 1744699 2188581 2387693 2111575 1744493 1845198 2221679 2091496 1320988
37653 1320988 750855 914174 1222304 1039644 805927 1218366 1928900 2148070 2135678 2855141
37643 2855141 4256227 5120444 4758145 3793224 3034002 2542087 2110575 1771975 1497722
37634 1497722 1146539 936744 1241849 1840788 2200393 2458023 3097682 3780068 3845175 3877404
37624 3877404 5015320 6681419 7392947 8407552 13472136 22896583 30519401 29812201
37616 29812201 21705001 13190643 8918951 7498239 5936211 3985749 2828657 2383918
37608 2383918 1908068 1554326 1660684 1686703 1190634 814304 1122614 1444234 1002225 313088
37598 313088 329374 928462 1324356 1358559 1398909 1518238 1678126 2179421 3054560 3537171
37588C537171n41907j085559p88916n02038o93494p50105k78640J74593J89818
37579g39077J10233J71427Q2942j38929j0068M01857M07679l1302j33015K67166
37569C88913L57639j58851n10336k90597j25866l11278j40386O51049J098895
37560I59182N68856j34940j96980j24432n46716q28562j96731O84692O75966K885
37550H63220k53163K5752O7502k53758l06536K1483J58710n1769j53318j8434
37540I9689m6942l29502m31576j43337K13120L20348J83407q9687l59269l82810
37530i66559j03523J37067P4469m3756P1056J87999K465k04120J9585M85217O05393
37519B65293K46319k25267n29956n84125k97823J88401L69130L5607k73187n8128
$$ plain form
37588 3537171 2995264 1909705 1120789 618751 -74743 -824848 -1103488 -928895 -739077
37579 -739077 -628844 -457417 -374475 -513404 -523472 -121615 286064 254762 121747 388913
37569 388913 746552 587701 77365 -213232 -339098 -650376 -790762 -139713 959182
37560 959182 1528038 1393098 1196118 1071686 524970 -303592 -500323 184369 860335 863220
37550 863220 610057 635809 703311 449553 143017 164500 323210 271441 118123 99689
37540 99689 52747 -276755 -708331 -851668 -638548 -318200 -134793 -224480 -583749 -966559
37530 -966559 -1070082 -933015 -858546 -902302 -831246 -643247 -640782 -844902 -825317 -340100 265293
37519 265293 511612 286345 -243611 -827736 -1125559 -937158 -568028 -532421 -805608 -863736
37509h63736L25158L06295Q1351J40204K61720n1955m81395l03144K98906M41792
37499A55196n84k59949m3429P1262k00604l62975j35354M2488r4751j24320K22901
37488g30119M96414K96655p2602k01254j95063k34587j19196K41849M28427J35192
37478D5716k56985k52336J1478Q7790m5877p3662R2757K69162L29143K48834K5879
37467D81899j91905j57386P1625J05527j63471l14459o7589K16720J03917k26959
37457a42081l19697j50405j2001N5786K08513L51753K64929N6535J2807P5091
37447D01230m8904l00508l08659n2546K0961l03184o28178n04388l7718L30301
37437a431593M12782L66700L38663K95407J64021o0274l32410n39019m98184j40605
$$ plain form
37509 -863736 -538578 -232283 -150932 -10728 250992 199037 -282358 -585502 -286596 155196
37499 155196 154612 -105337 -148766 -77504 -278108 -641083 -776437 -733949 -828700 -953020 -730119
37488 -730119 -233705 62950 -9652 -210906 -405969 -640556 -759752 -517903 -89476 45716
37478 45716 -211269 -463605 -452127 -364337 -410214 -483876 -391119 -121957 207186 456020 481899
37467 481899 289994 132608 204233 309760 146289 -168170 -235759 -19039 84878 -142081
37457 -142081 -461778 -612183 -624184 -568398 -359885 -8132 256797 313332 326139 401230
37447 401230 352326 51818 -256841 -309387 -288426 -591610 -1219788 -1724176 -1761894 -1431593
37437 -1431593 -1018811 -652111 -313448 -18041 145980 85706 -246704 -785723 -1283907 -1424512
37427a424512L13120N15907L67924J00049l5509r634P6138J32088N2924k24938
37417a36443m93760l61466J78516N20213J74719m62622n72604n3335L76832K54908
37407e75042p9017j91433j69720j91470q2614K26060L22861m9524m18125k41039
37397a449063K26451L66986J72371P7915R9179q9693l86407l72515j12749m1555
37387a509080r6508J75139O15525N07490j79650n47546j34982L69301K75124q2354
37377f07541r9336N1615q8489l02493q9601L48815L83177K0465j33979P7733J55835
37366b83799j20052k76363M3986M25616K55604l70922p45701m46810J89052N39180
37356g90209M18579J75021J40906K19371J32699r9553j92485m8891J10845J05743
$$ plain form
37427 -1424512 -1111392 -595485 -227561 -127512 -163021 -172655 -96517 35571 88495 -136443
37417 -136443 -630203 -991669 -813153 -292940 -118221 -580843 -1153447 -1206782 -829950 -575042
37407 -575042 -654059 -845492 -1015212 -1206682 -1289296 -1063236 -740375 -789899 -1208024 -1449063
37397 -1449063 -1222612 -855626 -683255 -605340 -506161 -595854 -982261 -1354776 -1467525 -1509080
37387 -1509080 -1605588 -1430449 -814924 -307434 -487084 -1034630 -1169612 -800311 -525187 -607541
37377 -607541 -706877 -655262 -743751 -1046244 -1135845 -787030 -403853 -383388 -517367 -439634 -283799
37366 -283799 -403851 -680214 -636228 -210612 44992 -325930 -1071631 -1518441 -1329389 -790209
37356 -790209 -371630 -196609 -55703 163668 296367 196814 4329 -44562 66283 172026
37346A72026J1992m2834m5547J8558J77026K71712M3251m40116p17236m84354
37336a035522J9035L46977L50752J80449M861q3119n7114p895n6601j45684j15869
37325e99730j8220n8561j88013j19662J45390K26959k3544k48683j60722L0847
37315a013939O4662Q6715K93292M74608L31865k3392k71292l39971l14650j60284
37305h72386J08002K48289J42642L9909J01046O0107k42477l98775o6713L07961
37295e72395J03782l97776l41682L70742Q86415O41672P3063j57043m3896p072
37285E55810j97140l94035l80170j75428k462p7422l18540l42856L8493M58767
37275h34983M34097L1038k68258k44121o5983J45219L93264N00303K47059j59311
$$ plain form
37346 172026 184018 141184 95637 114195 291221 562933 606184 166068 -551168 -1035522
37336 -1035522 -1016487 -669510 -318758 -138309 -133448 -216567 -273681 -281576 -338177 -483861 -599730
37325 -599730 -617950 -676511 -864524 -984186 -838796 -611837 -635381 -884064 -1044786 -1013939
37315 -1013939 -949277 -862562 -569270 -94662 237203 213811 -57481 -397452 -712102 -872386
37305 -872386 -764384 -516095 -373453 -333544 -232498 -172391 -414868 -813643 -880356 -572395
37295 -572395 -468613 -866389 -1208071 -837329 49086 690758 763821 606778 562882 555810
37285 555810 358670 -35365 -415535 -590963 -593425 -670847 -989387 -1332243 -1293750 -834983
37275 -834983 -400886 -369848 -638106 -882227 -948210 -802991 -409727 90576 337635 178324
37265A78324k55159n353J58777K5264j68407k33249k36219j58067R8255K92297
37255c03537N9556l54399k73106L00887N25207J8240m59679j67506M65568N44443
37245C55674L3330l79553l71997j91442j5661J74951K44780P8103k6016K39695
37235A41864N35293K98205k91050n11081k36526o9735k44944k53012J57853M29463
37225d3670J30797k43888n3856M19453M04276j63166n93801m79601j13465J24993
37215f11928K07647J87798K3105j60395q2731K03297K54305q2697l29648o2386
37205d53633M02032M44854M6020k54561j98119q4698j62814k41299r9136J23975
37195d77379K04745J84497J64061L6840k45404l83741j10558K93522K98118j06188
$$ plain form
37265 178324 -76835 -82188 76589 101853 -66554 -299803 -536022 -694089 -595834 -303537
37255 -303537 -243981 -598380 -871486 -570599 -45392 -27152 -486831 -654337 -188769 355674
37245 355674 389004 9451 -362546 -553988 -569649 -394698 -149918 -71815 -97831 141864
37235 141864 677157 975362 684312 173231 -63295 -133030 -377974 -630986 -473133 -43670
37225 -43670 87127 -156761 -210617 208836 613112 449946 -143855 -623456 -736921 -611928
37215 -611928 -404281 -216483 -193378 -353773 -436504 -233207 21098 -61599 -391247 -453633
37205 -453633 -51601 393253 439273 184712 -13407 -98105 -260919 -502218 -601354 -477379
37195 -477379 -272634 -88137 75924 112764 -132640 -516381 -626939 -333417 -35299 -141487
37185a41487l68461j55851K35361L70014K04066o1694l20347m89259l74983O2258
37175a040383M72077M73092J66206k4700J6848k3994l25012n77719m14805M6462
37165a231928L67136L77508K96558K64748R6679l26659o81749n37103K5083M48979
37155i00748L99839J24631J7393J03642J40353K798k52108n30030o74608m69693
37145b038531O2665N12177N30756L08345K63267L81342K93955l4237k04542o3355
37135A1842J9843k25157n08441m49729j50746N8407J60040L38124N19201M34638
37125B08022O5818l07721m62012l69091p2516K98565M79987L35618R9340O2444
37115C38454J21970k057j96759p7500L06035M12644K7231l66493l25959j06732
$$ plain form
37185 -141487 -509948 -665799 -430438 -60424 143642 81948 -238399 -727658 -1102641 -1040383
37175 -1040383 -568306 -95214 70992 46292 63140 39146 -285866 -863585 -1278390 -1231928
37165 -1231928 -864792 -487284 -190726 74022 170701 -155958 -837707 -1374810 -1349727 -900748
37155 -900748 -500909 -376278 -358885 -255243 -114890 -112092 -364200 -894230 -1568838 -2038531
37145 -2038531 -1975866 -1463689 -932933 -624588 -361321 20021 313976 279739 75197 11842
37135 11842 31685 -193472 -701913 -1151642 -1302388 -1243981 -1083941 -745817 -226616 208022
37125 208022 273840 -33881 -495893 -864984 -937500 -638935 -158948 176670 276010 338454
37115 338454 460424 458367 261608 184108 490143 902787 930018 563525 237566 130834
37105A30834j55344l24263j69529J76927J09958m33081p10401k11416N50914P15059
37095c20342K18220k28395j72700Q2003P0155j83809l17747j60695J30196L17239
37085e65875K78451N3863j58181j42233P2513J98450O6409j15737n9854J63628
37075b08566K12557n6877m29415o12936m75684m7908M58917O55582L10547k56333
37065d50116m28057n9985L19711K63465K0473P6217L49817L19036j42894n45543
37055b77876m86398j59855L7499O9055J35449K30869J78603M026q0670n9459j49645
37044e58402l82965m61481j95762J68919K89407J96239J68480K70414L00481J41363
37034f3307j07096l09975l66129j63240K36431M39927J47240k94786k48756K43667
$$ plain form
37105 130834 -24510 -348773 -518302 -341375 -231417 -664498 -1374899 -1586315 -1035401 -320342
37095 -320342 -102122 -330517 -503217 -421214 -351059 -534868 -852615 -1013310 -883114 -565875
37085 -565875 -287424 -233561 -391742 -533975 -461462 -263012 -196603 -312340 -372194 -208566
37075 -208566 3991 -52886 -482301 -1095237 -1570921 -1618829 -1159912 -504330 -193783 -450116
37065 -450116 -878173 -938158 -618447 -354982 -334509 -258292 91525 410561 267667 -277876
37055 -277876 -764274 -924129 -886630 -817575 -682126 -451257 -272654 -268628 -349298 -408757 -558402
37044 -558402 -941367 -1402848 -1598610 -1429691 -1140284 -944045 -775565 -505151 -204670 -63307
37034 -63307 -170403 -480378 -846507 -1009747 -773316 -333389 -186149 -480935 -729691 -486024
37024d86024M31157k279m11580k28794J10993n4589m28915k28900M34569O44793
37014b19569J49379k47484j8348K68810n1378o56853p80541l35958J42233L55696
37004a394013M31078M45016L11159O7356j38438k74900l31889j75104J65111K94928
36994e99696j5715l21053n1527N54991O91085J54699l54828k83621L8830M6444
36984a40391j75008j38408J88555L13224l6048n22880o61506l77851K3813K63287
36974a263213K89860J88861N8882j9632j9417o263n9117j24858n9986J32253K43662
36963f38968J49783J4905L7403J26814P8058m2409j291J67296K03457J01594J29808
36952C26450K93550K43940j03421l37106k13412p6733k35051l71000q8954L26034
$$ plain form
37024 -486024 -54867 -57146 -468726 -697520 -586527 -641116 -1070031 -1298931 -864362 -219569
37014 -219569 -70190 -317674 -336022 -67212 -118590 -775443 -1555984 -1891942 -1749709 -1394013
37004 -1394013 -962935 -517919 -206760 -139404 -277842 -552742 -884631 -1059735 -894624 -599696
36994 -599696 -615411 -936464 -987991 -433000 258085 412784 57956 -225665 -186835 -140391
36984 -140391 -315399 -453807 -265252 47972 11924 -510956 -1172462 -1550313 -1526500 -1263213
36974 -1263213 -973353 -784492 -725610 -745242 -764659 -770922 -830039 -954897 -1014883 -882630 -638968
36963 -638968 -489185 -474280 -436877 -310063 -232005 -274414 -275705 -108409 95048 196642 326450
36952 326450 620000 863940 760519 423413 210001 133268 -101783 -472783 -561737 -235703
36942b35703L12287n9690k40438j13385o6862k02656j84910L9644O6812k16637
36932i01538l53860q6927J78791O6318j32290J1431K99117K38150j16174k36979
36922a033961L5062K64841J06168k17731k93388q9951O9167k2364k08489k01798
36912a592444N2922L24195L84929K57348J11669L0435R88M1956J42394J42867
36902a02741q0254l39955l23266o1378R0565k009p1983N4516J40257m0519k60128
36891i96895j51449K12817L93565J76471j85433l19919j33815J48952K33515N2426
36881e69765j31766m162L83467O18794M25846j5545l43459m20034l42265k38875
36871f37764k00976k40860k01032Q6968M49518M71511J09439j56785l9363R4109
$$ plain form
36942 -235703 76584 16894 -223544 -336929 -403791 -606447 -791357 -751713 -684901 -901538
36932 -901538 -1255398 -1342325 -1163534 -1097216 -1229506 -1218075 -918958 -680808 -796982 -1033961
36922 -1033961 -998899 -734058 -627890 -845621 -1139009 -1228960 -1159793 -1182157 -1390646 -1592444
36912 -1592444 -1539522 -1215327 -830398 -573050 -461381 -430946 -429958 -388002 -245608 -102741
36902 -102741 -182995 -522950 -846216 -907594 -817029 -819038 -891021 -836505 -696248 -736767 -996895
36891 -996895 -1148344 -935527 -541962 -365491 -550924 -870843 -1004658 -855706 -622191 -569765
36881 -569765 -701531 -705693 -322226 296568 722414 706869 363410 -56624 -398889 -637764
36871 -637764 -838740 -1079600 -1280632 -1193664 -744146 -272635 -163196 -319981 -359344 -265235
36861b65235j33315l94442j59807L66583M97663J35465j23005J7091J65706M0347
36851A47051n0526J48534L04346M4985m05481n97611n04035l58776j82049O9538
36841a384024J80820J6153q5669J80200M15863M5566o07150n69181L31584J048266
36831d27572P09404k11977o36368l11671R9825R7741j29396k12196r4652R6593
36821a020269K97447M50730M33686J94494j38245l47964k90321l788K73102K91284
36811A40156Q7381m9205q280l1460k61006l93494j22852K96514L62249N0071k44710
36800a74636l70122m64338m06646Q9602P35362P59930N5058m65002j17078N37355
36790A79485N32147j29254o39039n99630l27350j03324J36586L53200L00846j130
$$ plain form
36861 -265235 -398550 -792992 -952799 -586216 -88553 46912 -76093 -59002 106704 147051
36851 147051 96525 245059 549405 594390 188909 -408702 -912737 -1271513 -1453562 -1384024
36841 -1384024 -1203204 -1187051 -1272720 -1092520 -676657 -631091 -1238241 -1807422 -1475838 -427572
36831 -427572 281832 69855 -566513 -878184 -778359 -680618 -810014 -1022210 -1116862 -1020269
36821 -1020269 -722822 -272092 161594 356088 217843 -130121 -420442 -424230 -151128 140156
36811 140156 227537 178332 170052 138592 -122414 -515908 -638760 -342246 20003 70074 -174636
36800 -174636 -544758 -1009096 -1415742 -1326140 -590778 169152 224210 -240792 -357870 179485
36790 179485 711632 582378 -56661 -656291 -983641 -1086965 -950379 -597179 -296333 -297463
36780b97463k00765j36500q517L8393Q7190J48411J04057J0326N1108J51715O7264
36769A5219j22182r5953Q3086n53l29114l24910K10037O31327L63839k14572l31151
36758a14927P5697L65791J47783k81387m31310j94936J11916J07116k44111n14795
36748i73163k70943L17719O05549L15898r8883j45407L9214J9057k52470m49645
36738h93074l63560m1532L69718O24536M44133r8772m72224k85948K01390M80904
36728c4429M52827L37578J94246l5702k03171j22330P3158J54994K14681M20202
36718A452054N47170K69217k11247l76513j83578q6378k66340m00130k77011j21365
36708C45879j44377k18925j73373m5851Q8600K20058K53451Q8891j04859o1419
$$ plain form
36780 -297463 -498228 -634728 -643245 -604852 -517662 -369251 -265194 -254868 -203760 -52045 15219
36769 15219 -106963 -202916 -119830 -120383 -449497 -774407 -564370 66957 430796 216224 -114927
36758 -114927 -39230 326561 474344 192957 -238353 -433289 -321373 -214257 -458368 -973163
36748 -973163 -1244106 -926387 -320838 -4940 -103823 -249230 -210016 -190959 -443429 -893074
36738 -893074 -1256634 -1298166 -928448 -303912 140221 41449 -430775 -716723 -515333 -34429
36728 -34429 418398 755976 950222 914520 711349 589019 662177 817171 1031852 1452054
36718 1452054 1999224 2268441 2057194 1680681 1497103 1410725 1144385 744255 467244 345879
36708 345879 201502 -17423 -190796 -236647 -148047 72011 325462 414353 309494 248075
36698B48075J09963L2754l07514m89846l06580l3566P3097R7114J25958N3242
36688c97303q8866m1907K12495L18138J02198j51741k18094k63116l83722k86105
36678a198023J93398O53701O40057K65293p1995k62164l65135k50408J53614N05623
36668B63961M46698J56541M0785O2945q7217l23603k64072M6087J24875j50017
36658C16983l09957n9049K32571J09020k68453l70561m7960L21676L70309J38321
36648D32900r8572j92752j88710j17411Q3937L70778M64635J50872l30160m65838
36638A09679j29002K16627J36749j97861l07005p6551J78121K22339J44520Q6854
36628C84470K4232j00412k16026k13612j06651k1017m3090j08277p6708M9407
$$ plain form
36698 248075 358038 390792 83278 -406568 -713148 -746714 -673617 -576503 -450545 -397303
36688 -397303 -486169 -528076 -315581 2557 104755 -46986 -265080 -528196 -911918 -1198023
36678 -1198023 -1004625 -350924 289133 554426 482431 220267 -144868 -395276 -241662 263961
36668 263961 710659 867200 907985 970930 883713 560110 296038 342125 467000 316983
36658 316983 7026 -52023 180548 289568 21115 -349446 -397406 -75730 294579 432900
36648 432900 334328 141576 -47134 -164545 -80608 290170 754805 905677 575517 109679
36638 109679 -19323 197304 334053 136192 -170813 -247364 -69243 153096 297616 384470
36628 384470 408702 308290 92264 -121348 -227999 -249016 -292106 -400383 -477091 -427684
36618d27684O9981j24179l05318j90213R4331J61934j3366m5125J88894K85698
36608c05047j6523l48415k49607J53093M05427L69995K07026j5316k59903l09835
36598c69105n9171J97024J78866P4577J35211J38813j74466m45187j81254L18354
36588a86338L29384j06763k17605K31677N74914L42348r7881k92329l42983m24365
36578a89941l44733k1559J94329R8396R05J19872J63069n6541j62098J28414M22943
36567C53056K85896n1201j89570k79607n79057p47983l44549L00830M79490J53291
36557f19404j18620j09255m6423L0772K66511M28701J33990l79685m59483m4517
36547i17413K76431K55558K40355L23288Q8848n09834q16076m21053K11642M94491
$$ plain form
36618 -427684 -357703 -481882 -787200 -977413 -883082 -721148 -734514 -779639 -590745 -305047
36608 -305047 -321570 -669985 -919592 -766499 -361072 8923 215949 200633 -59270 -369105
36598 -369105 -428276 -231252 -52386 22191 157402 296215 121749 -323438 -504692 -186338
36588 -186338 143046 36283 -181322 50355 625269 967617 869736 577407 234424 -189941
36578 -189941 -534674 -556233 -361904 -263508 -262603 -142731 20338 -36203 -198301 -69887 353056
36567 353056 638952 587751 398181 118574 -460483 -1208466 -1553015 -1252185 -772695 -619404
36557 -619404 -738024 -847279 -893702 -862930 -596419 -167718 -33728 -413413 -872896 -917413
36547 -917413 -640982 -385424 -145069 178219 267067 -242767 -1058843 -1479896 -1268254 -773763
36537g73763M86432M75796L75796N7978j95803j23271J8794j00062k82047j56479
36527b16629J61127K74267J25786o1113k28290m02129l94864p1961K68145K51801
36517b93860P82r7825k94P6133J29690K52689K41452r1938l93687k00943K22835
36506a54966J99755k60511m49989j18737J84420J30627J17096L71050L76645k01521
36496A93869p18731m46726K18144K97835k80810o06982j57769N31358P09717K99057
36486C8962k70967o11578n30544o2200M10167M06179m0832l27993o2168M14424
36476f36550N46345L12755R6141L1316p9034k90193l97920l32044k75733k75188
36466a300105q9286L62649P05605N63818J16136j40215p2961L890q7155j23853
$$ plain form
36537 -773763 -287331 188465 564261 622239 426436 303165 321959 221897 -60150 -216629
36527 -216629 -55502 218765 344551 283438 55148 -346981 -741845 -813806 -545661 -293860
36517 -293860 -293078 -390903 -391197 -315064 -185374 67315 308767 216829 -176858 -377801 -154966
36506 -154966 44789 -215722 -665711 -784448 -600028 -469401 -352305 18745 395390 193869
36496 193869 -524862 -971588 -753444 -455609 -736419 -1343401 -1501170 -969812 -260095 38962
36486 38962 -232005 -843583 -1374127 -1436327 -1026160 -619981 -660813 -988806 -1050974 -636550
36476 -636550 -90205 222550 318691 350007 270973 -19220 -417140 -749184 -1024917 -1300105
36466 -1300105 -1389391 -1026742 -321137 242681 358817 218602 145641 149531 62376 -61477
36456f1477P1637K80516K18110l8741k30884l31254m68461n66010m12082o3964
36446a602610J51981R6294j1206M1923J72045J93105R9209K8389P7349K26901
36436e26620L38839K25765j12752l56067k05035J57042K53932m763j99237n4876
36426d83772J74104J67996K544j18512k28460l65033l04525P6305M44749M41344
36416a93260K31016J77108J85036r7252n56861o73864l05040J14983K26092J34138
36406g57904O1288L2365K3673N6853N6897n2153j01329Q9899K73835O4555l42641
36395e94662l52699M6294J84970j70295l53511J06987O28278M50290j61924l56741
36385e73013n257K25397j1469k96563j87629J80103L99121K97904J7324j56735
$$ plain form
36456 -61477 10160 290676 508786 470045 239161 -92093 -560554 -1126564 -1538646 -1602610
36446 -1602610 -1450629 -1354335 -1365541 -1323618 -1151573 -958468 -859259 -830870 -753521 -526620
36436 -526620 -187781 37984 -74768 -430835 -635870 -478828 -224896 -229659 -428896 -483772
36426 -483772 -309668 -141672 -139128 -257640 -486100 -851133 -1155658 -1079353 -634604 -193260
36416 -193260 37756 214864 399900 302648 -254213 -928077 -1233117 -1118134 -892042 -757904
36406 -757904 -696616 -664251 -640578 -583725 -526828 -578981 -680310 -590411 -316576 -252021 -594662
36395 -594662 -947361 -901067 -716097 -886392 -1239903 -1132916 -504638 -54348 -216272 -573013
36385 -573013 -578270 -352873 -364342 -660905 -848534 -668431 -269310 28594 45918 -110817
36375a10817j7135K84962K80512k23363p42652o68536q4807L71551L57551R5375
36365d57359j17686j92271o8224K63230N30264M19867P4436q1448Q05l991j47872
36354B19751j45908j4955j23592m32847l70830K19121O59531M18923o3899r3703
36344B71592K10340K06820k08094n00885l43186J5862J99104Q4099k36099n10109
36334h10556m10817R5591N51162N11148J28492j16616j13642j18477j78352o4761
36324e26828K27199L84212K42855l1040k60954l93273l30704m4502J66388m300
36314e70947k90573j32718M05393O07768J74122l12265k98725n1905r0149l32253
36304h92252l46727p9869J97173L76475M47600K38787k35823m53902l2418N22862
$$ plain form
36375 -110817 -127952 157010 437522 214159 -528493 -1197029 -1281836 -910285 -552734 -457359
36365 -457359 -575045 -767316 -835540 -572310 -42046 377821 452257 370809 371614 367623 219751
36354 219751 73843 58888 -64704 -497551 -868381 -649260 10271 429194 365295 271592
36344 271592 481932 688752 480658 -20227 -363413 -347551 -148447 -64348 -300447 -810556
36334 -810556 -1221373 -1125782 -574620 -63472 65020 -51596 -165238 -283715 -462067 -526828
36324 -526828 -299629 84583 327438 296398 35444 -357829 -688533 -733035 -566647 -570947
36314 -570947 -861520 -994238 -588845 18923 193045 -119220 -417945 -469850 -559999 -892252
36304 -892252 -1238979 -1318848 -1121675 -745200 -297600 -58813 -294636 -748538 -780956 -258094
36294b58094M10192k56171n83167k34006J77447J64599K6019J04014J36584j54242
36284d66825m27895k60704J24542K43418J17377Q1402J15665k4286k20346j57531
36274h75183M9219J0613k17122j90909J29723K76619N4092j70407j16605L9971
36264a009989J54063L79087O52823M99371k13333q11337o53596o6860J50413r3607
36254a012965j53634K77981P02052N58054k6829m55142l55023J07986M52426L31715
36244D26621j21914m13216k59984N1414Q0005j45098k27850m7257R7665J9391
36234e40223p1761L8835K10026J93954K3304p8778m2398N029k1595n3962m895
36223c42464R4004J35633Q7104L6156M4103J6533j42045k81267j52212J54108
$$ plain form
36294 -258094 152098 -104073 -687240 -921246 -743799 -579200 -553181 -449167 -312583 -466825
36284 -466825 -894720 -1155424 -1030882 -787464 -670087 -588685 -473020 -497306 -717652 -875183
36274 -875183 -825964 -815351 -1032473 -1223382 -1093659 -817040 -762948 -933355 -1049960 -1009989
36264 -1009989 -855926 -476839 175984 675355 462022 -349315 -1002911 -1069771 -919358 -1012965
36254 -1012965 -1166599 -888618 -186566 371488 344659 -110483 -465506 -357520 94906 426621
36244 426621 304707 -108509 -368493 -317079 -237074 -382172 -610022 -657279 -559614 -540223
36234 -540223 -611984 -573149 -363123 -169169 -145865 -224643 -267041 -262012 -283607 -337569 -342464
36223 -342464 -248460 -112827 -25723 10433 54536 71069 -70976 -352243 -504455 -350347
36213c50347K26945n0915k55568o4167K03319R8843j96615j75502J30178K15340
36203b18489k5955j57719j612P8108j17708k43637l1863K40981K54047J46078
36193g7769J52674J52581l5190k53130k81597j99713j29241M3367L33110M08137
36183A13229Q6325k65589k72589j44752k31245l27539m0765M09754M43335N1926
36173a77910j91455m7656J05923q741j52428l6765K52218M74481N21693L63806
36163A103166K8207k95622m16697m04772m00195k72150J20548M46926K32082l49119
36153b07626n95594k66972J44536K49597K42144L25410K84433k2906k87735k57664
36143c92377j59792k18414j94916J36678M46285K95652j46380l35607j12558K09639
$$ plain form
36213 -350347 -123402 -174317 -429885 -494052 -290733 -191890 -388505 -564007 -433829 -218489
36203 -218489 -244444 -402163 -403775 -325667 -443375 -687012 -718875 -477894 -223847 -77769
36193 -77769 74905 227486 192296 -60834 -342431 -542144 -671385 -628018 -294908 113229
36183 113229 199554 -66035 -338624 -483376 -714621 -1042160 -1082925 -673171 -229836 -177910
36173 -177910 -369365 -417021 -311098 -319839 -472267 -509032 -256814 217667 739360 1103166
36163 1103166 1131373 835751 419054 14282 -385913 -658063 -537515 -90589 141493 -207626
36153 -207626 -803220 -1070192 -925656 -676059 -433915 -108505 175928 153022 -134713 -392377
36143 -392377 -552169 -770583 -965499 -828821 -382536 -86884 -233264 -568871 -681429 -471790
36133d71790L62879L28109J54318o1187j26862k038N4755j35410l40710k71373
36123e09309m0163O8735N2349L4753p7089l32104l84533M5169N43854M59554j02709
36112b41493l85322q9869K74164K69446J06707R7128J23187J0378o0717P7122
36102A80731J82485R359j95475n6194K76045L11318M184r0558M52216J308753
36092B382864J659226R93974l45180j406281j493911q32325k42828j69058k93311
36083B53170j97058J051j6460j22472N4912M19308M39134m1645n13730n16216
36073b40006k31784q5240q1308O6224L37127L83488J05107j35687p871L32731
36063D42781M49371J45771l48884o27559m61053m546K95779J25987l10750m89971
$$ plain form
36133 -471790 -108911 219198 373516 312329 185467 183429 238184 102774 -237936 -509309
36123 -509309 -549472 -480737 -428388 -393635 -470724 -802828 -1187361 -1142192 -598338 -138784 -241493
36112 -241493 -626815 -716684 -442520 -173074 -66367 30761 153948 164326 103609 180731
36102 180731 363216 372575 177100 120906 396951 708269 712453 621895 1074111 2382864
36092 2382864 4042090 5036064 4690884 3284603 1790692 958367 715539 546481 253170
36083 253170 56112 57163 40703 -81769 -26857 392451 831585 789940 276210 -240006
36073 -240006 -471790 -557030 -638338 -572114 -234987 148501 253608 117921 110050 442781
36063 442781 892152 1037923 689039 61480 -399573 -404119 -108340 17647 -293103 -783074
36053g83074k15178J43603J93570M2139K0872J20835Q6738n4711j0579K34695
36043b21090L34725J32237j15137j93817k09548k25379n9453K86829M23059J51064
36033C03490j36145o3225R0448j09229m40783l73692j1097O8230j53019p1203
36023h96225M32458O52896J75027m10612m25718j31061j73549m40070k44317N00387
36013i60784J040964Q04947R2912m25149m81560k72048o0746L7687M5439O2144
36003a16194J44688J95858P3826j82634l78303m15828l67004k74735o5105K73565
35993a111866N64648N91952L19722o3729k79457j74180J11566K43838O8207j92196
35983G8505k39992q9166N2785J57496L16087L80729Q7992l96153n10805r6072
$$ plain form
36053 -783074 -998252 -854649 -661079 -618940 -598068 -477233 -390495 -445206 -455785 -221090
36043 -221090 113635 245872 130735 -63082 -272630 -498009 -557462 -270633 152426 303490
36033 303490 167345 104120 194568 85339 -355444 -729136 -740233 -672003 -825022 -896225
36023 -896225 -463767 189129 364156 -46456 -472174 -603235 -776784 -1216854 -1461171 -960784
36013 -960784 80180 885127 978039 552890 71330 -200718 -261464 -223777 -178338 -116194
36003 -116194 28494 224352 298178 115544 -262759 -678587 -1045591 -1320326 -1385431 -1111866
35993 -1111866 -547218 44734 364456 300727 21270 -152910 -41344 202494 270701 78505
35983 78505 -161487 -250653 -197868 -40372 275715 656444 744436 348283 -162522 -258594
35973b58594K69799P8973l25399k69020J96993L72388m682l91860l27518q0229
35963g39149o6211j32931M7548K31761o7137o23051o03218K02630R03549O48464
35953a97745k16820o41739k46360L52033M98051K27889o0096j87277j91998o9272
35943g33334J67044L20188J99398p0293j47893R8825M16926M52140J24251l08815
35933E18437n17619m10538j76743k5491N1335J74522L00037K27046p9013l43280
35923b81307k77042P2351L60849K91456j10802m96101m72995k4758L74505K61486
35913c02358j90835l36348O2614M64987L04543k07408m21078j78993O8468J8673
35903g17735j05216l1721J30428J53760O8577L0454K9672k2073o7265r69J04032
$$ plain form
35973 -258594 11205 90178 -235221 -504241 -307248 65140 60458 -331402 -658920 -739149
35963 -739149 -805360 -938291 -890743 -658982 -726119 -1349170 -1952388 -1749758 -846209 -197745
35953 -197745 -414565 -1056304 -1302664 -950631 -452580 -224691 -284787 -472064 -664062 -733334
35943 -733334 -566290 -246102 -46704 -116997 -264890 -166065 250861 703001 827252 518437
35933 518437 818 -409720 -586463 -611954 -560619 -386097 -86060 140986 61973 -281307
35923 -281307 -558349 -485998 -125149 166307 55505 -440596 -913591 -938349 -563844 -302358
35913 -302358 -493193 -829541 -766927 -301940 2603 -204805 -625883 -804876 -736408 -717735
35903 -717735 -822951 -854672 -724244 -570484 -501907 -471453 -441781 -463854 -531119 -532088 -428056
35892d28056Q9825k2737o4485J786J8712j06441k27454j43829J01304K23336M2112
35881e15927k40972k39295J16552M29627L28924k2180j51959M3123J70493l1163
35871a12777k63906j06321L40689N56528K80472j95963m46334l92481k72130k68212
35861h80435l10113k25588l421J59714R9344q1069j16101P8289K99552L47418
35851f32410K69885K11169J53982r759k31028l23097k15076k5537J13110J61958
35841e26803J25164N0463O3199K15291L11732J26284j82061j78898J81330L46410
35831E32111o6645n81706m35009K71233N87915L5198o86733o91180j34297J47965
35821a021148m7833r8973L13257O51751M11617p6062k23874j01961j67236l85787
$$ plain form
35892 -428056 -338231 -360968 -425453 -423667 -404955 -511396 -738850 -882679 -781375 -558039 -515927
35881 -515927 -756899 -996194 -879642 -450015 -121091 -143271 -295230 -252107 -81614 -112777
35871 -112777 -376683 -483004 -142315 414213 694685 498722 52388 -340093 -612223 -880435
35861 -880435 -1190548 -1416136 -1419557 -1259843 -1160499 -1241568 -1357669 -1279380 -979828 -632410
35851 -632410 -362525 -151356 2626 -7133 -238161 -561258 -776334 -801871 -688761 -526803
35841 -526803 -401639 -351176 -287977 -72686 239046 365330 183269 4371 185701 532111
35831 532111 465466 -116240 -551249 -280016 307899 343097 -343636 -1034816 -1169113 -1021148
35821 -1021148 -1068981 -1167954 -854697 -202946 208671 132609 -91265 -193226 -360462 -746249
35811g46249l09387Q3199L00471J43375k8898J2806J2545j75341j98193J80429
35801g25243N27937L16232k37297m37902r4793K67201J84020j81733l64401j93648
35791i39627Q8220J76122N8963K0091K51040N13266L84337j25869m92827l57405
35781d23689J0531J55409M5345o6807j11895j47223n6309K53373N06748L68427
35771E33910j1129k07142j83583k52268m24810l57750p85K31012P7776k24541
35761h19310l76110l70594k69460k1689L16176N28419N46755M84894L17497o6414
35751B70164m53094m57946j79775j29189l62047l38892J07416L86189J38363r9478
35741a118289K06893O55979N70308Q1662j97494j81913k01645k07384O4712L43479
$$ plain form
35811 -746249 -1055636 -972437 -671966 -528591 -557489 -544683 -532138 -707479 -905672 -725243
35801 -725243 -197306 118926 -118371 -556273 -651066 -383865 -199845 -381578 -745979 -939627
35791 -939627 -851407 -675285 -616322 -596231 -345191 168075 552412 426543 -66284 -423689
35781 -423689 -413158 -257749 -212404 -279211 -391106 -538329 -594638 -341265 165483 533910
35771 533910 522781 315639 132056 -120212 -545022 -902772 -903557 -672545 -594769 -819310
35761 -819310 -1195420 -1566014 -1835474 -1857163 -1540987 -1012568 -465813 19081 336578 270164
35751 270164 -182930 -640876 -820651 -949840 -1311887 -1650779 -1543363 -1157174 -1018811 -1118289
35741 -1118289 -911396 -255417 314891 396553 199059 17146 -184499 -391883 -327171 16308
35731A6308J14415m15150m94913m082L69444K30817k7514l2613J2964j10973j76387
35720e17684K0487K30561J71598k0726q5174m3060m4037r9759j78747k80772k76784
35709a124097M43L93219N11841K94515P1594k1169k09400n12277n45087j49179
35699a289597K67522L15738J11762r0269k77215l86099j50185L68814N82366J75582
35689c71581l26641k96757Q6767K18331J0061j47214j20600j14505j52367n4575
35679a269081J25254J40741Q33m2422Q7225K42446L35446L35735J38367k04476
35669a09932l18487K304L43012K00199k05936k18343K45588N65086L25359j90692
35659F38158n20764n63100m60394l20676j94513q0294Q8865K79616L03361J63398
$$ plain form
35731 16308 130723 -284427 -779340 -783422 -413978 -183161 -210675 -243288 -230324 -341297 -517684
35720 -517684 -497197 -266636 -95038 -115764 -200938 -243998 -288035 -387794 -566541 -847313 -1124097
35709 -1124097 -1123654 -730435 -218594 75921 147515 126346 -83054 -595331 -1140418 -1289597
35699 -1289597 -1022075 -706337 -594575 -684844 -962059 -1348158 -1498343 -1129529 -547163 -371581
35689 -371581 -698222 -994979 -908212 -689881 -679820 -827034 -947634 -1062139 -1214506 -1269081
35679 -1269081 -1143827 -1003086 -1002253 -1044675 -957450 -715004 -379558 -43823 94544 -109932
35669 -109932 -428419 -426115 -83103 117096 -88840 -307183 -61595 503491 828850 638158
35659 638158 117394 -445706 -906100 -1226776 -1421289 -1501583 -1412718 -1133102 -829741 -666343
35649f66343J99862N17861N97421L1398o40903n67794J18783M70599J52301j87653
35639B5532j00057K1529k01181m52286l51680r1562J7691N6182J21893K2721k27863
35628a159081j94421K29053M49024R2305l03909j55969J92468J24288j26246R7243
35618g55245O54510P77089L10631j30359k24462k73008l96311k79411P2650J53140
35608i0776j48499k33598J76978M04009j77392j011787j007856p2468P29066N65466
35598h66857j94583n86121k06122M89906Q23083N61635J7029l34608k72265M8476
35588e20427L09008L33101K02157J12601J48403K00856J10659j32699l67197m26421
35578b9959k87401n8819J11406J14218m9310k45208l22035k63338j56925l3915
$$ plain form
35649 -666343 -466481 51380 648801 680199 39296 -528498 -409715 60884 213185 25532
35639 25532 -74525 -52996 -254177 -706463 -1058143 -1149705 -1132014 -1075832 -953939 -931218 -1159081
35628 -1159081 -1353502 -1124449 -675425 -583120 -887029 -1042998 -850530 -726242 -852488 -755245
35618 -755245 -100735 676354 986985 856626 632164 359156 -37155 -316566 -243916 -90776
35608 -90776 -239275 -472873 -295895 108114 -69278 -1081065 -2088921 -2161389 -1432323 -866857
35598 -866857 -1061440 -1647561 -1853683 -1363777 -540694 20941 37970 -296638 -568903 -520427
35588 -520427 -211419 121682 323839 436440 584843 785699 896358 763659 396462 -29959
35578 -29959 -317360 -376179 -264773 -150555 -199865 -445073 -767108 -1030446 -1187371 -1221286
35568a221286J37666L01520L15643J53509l1200q5724R042J84046L14272K42314
35558C19802k3131j82604m737K38481R0451l32087m15670j2888K70435N4186j75138
35547a72900Q1222M06620J35050m46396m51836J80044N30364Q7623n32194n61150
35537g43553j04452K24599J94187L0968n7088l1787Q4193J67703M5944j90847
35527c80133j83616J52028L74297J25325k77036k60510J69512M71053L76499J99351
35517G66770K51044L74685K92946J11944J26064K51457O1242n23719r38265o63801
35507A10367o605K35031j48815n14031l40344J7227m9655m11519m14272Q0117
35497a442499M92979M06476O7044j49061k49062l30644k35060J13278L46830R6154
$$ plain form
35568 -1221286 -1083620 -782100 -466457 -312948 -344148 -429872 -420830 -236784 77488 319802
35558 319802 296671 114067 109330 347811 438262 106175 -309495 -322383 -51948 2238 -172900
35547 -172900 -91678 314942 449992 3596 -448240 -268196 262168 349791 -182403 -743553
35537 -743553 -848005 -623406 -429219 -398251 -455339 -487126 -402933 -235230 -189286 -380133
35527 -380133 -563749 -411721 -37424 87901 -189135 -449645 -280133 190920 567419 766770
35517 766770 1017814 1392499 1685445 1797389 1923453 2174910 2236152 1712433 774168 110367
35507 110367 103762 338793 189978 -324053 -664397 -647170 -696825 -1108344 -1522616 -1442499
35497 -1442499 -949520 -543044 -476000 -625061 -874123 -1204767 -1439827 -1326549 -979719 -883565
35487h83565l66095l74771K30817Q37483Q12923K65702j61023j25360O1146j9391
35477B77866k61224k48546K4717J08692j26453j86589K27625N83117K79151l09059
35467C69297l26953J81466K96856k81731p07991l32353K72461K44150k66811m72237
35457a023846j81215J22327J86451K15080K74993J73593m0626n3347J53829K35582
35447F2821Q0660r914J12959J68196m8053k74309j92926O4217J38819R4m3201
35436E9363J59930L63632K66484o6343k87001k58694k66804n66707q67911o22082
35426b086133J45980P14008N86935J58652Q3852L12292K67403j79277n03141l32918
35416h32347O5563K78331K87679K91550L04087K10601K2627j52829k69048k95266
$$ plain form
35487 -883565 -1249660 -1624431 -1393614 -556131 256792 522494 361471 236111 297257 277866
35477 277866 16642 -231904 -207187 -98495 -224948 -411537 -183912 399205 678356 369297
35467 369297 42344 223810 520666 238935 -469056 -801409 -528948 -284798 -551609 -1023846
35457 -1023846 -1205061 -1082734 -896283 -681203 -406210 -232617 -273243 -326590 -172761 62821
35447 62821 143481 133567 246526 414722 366669 92360 -100566 -36349 102470 102564 59363
35436 59363 219293 582925 849409 783066 496065 237371 -29433 -596140 -1464051 -2086133
35426 -2086133 -1940153 -1226145 -639210 -480558 -396706 -84414 182989 3712 -499429 -832347
35416 -832347 -766784 -488453 -200774 90776 394863 605464 628091 475262 206214 -89052
35406h9052j44819J78160M40899L56872r3731n86072p12840l53987J81050M37837
35396c85683K94269M9104l4287o9017k41096l93129k56351M0897J18578m1702
35386i18417q2575Q6647J22162j19083k61158k2956K63050J47907k16506l11431
35376a312360k6304K62405L19248L01272L33094K48919o0725l46604k97058J1670
35366e66443J91418L1334k59129l25861q6111J99505K46364O5396q9289n9245
35356f52061L9606K4185p2782n5673J25752K69139J82292n0429j79770j29654
35346d99395p5889j41046j61451P8753M51984N57888K42279j73380l21089k54278
35336b95624k62554l54634k42242J56026N05581M84617K01886K976J1O378j08233
$$ plain form
35406 -89052 -233871 -55711 385188 742060 648329 62257 -650583 -1004570 -823520 -385683
35396 -385683 -91414 -42310 -76597 -145614 -386710 -779839 -1036190 -995293 -876715 -918417
35386 -918417 -1000992 -914345 -792183 -911266 -1172424 -1195380 -932330 -784423 -1000929 -1312360
35376 -1312360 -1338664 -1076259 -757011 -455739 -122645 126274 65549 -281055 -578113 -566443
35366 -566443 -375025 -343691 -602820 -928681 -1014792 -815287 -568923 -503527 -592816 -652061
35356 -652061 -612455 -588270 -661052 -716725 -590973 -321834 -139542 -189971 -369741 -499395
35346 -499395 -575284 -716330 -877781 -799028 -347044 210844 453123 279743 -41346 -295624
35336 -295624 -558178 -912812 -1155054 -999028 -493447 -8830 193056 196032 196043 202421 94188
35325I4188k11711j31090M8728N1878k15319m79551m05680m5430J94093Q9758
35315a010136q0550O0655M12266N04511J78398j56732q9856K10156K40151j16340
35305A52523m21900l06649N685K3026k85466m08865k5770M82652N15677P3843
35295a95244k60883j29713K00531L22888K04679K7812j51864l14473l09888q5154
35285f91309J29259J52599J55180L04042L56952M5540l33803k51023K09346L99993
35275D76776N9244l46616l82461k25183k23102l12038k17390N8223K86893L68852
35265d56802L59071K75484J03783r4463k22472k22012o8272J65568K49613L4894
35255A24392k55410k68915o5710m7376k96445m31557k59188q8815j48798j52388
$$ plain form
35325 94188 -117523 -248613 -199885 -148007 -363326 -842877 -1248557 -1293987 -1099894 -1010136
35315 -1010136 -1090686 -1030031 -617765 -113254 65144 -91588 -181444 28712 268863 152523
35305 152523 -269377 -576026 -570341 -547315 -832781 -1241646 -1267416 -784764 -269087 -195244
35295 -195244 -456127 -585840 -385309 -62421 142258 170070 18206 -296267 -606155 -691309
35285 -691309 -562050 -409451 -254271 49771 406723 452263 118460 -132563 76783 476776
35275 476776 536020 189404 -193057 -418240 -641342 -953380 -1170770 -1112547 -825654 -456802
35265 -456802 -97731 177753 281536 187073 -35399 -257411 -325683 -160115 89498 124392
35255 124392 -131018 -399933 -465643 -513019 -809464 -1241021 -1500209 -1589024 -1737822 -1890210
35245a890210J95897O42034P29298M13568k6078m06628o19887m97990r3491J90004
35235a363483J45575J36796M85300Q25058O27542Q5495j82632j19599k00667m91335
35225e1950m97770n8743L20812K57992J7593k8826M3491J3381o1184m8233l2626
35214a26063r9820j14333J7857J27106O8205j8280K0765M5902j43275m35732n04843
35203a162511j91395L33148O90484N65879L6628l93843l49971j03693j51068l49204
35193a075546q4785O11126Q65004K36074n21975n53875j52917j59464n56869n81193
35183a974420l9380M22588M19426L27453M53867M66578M6222m71992n59296k06452
35173a115406K09100M49001M63640K16195j82796l97216k53639j5652Q651r2508
$$ plain form
35245 -1890210 -1694313 -1052279 -322981 90587 64509 -342119 -962006 -1459996 -1553487 -1363483
35235 -1363483 -1217908 -1081112 -595812 229246 856788 942283 759651 640052 439385 -51950
35225 -51950 -549720 -608463 -287651 -29659 -12066 -40892 2599 15980 -45204 -93437 -126063
35214 -126063 -225883 -340216 -322359 -195253 -127048 -145328 -124563 -78661 -221936 -657668 -1162511
35203 -1162511 -1353906 -1020758 -330274 235605 272233 -121610 -471581 -575274 -726342 -1075546
35193 -1075546 -1160331 -549205 315799 551873 29898 -523977 -676894 -836358 -1393227 -1974420
35183 -1974420 -2013800 -1591212 -1171786 -844333 -390466 76112 122334 -349658 -908954 -1115406
35173 -1115406 -906306 -457305 6335 222530 39734 -357482 -611121 -626773 -618122 -710630
35163g10630q0678j813j4839j6507J35591K06492j09417n45910m72286J88289
35153a421708P45072O27311Q2041k51531j46461J05038J72655J1174j92101k19757
35143d88267m5506R0112l1898k37142j34677K75611N08760K65912j45661l01309
35133b44065k23713j37365P065L21368N44177L38662j00984k59408n7629J18160
35123C06268J17883J76758K97666J18623l73758n98013k23939K32668J36017l26377
35113a36204m58576p4170L40031L72690J12274j63290l05123k62127o4867J09207
35103e30155J08400M1853R7024J73620O689l57800n42993l52388n296K17892K89919
35092h53235K86865J75253q6891l88001n35918m21126q0128L02394M76870L62389
$$ plain form
35163 -710630 -791308 -793121 -807960 -824467 -688876 -482384 -591801 -1137711 -1609997 -1421708
35153 -1421708 -676636 -49325 32716 -218815 -365276 -260238 -87583 -76409 -268510 -488267
35143 -488267 -533773 -443661 -475559 -712701 -847378 -571767 -63007 202905 57244 -244065
35133 -244065 -467778 -605143 -598078 -276710 267467 606129 505145 245737 188108 306268
35123 306268 424151 600909 898575 1017198 643440 45427 -178512 54156 190173 -136204
35113 -136204 -594780 -668950 -328919 43771 156045 -7245 -312368 -574495 -639362 -530155
35103 -530155 -421755 -379902 -282878 -109258 -102569 -460369 -1003362 -1355750 -1361046 -1143154 -853235
35092 -853235 -566370 -391117 -478008 -866009 -1401927 -1823053 -1903181 -1600787 -1123917 -761528
35082g61528J67164J10686R6406j00038l83543m13740j41962Q9600Q3882N9135
35072a193938K04448L14866J47983j29927j89222m5861K5529j7605N0480K70236
35062e63011L56354J31878j56337j54590R9979K19009l198k88686k36715J14818
35052d80499L10614J04923j79933j28296J31374J18541k32949m40555k23294M8871
35042i71203m6800k86155j39648L69987O54640M09715J0652q3648O6929J23474
35032A07943J1248r5470j44840k14771k32902m6804K14449K03151j11946l01774
35022f11716p2939K74129K73273l6465k30212j55126m9544l5321N2620K34968
$$ plain form
35082 -761528 -594364 -483678 -387272 -487310 -870853 -1284593 -1426555 -1336955 -1253073 -1193938
35072 -1193938 -989490 -674624 -526641 -656568 -845790 -891651 -866122 -883727 -833247 -563011
35062 -563011 -206657 -74779 -231116 -385706 -285727 -66718 -69916 -358602 -595317 -480499
35052 -480499 -169885 -64962 -244895 -373191 -241817 -123276 -356225 -796780 -1020074 -971203
35042 -971203 -1018003 -1304158 -1443806 -1073819 -419179 -9464 1188 -82460 -15531 107943
35032 107943 119191 23721 -121119 -335890 -568792 -615596 -401147 -197996 -309942 -611716
35022 -611716 -684655 -410526 -137253 -173718 -403930 -559056 -608600 -643921 -591301 -356333
$$ [...]
##END NTUPLES=NMR SPECTRUM
##END=
