##TITLE=31Pdec_IPEDP2511
 CDCl3, 24 sc
 26.11.2020
##JCAMPDX= 6.0         $$ Bruker NMR JCAMP-DX V2.0
##DATA TYPE= NMR SPECTRUM
##DATA CLASS= NTUPLES
##ORIGIN= UXNMR, Bruker Analytische Messtechnik GmbH
##OWNER= root
$$ XWIN-NMR		Version 3.5
$$ Thu Nov 26 10:45:23 2020 Russian Standard Time (UT+4h)  she@DPX200
##.OBSERVE FREQUENCY= 81.013821
##.OBSERVE NUCLEUS= ^31P
##.ACQUISITION MODE= SIMULTANEOUS
##.ACQUISITION SCHEME= undefined
##.AVERAGES= 24
##.DIGITISER RES= 17
##SPECTROMETER/DATA SYSTEM= spect
##.PULSE SEQUENCE= zgpg30
##.SOLVENT NAME= DMSO
##.SHIFT REFERENCE= (INTERNAL, DMSO, 0, 182.463)
##AUDIT TRAIL= $$ (NUMBER, WHEN, WHO, WHERE, WHAT)
$$ ##TITLE= Audit trail, XWIN-NMR		Version 3.5
$$ ##JCAMPDX= 5.01
$$ ##ORIGIN= Bruker BioSpin GmbH
$$ ##OWNER= she
$$ F:/spectra/data/she/nmr/P31/1/pdata/1/auditp.txt
$$ ##AUDIT TRAIL=  $$ (NUMBER, WHEN, WHO, WHERE, WHAT)
(   1,<2020-11-26 10:44:25.17 +0400>,<she>,<DPX200>,
      <created by zg, POWCHK disabled, PULCHK disabled
       configuration hash MD5:
       00 E9 B6 7A A2 85 ED C7 34 08 36 98 17 FE 4E 26
       data hash MD5: 32K
       08 84 31 D2 74 37 0E 47 7A CF D9 B9 BF 81 9A DF>)
(   2,<2020-11-26 10:44:27.65 +0400>,<she>,<DPX200>,
      <Start of raw data processing
       efp BC_mod = 2 LB = 1 FT_mod = 6 PKNL = 1 PHC0 = -2421.854 PHC1 = 163.0008 SI = 64K 
       data hash MD5: 64K
       BD B2 A2 22 76 A6 0D 05 3D 63 F2 8E A1 40 3B F3>)
(   3,<2020-11-26 10:44:49.07 +0400>,<she>,<DPX200>,
      <pk PHC0 = 5.605396 PHC1 = 0 
       data hash MD5: 64K
       FA 0C 27 B2 AA A0 CA 31 27 B7 C2 1B 79 10 5E 03>)
$$ ##END=
$$ 
$$ hash MD5
$$ B1 3E E7 29 C9 8E C2 64 96 12 23 89 9A 62 6E FC
##$RELAX= 
##$RELAX= 
##$RELAX= 
##$RELAX= 
##$RELAX= 
##$RELAX= 
##$RELAX= 
##$RELAX= 
$$ Bruker specific parameters
$$ --------------------------
##$DU= <F:/spectra>
##$EXPNO= 1
##$NAME= <P31>
##$PROCNO= 1
##$TYPE= <nmr>
##$USER= <she>
##$AMP= (0..31)
100 100 100 100 100 100 100 100 100 100 100 100 100 100 100 100 100 100 
100 100 100 100 100 100 100 100 100 100 100 100 100 100 
##$AQSEQ= 0
##$AQ_mod= 1
##$AUNM= <au_zg>
##$AUTOPOS= <>
##$BF1= 81.014009
##$BF2= 200.13
##$BF3= 200.13
##$BF4= 200.13
##$BF5= 200.13
##$BF6= 200.13
##$BF7= 200.13
##$BF8= 200.13
##$BYTORDA= 1
##$CFDGTYP= 0
##$CFRGTYP= 5
##$CHEMSTR= <none>
##$CNST= (0..31)
1 1 145 1 1 1 1 1 1 1 1 1 1 1 1 1 1 1 1 1 1 1 1 1 1 1 1 1 1 1 1 1 
##$CPDPRG= <waltz16>
##$CPDPRG1= <>
##$CPDPRG2= <waltz16>
##$CPDPRG3= <>
##$CPDPRG4= <mlev>
##$CPDPRG5= <mlev>
##$CPDPRG6= <mlev>
##$CPDPRG7= <mlev>
##$CPDPRG8= <mlev>
##$CPDPRGB= <>
##$CPDPRGT= <>
##$D= (0..31)
0 1 0 0 0 0 0 0 0 0 0 0.03 2e-05 3e-06 0 0 0 0 0 0 0 0 0 0 0 0 0 0 0 0 
0 0 
##$DATE= 1606373064
##$DBL= (0..7)
120 120 120 11 120 120 24 19 
##$DBP= (0..7)
150 150 150 150 150 150 150 150 
##$DBP07= 0
##$DBPNAM0= <>
##$DBPNAM1= <>
##$DBPNAM2= <>
##$DBPNAM3= <>
##$DBPNAM4= <>
##$DBPNAM5= <>
##$DBPNAM6= <>
##$DBPNAM7= <>
##$DBPOAL= (0..7)
0.5 0.5 0.5 0.5 0.5 0.5 0.5 0.5 
##$DBPOFFS= (0..7)
0 0 0 0 0 0 0 0 
$$ [...]
##$SUBNAM2= <"">
##$SUBNAM3= <"">
##$SUBNAM4= <"">
##$SUBNAM5= <"">
##$SUBNAM6= <"">
##$SUBNAM7= <"">
##$SUBNAM8= <"">
##$SUBNAM9= <"">
##$SW= 369.568048894756
##$SWIBOX= (0..15)
0 1 3 0 0 0 0 0 0 0 0 0 0 0 0 0 
##$SW_h= 29940.119760479
##$TD= 32768
##$TD0= 1
##$TE= 0
##$TE2= 300
##$TE3= 300
##$TEG= 300
##$TL= (0..7)
0 120 53 12 22 120 120 120 
##$TP= (0..7)
150 150 150 150 150 150 150 150 
##$TP07= 0
##$TPNAME0= <>
##$TPNAME1= <>
##$TPNAME2= <>
##$TPNAME3= <>
##$TPNAME4= <>
##$TPNAME5= <>
##$TPNAME6= <>
##$TPNAME7= <>
##$TPOAL= (0..7)
0.5 0.5 0.5 0.5 0.5 0.5 0.5 0.5 
##$TPOFFS= (0..7)
0 0 0 0 0 0 0 0 
##$TUNHIN= 0
##$TUNHOUT= 0
##$TUNXOUT= 0
##$USERA1= <user>
##$USERA2= <user>
##$USERA3= <user>
##$USERA4= <user>
##$USERA5= <user>
##$V9= 5
##$VALIST= <valist>
##$VCLIST= <CCCCCCCCCCCCCCC>
##$VD= 0
##$VDLIST= <DDDDDDDDDDDDDDD>
##$VPLIST= <PPPPPPPPPPPPPPP>
##$VTLIST= <TTTTTTTTTTTTTTT>
##$WBST= 1024
##$WBSW= 4
##$XGAIN= (0..3)
0 0 0 0 
##$XL= 0
##$YL= 0
##$YMAX_a= 16093
##$YMIN_a= -16024
##$ZGOPTNS= <>
##$ZL1= 120
##$ZL2= 120
##$ZL3= 120
##$ZL4= 120
##$ABSF1= 0
##$ABSF2= 0
##$ABSG= 0
##$ABSL= 0
##$ALPHA= 0
##$AQORDER= 0
##$ASSFAC= 0
##$ASSFACI= 0
##$ASSFACX= 0
##$ASSWID= 0
##$AUNMP= <proc_1d>
##$AZFE= 0.1
##$AZFW= 0.5
##$BCFW= 0
##$BC_mod= 2
##$BYTORDP= 0
##$COROFFS= 0
##$CY= -3
##$DATMOD= 1
##$DC= 0
##$DFILT= <>
##$DTYPP= 0
##$F1P= 0
##$F2P= 0
##$FCOR= 1
##$FTSIZE= 65536
##$FT_mod= 6
##$GAMMA= 0
##$GB= 0
##$INTBC= 1
##$INTSCL= 5.30512e-09
##$ISEN= 30
##$LB= 1
##$LEV0= 0
##$LPBIN= 0
##$MAXI= 10000
##$MC2= 0
##$MEAN= 0
##$ME_mod= 0
##$MI= 50
##$NCOEF= 0
##$NC_proc= -6
##$NLEV= 6
##$NOISF1= 182.463
##$NOISF2= 159.3651
##$NSP= 0
##$NTH_PI= 0
##$NZP= 0
##$OFFSET= 182.463
##$PC= 4
##$PHC0= -2416.249
##$PHC1= 163.0008
##$PH_mod= 1
##$PKNL= yes
##$PPARMOD= 0
##$PSCAL= 0
##$PSIGN= 0
##$REVERSE= no
##$SF= 81.014009
##$SI= 65536
##$SIGF1= 159.3651
##$SIGF2= -187.1042
##$SINO= 113.3802
##$SIOLD= 16384
##$SREGLST= <1H.CDCl3>
##$SSB= 0
##$STSI= 65536
##$STSR= 0
##$SW_p= 29940.119760479
##$SYMM= 0
##$S_DEV= 0
##$TDeff= 32768
##$TDoff= 0
##$TI= <>
##$TILT= no
##$TM1= 0
##$TM2= 0
##$TOPLEV= 0
##$USERP1= <user>
##$USERP2= <user>
##$USERP3= <user>
##$USERP4= <user>
##$USERP5= <user>
##$WDW= 1
##$XDIM= 65536
##$YMAX_p= 283727322
##$YMIN_p= -8615527
$$ End of Bruker specific parameters
$$ ---------------------------------
##NTUPLES= NMR SPECTRUM
##VAR_NAME=  FREQUENCY,     SPECTRUM/REAL,   SPECTRUM/IMAG
##SYMBOL=    X,             R,               I
##VAR_TYPE=  INDEPENDENT,   DEPENDENT,       DEPENDENT
##VAR_FORM=  AFFN,          ASDF,            ASDF
##VAR_DIM=   65536,         65536,           65536
##UNITS=     HZ,            ARBITRARY UNITS, ARBITRARY UNITS
##FACTOR=    0.456856943014862, 1,           1
##FIRST=     14782.0589164895, 0,            0
##LAST=      -15158.0608439895, 0,           0
##MIN=       -15158.0608439895, -8615527,    0
##MAX=       14782.0589164895, 283727322,    0
$$ Real data points
##PAGE= N=1
##DATA TABLE= (X++(R..R)), XYDATA
$$ [...]
44390 -3553234 -3396266 -1932262 -168222 796838 1123353 1402560 1303928 506036 54890
44381 54890 956099 2185446 2110072 1185418 1024011 1429549 923156 -149376 100587 1593790
44371 1593790 1955680 348381 -1045750 -388884 1271384 1960968 1288659 -74245 -1544140
44362 -1544140 -2184696 -943289 1503119 2790921 1884047 476091 355058 1061543 1325542
44353 1325542 1092621 737017 -92780 -1259616 -1251988 709540 2811285 2631624 175516
44344 175516 -2511222 -3882554 -3692740 -2275263 -569280 7736 -707034 -776914 1385501
44335 1385501 4462954 5786506 4828151 3397863 2778292 2466476 1662247 344790 -1278862
44326 -1278862 -3039532 -4353025 -4617733 -4150192 -3781292 -3615805 -3127935 -2241017 -1247954
44317 -1247954 61759 1947808 3525580 3362123 1417564 -748900 -1923056 -2380123
44309 -2380123 -2878217 -3483871 -3773728 -3500779 -2721898 -1692113 -737711 77162 978438
44300 978438 1834302 1945657 1075331 179159 347751 1461224 2620059 3283349 3095169
44291 3095169 1433320 -1478033 -3642484 -3204055 -1099492 -125365 -1326543 -2960998
44283 -2960998 -3238653 -2354531 -1296703 -318770 490983 456249 -764615 -2338405 -3231844
44274 -3231844 -3393606 -3320438 -3136606 -2744118 -2257200 -1696619 -836357 150033 552696 177547
44264 177547 -132213 352110 1172506 1432162 1091143 787359 755154 687591 498718 533632
44254 533632 987967 1606025 2075696 2405447 2685563 2573675 1405408 -757376 -2385414
44245 -2385414 -1730338 771705 2383004 1369168 -440048 70885 2937766 4958143
44237 4958143 4058825 1828719 855644 1253264 1223123 -51877 -1641412 -2514170 -2591790
44228 -2591790 -2191469 -1413025 -335053 642280 883464 22098 -1450351 -2360747 -2168707
44219 -2168707 -1821971 -2444113 -3487943 -3508765 -2645707 -2568283 -3642224 -4201350 -3544507
44210 -3544507 -3508120 -5401681 -7238443 -6312951 -3302418 -1240056 -1044347 -761301 721930
44201 721930 1842954 1057746 -623586 -918309 1114377 4476503 7203195 7464505 4896166
44192 4896166 1420814 -332550 49434 491834 -520710 -2006396 -2335499 -1627024 -1157888
44183 -1157888 -1438607 -2099560 -2854306 -3318025 -2554455 -163146 2579836 3921182 3721159
44174 3721159 3252199 3256387 3452657 3726081 4336923 4823893 4120285 2234928 682289
44165 682289 673945 1776672 2844935 3396485 3538593 3394068 3205392 3250581 3149304 2154604
44155 2154604 677679 307381 1348888 1655752 -495664 -3384974 -3808078 -1619438 46761
44146 46761 -688250 -2108490 -2042422 -1150423 -1416186 -2896443 -3919464 -3650901 -2613151
44137 -2613151 -1161187 745247 2390273 2602967 1424855 181346 -300105 -411970 -628236
44128 -628236 -852111 -1078203 -1523524 -1861300 -1490159 -814411 -976192 -1898894 -1942684 -229087
44118 -229087 1856539 2362300 1067851 -708427 -1743802 -1561348 -315554 1036625 1142307
44109 1142307 -255665 -1778015 -2078184 -1358315 -499371 380052 1423019 1951221 1256429
44100 1256429 -66380 -946580 -1552730 -2673446 -3682177 -2940091 -528915 1120411 205813
44091 205813 -2005454 -2758465 -1169393 997310 1654228 617109 -655713 -994876 -717093
44082 -717093 -896443 -1858049 -2846004 -3092325 -2624576 -1849717 -929775 99842 1108356
44073 1108356 2096552 3108148 3638842 2886642 1050388 -439396 -625167 -185579 -228044
44064 -228044 -787463 -1314529 -1685004 -1733705 -816275 923109 1853752 893484 -704616
44055 -704616 -1233267 -1192124 -2065184 -3373827 -3455673 -2633664 -2774692 -3745725 -3302396 -975083
44045 -975083 918706 1053654 978368 1928922 2632625 2061132 1641853 2422852 2474022 -31388
44035 -31388 -3026142 -3056800 -452756 1201241 206691 -1680826 -2685932 -3037800 -3159730
44026 -3159730 -2529899 -1231846 -490197 -666823 -474491 839093 2065930 1863364 755072
44017 755072 182874 437972 586777 -40883 -1079764 -1600672 -969577 517895 1797916
44008 1797916 2196842 2228167 2637408 3037207 2508253 1315262 724667 1046411 1203843
43999 1203843 571195 -85242 -79175 -46938 -934200 -2587347 -4072926 -4740882 -4420291 -3263127
43989 -3263127 -1978703 -1576588 -2252628 -3007013 -2848529 -1913921 -1010587 -567559 -446718
43980 -446718 -352091 -84985 268132 292867 -194608 -660066 -558410 -288177 -500990 -731652
43970 -731652 -61353 958835 790606 -404101 -571220 892283 1662891 -122700 -2754642
43961 -2754642 -3261477 -1630085 -429626 -821652 -1257130 -202606 1795615 3188066 3120585
43952 3120585 1716446 -134765 -1059263 -423861 568489 150967 -1567659 -2720483 -2361917
43943 -2361917 -1529650 -1210214 -815370 425079 1826915 2141471 1227724 -207654 -1803597
43934 -1803597 -3332666 -3828770 -2284600 688332 2909589 2775632 919238 -565437
43926 -565437 -364465 784872 1097059 -67178 -1354846 -1117241 391416 1300520 601207
43917 601207 -602236 -686416 501781 1871390 2607498 2666967 2225719 1514929 1023317
43908 1023317 1085435 1307890 1053670 482437 471623 1404645 2606841 3213040 3190907 3229269
43898 3229269 3818662 4658376 4932456 4103539 2410805 536512 -1087329 -2325456 -2795008
43889 -2795008 -1976156 -217508 1044748 805420 -157001 -255711 809857 1852015 2027676
43880 2027676 1804478 1799546 1696755 1031038 300424 346647 963995 1065459 237564 -672826
43870 -672826 -763366 -258821 -76261 -530656 -912496 -351697 1115075 2434755 2537253
43861 2537253 1492954 573459 992936 2658957 4364337 5070755 4632210 3374622 1646267
43852 1646267 37869 -659050 -392275 -355638 -1745652 -4097051 -5599319 -5106281 -3139154
43843 -3139154 -906095 736706 1158497 -3745 -1917096 -2655436 -1314316 651106
43835 651106 1328426 919633 964125 1522866 1112419 -458820 -1342062 -563091 252634 -566966
43825 -566966 -2077207 -2377249 -1674732 -1517308 -1709947 -510841 2042881 3442428 2149286
43816 2149286 -209403 -1218962 -728412 -232603 -422861 -848373 -1229512 -1581539 -1428412
43807 -1428412 -334782 859552 632403 -1194869 -3042468 -3460488 -2599278 -1504411 -759253
43798 -759253 -377921 -525054 -1617936 -3620566 -5527301 -5851895 -3942344 -900895 1160037
43789 1160037 1076843 -397148 -1764963 -2382031 -2412095 -1869884 -727966 283317 152146
43780 152146 -925519 -1463425 -467441 1388114 2684146 2719600 1761682 509473 -311534
43771 -311534 -422186 -427894 -1187000 -2424572 -2767446 -1684674 -513942 -660588 -1474057
43762 -1474057 -1125310 684911 2160489 1719179 -171180 -1884437 -2586836 -2700400 -2825780
43753 -2825780 -2815185 -1997950 -152789 1887259 2841877 2338634 1351210 969125 1094212
43744 1094212 897832 245168 -142213 125073 597712 794008 705544 279098 -740877
43735 -740877 -2024525 -2535539 -1827050 -757733 -179706 396823 1801027 3350940 3334732
43726 3334732 1371556 -937336 -2052203 -2087288 -1838434 -1363954 -545030 -206801 -1247583
43717 -1247583 -2899523 -3325473 -2204974 -1355647 -2071760 -3041294 -2144790 381051 2100398
43708 2100398 1631753 289771 30632 984875 1866670 1937655 1483458 856104 219420
43699 219420 81879 890765 1921716 1717862 158055 -936898 -160192 1305156 1187244
43690 1187244 -474120 -1055683 945076 3386997 3088034 191736 -1938649 -1293026 282226
43681 282226 173594 -1090187 -917392 1263947 3313208 3709043 3228609 2673592 1269444
43672 1269444 -1178793 -2489980 -715210 2536745 3756944 2115794 142939 -129408
43664 -129408 576111 847324 742456 844018 838107 318953 -148532 69563 622908 1002896
43654 1002896 1495959 2318195 2731319 2150607 1322258 1212177 1445965 1101996 396803
43645 396803 200701 383633 126749 -415823 -285979 517388 916384 521405 154512 340534
43635 340534 528107 186121 -434536 -1012070 -1583292 -1894165 -1379170 -234148 520105
43626 520105 548865 742771 1642997 2388782 2082878 1296304 1168675 1639895 1687345 1021080
43616 1021080 525687 1012488 2260258 3395073 3780700 3480444 3060359 2892628 2682884
43607 2682884 2040256 1413897 1669335 2534492 2471192 750062 -1218736 -1591733 -530787
43598 -530787 167265 -424421 -1370506 -1422944 -552784 402749 934342 1245913 1725098 2342925
43588 2342925 2637248 2362487 2049884 2478284 3519237 4166852 3979912 3648102 3586280
43579 3586280 2990424 1346719 -3670 647035 2717365 3834784 3006281 1655253 1195122
43570 1195122 1262283 1110218 1183275 2034633 2773476 2066505 155876 -1410837 -1765810
43561 -1765810 -1291547 -453813 674119 1641364 1563189 281123 -1232834 -2065410 -2308540
43552 -2308540 -2431410 -2386541 -1933035 -1355226 -1155808 -1275721 -1275592 -1165435 -1360314 -1771387
43542 -1771387 -1677097 -816438 5410 -77310 -806606 -1222532 -958899 -423598 68077 409970
43532 409970 -10783 -1928863 -4596553 -5748226 -4247964 -1983481 -1740099 -3541440 -4642072
43523 -4642072 -3278483 -853045 289017 -108109 -575271 -414219 -348351 -900589 -1484813
43514 -1484813 -1429543 -943753 -575034 -365688 -90450 115994 -25208 -302770 -188877 340284
43504 340284 682574 511852 372625 967163 2066553 2627678 2011623 646595 -625585
43495 -625585 -1386364 -1576022 -1110665 -100782 847896 1185273 1215175 1822692 3392915
43486 3392915 5403361 6994619 7491257 6579088 4708341 3257260 3366894 4376061 4310523
43477 4310523 2359171 -4398 -1008141 -870666 -1154649 -2372265 -3391034 -3163371 -2040405
43468 -2040405 -1122123 -1028024 -1648793 -2605663 -3541440 -4144618 -4163033 -3482465 -2346943 -1575163
43458 -1575163 -2156505 -4150905 -6177301 -6575999 -5127480 -3176718 -2031228 -1736090 -1568923
43449 -1568923 -1222862 -1093278 -1599829 -2578125 -3368954 -3380992 -2546544 -1264607 42680
43440 42680 1204289 2141307 2683338 2748206 2603942 2766037 3586938 4853075 5653910 4914013
43430 4914013 2585429 202503 -537731 127946 326906 -656673 -1111979 559961 3124308
43421 3124308 3950308 2618306 1215792 1032461 923928 -385095 -2106418 -2665455 -1937083
43412 -1937083 -895136 95141 1238919 2119737 2007760 1216420 824624 924493 361033
43403 361033 -1369468 -2966102 -2759586 -749860 1399927 2106531 1166853 -387819 -1226399
43394 -1226399 -620872 1070419 2636028 2950642 1893270 381702 -478258 -288296 434123
43385 434123 765443 157297 -1056763 -1887396 -1640979 -733438 -287870 -764407 -1377925
43376 -1377925 -1253904 -715084 -683930 -1124753 -1190688 -933533 -1459804 -2837578 -3333676 -1904400
43366 -1904400 -178089 -296617 -1704501 -2136832 -1311864 -1237505 -2675627 -3775760 -3081925
43357 -3081925 -1659631 -907274 -240225 1276024 2602504 2178913 650983 -41452 352448
43348 352448 555898 602344 2111353 5314155 7873395 7619030 5080559 2416592 897992
43339 897992 321441 101584 -9392 -7333 153098 427708 695319 975200 1296786 1096131
43329 1096131 -496042 -3008554 -4193785 -2641920 -173682 186850 -1707649 -3212617
43321 -3212617 -3100210 -3150623 -4705730 -6133117 -5407403 -3284609 -1839517 -1241751 -259279
43312 -259279 929389 855886 -547859 -1594232 -1359110 -637744 -27389 1070143 2766860
43303 2766860 3651066 2633937 747328 -187160 -22144 -91774 -803284 -829977 813832
43294 813832 2913977 3299914 1651235 -59958 -253814 193809 -473479 -2028767 -2530482
43285 -2530482 -1336901 -69874 9484 -126694 784308 1914748 1618787 190233 -557446
43276 -557446 -90977 333000 -57408 -577332 -707997 -993149 -1665374 -1856380 -1098837 -479343
43266 -479343 -1259810 -3100410 -4578824 -4958855 -4667754 -4385019 -4256794 -3767409 -2151930
43257 -2151930 570475 2871468 2929256 972919 -577072 25008 1803986 2748190 2558068
43248 2558068 2431352 2784826 2780697 2034777 1333871 1311783 1529554 1345116 837102 365489
43238 365489 -79799 -559034 -810394 -820530 -1315420 -2904302 -4843917 -5410485 -3791913
43229 -3791913 -1171410 484069 526809 57925 234886 716027 244463 -1525462 -3418805
43220 -3418805 -3965894 -2718324 -337026 1982472 3033648 2349294 921830 547808 1837221
43211 1837221 3361270 3416797 2156237 1190358 1476968 2510280 3333416 3353095 2298368
43202 2298368 506744 -676431 19566 1978567 3108793 2550734 1788251 2309684 3391355
43193 3391355 3447707 2629742 2433008 3146283 3448155 2639074 1625536 1200756 830481
43184 830481 -66569 -941966 -1276577 -1789545 -3125139 -4158203 -3261627 -932131 532783
43175 532783 75053 -989112 -1259033 -1111181 -1445812 -1907143 -1595390 -739301 -366872
43166 -366872 -685912 -906322 -509134 239732 946084 1446316 1592189 1418978 1439670 2057560
43156 2057560 2786781 2773754 1976959 1075796 338761 -556088 -1604429 -2261187 -2219411 -1637546
43146 -1637546 -626816 629941 1347120 821371 -270649 -420062 637222 1552222 1373600
43137 1373600 703353 438540 651938 1245192 2299328 3046289 2028164 -626272 -2543765
43128 -2543765 -2103151 -741853 -615638 -1215681 -454412 1681054 2965017 2261753 777296
43119 777296 -230193 -903127 -1400206 -958241 708119 2424555 2906180 2171719 1031115
43110 1031115 96049 -233690 220068 935551 1109956 866193 1044335 1585280 1404331
43101 1404331 261898 -644418 -570486 -314715 -643237 -1011269 -805820 -520243 -568033 -210473
43091 -210473 1024813 2032024 1704396 790800 594654 759572 133598 -920486 -1080627
43082 -1080627 -505042 -643712 -1675623 -2146667 -1415905 -597198 -575165 -763402 -485904
43073 -485904 -106000 -41611 19248 130677 -476363 -2091077 -3659703 -4088654 -3573824 -2902675
43063 -2902675 -2316499 -1829006 -1766335 -2091051 -1990343 -1089925 -372016 -897649 -2238557
43054 -2238557 -3187125 -3418046 -3301495 -2593597 -737694 1610321 2718272 1812386 76726
43045 76726 -746521 -128841 1102082 1803202 1423564 293751 -738814 -1142940 -1150904 -1184691
43035 -1184691 -1117398 -582125 167572 306732 -593474 -2047089 -3153091 -3398885 -3065759
43026 -3065759 -2950242 -3378062 -3464635 -2075222 231761 1294695 113074 -1615108 -1895268
43017 -1895268 -1244869 -1382856 -2040816 -1407186 583156 1995439 2182179 2636652 3757089
43008 3757089 3523938 961060 -1569609 -1663200 -408421 -156665 -494561 599391 2731706
42999 2731706 3476024 2343527 1197678 688909 -513264 -2379383 -2608471 -315458 2136689
42990 2136689 2626595 2228813 2825467 3876368 3801228 2962567 2814968 3066696 2076021
42981 2076021 -314038 -2339011 -2632235 -1501517 -53090 770955 620181 230072 922638
42972 922638 2682406 3696588 2929395 1804811 1735163 1555801 -204833 -1863092 -556351
42963 -556351 2897953 4536556 2834643 460016 -208613 -19983 -262288 -76331 1417035
42954 1417035 2934516 3092242 2598111 2362751 1427853 -961064 -3049792 -2911473 -1620370
42945 -1620370 -1403148 -1849606 -945359 897104 1074691 -932980 -2487047 -1545408 935817
42936 935817 2998199 3883798 3497005 1741619 -547310 -1653519 -1028262 -49812 840
42927 840 -593481 -1216380 -2104249 -3320334 -3903218 -3238450 -2227704 -1916436 -1874727 -1178841
42917 -1178841 -241086 -283644 -1373763 -2255819 -2061525 -1159489 -267517 388239 823636
42908 823636 911368 651985 497835 994220 2069263 2940375 2977522 2509675 2251437 1914552
42898 1914552 317336 -2571688 -4729222 -4411047 -2677209 -2033992 -2921989 -3366542 -2183283
42889 -2183283 -581822 22106 8267 383488 1070004 1493668 1737285 2022992 2022550 1633231
42879 1633231 1407848 1289326 144457 -2272074 -4144691 -3870083 -2426220 -1830430 -2192913
42870 -2192913 -2152039 -1433151 -856678 -318371 897886 1911231 836200 -1975372 -3658727
42861 -3658727 -2730184 -1135957 -1113155 -1890315 -1299397 687397 2109695 2027807 1345464
42852 1345464 748521 -265780 -1837885 -2775504 -2038389 -222205 1375759 2488051 3604984
42843 3604984 4370089 3615997 1327454 -589933 -371406 1436285 2822338 2867750 2277612
42834 2277612 1575509 297550 -1548404 -2595036 -1679875 536903 2435943 3243568 3137275
42825 3137275 2338018 1211165 680106 1295624 2207854 2191924 1421298 1111593 1674581
42816 1674581 2397171 2732016 2693956 2172952 1146574 416406 746543 1392575 1001027
42807 1001027 -134083 -485381 10204 -213336 -1388802 -1630699 -143334 1067708 316173
42798 316173 -917074 -353630 1415840 2089269 1489801 1594177 3032725 4122862 3721112
42789 3721112 2840463 2719764 3063944 3088446 2895782 2860460 2753303 2415611 2403426 3009017
42779 3009017 3353764 2469560 861925 27585 549248 1491740 1766445 1404653 1137814
42770 1137814 1155685 887363 68430 -585369 -358891 121839 -499532 -2174557 -3001288
42761 -3001288 -1606495 922695 2461929 2433539 1747182 871816 -320274 -1066343 -119132
42752 -119132 1915163 2538356 633931 -1755881 -2152049 -869453 -54448 -449082 -849174
42743 -849174 -375751 429663 905479 1287269 2022228 3005801 3852002 4239784 3809344 2385742
42733 2385742 475285 -1042524 -1786214 -1890746 -1327300 -71281 1101266 1079729 -33431
42724 -33431 -836814 -489980 304505 637781 631088 612100 147469 -997077 -1783072 -1147038
42714 -1147038 171137 465017 -460324 -1017835 -68041 1886031 3842348 5223109 5307571
42705 5307571 3301146 -106067 -2467010 -2099408 -179323 809502 195243 -462543 229679
42696 229679 1865309 3071396 3040864 1966731 551933 -619553 -1432344 -1993754 -2086819
42687 -2086819 -1388561 -416010 -384955 -1472569 -2083143 -864176 1260865 2318113 1938517
42678 1938517 1294026 838666 -33186 -1108786 -1130902 101661 1247706 1690756 2448420
42669 2448420 3896048 4478670 3107411 1210898 688546 1161145 1148328 824842 1384108
42660 1384108 2400917 2233878 842896 -96353 9848 13555 -442334 -10228 1831807
42651 1831807 3350000 2987082 1687348 1323996 1940679 2086512 1185303 140201 -92485
42642 -92485 568625 1564702 1989365 1008501 -1129633 -2831653 -2799907 -1684707 -1211305
42633 -1211305 -1839352 -2237278 -1140504 1085406 2962469 3407765 2490764 1088170 71285
42624 71285 -236286 76799 901217 1930768 2254098 1037581 -1007393 -1763290 -141136
42615 -141136 2258542 2908756 1403195 -283200 -390904 828490 1966548 2110517 1338491
42606 1338491 327323 -137658 258007 997684 1297357 1087136 975601 1200270 1189227
42597 1189227 379808 -964809 -1982873 -1985305 -942817 485597 1389320 1356721 751508
42588 751508 66241 -636543 -1253711 -1204657 -307278 381047 -197796 -1188310 -551300 2060369
42578 2060369 4560423 5137198 4402442 3984728 4156157 4060382 3483084 3024946 2857349
42569 2857349 2517077 1862511 1255708 787567 145952 -682741 -1249200 -1260415 -904698 -608675
42559 -608675 -803612 -1629714 -2447594 -2132073 -517929 931338 770887 -471108 -952966
42550 -952966 116703 1787259 2859672 2992108 2389995 1499541 1016930 1123877 795436
42541 795436 -855258 -2629358 -2309682 71022 1927895 1793693 1255060 1890401 2256175
42532 2256175 163321 -3268120 -4502341 -2328868 714763 2081054 2243152 2992162
42524 2992162 4340639 4634336 3098238 1005038 286198 1585703 3731084 4870916
42516 4870916 4152477 2333103 729706 -129562 -501263 -515954 -1982 926164 1852988
42507 1852988 2641343 3371512 3761325 3407577 2608970 2124982 2022754 1595698 552719
42498 552719 -607066 -1579776 -2601383 -3475911 -3358261 -2115456 -906050 -619154 -631645
42489 -631645 -58995 585539 236090 -720316 -738121 542333 1585182 1141974 163420
42480 163420 599897 2673844 4366089 3912060 2054788 1009563 1501844 2010404 1253547
42471 1253547 90023 -107283 171688 -457325 -1593925 -1526075 -371525 -363411 -2284790
42462 -2284790 -3887671 -3176313 -1287067 -374983 -305296 441156 1771436 2197594 1407341
42453 1407341 476151 -124958 -764530 -1175535 -684151 250833 593317 642302 1448426 2513828
42443 2513828 2273723 898583 262783 853118 1205374 948274 1646208 3495994 3960905
42434 3960905 1548251 -1387011 -1901460 -732026 -812345 -2796160 -4652023 -5010448 -4427231
42425 -4427231 -3550644 -2288041 -947492 -342977 -442611 -330945 335919 1114708 1977304
42416 1977304 3319797 4680611 4853788 3590467 2046752 1281089 1307679 1768742 2486807
42407 2486807 3141335 3319762 3038501 2457931 1279161 -575492 -1999288 -1775509 -469058
42398 -469058 275816 287755 913624 2255557 2461465 724607 -896323 -156642 2218483
42389 2218483 3697696 3352382 2450973 2203748 2543684 2981623 3212645 2755028 1210440
42380 1210440 -807669 -1943454 -1669867 -931541 -914504 -1688851 -2348861 -2134382 -1189835
42371 -1189835 -399541 -507300 -1260168 -1609163 -1019927 -279105 -506834 -1576390 -2133130
42362 -2133130 -1177130 887238 2757409 3275116 2063896 -140266 -1698873 -1423097 -48443
42353 -48443 433286 -568417 -1130698 645232 3626294 4655190 2580997 -241884 -1093591
42344 -1093591 -163843 443282 -79072 -660493 -540646 -222579 -20518 695432 2120016
42335 2120016 3219350 3211186 2732220 2526741 1993166 306099 -1774334 -2656433 -2102399
42326 -2102399 -1330395 -1150915 -1261046 -1264968 -1143466 -727156 89882 594736 -51502 -1269594
42316 -1269594 -1460329 -156379 1387464 1925481 1365353 132763 -1168044 -1314979 588910
42307 588910 3274628 4201478 2971373 1927733 2398883 2552843 653506 -1644395 -1705424
42298 -1705424 -158320 105131 -1549035 -2870796 -2536608 -1797827 -1822505 -1905101 -1302074
42289 -1302074 -773817 -1080105 -1574042 -1518346 -1413671 -1772541 -1810871 -740653 603982
42280 603982 840680 19035 -803616 -1309102 -1785097 -1734293 -315677 1798517 2604362
42271 2604362 1289765 -658704 -1493627 -1287747 -1141779 -1209373 -761611 127713 386081
42262 386081 -178073 13376 2276318 5333011 6369842 4559704 2242264 1896379 3035054
42253 3035054 3334197 2107570 943107 938676 1163215 582821 -67654 396289 1525313
42244 1525313 1997138 1804958 2039874 2734447 2639509 1367065 135761 -194048 -317979
42235 -317979 -805831 -639693 1125686 3225081 3471395 1779316 138229 -386582 -741573
42226 -741573 -1514057 -1392057 764012 3656545 4889042 3807685 1620728 -645000 -2723715
42217 -2723715 -4076049 -4092359 -3412253 -3366883 -3807320 -3152373 -1108908 449067 309731
42208 309731 -41403 1293817 3599144 4616063 3852714 2918032 2871436 3074239 2767625
42199 2767625 2167213 1626828 1035057 444667 177784 -20776 -812153 -1913724 -2120310
42190 -2120310 -1173633 -441425 -1046533 -2346738 -3025842 -2727868 -1758231 -120513 2002940
42181 2002940 3458724 3067775 1186450 -585079 -1103636 -405214 908652 2126553 2495269
42172 2495269 1763757 686488 317015 871199 1852790 2955275 3974701 4165240 2947012
42163 2947012 1336690 1324014 3261548 5008556 4533325 2507067 1257301 1733674 2765089
42154 2765089 3125767 2957848 2771968 2233711 846502 -816742 -1581054 -1172856 -398825
42145 -398825 113670 461090 641097 219916 -651406 -818908 356695 1698159 1589006
42136 1589006 373441 75715 1556611 3203113 3060880 1313050 -206599 -353688 379740
42127 379740 956652 962291 629327 290216 18881 -358675 -898883 -1180155 -625223 668715
42117 668715 1838030 2269859 2286409 2461667 2727560 2672806 2325390 1997007 1591462 702358
42107 702358 -706402 -2218069 -3409051 -3938475 -3513803 -2407255 -1730609 -2364981 -3668041
42098 -3668041 -4062020 -2991866 -1517812 -796208 -800604 -943096 -1209462 -1969553 -3002790
42089 -3002790 -3406542 -2555464 -840693 653524 1158834 908364 761639 1101574 1314728
42080 1314728 581304 -1044412 -2661586 -3410963 -2972651 -1495604 376369 1608783 1596791
42071 1596791 826682 122148 -546709 -1658002 -2762990 -2778058 -1859763 -1637333 -2909724
42062 -2909724 -4300038 -4171162 -2898316 -2026346 -1901019 -1576358 -724541 -97314 45407
42053 45407 580913 2078014 3737430 4441871 4168932 3726693 3590365 3610934 3527303 3180501
42043 3180501 2402918 1198156 -17168 -701111 -701542 -300311 116714 244700 -30815 -353548
42033 -353548 71703 1617137 3335783 3497827 1465105 -1220015 -2163077 -620677 1748669
42024 1748669 2848685 2404672 1740608 1639570 1391367 235973 -1173806 -1569318 -815099
42015 -815099 109735 659969 1145977 1486523 761902 -1288032 -3212609 -3299138 -1647079
42006 -1647079 123818 960307 1205435 1468024 1767162 2035181 2444523 2713681 1961932
41997 1961932 17487 -1760626 -1861413 -460592 994106 1751209 2231770 2527426 1687261
41988 1687261 -801894 -3641679 -4806561 -3790450 -2026983 -1097186 -1168778 -1381201 -1223222
41979 -1223222 -1046571 -1322205 -1814646 -1799471 -1084635 -486147 -945188 -2258584 -3125209
41970 -3125209 -2576854 -965463 652929 1628800 1842815 1244386 -9769 -1178742 -1498874
41961 -1498874 -1173011 -1098227 -1504526 -1673040 -1332093 -1432028 -2725588 -4168269 -3841954
41952 -3841954 -1438008 1154534 2015136 1161004 -69942 -855660 -1325198 -1592900 -1402432
41943 -1402432 -864468 -636065 -814413 -273774 2033151 5237231 6876511 5418055 1947463
41934 1947463 -1105306 -2547999 -3085266 -3536552 -3360522 -1642506 903699 2014781 385495
41925 385495 -2589630 -4329594 -3981996 -2911478 -2369748 -1941908 -900542 86769 -95564
41916 -95564 -975336 -945031 341799 1575498 2033601 2546243 3461916 3303430 910683
41907 910683 -2226550 -3558247 -2789800 -1795119 -1510685 -941694 441531 1319190 541447
41898 541447 -930945 -1386046 -741958 -316124 -774758 -1494259 -1727245 -1399917 -760447
41889 -760447 38382 963104 2130400 3633027 4946571 4943132 3206180 1076325 543705
41880 543705 1987567 3586203 3158965 357708 -2906852 -4047446 -2151384 895226
41872 895226 2030024 199270 -2557059 -3693734 -3039885 -2105708 -1317462 318499 2876184
41863 2876184 4734336 4838567 4236435 4334983 4811234 4502396 3500481 2910586 2964032
41854 2964032 2824922 2218668 1911067 2302066 2683043 2391400 1839765 1810902 2336636 2818341
41844 2818341 2790780 2100277 814752 -487073 -784977 290732 1644613 1727622 348092
41835 348092 -1182904 -1755517 -1573519 -1314439 -963039 -148737 835585 1234754 985919
41826 985919 825916 999399 629662 -1022466 -3168452 -4181723 -3589963 -2611049 -2523059
41817 -2523059 -3170966 -3474907 -2866715 -1656584 -353868 685448 1108393 816578 433269
41808 433269 820003 1896800 2557830 2076053 1007131 294712 92562 81652 398527
41799 398527 1372948 2621424 3322785 3329213 3128190 2718093 1546121 -208362 -1361943
41790 -1361943 -1297826 -898915 -1146167 -1507013 -673890 1473116 3531692 4069814 2829045
41781 2829045 681534 -979302 -1082897 152809 1238591 992797 -123236 -793238 -492827
41772 -492827 440594 1788081 3256884 3668153 1918944 -1080149 -2899244 -2434343 -923368
41763 -923368 304909 1507631 3063069 3889499 2859327 835296 -358458 -546081 -1206478
41754 -1206478 -2930689 -4308656 -3754694 -1497934 742357 1589821 1199947 815688 1247553
41745 1247553 1877595 1516306 187513 -721405 -323357 736385 1628568 2572450 3789587
41736 3789587 4359308 3500380 2151419 1704911 1796609 1066845 -352154 -1047211 -825189
41727 -825189 -913335 -1513767 -1324875 -50470 721415 52234 -884813 -1037222 -1332554 -2805158
41717 -2805158 -4416662 -4478485 -3092843 -1518293 -180296 947437 1064552 -242784 -1291886
41708 -1291886 -172411 2049747 2534361 1146549 976331 3517095 5952670 5037055 1752458
41699 1752458 -214184 384625 1167399 -62675 -2526427 -4115150 -4120234 -3201652 -1761033
41690 -1761033 193318 1941245 2271224 1130645 -28646 -181015 -137783 -1088596 -2376890
41681 -2376890 -2121063 -12712 1965739 2119992 1034972 133601 -537691 -1726631 -3028815
41672 -3028815 -3260565 -2542920 -2278884 -2813173 -2758519 -1351672 -75903 -801279 -3161632
41663 -3161632 -4939986 -4628209 -2637907 -306521 1284402 1572278 563612 -1066417
41655 -1066417 -2429086 -3162244 -3395703 -3052155 -1759991 370060 2372503 3158669 2406904
41646 2406904 617546 -1330450 -2443175 -1934610 35807 2015957 2340387 873660
41638 873660 -737415 -892253 251837 1318038 1532183 1250749 896470 425678 74632
41629 74632 531362 1690405 2180128 1155743 -123496 204643 1892104 2845273 2139743
41620 2139743 1196435 1403667 2050829 1745953 827979 869861 2158521 3108279 2388609
41611 2388609 588462 -677749 -638838 163047 883428 1306960 1721865 2160938 2134682
41602 2134682 1388136 714781 1334749 3199273 4610979 4180996 2638036 1792155 2035821
41593 2035821 2058947 1102666 151464 224713 607507 -52027 -1476511 -1929113 -634247
41584 -634247 1156589 1886868 1534499 1124056 1128473 1202526 1144308 1212396 1467680 1545292
41574 1545292 1281437 977657 780017 341769 -495257 -1122244 -799239 343426 1404097
41565 1404097 1676304 1130778 149022 -697222 -755042 121102 995610 560455 -1248901
41556 -1248901 -2892057 -2911230 -1540537 -114494 739542 1556882 2758581 3760132 3760693
41547 3760693 2910324 2120566 1903587 1973025 2023968 2282309 2898065 3282642 2758731 1709516
41537 1709516 1234859 1511721 1447507 512266 -75200 866916 2182535 1527805 -1138170
41528 -1138170 -2966118 -1869981 714519 1939872 1251708 361910 249281 186837 -225578
41519 -225578 -38793 1296411 2693819 2997007 2621724 2461581 2160384 995222 -165984
41510 -165984 355081 2309812 3418284 2611158 1710503 2684657 4514603 4545225 2428692
41501 2428692 820736 1831129 4325460 5598925 4713404 3140265 2636080 3527152 4991908
41492 4991908 6156602 6633769 6418673 5579944 4122528 2294308 937719 944603 2038476
41483 2038476 2706058 1965162 721906 576087 1658117 2645717 2714714 2280724 1755959
41474 1755959 947421 188023 696321 2758479 4546449 4113257 2067613 847931 1432969
41465 1432969 2196923 1404860 -420806 -1483814 -1243538 -832166 -1167035 -1740011 -1616789
41456 -1616789 -843724 -181001 148826 589770 1169499 1239693 706257 639624 1816573 3264999
41446 3264999 3368397 2095433 850675 190143 -764759 -2254445 -2897139 -1824843 -438107
41437 -438107 -538129 -1604033 -1611212 -116270 1201666 1078570 155579 -384132 -278257
41428 -278257 248277 1186102 2269303 2687125 2071379 1201998 1020404 1316671 1020105
41419 1020105 -368992 -2073253 -2769664 -1934948 -493769 87844 -470192 -983279 -769892
41410 -769892 -1061205 -3167194 -5794950 -6096987 -3570388 -949754 -456587 -1001726 -367497
41401 -367497 1449853 2795393 3072778 2940952 2477847 1181946 -383861 -866019 -232646
41392 -232646 49131 -686068 -1345312 -991071 -355361 -615289 -1632581 -2255809 -1763692
41383 -1763692 -395376 1057894 1799289 1718447 1792790 3086611 5086835 5924608 4697051
41374 4697051 2640419 1366439 859339 121020 -944303 -1406119 -727087 614970 1695387
41365 1695387 1611288 -199225 -3165431 -5384665 -5252723 -3274196 -1376427 -521039 -30811
41356 -30811 686456 1023981 339785 -766446 -1166101 -620406 242717 948247 1439797 1581735
41346 1581735 1139796 298897 -280398 -6765 1246428 3112744 4795741 5426513 4859121
41337 4859121 3985679 3754217 3969440 3666720 2663652 1980151 2416826 3385614 3684976
41328 3684976 2964035 1783822 546674 -853105 -2320131 -3231350 -3116934 -2254010 -1326277
41319 -1326277 -773303 -639677 -758317 -859555 -704659 -273824 307109 969425 1514084
41310 1514084 1382600 321419 -644032 106855 2519078 4178819 2998698 67996 -1500914
41301 -1500914 -463361 1228919 1299784 -65333 -1162971 -1375446 -1500590 -1980299 -2214705
41292 -2214705 -1793829 -1308488 -1405130 -1697960 -1262532 37674 1273891 1570033 1155282
41283 1155282 1036893 1686116 2374681 2080011 870860 -88161 -23933 424813 29398
41274 29398 -1485626 -3168962 -4007327 -3935937 -3605275 -3434723 -3124172 -2121839 -474535
41265 -474535 1020998 1702942 1857627 2234186 2886035 3116436 2621812 1951969 1578674
41256 1578674 1284147 925555 1004347 1762510 2394133 2035523 1023084 266734 -104902
41247 -104902 -428635 -382697 417064 973510 -249696 -2780181 -4042039 -2533943 146658
41238 146658 1305831 188359 -1847668 -3297745 -3624821 -3004841 -2022585 -1461696 -1704051
41229 -1704051 -2373649 -2792982 -2467535 -1127125 932717 2442627 2193163 825636 311692
41220 311692 1112004 1447585 367727 -317735 1068341 2909069 2561456 753563 688993
41211 688993 2914415 4199180 2300347 -910433 -2469382 -2236151 -2030426 -2530150 -2996817
41202 -2996817 -3074945 -3028687 -2719128 -1843640 -835065 -313149 -31453 530106 984772 622589
41192 622589 -204399 -497108 -191094 -148819 -655624 -1045092 -909766 -705516 -924110 -1388875
41182 -1388875 -1602554 -1360105 -975361 -1144495 -2288665 -3756039 -4282019 -3693253 -3289317
41173 -3289317 -3786358 -3983783 -2773608 -1410990 -1812104 -3166710 -2658980 226611 2521649
41164 2521649 1847599 -338996 -1019984 333587 1680453 1542109 555752 115829 719396
41155 719396 1722895 1959637 598584 -2055689 -4619229 -5721080 -4874517 -2375595 893307
41146 893307 3423076 3930303 2844315 2005619 2247880 2358902 1275944 -21850 -268077
41137 -268077 -407034 -2257907 -5182077 -6406651 -4945140 -3048577 -2907585 -3767879 -3687249
41128 -3687249 -2767975 -2817074 -4323274 -5504910 -4588006 -1866252 912351 2409846 2481323
41119 2481323 1680294 637109 -180376 -563572 -588796 -423604 -81084 503752 1144635
41110 1144635 1375581 927483 102697 -529379 -702146 -493991 19925 760789 1402474
41101 1402474 1660572 1819813 2359991 2962470 2617268 1004248 -952168 -2280634 -2933114
41092 -2933114 -3070478 -2328354 -686674 709841 746038 -116124 -566714 -288573 80556
41083 80556 374429 887690 1210794 663733 -101042 392995 2025089 2838696 1842742 484315
41073 484315 454099 1422954 2008719 1763219 1029269 -88138 -1301458 -1589390 -448546
41064 -448546 974537 1322202 969033 1141717 1693374 1414529 319801 -112863 784193
41055 784193 1833180 1744364 774443 120753 455516 1482801 2354281 2269776 1166994
41046 1166994 -89411 -615181 -409147 129201 1018042 2101116 2247272 608690 -1536923
41037 -1536923 -1851619 -25117 1803423 2089866 1670374 1773753 1914412 1041662 -378502
41028 -378502 -848137 214888 2112639 3921758 4966476 4766853 3469489 1979215 938301
41019 938301 -1203 -1295725 -2520872 -2940084 -2414096 -1092010 973395 3093133 3788499
41010 3788499 2513421 744616 123346 239498 -367101 -1671845 -2245635 -1503408 -290763
41001 -290763 604496 1094891 1172254 1090385 1838911 3781833 5158590 3945378 1116036
40992 1116036 -211620 875565 2035722 1625595 1098092 2116835 3672242 3997306 3452581
40983 3452581 3299066 3071752 1604566 -294795 -715062 204845 350085 -1064653 -2296974
40974 -2296974 -1560091 881901 3444850 4699049 3869090 1209832 -1694176 -3043288
40966 -3043288 -2564225 -1406433 -493246 -60614 -537470 -2291219 -4325415 -4793646 -3310126
40957 -3310126 -1478920 -718917 -878536 -1427482 -2478541 -3806775 -4264675 -3313934 -2107695
40948 -2107695 -1923053 -2341065 -2066185 -844197 521409 1480891 1994178 1939993 1317850
40939 1317850 709411 570456 344494 -764563 -2351062 -3125288 -2638391 -1789889 -1498014
40930 -1498014 -1635308 -1543467 -1027387 -445068 -27708 554130 1741806 3159803 3533066
40921 3533066 2123898 58242 -699030 189782 1044747 624700 -212051 -97426 711205
40912 711205 1020156 794283 1156896 2536440 4009428 4485880 3674728 1971703 194916
40903 194916 -690700 -330657 641321 1490653 2221561 2953426 3203460 2749377 2477980 3132253
40893 3132253 3824624 3225779 1727407 809757 653891 242527 -344512 131538 1571602
40884 1571602 2133295 1037784 -151753 -4232 769005 867425 371088 -52888 -460782
40875 -460782 -869450 -570835 398883 461867 -1216405 -2865166 -2357722 -323961 946832
40866 946832 903678 879862 1365241 1480366 1148777 1530160 2901517 4109879 4658055 5392744
40856 5392744 6387226 6114819 3945101 1773547 1549442 2369430 1819582 -463173 -2400769
40847 -2400769 -2533119 -1802387 -1848310 -2774248 -3398428 -3041851 -2221825 -1726554 -1640862 -1460510
40837 -1460510 -836296 57515 763285 873522 159177 -1284989 -2877358 -3827292 -3808142
40828 -3808142 -3174153 -2442666 -1967822 -2231000 -3669252 -5606632 -6098200 -3956907 -658208
40819 -658208 979197 105612 -1286570 -1117538 255914 969901 294732 -623949 -418341
40810 -418341 912080 2240453 2769621 2925520 3620311 4735373 4958435 3587431 1871198
40801 1871198 1603516 2743578 3655471 3611237 3559430 4060970 4056418 2619061 647397 -407091
40791 -407091 -538276 -595457 -467764 620949 2396258 3627880 3873949 3778590 3597208
40782 3597208 2805610 1448420 544863 593130 783383 383829 -52243 299579 1072788
40773 1072788 1238484 657115 147088 168172 284239 -13777 -636250 -1225016 -1637956 -1845962
40763 -1845962 -1690731 -1046963 -101517 718436 1048312 741100 -149023 -1331524 -2229279
40754 -2229279 -2233225 -1274106 -73232 493797 353351 230133 560584 886360 752548 758509
40744 758509 1897648 3913257 5216558 4792914 3450196 2577211 2241856 1415224 -122287
40735 -122287 -1156329 -696584 535356 1036092 563364 318134 1008102 1704104 1270202
40726 1270202 237717 191444 1481519 2715101 2772725 2192332 1921649 1739998 950266
40717 950266 -123479 -605663 -610581 -988599 -1763865 -2251060 -2666066 -3962275 -5733128
40708 -5733128 -6019939 -4046754 -1639852 -840147 -1417883 -1965218 -2126206 -2168686 -1497016
40699 -1497016 454107 2570424 3301706 3034807 3138637 3115177 1262997 -1809799 -3205333
40690 -3205333 -2000863 -702204 -1151978 -1721347 -545854 932709 391586 -1230048 -1186267
40681 -1186267 511630 1273385 320854 -380659 116287 209162 -1053996 -2043436 -1304386
40672 -1304386 25705 250329 -297019 -497032 -688855 -1655274 -2550143 -1986123 -514055
40663 -514055 32324 -614265 -814959 457545 2370907 3708438 4267291 4494672 4759806
40654 4759806 5213156 5565324 4998901 3126258 943299 -69220 290403 966642 1254527
40645 1254527 1359561 1480734 1472164 1442932 1618897 1596634 839219 -121106 -243442 230586
40635 230586 5316 -1030550 -1413295 -506071 320162 -195584 -1352029 -1882367 -1950161
40626 -1950161 -2424936 -3168942 -3488724 -3556124 -3893217 -3933582 -2606508 -178337 1846025
40617 1846025 2664191 2844668 3012084 3007090 2583656 1976665 1441819 933384 465478 182045
40607 182045 -75459 -675655 -1542972 -2127224 -2108162 -1653634 -993194 -226363 548825 1440192
40597 1440192 2830918 4518681 5131651 3536627 775422 -720112 -153013 726641 339734
40588 339734 -481204 -121277 1068580 1321581 277448 -539768 -231726 148290 -512321
40579 -512321 -1543078 -1702692 -1296778 -1613570 -2626651 -2826106 -1532675 30686 571055
40570 571055 437652 647613 1223895 1645990 2168419 3282425 4305554 4035950 2713870
40561 2713870 1817859 1794938 1550877 528046 -358242 -504689 -681270 -1294787 -1155802
40552 -1155802 611947 2715767 3399357 3024533 3161113 3820371 3567202 2092727 738323
40543 738323 385856 563293 881112 1713559 2994299 3765134 3504979 2779332 2136041
40534 2136041 1447157 713657 387372 478220 437871 305757 791583 1786622 2085876 1259647
40524 1259647 610355 1450583 3412247 5210335 6115748 5933189 4572333 2616014 1491023
40515 1491023 2084878 3722746 5131872 5673689 5097246 3196042 632499 -910925 -522856
40506 -522856 762378 1567369 2073613 3188551 4657404 5330263 4712486 3050422 549944
40497 549944 -2187845 -3654946 -2920071 -1190142 -378821 -499607 -68720 1223594 2045974
40488 2045974 1616644 588164 -483695 -1855417 -3333097 -3854037 -2977408 -1547591 -357757
40479 -357757 618177 1213595 711201 -752883 -1696067 -1124509 119406 648136 216940
40470 216940 -626245 -1506776 -1908325 -967444 1171785 2598299 1624471 -885141 -2458125
40461 -2458125 -2041539 -844411 -233855 -100058 289813 798054 506643 -1000891 -2888381
40452 -2888381 -3635876 -2414675 -41690 1592861 1318824 -196070 -1328675 -1277162 -623102
40443 -623102 -320664 -628494 -1147551 -1575292 -2104112 -2989406 -3887053 -4032149 -3326156 -2804779
40433 -2804779 -3360609 -4230182 -3716521 -1601490 152829 -284890 -2320926 -3722087 -3269230
40424 -3269230 -1842425 -1011456 -1228291 -1543327 -775399 1168962 3135795 3953493 3610582
40415 3610582 2801331 1616164 -346637 -2513190 -3263543 -2029855 -421009 -227523 -1045017
40406 -1045017 -1055647 286486 1620081 1664074 767486 290038 1131932 2948207 4313452
40397 4313452 3844275 1754757 13287 228233 1695144 2409256 1670080 540566 -102582
40388 -102582 -568432 -1129537 -1129598 -24825 1555586 2490786 2356873 1486772 447147 -101220
40378 -101220 384878 1740829 3093991 3732663 3537070 2491011 599897 -1397923 -2195890
40369 -2195890 -1455276 -442678 -434590 -1139595 -1450510 -1119771 -766002 -675961 -579296 -377256
40359 -377256 -229505 -87551 91858 -92834 -882403 -1546033 -1134577 62615 826175
40350 826175 789999 846347 1567875 2308312 2327383 1870895 1550579 1449736 1469947 1796652
40340 1796652 2251194 1880909 202709 -1570865 -1646938 98573 1967367 2596105 2330276
40331 2330276 2201123 2435457 2546736 2325668 2103776 2266800 2910098 3757616 4135979
40322 4135979 3362616 1545656 -294626 -1309140 -1712075 -2104374 -2272241 -1433366 424699
40313 424699 2270563 3193648 3094178 2115430 365216 -1393539 -1841734 -766692 203686
40304 203686 -334216 -1371108 -778147 1491445 3167431 2885372 1959480 2135876 3084096
40295 3084096 3443165 3238879 3533807 4197981 3891056 2415443 1448402 2278882 4001160
40286 4001160 4771676 4045069 2752602 1862097 1618663 1885082 2407063 2741381 2482802
40277 2482802 1697050 921896 766463 1547027 3010009 4254122 4327801 3224533 1969725
40268 1969725 1416268 1294942 789780 -323591 -1516981 -2122849 -1692863 -177941 1700367
40259 1700367 2672414 2197617 1212740 924248 1235450 1265889 1085069 1658151 2978448
40250 2978448 3583994 2521178 760807 -142121 -65017 -99974 -772379 -1420651 -1293361
40241 -1293361 -527443 151571 292678 71462 -62656 96632 467911 1098899 2209148
40232 2209148 3492370 3851918 2572765 503523 -827646 -1131776 -1301501 -1493408 -775791
40223 -775791 861935 1770892 965938 -164277 138728 1351859 1655131 814794 244924
40214 244924 512068 646069 64770 -490313 -356000 95709 378158 576481 648333 160052
40204 160052 -748980 -1149343 -641285 -39214 -237169 -1159014 -2202439 -2882034 -2701918
40195 -2701918 -1367060 414677 1261530 705801 -432459 -1543409 -2889471 -4298897
40187 -4298897 -4647973 -3593229 -2563857 -2862887 -3806472 -3950529 -3208069 -2415306 -1625606
40178 -1625606 -312190 1304393 2549523 3459256 4308204 4452039 3113918 1018517 -221391
40169 -221391 -169780 344409 929681 1859945 2712724 2482092 1295974 514545 784242 1366928
40159 1366928 1698084 2163686 2899141 3265349 3124713 3288046 3976670 4095685 2877117
40150 2877117 1181613 337206 598361 1448917 2449732 3074617 2748521 1860415 1710912
40141 1710912 2584744 2952066 1616096 -412960 -1434097 -1484204 -1774786 -2420789 -2395669
40132 -2395669 -1471908 -661081 -677585 -1187989 -1623743 -1657257 -908262 685336 2147003
40123 2147003 2238523 1151341 420934 951708 2100139 2944776 3402207 3608441 3157944
40114 3157944 1747473 83250 -549699 454691 2395627 3689059 2971133 319383
40106 319383 -2484480 -3415352 -2131449 -76669 1309077 1844265 1998766 1909299 1535798
40097 1535798 1208485 1330799 1742945 1870413 1419968 643619 59853 138211 1035964 2337565
40087 2337565 3182294 2947236 1822260 611975 30233 221192 815794 1341793 1604822
40078 1604822 1644201 1351481 516055 -437669 -246642 1799541 4354191 4983211 3088802
40069 3088802 919541 824954 2209270 2429560 490327 -1565631 -1405332 614408 2186675
40060 2186675 2131003 1520213 1758626 2654250 2937483 2027406 581515 -477594 -914234
40051 -914234 -1164805 -1710565 -2499160 -2913038 -2497909 -1720588 -1481877 -1711043 -1275822 130021
40041 130021 979869 -26959 -1653714 -1567428 203593 1265609 559332 -157850 513813
40032 513813 1144969 -25452 -1775162 -1399403 1361707 4233311 5823691 6757732 7352434
40023 7352434 6582159 4124071 1499972 140519 -248305 -466989 -370829 254781 567361
40014 567361 -271619 -1691458 -2550934 -2772503 -3048738 -3460664 -3521810 -3231221 -2970904 -2549701
40004 -2549701 -1409376 225891 1343949 1431555 1031152 847162 917063 893343 674759
39995 674759 488381 580885 962110 1323503 1238083 613310 -98647 -281669 313768 1461342
39985 1461342 2671329 3408641 3346626 2592744 1552031 561144 -150828 -293243 226637
39976 226637 913606 1105146 815811 581734 466501 -25335 -964163 -1815946 -2428437 -3142748
39966 -3142748 -3565026 -2496111 111599 2284965 2263337 749697 -278590 -274544 -242691
39957 -242691 -639062 -681224 266157 1858395 3407818 4383755 4360805 3466298 2735958 2944781
39947 2944781 3257915 2298589 451514 -410969 275345 815045 -264510 -2129762 -2935687
39938 -2935687 -2186609 -867461 18219 124048 -482609 -1387403 -1928554 -1787941 -1236054
39929 -1236054 -554092 243325 867449 739252 13956 -156547 915575 2312645 2509173
39920 2509173 1074294 -1093303 -2644925 -2486051 -495517 1767744 2050383 108786
39912 108786 -1470166 -423204 2045159 2941264 1750956 919762 1944804 3191581 2580227
39903 2580227 714768 -137880 850261 2477989 3449250 3481550 2701818 1259244 -289818
39894 -289818 -1206142 -1443431 -1554151 -1557469 -735874 1072207 2728686 2932017 1643845
39885 1643845 -108775 -1413281 -1910712 -1519925 -527248 239721 176180 -115787 593540
39876 593540 2408603 3945699 4123962 3551505 3471628 3954723 4059476 3495908 3105123
39867 3105123 3549225 4330904 4465661 3619380 2266443 1104603 614803 924367 1798504
39858 1798504 2816532 3604024 3817285 3110016 1507845 -260611 -1254956 -1162330 -294388
39849 -294388 1051211 2562003 3365456 2543331 587316 -542346 490125 2809078 4485816
39840 4485816 4750822 4274309 3703905 2988912 2141089 1665138 1834937 2150568 1953431
39831 1953431 1252022 592605 320253 285502 229679 220550 577609 1363499 2083303 2142655
39821 2142655 1668916 1544978 2317082 3285502 3143512 1544913 -377405 -1239887 -841286
39812 -841286 -64157 441424 932910 1740943 2267635 1509706 -423754 -2027256 -1980608
39803 -1980608 -463361 1526024 3480055 5231969 6121329 5572300 4360953 3976230 4519326
39794 4519326 4542232 3386580 2274777 2252055 2383319 1309799 -357321 -777023 447460
39785 447460 1886929 2479567 2627831 2872201 2832927 2128799 1401118 1570601 2476738 2957851
39775 2957851 2282890 1130692 940716 2260368 3929708 4277199 3079703 1746571 1464724
39766 1464724 1990595 2612884 3255273 3854130 3674599 2415819 1190127 1057323 1281456
39757 1281456 630160 -168457 728792 3048070 4137035 2504396 -152268 -1276119 -377246
39748 -377246 1197349 2139998 1937293 827119 -139351 135054 1359886 2157545 2208374
39739 2208374 2719526 4075311 4610880 2913917 4961 -2137690 -3072595 -3492051 -3441082
39730 -3441082 -2605234 -1537629 -914724 -241240 1064749 2023001 1402703 98563 77102
39721 77102 1238670 1615041 765049 525831 1724290 2487256 1147120 -1005420 -1566164
39712 -1566164 -448869 264488 -622059 -2036390 -2320147 -1240965 -32750 127601 -532818
39703 -532818 -629704 626813 2249555 2697598 2027391 1741155 2420753 2820897 1855906
39694 1855906 262883 -624006 -796446 -1164213 -1875653 -2222123 -1910518 -1346773 -708283
39685 -708283 320320 1710535 2682491 2460522 1160407 -212790 -561744 396045 1872575
39676 1872575 2790441 2858193 2608868 2436529 2188709 1887753 2157884 3429155 5158606
39667 5158606 6333019 6467424 5808697 4935214 4432864 4515499 4708353 4438171 4106023
39658 4106023 4726017 6131768 6644013 5329779 3537231 3016502 3450484 3411047 3072124
39649 3072124 3916518 5768507 6322404 4455730 2218878 2192551 4136672 5855206 6561644
39640 6561644 7472140 9136294 10105548 9086113 7094848 6205173 6785518 7334073 6945567
39631 6945567 6542426 7117937 7890848 7290187 5261854 3482980 3379604 4860164 6962532
39622 6962532 8715248 9224820 8112039 6447212 6241831 8150245 10387415 10852434 9802800
39613 9802800 9414512 10972871 13526402 15332474 15717819 15207789 14452686 13557301 12407209
39604 12407209 11329794 11015938 11530241 11863272 11253181 10651436 11602748 13587531 14119714
39595 14119714 12182008 9890552 9521488 10472586 10904770 10960037 11982481 13457733 13499869
39586 13499869 12185495 11602347 12220765 12007405 10120229 8857327 10268221 12889541
39578 12889541 13867097 12904352 12040684 12412956 13260715 13772682 14151000 14788232 15662637
39569 15662637 16673961 17706391 18370022 18364931 18003429 17865690 18168762 18820696 19628337
39560 19628337 20136205 19974415 19762866 20758107 23055064 25177774 26151185 26799457 28070999
39551 28070999 29384715 29932883 30403615 31818565 33711059 35243200 37196406 40791890
39543 40791890 45236524 48745616 51627947 55850037 61458300 66025738 68365346 70533823
39535 70533823 75062448 81979420 89661826 97065625 103958243 110320627 116793109 124694016
39527 124694016 134430065 144606761 153519770 160742183 166684754 171774064 176927912 183634780
39519 183634780 192321356 201420824 209165556 215676133 222326936 229715226 237280743 244435028
39511 244435028 251107242 257422924 263411811 268714403 272466396 274338357 275763456 278636233
39503 278636233 282302854 283727322 281758513 279190954 278622478 277971890 272839936 262466538
39495 262466538 250408607 239355174 228164053 214847455 200009682 185706790 172376277
39488 172376277 158665403 143886249 129395771 117329516 108372535 100998114 93102870
39481 93102870 84366674 76352235 70026214 64311071 58002870 51931293 47606139 44544028
39473 44544028 40949601 36724104 33660274 32483405 31695917 29830356 27099568 24306910
39465 24306910 21801520 20044633 19489331 19254737 17652361 14770246 12749770 12621988
39457 12621988 12759000 11607350 10036656 9476611 9523783 9223843 9150350 10100013 10967857
39448 10967857 10187272 8413838 7533813 7662909 7435496 6851869 7386344 9189519 10436144
39439 10436144 9885507 8245658 6609680 5275326 4520299 4810125 5628139 5608601 4429659
39430 4429659 3226717 2716762 2448515 2404736 3555999 5836151 7160576 5839909 2939957
39421 2939957 979597 1012136 2043552 2677865 2335109 1320995 514376 644883 1441045
39412 1441045 2042155 2447014 3541681 5334528 6479078 6241684 5577920 5359031 5039204
39403 5039204 4322744 4505520 6257856 7419941 5471213 1547448 -548624 732689
39395 732689 3147220 4247694 4096400 3717731 3175947 2466319 2472931 3514811 4290804
39386 4290804 3757193 2941150 3382207 4726393 5497696 5523304 5797004 6309857 5889807
39377 5889807 4305038 2853244 2453397 2590264 2703081 3255233 4545052 5525567 4910095
39368 4910095 2861016 669803 -751057 -1228036 -771578 214610 520336 -742854 -2520987
39359 -2520987 -2616821 -554112 1496776 1381048 -408708 -1720223 -1581915 -780989 -6903
39350 -6903 1068383 2616757 3863778 4153440 3955697 4093465 4550682 4724051 4392414
39341 4392414 3760571 2918590 1958036 1342746 1439241 1841253 1848379 1498716 1425853 1756711
39331 1756711 1907305 1531745 927299 335478 -421671 -1322928 -1850891 -1713091 -1281393
39322 -1281393 -872680 -127563 1345739 3099046 4169112 4012751 2683032 452976 -2119088
39313 -2119088 -4007272 -4343214 -3280967 -1764492 -489987 398009 705523 55632 -1401347
39304 -1401347 -2722632 -2985194 -2063098 -457229 1204698 2303734 2402320 1677106 804715
39295 804715 107283 -701387 -1545109 -1476716 33960 1818975 2128579 848007 -552889
39286 -552889 -1230203 -1703590 -2074872 -1194540 1319382 3637888 3935468 3171032 3748918
39277 3748918 5752735 6572345 4576011 1268448 -958706 -1616829 -1620301 -1365971 -717806
39268 -717806 -96846 -196225 -905052 -1468378 -1426221 -735078 470506 1500897 1224427 -501150
39258 -501150 -2196916 -2565263 -2153319 -2045224 -1800495 -331994 1830495 3082305 3209278
39249 3209278 3272340 3168942 1649046 -860589 -1856913 -210229 1987088 2270311 826415
39240 826415 -590542 -1145227 -851949 507605 2661074 4115251 3828770 2776954 2375203
39231 2375203 2323326 1650095 889636 1226542 2161402 2124912 1061377 387304 586423 845584
39221 845584 986588 1682576 2634926 2627478 1743476 1494925 2240375 2504911 1575683 747165
39211 747165 1011270 1464207 1275342 1430626 2928601 4726066 5231960 4702501 4362179
39202 4362179 4052060 2685067 570161 -593182 -71542 987672 1167007 289254 -741361
39193 -741361 -857378 269721 1656327 1798185 660672 50101 1040968 2076771 1188057
39184 1188057 -758068 -1141778 359721 1177269 -205571 -1910088 -1459036 697601 1992095
39175 1992095 1186985 -451835 -1133697 -550045 225342 256494 -66000 534645 2342926
39166 2342926 3610883 2378382 -706039 -2727940 -2162522 -817086 -1144260 -2850249
39158 -2850249 -3673840 -2749484 -1391611 -717186 -293598 461689 1112596 1257719 1550883
39149 1550883 2586935 3546418 3131093 1471725 -33299 -676536 -1095834 -1738787 -1781509
39140 -1781509 -344784 1846037 2962129 2138441 322032 -1013717 -1345209 -1014248 -272522
39131 -272522 916726 2253914 2985388 2788531 2427821 2951796 4178242 4548511 2950071
39122 2950071 337914 -1199156 -995524 -575872 -1450995 -2964339 -3229729 -1755412 10969
39113 10969 775915 927647 1529939 2649957 3406926 3246062 2470459 1600681 687348 -597270
39103 -597270 -2243040 -3341173 -2608547 81350 2994230 4160521 3665402 3406932 4437801
39094 4437801 5613301 5360391 3817738 2510440 2646210 4404034 7167891 9719714
39086 9719714 10889462 10798139 10854309 11890947 13164671 13957679 15031678 17264997 19902313
39077 19902313 21765811 23386613 26071945 29427437 31937796 33829632 37042719 41948385
39069 41948385 46249831 48027481 48141120 48578263 49810241 50811956 50565789 48624400
39061 48624400 45194711 41463439 38835864 37126796 34562090 30263714 25546010 21985587
39053 21985587 19547350 17592641 16270477 15498134 13863010 10369376 6520520 4859395
39045 4859395 5767870 7221938 7449062 6421948 4960450 3806223 3597011 4503018 5741094
39036 5741094 6329578 6217224 5872830 5215759 4062001 3178480 3507432 4556298 4960902
39027 4960902 4521720 4177822 3967107 2752993 448879 -1088954 -283929 2153852 4288602
39018 4288602 5148407 5044803 4452829 3517796 2382770 1320866 563106 193388 32075
39009 32075 -333096 -962350 -1084051 141575 2304136 3883515 3926286 3008455 2333481
39000 2333481 2400464 2751610 2594730 1564568 216794 -334850 317519 1262456 1466504
38991 1466504 1122655 1007963 1074977 869491 857028 1760580 2800968 2455441 1139086
38982 1139086 1120735 3118908 4950737 4678616 3324065 2931720 3376868 2964313 1332781
38973 1332781 -112608 -321866 417491 1462123 2395240 2629835 1633193 -268646 -2119016
38964 -2119016 -3353288 -3909805 -3589430 -2236247 -467006 674616 839268 468190 -97981
38955 -97981 -794991 -1193067 -621915 810636 2019736 2103943 1301950 571847 489144 709946
38945 709946 429628 -607735 -1607404 -1559187 -576961 192923 184791 167847 953890 2161919
38935 2161919 2950536 3226712 3263901 2822663 1768448 1070811 1871364 3621782 4319196
38926 4319196 2829106 179804 -1624342 -1480085 144108 1822575 2396830 1958238 1509426
38917 1509426 1502138 1319676 607678 199547 826923 1714948 1622613 665154 -132666 -522316
38907 -522316 -901604 -1045082 -551789 -167599 -905147 -2042905 -1868282 -404624 568624
38898 568624 388316 293351 898971 1124360 521802 502920 1906375 3201429 2680420 914403
38888 914403 -552341 -1517984 -2389938 -2456789 -966027 938332 1449221 767629 549605
38879 549605 982974 477884 -1559382 -3493711 -3605171 -2194739 -949960 -1002610 -1966808
38870 -1966808 -2415689 -1363944 312732 496434 -1426894 -3325452 -3074461 -1664943 -1722797
38861 -1722797 -3449515 -4310538 -2907121 -883090 -254126 -843278 -1445954 -1841397 -2318565
38852 -2318565 -2512269 -2067690 -1462875 -981060 88164 1917550 2885548 1550146 -802816
38843 -802816 -1438139 202845 1898447 1790071 486063 -450777 -662938 -758296 -865331
38834 -865331 -439942 822376 2517448 3804163 3863215 2436728 236150 -1483899 -2043214
38825 -2043214 -1806291 -1445674 -1183037 -982337 -954444 -1069266 -808570 296862 1867025
38816 1867025 2907619 2900638 2305301 1912889 2050103 2582967 3385379 4370955 5007035 4215628
38806 4215628 1309659 -2821426 -5919013 -6288443 -4469624 -2563929 -2003115 -2570948 -3532819
38797 -3532819 -4648015 -5519464 -5007592 -2531192 538668 2165698 2220596 2297107 2795189
38788 2795189 2029606 -744479 -3116212 -2274388 859173 2489434 943267 -1365777
38780 -1365777 -1645620 -383344 157581 -370152 -257255 1219167 2646492 2688169 1847192
38771 1847192 1290472 1096820 668200 131230 195676 885473 1439124 1522363 1648422 2124205
38761 2124205 2385273 1926311 1268361 1190867 1333985 572659 -1126996 -2246302 -1645605
38752 -1645605 -149833 630020 517012 745822 1890688 2951580 2763891 1377233 -417857
38743 -417857 -2135258 -3542150 -4172418 -3653535 -2265315 -632333 878534 1965568 1944624
38734 1944624 214426 -2823836 -5802341 -7428404 -7310585 -5974692 -4420478 -3482359
38726 -3482359 -3205076 -2858383 -1760411 41242 1956420 3310483 3490721 2309406 657112
38717 657112 109750 1182111 2510747 2556930 1612112 1162793 1673489 2136888 1690624
38708 1690624 595064 -405746 -726887 9433 1529834 2533939 1911684 425728 -24925
38699 -24925 1016613 2039342 1894585 1151669 558783 -234809 -1384943 -1745755 -520801
38690 -520801 1026413 1121922 64782 -364085 323330 825870 341091 -222438 237919
38681 237919 1439973 2214898 1854247 557430 -908783 -1709782 -1542710 -934470 -663680
38672 -663680 -933438 -1405259 -1764051 -1784070 -1230758 -377445 -227183 -1333504 -2685124
38663 -2685124 -2788802 -1728947 -1067522 -1697937 -2904513 -3638177 -3543389 -2495524 -407044
38654 -407044 1960625 3117863 2493417 1117124 123215 -469565 -903111 -765583 90445
38645 90445 682190 157009 -728688 -585172 624221 1730562 2105182 2048477 1701934 876878
38635 876878 -34370 -201787 406664 989410 1283138 1889228 2952135 3612395 3263092
38626 3263092 2389598 1602772 735535 -446354 -1471844 -1875793 -1952335 -1958698 -1284377 500418
38616 500418 2280559 2379204 814650 -619634 -685511 -52739 -35315 -975762 -2365597
38607 -2365597 -3694279 -4518264 -4358898 -3278592 -2135361 -1631714 -1494108 -1160395 -772302
38598 -772302 -745788 -865115 -787887 -1066149 -2417265 -4076563 -4300922 -2821723 -1376940
38589 -1376940 -1138048 -1008516 385633 2204517 2505830 1179170 -3275 -90746 76557
38580 76557 -152038 -68664 774911 1271952 349564 -1079873 -1117069 606771 2607584 3558172
38570 3558172 3536281 3244410 2973806 2656555 2298590 2018061 1963080 2261509 2746677 2856860
38560 2856860 2296449 1694552 1976942 3062304 3868488 3767048 3306029 3151543 3033806
38551 3033806 2359837 1348142 750143 658092 419159 -197615 -551126 -249770 -112091
38542 -112091 -1268806 -3440809 -4845392 -4123694 -1934403 -211331 -69703 -946395 -1754392
38533 -1754392 -2250522 -2891906 -3731960 -4077269 -3334465 -1798887 -302261 796518 1915947
38524 1915947 3388852 4584560 4403436 2742330 928499 271922 578177 673293 82183
38515 82183 -605827 -897339 -977355 -1035034 -962629 -966763 -1467757 -2011872 -1433606 238449
38505 238449 1250159 537378 -420186 453691 2863347 4704944 5001773 4510573 3737401
38496 3737401 2353433 764007 335516 1426327 2705000 3044532 2728713 2255381 1446613
38487 1446613 449697 130539 616999 854706 447269 397394 1078925 1280168 587546 737859
38477 737859 2629510 3832249 1767517 -1886231 -3059142 -1015245 971543 751591
38469 751591 -78370 510413 1937779 2679228 2635531 2259454 1253566 -182228 -446174
38460 -446174 1335222 3576135 4358876 4106985 4302243 4593067 3345470 594480 -1596518
38451 -1596518 -1697643 -65029 2110731 3679376 3586247 1800751 210654 819572 2836894
38442 2836894 3403187 1681111 220884 1208716 3235401 3547892 2223130 1878018 3600105
38433 3600105 5371361 5068956 3295563 2084909 1880951 1314900 -281250 -1666798 -1584516
38424 -1584516 -785151 -991766 -2198203 -2349063 -132578 2972175 4344057 3332666 1697589
38415 1697589 1172083 1669878 2050379 1663972 661890 -489731 -1174443 -765791 743170
38406 743170 2419898 3164537 2705603 1556978 261970 -895685 -1641198 -1714720 -1165035
38397 -1165035 -291680 681186 1555352 1920263 1493569 733457 523110 1014130 1338342
38388 1338342 858257 170676 237911 906819 1146923 666272 334503 739936 1218721 904118
38378 904118 73247 -315832 -25693 330338 392903 528837 1144337 2088842 2855038 3054763
38368 3054763 2757492 2572998 3049903 3675978 3131559 1219502 -225676 470094 2303556
38359 2303556 2811252 1505439 249437 126053 78749 -591167 -515825 1454742 3867523
38350 3867523 4406067 3056401 1814739 1848627 2494575 2654009 1839693 225232 -1199845
38341 -1199845 -1102865 416815 1346816 422266 -738696 33334 1971878 2588585 1752926
38332 1752926 1720398 3054074 3557039 2124772 825640 1548673 2831237 2028222 -858535
38323 -858535 -3456549 -4154546 -3273572 -1815482 -552344 58054 213381 674004 1576227
38314 1576227 2013178 1556222 1291398 2343178 4162965 5299456 5114441 3776781 1476157
38305 1476157 -1155808 -2678903 -2293919 -1111398 -710893 -969681 -601257 660235 1810180
38296 1810180 2207588 2152825 1990442 1753099 1543462 1349604 797026 -103624 -591235 -468431
38286 -468431 -844453 -2264839 -3186698 -2186149 -771383 -1566605 -4074667 -4964710 -2877038
38277 -2877038 -277228 351657 -290239 -305458 318733 468635 272476 681992 1440963
38268 1440963 1297001 27144 -1144952 -1194912 -432910 38245 -559050 -1957394 -2880483
38259 -2880483 -2163211 -157451 1497067 1789941 1286849 800160 160668 -883477 -1528163
38250 -1528163 -907639 328648 721699 78839 -362077 94782 560674 -124343 -1784887
38241 -1784887 -3118489 -3161942 -2166420 -1089316 -435055 205897 1318342 2430579 2552077
38232 2552077 1695228 1108694 1508772 1880295 901629 -990931 -2064657 -1626402 -755143
38223 -755143 -552761 -759195 -617510 -214808 -145561 -395608 -509941 -647991 -1442962 -2640591
38213 -2640591 -2878870 -1464020 325905 605081 -783129 -2233724 -2571863 -2232082 -2067736
38204 -2067736 -2062137 -1780850 -1257013 -756470 -332903 -211278 -836349 -1818397 -1705421 184299
38194 184299 2469037 3402531 3130070 2864305 2536368 1151254 -779028 -1271382 256664
38185 256664 1973385 2184081 1348847 737440 463030 -105599 -998330 -1722940 -2004644
38176 -2004644 -1737263 -871737 127150 498433 323628 562124 1480084 2020717 1288016
38167 1288016 -292578 -1778611 -2635162 -2453129 -1083417 344150 66674 -1704766 -2355990
38158 -2355990 -322969 2408256 2784357 548170 -1984755 -3079847 -2845747 -2066816 -1453068
38149 -1453068 -1627734 -2478859 -2981303 -2750252 -2853503 -3801252 -4070015 -2579303 -1354760
38140 -1354760 -3034042 -6421140 -7576022 -5323225 -2577698 -1639497 -1367382 -392035 -107868
38131 -107868 -2047635 -4357663 -3785506 -317874 2720846 2998734 1444881 53517 -578177
38122 -578177 -845860 -869771 -727574 -983817 -1859127 -2454590 -1943754 -1181805 -1771206 -3460679
38112 -3460679 -4017645 -2388288 -493063 -508143 -1562920 -1125779 1002093 2481387 2179069
38103 2179069 1520262 1514628 1119888 -157309 -619727 706675 1755447 455231 -1742409
38094 -1742409 -2149881 -1200135 -1337922 -2455713 -1917783 921231 3522359 4049361 3574270
38085 3574270 3553755 3689559 3452953 3544521 4453719 5158648 4498165 2750619 1099077
38076 1099077 506849 1378593 3105967 3909665 2642182 705771 408758 1527773 1692477
38067 1692477 249983 -830720 -407968 155015 -311387 -961398 -1014268 -1267860 -2159885
38058 -2159885 -2526315 -1715276 -841938 -570665 154927 1712923 2465064 1512176 460990
38049 460990 556083 433337 -1071012 -2254180 -1330748 233587 110709 -946986 -671329
38040 -671329 649434 888281 -193905 -1120367 -1762929 -3027688 -4047340 -2931909 -171398
38031 -171398 1698511 1830970 1694837 1993676 1788570 905072 505605 849080 900290 496905
38021 496905 544246 775097 -251141 -2498240 -4142303 -4370004 -4244316 -4373922 -4041860
38012 -4041860 -3178596 -2905835 -3468784 -3768542 -3518444 -3710196 -4417948 -4413295 -3564260 -3281326
38002 -3281326 -3875453 -3831679 -2488129 -1044721 -93627 1311145 3162734 3794696 2920616
37993 2920616 2617192 3690631 3850334 1563198 -869476 -627249 1327072 1966615 640254
37984 640254 -850482 -1388246 -1204658 -312601 1349951 2818632 3154229 2996990 3369297
37975 3369297 3761567 3112655 1722202 399857 -1218213 -3542385 -5294315 -5063781 -3672742
37966 -3672742 -2785504 -2133550 -574555 1019920 848572 -337841 42419 2121537 3081160
37957 3081160 1517944 -506878 -741248 429880 1600445 2538935 3348293 3338494 2359156
37948 2359156 1826305 2821232 4182612 3911274 1715955 -1034164 -3186128 -4449055 -4688999
37939 -4688999 -3774123 -2079852 -455765 349641 128259 -529359 -447134 867083 2081751
37930 2081751 1259309 -1437939 -3489758 -3152870 -1641087 -1153913 -1844221 -2213757 -1819271
37921 -1819271 -1811876 -2777047 -3630145 -3232886 -2020633 -1286573 -1517963 -2158472 -2615244 -2792069
37911 -2792069 -2758900 -2509975 -2129901 -1758653 -1262379 -327780 885089 1506174 753921
37902 753921 -1103355 -2853251 -3404766 -2649229 -1421440 -760130 -987228 -1336341 -807137
37893 -807137 397832 831052 -317010 -1901082 -2204924 -1134177 20793 579461 868398
37884 868398 847206 8509 -1130904 -1152578 43265 716368 -222310 -1712342 -2463332
37875 -2463332 -2779854 -3207726 -2901437 -1079807 971956 1190126 -596158 -2813107 -4342982
37866 -4342982 -5127103 -5236668 -4849338 -4568661 -4385068 -3112798 -380844 1811383 1458847
37857 1458847 -392817 -1141166 -444466 -84137 -553221 -585886 9946 -42936 -765371 -692193
37847 -692193 66089 -515945 -2737601 -4159710 -3538434 -2816046 -3415906 -3455431 -1112536
37838 -1112536 1679972 1877509 -72281 -1352645 -1329529 -1787828 -3111673 -3349524 -1452390
37829 -1452390 996847 1961104 1133455 -535373 -2041864 -2611521 -1906624 -329695 1505089
37820 1505089 3350338 4671031 4228230 1652751 -1243179 -2335581 -1858169 -1507521 -1476521
37811 -1476521 -543917 1154362 1948102 1504523 1373701 1971429 1534265 -699088 -2629012
37802 -2629012 -2357096 -1106104 -989797 -1534561 -931740 409243 459973 -641196 -357820
37793 -357820 2172493 4424173 3997828 1815942 334509 140651 90331 -216381 -49862
37784 -49862 727994 1300038 1310803 1226621 1117930 419834 -774465 -1476656 -1365198 -1338816
37774 -1338816 -1828396 -1847277 -776034 103051 -628206 -2053724 -2062870 -642792 -22406
37765 -22406 -1214037 -2333233 -1344168 974403 2143763 1213959 -452210 -1227576 -879925
37756 -879925 -269653 -337077 -1483817 -3253848 -4477992 -4260123 -2985401 -1969148 -1944320
37747 -1944320 -2173499 -1281783 1072306 3493472 3994460 1965692 -1164244 -3430761 -4182216
37738 -4182216 -3990463 -3167456 -1437841 813118 2155967 1709324 361937 -427403 -539877
37729 -539877 -973557 -1941208 -2234903 -842603 1446008 2711531 2161757 1154779 1462205
37720 1462205 2751594 2751768 322767 -2662880 -3554389 -2305237 -1175447 -1442269 -2145443
37711 -2145443 -2144164 -1517047 -395709 1689691 4281513 5460715 4165803 1797930 303380
37702 303380 -73464 126215 1201113 3149229 4132243 2371687 -948159 -2765189 -1899627
37693 -1899627 97879 1552252 2138828 1872371 730450 -411543 -331532 620942 800155
37684 800155 -192625 -942061 -630770 -256272 -785530 -1765898 -2547173 -3259126 -3658132 -2608408
37674 -2608408 102236 2780366 3872186 3779842 3468126 2613655 700694 -1154111 -1336572
37665 -1336572 -109299 860822 968680 1000486 1224874 926714 30861 -443794 -86203
37656 -86203 107117 -637755 -1558745 -1607994 -1204639 -1611774 -2908937 -3718317 -3104433 -1840292
37646 -1840292 -1277766 -1571485 -1804777 -1635307 -1815721 -2751212 -3428431 -2610658 -632804
37637 -632804 952594 1354329 1172605 998555 486228 -680068 -1754492 -1637796 -209135
37628 -209135 1674940 3267452 4466511 5332329 5519627 4447550 2123957 -292222 -1256696
37619 -1256696 -564812 194870 -357199 -1402227 -1046088 830445 2312296 2230176 1646831
37610 1646831 1933498 2813364 3304578 3348589 3238961 2442727 479500 -1655090 -2435758
37601 -2435758 -1860602 -1234063 -1167254 -1153167 -971858 -1021575 -1092874 -264492 1501740 2900375
37591 2900375 3046628 2629763 2556185 2447463 1562729 507493 636268 1846667 2321786
37582 2321786 1013906 -595192 -208364 2194459 4098770 3508037 1281483 -216804
37574 -216804 -15275 966274 1823665 2590116 3092364 2447010 611747 -686825 121743
37565 121743 2134070 2861396 1323989 -821633 -1335257 327419 2947978 4911022 5286257
37556 5286257 4221207 2785256 2127410 2397047 2597944 1700645 -176883 -1788404 -1918660
37547 -1918660 -530834 1210118 2098236 2002214 1671767 1652828 1892541 2303989 2921386
37538 2921386 3335673 2934103 2160379 2458320 4063197 4881151 3023121 -151958 -1305821
37529 -1305821 575684 2942019 3275905 2242392 2065925 2998436 3121630 1355967 -943074
37520 -943074 -1846651 -1243593 -605013 -910372 -1675248 -1969247 -1592248 -915009 -189996 351029
37510 351029 139268 -1087038 -2371554 -2318713 -1068613 -443333 -1496108 -2920970 -2917383
37501 -2917383 -1795979 -1276248 -1606132 -1146655 870792 2805404 2760756 1155312 -47020
37492 -47020 -8664 412477 589378 1204865 2832175 4422350 4294275 2447936 914966
37483 914966 1470069 3648712 5545812 6047803 5490053 4415491 2794391 752840 -867533
37474 -867533 -1342805 -970434 -592107 -578170 -745487 -914981 -1047546 -1076396 -1007284 -966148
37464 -966148 -905988 -617376 -202211 9378 211640 1007328 2166315 2487541 1645472 1224252
37454 1224252 2784903 5507974 6931286 5709074 2681783 -371222 -2029449 -1764535
37446 -1764535 -400745 215498 -852370 -2266291 -2075588 -387908 903211 767169 -29628
37437 -29628 -505797 -479951 15275 847034 1226678 548101 -135066 845405 3033336 4047080
37427 4047080 3047153 2006338 2543046 3406030 2609898 586074 -554914 27420 1350462
37418 1350462 2400264 2916318 2682541 1460600 -278139 -1539276 -1888642 -1796939 -1941965
37409 -1941965 -2560663 -3342146 -3715009 -3486973 -3216892 -3430848 -3587814 -2788206 -1555066
37400 -1555066 -1586032 -3251379 -4657894 -4029265 -1950274 -396542 -477476 -1896814 -3637041
37391 -3637041 -4405347 -3479381 -1894888 -1609185 -2733838 -3121752 -1683228 -213867 -345638
37382 -345638 -662082 789893 2716456 2270425 -359489 -2185021 -1965160 -1361314 -1305037
37373 -1305037 -445738 1726461 3084516 1909324 -387305 -1407974 -1028615 -686424 -697547
37364 -697547 -297216 337638 50808 -1350647 -2572438 -2474480 -1262653 152115 1205123
37355 1205123 1764983 1665814 643176 -1176117 -2934623 -3641582 -3358882 -3331684 -4380920
37346 -4380920 -5584971 -5402495 -3829182 -2364981 -1859260 -1560223 -587362 745347 1590712
37337 1590712 1674551 1177533 230344 -871149 -1437330 -891029 696650 2646426 3908404
37328 3908404 3533983 1716287 206271 654142 2505388 3636866 3145169 2226225 2085908
37319 2085908 2443009 2583453 2399165 1689755 -2525 -1897846 -1946429 291302 2167957
37310 2167957 1176932 -1402138 -2180659 -394134 1300574 795950 -842555 -1387232 -400166
37301 -400166 849000 1332254 1046417 348988 -617705 -1853178 -3168574 -3958403 -3509726
37292 -3509726 -1916417 -432685 -250235 -1024336 -1358546 -708072 108462 437589 792223
37283 792223 1782690 2878010 3016603 1982026 461422 -923951 -1954651 -2459829 -2415559
37274 -2415559 -2311927 -2653858 -3071577 -2754161 -1930212 -1901612 -2998849 -3462915 -1519166
37265 -1519166 1907578 3873215 2806180 21223 -2276543 -3155110 -2714855 -1203483
37257 -1203483 611337 1384338 783504 252249 913429 1639336 795209 -873234 -1041403
37248 -1041403 857412 3073730 4213822 4439304 3909756 2231084 -23654 -1309241
37240 -1309241 -1347383 -1452587 -1949726 -1440789 380181 1522178 782567 -158906 462448
37231 462448 1673171 1867944 1803617 2933772 4337445 4121696 2683526 1692377 874879
37222 874879 -1039515 -2992083 -2759830 -1132242 -1163933 -3005752 -3380300 -1113462 761062
37213 761062 127839 -709876 807365 2996790 2788874 741263 -292378 24919 -384980
37204 -384980 -1840860 -2329599 -1181288 -216528 -565105 -920283 19951 1448296 2034271
37195 2034271 2061534 2601119 3521201 3648303 2532620 1062957 343003 516044 811301
37186 811301 555755 -23177 -222801 -80591 -569447 -2143321 -3684519 -3711347 -2298991
37177 -2298991 -896098 -374901 -206838 350032 1135371 1480182 1119339 402493 -57252
37168 -57252 170287 943079 1645291 1964359 2332581 3159628 3966435 3952840 3164376 2284390
37158 2284390 1427927 91439 -1658039 -2934088 -3259033 -3182459 -3265242 -3198659 -2477293
37149 -2477293 -1376490 -633942 -457821 -383207 -3948 528895 744065 391578 -326931
37140 -326931 -1091094 -1912735 -2899562 -3528555 -2864690 -1036659 202656 -607101 -2507858
37131 -2507858 -3056134 -1327567 1128278 2416400 2199580 1189810 -44120 -1115113
37123 -1115113 -1570640 -1310486 -706322 16421 824078 1200848 544479 -479293 -358512
37114 -358512 915089 1482937 549888 -44349 1277321 2971301 2607500 817797 358733
37105 358733 1712633 2469227 1311114 -198483 -676502 -1133076 -2592042 -3689205 -2707836
37096 -2707836 -527634 636512 512427 625393 1370099 1407560 70715 -1539298 -2350009
37087 -2350009 -2689064 -3197033 -3591329 -3343629 -2748619 -2466843 -2462142 -2082862 -988200 454557
37077 454557 1568888 1934762 1719992 1550867 1838151 2230176 2062576 1335794 795900
37068 795900 963986 1554749 2021070 2215000 2237683 2000419 1285808 107045 -1171843
37059 -1171843 -1976135 -1799293 -618143 914832 1951555 2174015 1856083 1344047 867969
37050 867969 740372 1119459 1454228 785603 -1040916 -2878122 -3389403 -2434307 -1040363
37041 -1040363 -168291 169311 530016 978605 694013 -1038062 -3518117 -4972654 -4535654
37032 -4535654 -3216294 -2318339 -1715240 -733941 28441 -577579 -2017293 -2473972 -1699784
37023 -1699784 -1450300 -2390674 -2659550 -840278 1521879 2272345 2054310 3007629 4907183
37014 4907183 5226438 3046852 491210 -331385 198218 670213 849265 1145292 1116455
37005 1116455 10175 -1724370 -2767902 -2742923 -2762150 -3911613 -5680772 -6267753 -4456077
36996 -4456077 -1055634 1732359 2426104 1436290 80001 -895869 -1319603 -868142 620700
36987 620700 2351583 3075526 2432522 1147776 104068 -77027 1013735 2941343 4046599
36978 4046599 3023809 881397 66743 1539474 3925772 5591997 6110267 5516190 3819444
36969 3819444 1853685 1061877 1617709 2075738 1622558 1246000 1767553 2198227 1276065
36960 1276065 -596011 -2189250 -3058666 -3057049 -1523195 1432370 3875904 4058450 2731534
36951 2731534 1796401 1469705 736716 -62628 528090 2320593 3269911 2507769 1627211
36942 1627211 2180926 3512368 4006502 3292709 2292008 1901054 2311878 2988748 2903399
36933 2903399 1449571 -643173 -2026785 -2413773 -2601628 -2831243 -2437988 -1453260 -1101679
36924 -1101679 -1916371 -2572326 -1655501 244240 1295254 773685 -301232 -575625 386225
36915 386225 2053800 3452378 3794408 3078464 2096828 1681972 2059775 2930449 3796001
36906 3796001 4117842 3594925 2467073 1238169 119523 -848866 -1314387 -952092 -216160
36897 -216160 76018 -37140 282261 1296808 2309164 2827387 3119382 3355026 3271527
36888 3271527 3046796 3337256 3937424 3664287 2337416 1581071 2506325 3666486 2788628
36879 2788628 -38334 -2313761 -2068078 232286 2565494 3217037 1939502 110862
36871 110862 -391774 836713 2142218 1842891 391931 -348826 417138 1687455 2150687
36862 2150687 1397334 -190441 -1732783 -2120721 -1038459 253429 177151 -1032891 -1547199
36853 -1547199 -564391 389877 -563913 -3158226 -5225358 -5082121 -3042138 -706307 698196
36844 698196 1092679 927717 282200 -950238 -2112037 -1905343 -3884 2144865 2981599
36835 2981599 2845690 3289765 4610071 5298400 4207091 2160893 783725 456682 223539
36826 223539 -598652 -1476054 -1444642 -371734 967032 2000282 3019226 4308565 5096652
36817 5096652 4358262 2622036 1713599 2248501 2722051 1983328 1208481 1891280 3022428
36808 3022428 2384150 141555 -1136391 -112962 1836908 3199404 4198055 5227742
36800 5227742 5462340 4420973 3344832 3445760 3969850 3576919 2671125 2683237 3706570
36791 3706570 4499593 4383712 3523254 1689104 -1413718 -4516192 -5306623 -3213923 -354601
36782 -354601 956001 553959 -323071 -976122 -1428150 -1481631 -837233 77979 442912 269040
36772 269040 462842 1417265 2223248 1764841 215731 -1099255 -1215219 -402570 479240
36763 479240 942692 911947 314325 -772754 -1773617 -2065907 -1830127 -1896181 -2608077 -3349781
36753 -3349781 -3392187 -2721415 -1789854 -958941 -518947 -733637 -1372776 -1634616 -1134179 -645473
36743 -645473 -1147039 -2271571 -2509569 -1135993 745211 1499266 840647 -162099 -736015
36734 -736015 -1267435 -2227179 -2949807 -2377749 -846834 -21794 -636845 -1325497 -583587
36725 -583587 940014 1439621 778162 670744 1935325 3222493 3125972 2119993 1420366
36716 1420366 1092484 509563 -164008 -309085 -210241 -792974 -2151047 -3385648 -3855517
36707 -3855517 -3698965 -3142768 -2087795 -455294 1555637 3444058 4318196 3371203 1043785
36698 1043785 -930816 -1463881 -1412193 -1929950 -2346131 -1240945 888805 1987354 1506328
36689 1506328 1143409 1957228 2550540 1181030 -1645425 -3861123 -4214924 -2957205 -961455
36680 -961455 752230 1172314 45969 -1689242 -2849063 -3121593 -2886162 -2506644 -2311447
36671 -2311447 -2612311 -3095584 -2820531 -1520125 -269775 -87339 -516792 -513638 -111648
36662 -111648 -93048 -462211 -504841 -164578 -110377 -417173 -338745 456103 1462394 2298055
36652 2298055 3011265 3232528 2239133 365379 -789952 -310985 813743 1217905 993200
36643 993200 980512 1052943 492214 -349549 -299601 698388 1367855 1168318 1150750 2035910
36633 2035910 2791469 2304130 1395664 1560511 2283710 1514142 -1112099 -3373361 -3437056
36624 -3437056 -2136799 -1251583 -884790 -6984 1342263 2112030 2113170 2209119 2664260 2762199
36614 2762199 2228446 1679707 1356592 670197 -591439 -1794311 -2631582 -3553055 -4485031
36605 -4485031 -4384202 -2819284 -833937 573156 1616649 2453019 2158131 405126 -1068055
36596 -1068055 -529537 1017718 1232411 152334 291159 2828735 5768770 6585971 5071689
36587 5071689 2739731 826447 -139841 59248 1022756 1734899 1795820 2062434 3280005
36578 3280005 4666604 4724205 3099608 929646 -386341 -235230 986208 2116722 2042930
36569 2042930 818821 -304395 -384704 84653 41407 -603449 -923577 -190758 1442299
36560 1442299 3236214 4335262 4199511 3089425 1948089 1426926 1299723 1126354 946392
36551 946392 816546 330726 -555889 -762006 742543 3199460 4655182 4368846 3542622
36542 3542622 3366047 3383267 2441518 536261 -1079085 -1362303 -510752 391627 461710
36533 461710 -164814 -524769 -60555 386548 -622299 -3090237 -4958755 -4141317 -958565
36524 -958565 2063005 2856214 1805255 912861 1375196 2418240 2535616 1472188 574646
36515 574646 1167731 2952799 4276871 3815090 1739184 -613489 -1882827 -1580062 -294317
36506 -294317 799738 871834 95159 -617366 -534377 252862 966034 776145 -530831 -2265904
36496 -2265904 -3282780 -2962588 -1773374 -753882 -554734 -1066625 -1708840 -1867574 -1373118
36487 -1373118 -854206 -1258739 -2628865 -3803778 -3923794 -3737179 -4526883 -6083065 -6863943
36478 -6863943 -6100196 -4559449 -3123587 -1909860 -1126225 -1314073 -1940101 -1139923 1869533
36469 1869533 5153596 6285449 5446422 4678198 4563987 3640889 1261558 -914286 -1153190
36460 -1153190 27432 859502 717963 382799 467248 705936 683771 428953 200872 181945
36450 181945 387210 580792 460106 225395 621848 1911105 3106053 2938751 1525961
36441 1525961 345712 390217 980154 785748 -417402 -1502875 -1356800 -101050 1087524
36432 1087524 1206242 425470 -149940 202293 844898 468732 -1161183 -2632433 -2482604
36423 -2482604 -1021259 118690 166278 120295 1155121 2879415 3900138 3686254 2994766
36414 2994766 2547777 2181728 1511381 650709 -144326 -950892 -1820456 -2430703 -2597272
36405 -2597272 -2700303 -3047956 -3207836 -2610764 -1504775 -610336 -83545 387890 638137
36396 638137 133024 -879161 -1256913 -366533 1092953 2011466 2008668 1334155 277146
36387 277146 -845160 -1584342 -1710945 -1377349 -740707 87875 566487 -27433 -1426185
36378 -1426185 -2209351 -1456965 76678 1132142 1605036 2135363 2650111 2512315 1872500
36369 1872500 1676162 2285025 3108272 3703183 4275708 4903751 5160738 4759664 3810393
36360 3810393 2344670 503718 -708847 -78886 1951555 3252326 2583837 1158492
36352 1158492 709809 1005961 554191 -918349 -2175119 -2391964 -1903776 -978105 697357
36343 697357 2804519 3900589 3032770 1167743 157581 629169 1619015 2089199 2045972
36334 2045972 2034281 2123713 1861037 1105065 470665 659398 1505067 2119166 2072120 1903160
36324 1903160 2088041 2059913 1035799 -491905 -1133801 -554862 48848 -125542 -148081
36315 -148081 1173663 3255813 4328563 3713089 2360762 1244448 411948 -215415 -330015
36306 -330015 -17965 10199 -350917 -96692 1295834 2645166 2567710 1517923 967316
36297 967316 1026428 543568 -535883 -837024 -82602 -25485 -1671510 -3164632 -2167546
36288 -2167546 656118 2470240 2119453 1203671 1280402 1900296 2007154 1720024 1777923
36279 1777923 2255310 2723371 2945010 2680610 1515713 -351991 -1744704 -1710636 -721805
36270 -721805 -57453 -341823 -1154408 -1638307 -1058519 674537 2513633 2907396 1553642
36261 1553642 -963 -105350 1194354 2631044 3275993 2963829 1985092 1200732 1611977
36252 1611977 2826937 2918637 1091215 -540332 405692 2970451 4071622 2897197 1587958
36243 1587958 1468396 1357213 451375 186190 1567599 2816464 1822991 -477742 -1362191
36234 -1362191 -46652 1870315 3027747 3304185 2556114 472071 -2133001 -3645115
36226 -3645115 -3655459 -3228730 -2935494 -2150394 -770169 -52408 -791108 -1822439 -1488841
36217 -1488841 103645 1355751 1310928 534656 -56474 -382483 -904991 -1577491 -1562439
36208 -1562439 -164642 2076655 3587766 3278791 1621627 -29910 -847506 -874858 -429867
36199 -429867 132172 342798 132382 274119 1437796 2878984 3107201 1984895 1057473
36190 1057473 1433568 2425867 2884052 2840662 2976032 3279647 3257758 2896096 2400372 1432925
36180 1432925 -297565 -1967322 -2325197 -1422734 -557989 -380617 -170433 674046 1556571
36171 1556571 1747838 1596201 1798722 2171706 2196988 2314063 3391316 4954862 5240909
36162 5240909 3432801 803079 -959829 -1600488 -1667008 -1005875 747324 2641142 2965526
36153 2965526 1490716 -222679 -1099924 -1735499 -2636069 -2751431 -1071466 1321866 2418516
36144 2418516 2054676 1953787 3064553 4323105 4309395 2887820 838646 -1028233 -1948264
36135 -1948264 -1424548 53570 1326041 2014665 2745216 3515527 3106498 1076655 -758064
36126 -758064 -289192 1966273 3407330 2749259 1482962 1551768 2715532 3045051 1490310
36117 1490310 -877882 -2181748 -1774548 -729348 -467388 -1197171 -1869070 -1510190 -271956
36108 -271956 882160 1206860 741987 96359 -144889 95846 430995 574852 651769 674195
36098 674195 72595 -1590188 -3586461 -4544951 -4112491 -3285935 -2900892 -2689259 -2195169
36089 -2195169 -1660013 -1353849 -867318 81900 739538 137395 -1452819 -2626895 -2306424
36080 -2306424 -710063 865226 1046363 -273802 -1410371 -542443 1802990 3033814
36072 3033814 1810252 -224560 -911284 -330091 248870 740325 1650946 2186285 1251559
36063 1251559 -218267 -320143 617696 378622 -1385854 -2261424 -666973 1931906 3438067
36054 3438067 3696767 3416597 2459077 840119 -96354 657487 1938719 1915142 672485
36045 672485 -224810 -134880 178287 18523 -643938 -1718281 -2916332 -3423351 -2769412
36036 -2769412 -1736618 -1340054 -1267895 -487895 893950 1642872 1210233 411469 207218
36027 207218 714891 1479045 1951020 1739399 1076202 862535 1567037 2417615 2485785 2099307
36017 2099307 2113620 2218184 1343341 -378658 -1511179 -1378863 -954094 -1314945 -2292709
36008 -2292709 -3009520 -2812782 -1456849 579279 1729524 577091 -2024673 -3304174
36000 -3304174 -1811837 753743 1815507 1014056 -10506 -78054 563970 1213113 1336264
35991 1336264 423798 -1531634 -3358220 -3638829 -2549915 -1720161 -1875463 -1719552 45315
35982 45315 2487819 3494520 2669395 1724611 1754619 1643650 178506 -1476684 -1158431
35973 -1158431 855997 1773523 116048 -2136252 -2318941 -639110 540838 124256 -698350
35964 -698350 -555959 547883 1885425 2879994 3029564 2038362 428647 -751441 -1088736
35955 -1088736 -1041045 -1019229 -1046625 -1326923 -2189477 -3302794 -3806067 -3384844 -2449018 -1272964
35945 -1272964 119845 1316907 1898136 2402070 3595787 4782752 4427253 2692993 1584329
35936 1584329 2018412 2597744 2127839 1454840 1574041 1711625 882268 -173090 -359955
35927 -359955 -219581 -720466 -1295645 -1040018 -653349 -988520 -867425 970712 2690453
35918 2690453 1370119 -2106162 -3665708 -1997605 -339826 -1112455 -2229194 -945573
35910 -945573 1487644 1948149 328726 -811038 -456430 7032 -184981 -89659 734024
35901 734024 1326352 1305660 1750306 3149485 4072382 3103656 1072139 128758 1123247
35892 1123247 2876316 3785105 3333326 2075078 827852 159013 352799 1449916 3053008
35883 3053008 4188910 3871025 2177194 487850 183197 1211815 2302517 2389614 1430185
35874 1430185 119504 -618411 -140548 1138471 1624258 94954 -2554011 -3995288 -3114228
35865 -3114228 -1158622 -7052 -175083 -949873 -1612044 -1856215 -1628969 -1167944 -720884
35856 -720884 108626 1919477 3977730 4295653 2203155 -256419 -823941 44962 393563
35847 393563 39993 427098 1581265 1852027 1082601 1379661 3573534 5302238 4340389
35838 4340389 1861219 357095 29519 -322998 -239339 1558623 3890053 3898118 1359629
35829 1359629 -701843 -445121 443407 -2272 -952732 -717711 218994 194187 -884737
35820 -884737 -1778254 -2035446 -2037543 -1573408 -196945 1310883 1511253 332575 -767967
35811 -767967 -651077 532143 2011457 2994459 2833739 1644057 516609 186631 -27773
35802 -27773 -856708 -1348550 -131333 2005488 2710814 1340121 -224200 -413111 124777
35793 124777 138324 -302541 -465309 -300103 -137757 -9333 -114311 -999559 -2365110 -2629141
35783 -2629141 -785651 1973739 3575024 3496605 2828336 2294167 1455573 -7692 -1229738
35774 -1229738 -923032 1089793 3429661 4288204 3059904 887539 -500292 -446155 261009
35765 261009 449345 -313006 -1445857 -1830588 -841961 652125 796823 -1039004 -3084094
35756 -3084094 -3190616 -1558864 -181396 -343 -274450 -620434 -1661884 -3214936 -3815420
35747 -3815420 -2969798 -2168389 -2533803 -2979861 -2029066 -173872 1037100 1283123 1369214
35738 1369214 1533080 1248085 387048 -424122 -418916 733920 2348723 2637584 512403
35729 512403 -2261146 -2531981 -55990 1821238 901490 -861067 -873830 61225 -163774
35720 -163774 -963735 -410988 860722 591779 -1091836 -2007696 -1715119 -1572041 -1399667
35711 -1399667 219743 2335738 2230157 138369 -558735 1149191 2138176 454365 -1448297
35702 -1448297 -950996 705943 1251426 1196079 1877992 2278975 976697 -737535 -824349
35693 -824349 83371 237356 158451 1262685 2449094 1494704 -992948 -2376268 -2178485
35684 -2178485 -2154842 -2525577 -1608059 630594 1989211 1586192 991176 1095474 769567
35675 769567 -395125 -816628 292810 1373678 1241263 1108723 2211019 3382147 2900166
35666 2900166 1227867 22681 -440116 -1044743 -1849497 -2004003 -1232494 -128331 721674
35657 721674 1045419 777520 277499 13008 -408849 -1847823 -3721738 -3917996 -1651496
35648 -1651496 942028 1429030 131722 -948763 -1151641 -1231842 -1207800 -290691 1203044
35639 1203044 1842928 1186844 199927 -713875 -2392160 -4949791 -6607123 -5602511 -2519752
35630 -2519752 237145 963780 63813 -817801 -632435 86703 48184 -940075 -1395681
35621 -1395681 -24579 2264337 3227927 2123031 566492 298185 1148737 1774981 1481308
35612 1481308 521654 -712478 -1855914 -2291445 -1651533 -555509 -102392 -550399 -1087842
35603 -1087842 -1008139 -535156 -260824 -279132 -284481 -225070 -382354 -848443 -1301305 -1392203
35593 -1392203 -1118983 -713950 -360287 -158497 -207774 -514464 -876169 -1017303 -825004 -389110
35583 -389110 58243 127671 -565603 -1899866 -3011274 -2939579 -1574160 258118 1597109
35574 1597109 2005359 1612886 979653 847964 1488546 2252187 2302418 1792548 1619699 1958028
35564 1958028 2005213 1539830 1600534 2771110 3797021 3219411 1744002 1369277 2329677
35555 2329677 2717349 1610279 797684 2132549 4406505 4648060 2169665 -440495 -726133
35546 -726133 678190 1335234 207449 -1621672 -2854321 -3173725 -2532670 -750569 1483730
35537 1483730 2405006 1151560 -739960 -1124346 -117652 338977 -302079 -255560 1659878
35528 1659878 3838989 3967061 2132522 330797 -384527 -548812 -431788 597888 2518497
35519 2518497 3978121 3851917 2479852 846295 -498186 -1144178 -473227 1515976 3669018
35510 3669018 4791527 4901513 4753600 4612894 4214326 3517381 2707674 1710621 469512
35501 469512 -452649 -300479 859934 2157418 2887635 2883704 2072564 508554 -1026152
35492 -1026152 -1336530 -236308 911974 659185 -840782 -2121871 -2162088 -1274348 -298145
35483 -298145 450668 1107461 1549919 1304899 190113 -1317593 -2536363 -3198560 -3420914
35474 -3420914 -3231205 -2464977 -1183494 79877 705262 585103 241812 321429 947872
35465 947872 1580680 1602326 1059430 629142 772481 1228967 1564718 1796214 1972898 1533857
35455 1533857 -84559 -2312006 -3866992 -4432416 -4864969 -5410455 -4988047 -3125465 -1409344
35446 -1409344 -1524103 -2569128 -2139662 77667 1720211 1209953 -24614 182488 1734140
35437 1734140 2993261 3465757 4031205 4976804 5549329 5459580 5228235 4764182 3165441
35428 3165441 569062 -1231160 -1028761 28799 91257 -826517 -1264478 -711581 -48435
35419 -48435 228403 681389 1575948 2184725 1953407 1288327 635223 -242835 -1429741 -2205814
35409 -2205814 -1990233 -1173678 -262539 1022861 2907152 4570270 5087519 4765699 4360803
35400 4360803 3496717 1308762 -1578161 -3295753 -3121975 -2197710 -1541384 -783066 528251
35391 528251 1702193 1927552 1552558 1422609 1677069 2007922 2374162 2616165 2083743
35382 2083743 592316 -885712 -1465629 -1648029 -2231261 -2539028 -1266752 1059745 2119405
35373 2119405 759683 -1348988 -1782355 -236413 1503732 1982619 1581167 1571190 2267753
35364 2267753 2602612 1614294 -29845 -648401 235879 1127257 585029 -740401 -1119080
35355 -1119080 -336427 27286 -1024868 -2469254 -2685545 -1466839 -35804 434916 -109287
35346 -109287 -664287 -77139 1728672 3358897 3267876 1533816 -242216 -835896 -481249
35337 -481249 55392 591024 1272400 1925906 2269895 2378129 2463962 2463237 2111656 1203879
35327 1203879 -286697 -1987990 -3090715 -3062793 -2320468 -1568676 -731186 484967 1199517
35318 1199517 24345 -2621369 -4423729 -4083877 -2906562 -2634314 -3112094 -3252108 -3007136
35309 -3007136 -2921383 -2736739 -2012026 -1368007 -1585562 -2118347 -2011013 -1623392 -1810234 -2070460
35299 -2070460 -1428461 -634948 -1256788 -2692352 -2464544 105783 2713152 3280218 2401810
35290 2401810 1690459 1508212 1481268 1703303 2141626 2085611 1410845 1328643 2705634 4551703
35280 4551703 5240651 4392015 2659548 676185 -818014 -914182 213664 965643 386811
35271 386811 -413488 -103280 757459 918611 650927 959320 1442918 916035 -375142
35262 -375142 -1118492 -1147949 -1333460 -1561586 -952995 -41693 -495291 -2327394 -3491413
35253 -3491413 -2798043 -1288766 -123467 872090 1773329 1788422 1081077 1366408 3198449
35244 3198449 4470888 3422716 1578161 1566729 3182451 3974744 3096887 2112060 2070648
35235 2070648 2155168 1700676 1485901 2060930 2359910 1178627 -954727 -2519988 -2995539
35226 -2995539 -3021820 -2836139 -1603088 1337815 5041884 7297768 6582129 3596701 648495
35217 648495 -540055 -182110 374125 238848 -542352 -1530153 -2203223 -1934854 -370602
35208 -370602 2030780 4196304 5267938 5127358 4299532 3532813 3208422 2968388 2267285
35199 2267285 1394941 1298959 2115319 2763606 2605561 2529426 3389458 4262825 3646737 1792568
35189 1792568 290735 -286103 -576815 -430421 1199313 3877412 5215218 3863933 1459807
35180 1459807 366033 742651 1198641 1215260 1209175 834974 -889194 -3651489 -5510065
35171 -5510065 -5015939 -2870495 -1071942 -879814 -1837105 -2516487 -2142142 -1484353 -1830709
35162 -1830709 -3069098 -3596511 -2518923 -951161 -302400 -258686 229591 753983 61113
35153 61113 -1355502 -1275810 1109622 3747993 4301875 2877518 1160669 -20318 -923156
35144 -923156 -1457114 -1114654 -218603 151069 -235879 -329064 492495 1140638 105550 -2324354
35134 -2324354 -4025344 -3421870 -1318742 102406 -194457 -1222403 -1624296 -1397968 -1410199
35125 -1410199 -1784858 -1788262 -1260442 -1099759 -1903566 -2966470 -3308235 -3105508 -3268711 -3919515
35115 -3919515 -4216045 -3732550 -3206020 -3576228 -4771518 -5803062 -5815823 -4812510 -3505197
35106 -3505197 -2597619 -2120937 -1531029 -667730 -372722 -1495302 -3227950 -3348283 -794504
35097 -794504 2626829 4110327 3198082 2110899 2586013 3681991 3533332 2196185 1282796
35088 1282796 1185371 422301 -1773304 -3684745 -3083043 -211593 2421729 2984103 1973336
35079 1973336 955855 720555 1051916 1513716 1828883 1856055 1685819 1592226 1598995 1300215
35069 1300215 391045 -789447 -1503716 -1315847 -415170 587453 1033608 587576 -518368
35060 -518368 -1633535 -2158488 -1826716 -671251 921957 2146002 2317019 1752368 1590260
35051 1590260 2295465 2855556 2210850 1166888 1780690 4546972 7188603 7107088 4533870
35042 4533870 2176467 1758461 2091960 1193288 -698838 -1528684 -540113 555428 32299
35033 32299 -1525401 -2407411 -2388953 -2730646 -3902891 -4808301 -4470674 -3237756 -1902243
35024 -1902243 -743802 42734 52527 -498258 -623267 -22695 300190 -196299 -311088 1051943
35014 1051943 2690972 2581914 1063723 489824 1660704 2756310 2443645 1950881 2733828
35005 2733828 3756241 2948214 451767 -1485808 -1562621 -715935 -338701 -650300 -1119797
34996 -1119797 -1274520 -637533 1103627 3272860 4332564 3463548 1508294 -100684 -804466
34987 -804466 -883739 -610504 -100993 423431 907986 1682241 2771485 3341497 2631548 1212311
34977 1212311 353858 143785 -670044 -2577326 -4105119 -3590210 -1503436 55370 -27180
34968 -27180 -800831 -914198 -382517 -154379 -560299 -980575 -916027 -709710 -968555 -1624439
34958 -1624439 -1946023 -1503965 -857272 -986812 -2043268 -3022632 -2941709 -2001387 -1099016
34949 -1099016 -445238 549297 1964227 2879211 2671944 2014385 1814530 1784613 1084862
34940 1084862 30364 -135855 670105 768630 -1090136 -3747661 -4769253 -3234684 -629371
34931 -629371 969613 969860 433737 623137 1617591 2293546 1618442 -103045 -1489666 -1607061
34921 -1607061 -860500 -200941 93218 426432 1053373 1819563 2543395 3044317 2872637
34912 2872637 1707572 160470 -484234 291157 1495163 1730410 750436 -454461 -879266
34903 -879266 -394092 441324 988740 893164 162523 -924015 -2021344 -2818079 -2963775
34894 -2963775 -2214241 -919520 -85076 -429926 -1430592 -1844059 -1279280 -660254 -825063
34885 -825063 -1261297 -874295 312391 1037045 478598 -586053 -639184 898930 3127232
34876 3127232 4593750 4561497 3497347 2477299 2104421 2096087 2016046 2018948 2331237 2308035
34866 2308035 996471 -1220782 -2617006 -2303486 -1447927 -1498637 -2118857 -2084012 -1508415
34857 -1508415 -1580404 -2342200 -2498403 -1685742 -1200123 -1741593 -2005485 -684728 1335741
34848 1335741 2190645 1600562 736258 109785 -703255 -1388992 -721964 1462661 3524652
34839 3524652 3974704 3147808 2216803 1521029 832627 504093 1096548 2154943 2567561
34830 2567561 2208135 2100218 2603261 2530191 914969 -1064794 -1122422 1252735 3975399
34821 3975399 4695951 3119806 624958 -1526389 -2800306 -2930212 -2062447 -1244674 -1656138
34812 -1656138 -3115491 -4174556 -3897117 -2758948 -1630891 -838529 -567539 -1125861 -2143943
34803 -2143943 -2455904 -1585603 -523341 -164666 123372 1240180 2486151 2472126 1443321
34794 1443321 1042857 1774628 2259130 1312555 -574898 -2242495 -3127422 -3049476 -1885368
34785 -1885368 -131468 1109134 1343833 1174910 1137942 946352 418838 170031 568612
34776 568612 817570 38631 -1233304 -1554546 -347765 1461348 2393569 1632591 -348485
34767 -348485 -2068058 -2389591 -1780232 -1567520 -1860547 -1337178 496731 2246637 2759974
34758 2759974 2942197 4001537 5002339 4077353 1520306 -359892 -470637 -140555 -705262
34749 -705262 -1579967 -1543119 -682220 -63436 -166452 -470303 -265417 564968 1290412 744387
34739 744387 -1502114 -4262143 -5626414 -4932018 -3323302 -2247569 -1987793 -1847471 -1220146
34730 -1220146 -239583 316045 -161323 -1050791 -732203 1338268 3296110 2873585 495601
34721 495601 -1145709 -659921 638245 1345338 2055494 3625463 4924545 4094826 1334955
34712 1334955 -1163230 -1792063 -837316 527472 1402883 1423414 880730 648605 1261454
34703 1261454 2128544 2284582 1712563 1236428 1318949 1688331 1968054 1951801 1419240 399088
34693 399088 -519510 -799720 -680325 -605801 -233262 1102081 3070465 4432963 4514683
34684 4514683 3845476 3296500 3243202 3531460 3614343 2885368 1590972 1077134 2148422
34675 2148422 3533928 3324585 1798470 1181347 2332113 3439073 2812010 1328164 798386
34666 798386 1147305 818816 -723489 -2472461 -3524032 -3820122 -3340949 -1901858 12896
34657 12896 1246655 1137533 38790 -1380085 -2623409 -3137054 -2419943 -601584 1643356
34648 1643356 3740822 5164756 5041721 2962661 235659 -1007893 -414936 144113 -590889
34639 -590889 -1338247 -361361 1631945 2358293 1221244 -42976 -8980 744494 999264
34630 999264 613581 200353 91976 339698 999162 1783868 2061639 1720295 1407465 1491289
$$ [...]
##END NTUPLES=NMR SPECTRUM
##END=
