##TITLE=31Pdec_IPEDM8
 CDCl3, 124 sc
 22.7.2019
##JCAMPDX= 6.0         $$ Bruker NMR JCAMP-DX V2.0
##DATA TYPE= NMR SPECTRUM
##DATA CLASS= NTUPLES
##ORIGIN= UXNMR, Bruker Analytische Messtechnik GmbH
##OWNER= root
$$ XWIN-NMR		Version 3.5
$$ Mon Jul 22 14:15:59 2019 Russian Standard Time (UT+4h)  she@DPX200
##.OBSERVE FREQUENCY= 81.013821
##.OBSERVE NUCLEUS= ^31P
##.ACQUISITION MODE= SIMULTANEOUS
##.ACQUISITION SCHEME= undefined
##.AVERAGES= 124
##.DIGITISER RES= 17
##SPECTROMETER/DATA SYSTEM= spect
##.PULSE SEQUENCE= zgpg30
##.SOLVENT NAME= Tol
##.SHIFT REFERENCE= (INTERNAL, Tol, 0, 182.463)
##AUDIT TRAIL= $$ (NUMBER, WHEN, WHO, WHERE, WHAT)
$$ ##TITLE= Audit trail, XWIN-NMR		Version 3.5
$$ ##JCAMPDX= 5.01
$$ ##ORIGIN= Bruker BioSpin GmbH
$$ ##OWNER= she
$$ F:/spectra/data/she/nmr/P31/1/pdata/1/auditp.txt
$$ ##AUDIT TRAIL=  $$ (NUMBER, WHEN, WHO, WHERE, WHAT)
(   1,<2019-07-22 14:14:46.28 +0400>,<she>,<DPX200>,
      <continue with go, POWCHK disabled, PULCHK disabled
       configuration hash MD5:
       00 E9 B6 7A A2 85 ED C7 34 08 36 98 17 FE 4E 26
       data hash MD5: 32K
       72 86 53 81 F1 0C B9 C9 71 8E 57 45 28 81 CB 55>)
(   2,<2019-07-22 14:14:56.17 +0400>,<she>,<DPX200>,
      <Start of raw data processing
       efp BC_mod = 2 LB = 1 FT_mod = 6 PKNL = 1 PHC0 = -2769.202 PHC1 = -239.2011 SI = 64K 
       data hash MD5: 64K
       DB 12 EA 23 FD 1A C7 22 A0 BF C1 74 FF 8C DC EF>)
(   3,<2019-07-22 14:15:34.87 +0400>,<she>,<DPX200>,
      <pk PHC0 = -1.926009 PHC1 = 0 
       data hash MD5: 64K
       63 4A 2A 26 F0 EA 84 9E 34 9C B6 4D A2 1B 31 71>)
(   4,<2019-07-22 14:15:37.93 +0400>,<she>,<DPX200>,
      <abs ABSG = 5 
       data hash MD5: 64K
       44 9A B7 DE F7 E6 B4 37 C5 26 8F E4 83 CD CD 54>)
$$ ##END=
$$ 
$$ hash MD5
$$ 86 43 F2 32 7A 40 61 50 3C 34 C2 B1 46 1F BE 7E
##$RELAX= 
##$RELAX= 
##$RELAX= 
##$RELAX= 
##$RELAX= 
##$RELAX= 
##$RELAX= 
##$RELAX= 
$$ Bruker specific parameters
$$ --------------------------
##$DU= <F:/spectra>
##$EXPNO= 1
##$NAME= <P31>
##$PROCNO= 1
##$TYPE= <nmr>
##$USER= <she>
##$AMP= (0..31)
100 100 100 100 100 100 100 100 100 100 100 100 100 100 100 100 100 100 
100 100 100 100 100 100 100 100 100 100 100 100 100 100 
##$AQSEQ= 0
##$AQ_mod= 1
##$AUNM= <au_zg>
##$AUTOPOS= <>
##$BF1= 81.014009
##$BF2= 200.13
##$BF3= 200.13
##$BF4= 200.13
##$BF5= 200.13
##$BF6= 200.13
##$BF7= 200.13
##$BF8= 200.13
##$BYTORDA= 1
##$CFDGTYP= 0
##$CFRGTYP= 5
##$CHEMSTR= <none>
##$CNST= (0..31)
1 1 145 1 1 1 1 1 1 1 1 1 1 1 1 1 1 1 1 1 1 1 1 1 1 1 1 1 1 1 1 1 
##$CPDPRG= <waltz16>
##$CPDPRG1= <>
##$CPDPRG2= <waltz16>
##$CPDPRG3= <>
##$CPDPRG4= <mlev>
##$CPDPRG5= <mlev>
##$CPDPRG6= <mlev>
##$CPDPRG7= <mlev>
##$CPDPRG8= <mlev>
##$CPDPRGB= <>
##$CPDPRGT= <>
##$D= (0..31)
0 1 0 0 0 0 0 0 0 0 0 0.03 2e-05 3e-06 0 0 0 0 0 0 0 0 0 0 0 0 0 0 0 0 
0 0 
##$DATE= 1563790301
##$DBL= (0..7)
120 120 120 11 120 120 24 19 
##$DBP= (0..7)
150 150 150 150 150 150 150 150 
##$DBP07= 0
##$DBPNAM0= <>
##$DBPNAM1= <>
##$DBPNAM2= <>
$$ [...]
##$SUBNAM3= <"">
##$SUBNAM4= <"">
##$SUBNAM5= <"">
##$SUBNAM6= <"">
##$SUBNAM7= <"">
##$SUBNAM8= <"">
##$SUBNAM9= <"">
##$SW= 369.568048894756
##$SWIBOX= (0..15)
0 1 3 0 0 0 0 0 0 0 0 0 0 0 0 0 
##$SW_h= 29940.119760479
##$TD= 32768
##$TD0= 1
##$TE= 0
##$TE2= 300
##$TE3= 300
##$TEG= 300
##$TL= (0..7)
0 120 53 12 22 120 120 120 
##$TP= (0..7)
150 150 150 150 150 150 150 150 
##$TP07= 0
##$TPNAME0= <>
##$TPNAME1= <>
##$TPNAME2= <>
##$TPNAME3= <>
##$TPNAME4= <>
##$TPNAME5= <>
##$TPNAME6= <>
##$TPNAME7= <>
##$TPOAL= (0..7)
0.5 0.5 0.5 0.5 0.5 0.5 0.5 0.5 
##$TPOFFS= (0..7)
0 0 0 0 0 0 0 0 
##$TUNHIN= 0
##$TUNHOUT= 0
##$TUNXOUT= 0
##$USERA1= <user>
##$USERA2= <user>
##$USERA3= <user>
##$USERA4= <user>
##$USERA5= <user>
##$V9= 5
##$VALIST= <valist>
##$VCLIST= <CCCCCCCCCCCCCCC>
##$VD= 0
##$VDLIST= <DDDDDDDDDDDDDDD>
##$VPLIST= <PPPPPPPPPPPPPPP>
##$VTLIST= <TTTTTTTTTTTTTTT>
##$WBST= 1024
##$WBSW= 4
##$XGAIN= (0..3)
0 0 0 0 
##$XL= 0
##$YL= 0
##$YMAX_a= 26133
##$YMIN_a= -15951
##$ZGOPTNS= <>
##$ZL1= 120
##$ZL2= 120
##$ZL3= 120
##$ZL4= 120
##$ABSF1= 182.463
##$ABSF2= -187.1042
##$ABSG= 5
##$ABSL= 3
##$ALPHA= 0
##$AQORDER= 0
##$ASSFAC= 0
##$ASSFACI= 0
##$ASSFACX= 0
##$ASSWID= 0
##$AUNMP= <proc_1d>
##$AZFE= 0.1
##$AZFW= 0.5
##$BCFW= 0
##$BC_mod= 2
##$BYTORDP= 0
##$COROFFS= 0
##$CY= -3
##$DATMOD= 1
##$DC= 0
##$DFILT= <>
##$DTYPP= 0
##$F1P= 0
##$F2P= 0
##$FCOR= 1
##$FTSIZE= 65536
##$FT_mod= 6
##$GAMMA= 0
##$GB= 0
##$INTBC= 1
##$INTSCL= 5.30512e-09
##$ISEN= 30
##$LB= 1
##$LEV0= 0
##$LPBIN= 0
##$MAXI= 10000
##$MC2= 0
##$MEAN= 0
##$ME_mod= 0
##$MI= 50
##$NCOEF= 0
##$NC_proc= -6
##$NLEV= 6
##$NOISF1= 182.463
##$NOISF2= 159.3651
##$NSP= 0
##$NTH_PI= 0
##$NZP= 0
##$OFFSET= 182.463
##$PC= 4
##$PHC0= -2771.128
##$PHC1= -239.2011
##$PH_mod= 1
##$PKNL= yes
##$PPARMOD= 0
##$PSCAL= 0
##$PSIGN= 0
##$REVERSE= no
##$SF= 81.0140089999434
##$SI= 65536
##$SIGF1= 159.3651
##$SIGF2= -187.1042
##$SINO= 113.3802
##$SIOLD= 16384
##$SREGLST= <1H.CDCl3>
##$SSB= 0
##$STSI= 65536
##$STSR= 0
##$SW_p= 29940.119760479
##$SYMM= 0
##$S_DEV= 0
##$TDeff= 32768
##$TDoff= 0
##$TI= <>
##$TILT= no
##$TM1= 0
##$TM2= 0
##$TOPLEV= 0
##$USERP1= <user>
##$USERP2= <user>
##$USERP3= <user>
##$USERP4= <user>
##$USERP5= <user>
##$WDW= 1
##$XDIM= 65536
##$YMAX_p= 59186535
##$YMIN_p= -395099419
$$ End of Bruker specific parameters
$$ ---------------------------------
##NTUPLES= NMR SPECTRUM
##VAR_NAME=  FREQUENCY,     SPECTRUM/REAL,   SPECTRUM/IMAG
##SYMBOL=    X,             R,               I
##VAR_TYPE=  INDEPENDENT,   DEPENDENT,       DEPENDENT
##VAR_FORM=  AFFN,          ASDF,            ASDF
##VAR_DIM=   65536,         65536,           65536
##UNITS=     HZ,            ARBITRARY UNITS, ARBITRARY UNITS
##FACTOR=    0.456856943014862, 1,           1
##FIRST=     14782.0589164792, 0,            0
##LAST=      -15158.0608439998, 0,           0
##MIN=       -15158.0608439998, -395099419,  0
##MAX=       14782.0589164792, 59186535,     0
$$ Real data points
##PAGE= N=1
##DATA TABLE= (X++(R..R)), XYDATA
$$ [...]
$$ plain form
4255 -4646791 -176867 2961433 7233254 11236974 10714763 5712914 1566521 1533642 2957009
4246 2957009 2521556 1152637 1233758 2472655 3379224 4174007 5511634 6405530 5720806
4237 5720806 3865760 1305018 -2270779 -5681010 -6155681 -3645552 -1949098 -2741798 -2028697
4228 -2028697 3474943 9599013 9628892 4172357 477538 2314532 5941244 6724638 4694526
4219 4694526 2044426 -272850 -1208617 1075773 5584378 7395962 3726797 -1195132
4211 -1195132 -1171938 3393526 6178169 4118441 1579693 3620405 8556954 10493352 7486489
4202 7486489 3353506 1414202 308128 -2244025 -4650045 -3599497 502628 3596847
4194 3596847 3103981 124948 -3255418 -5731955 -5765947 -2499059 1297036 918014 -3676959
$$ packed form
4255d646791M469924L138300M271821M003720n22211n001849m146393l2879J423367
4246B957009m35453j368919Q1121J238897R06569P94783J337627Q93896o84724
4237E720806j855046k560742l575797l410231m74671K510129J696454p92700P13101
4228b028697N503640O124070K9879n456535l694819J836994L626712P83394k030112
4219D694526k650100k317276r35767K284390M508605J811584l669165m921929
4211a195132K3194M565464K784643k059728k538748K040712M936549J936398l006863
4202G486489m132983j939304j106074k552153k406020J050548M102125L094219
4194C596847m92866k979033l380366k476537l3992L266888L796095l79022m594973
$$ plain form
4185 -3676959 -6377544 -2655573 4241605 8017118 7587877 6733522 7380709 7621884 5754406
4176 5754406 2325506 -1743718 -5612591 -7240461 -5206596 -1957876 -1630680 -4098729
4168 -4098729 -4820303 -1623583 1977823 1976594 -811245 -2923812 -3260233 -3283839 -3788414
4159 -3788414 -3924456 -2712266 191194 4482036 8488600 9251260 5004075 -2460039 -8805269
4150 -8805269 -10515737 -7193132 -1483790 2683157 2684552 -999342 -5621380 -8763129 -9636021
4141 -9636021 -8427258 -5927928 -3875402 -3919763 -5541959 -6275506 -4684997 -2094035 -853638
4132 -853638 -1887180 -4288447 -6289074 -6365251 -4488303 -2446741 -1870470 -2142850 -1636719
4123 -1636719 -508350 -265637 -1008720 -1692001 -2886127 -5941893 -8987672 -7665853 -1442006
$$ packed form
4185c676959k700585L721971O897178L775513m29241q54355O47187K41175j867478
4176E754406l428900m069224l868873j627870K033865L248720L27196k468049
4168d098729p21574L196720L601406j229k787839k112567l36421k3606n04575
4159c788414j36042J212190K903460M290842M006564P62660m247185p464114o345230
4150h805269j710468L322605N709342M166947J395l683894m622038l141749q72892
4141i636021J208763K499330K052526m4361j622196p33547J590509K590962J240397
4132h53638j033542k401267k000627p6177J876948K041562N76271k72380N06131
4123a636719J128369K42713p43083o83281j194126l055766l045779J321819O223847
$$ plain form
4114 -1442006 4484782 5873142 4677242 4802949 5967041 5622788 4386243 4891470 6565618
4105 6565618 6166182 3214696 719292 249459 58105 -1348256 -3218172 -4822202 -6427677
4096 -6427677 -7224463 -5637450 -2811818 -2342861 -4896812 -6474205 -4290496 -1224128 -1376324
4087 -1376324 -3800133 -4399045 -2445861 -1109402 -1938086 -2770447 -1748025 3230 1025173
4078 1025173 2065921 4064338 5558109 4271304 323790 -3877176 -6349193 -6826466
4070 -6826466 -6102343 -5558663 -6736916 -9753905 -12498545 -13005511 -12248409 -12615210 -13797953
4061 -13797953 -12796085 -8704222 -4771828 -3917018 -4355335 -2141475 3281456 8569458
4053 8569458 10599744 8651878 3422448 -3027563 -6714511 -4797972 -25320 1241495
$$ packed form
4114a442006N926788J388360j195900J25707J164092l44253j236545N05227J674148
4105F565618l99436k951486k495404m69833j91354j406361j869916j604030j605475
4096f427677p96786J587013K825632M68957k553951j577393K183709L066368j52196
4087a376324k423809n98912J953184J336459q28684q32361J022422J751255J021943
4078A025173J040748J998417J493771j286805l947514m200966k472017m77273
4070f826466P24123N43680j178253l016989k744640n06966P57102l66801j182743
4061a3797953J001868M091863L932394Q54810m38317K213860N422931N288002
4053H569458K030286j947866n229430o450011l686948J916539M772652J266815
$$ plain form
4045 1241495 -3025618 -7471189 -6190623 59877 5894499 8104945 7326175 4725133
4037 4725133 887519 -2388146 -2736971 -412505 1549812 982088 -1419743 -3928902 -5577715
4028 -5577715 -5788317 -4315507 -2219471 -1110855 -880142 -7139 1409102 1247445 -929541
4019 -929541 -2119951 239105 4301083 5903623 3654064 -73165 -2477442 -2670699 -1223974
4010 -1223974 452703 393303 -2106587 -4679640 -3956724 -42664 3074839 2505466 -161591
4001 -161591 -1825533 -2172100 -2750280 -3275302 -1872441 1429760 4500091 6686394 9555109
3992 9555109 13105188 14364567 11713172 7937649 6348609 6036005 4188194 1378562
3984 1378562 498244 1188662 -106829 -3985113 -6455373 -5247821 -3747749 -5715749 -9121889
$$ packed form
4045A241495m267113m445571J280566O250500N834622K210446p78770k601042
4037D725133l837614l275665l48825K324466J962317n67724k401831k509159j648813
4028e577715k10602J472810K096036J108616K30713Q73003J416241j61657k176986
4019i29541j190410K359056M061978J602540k249559l727229k404277j93257J446725
4010a223974J676677n9400k499890k573053P22916L914060L117503n69373k667057
4001a61591j663942l46567n78180n25022J402861L302201L070331K186303K868715
3992I555109L550079J259379k651395l775523j589040l12604j847811k809632
3984A378562q80318O90418j295491l878284k470260J207552J500072j968000l406140
$$ plain form
3975 -9121889 -8930077 -4397938 12830 548249 -1955425 -4136248 -3690251 -578167 3516253
3966 3516253 6414192 7174663 6755820 6410869 6069562 5159410 4105986 3789142 4307855
3957 4307855 5485055 7622958 10334947 11618632 9781138 5617020 1282007 -2068073
3949 -2068073 -4138301 -4395052 -3045871 -1895974 -2189724 -2899353 -3233353 -4856845 -8475460
3940 -8475460 -10163418 -5629082 2576803 7021259 5024090 1687539 2160297 5445425
3932 5445425 7907438 8702376 8810586 8028417 6207942 5071757 5665810 5868579 3359305
3923 3359305 -452525 -2261308 -1470620 -398611 -773694 -2317721 -4089751 -5227095 -4994232
3914 -4994232 -3751171 -3103449 -3736612 -4235351 -3375789 -2098426 -1742607 -2127502 -3055052
$$ packed form
3975i121889J91812M532139M410768N35419k503674k180823M45997L112084M094420
3966C516253K897939P60471m18843l44951l41307r10152j053424l16844N18713
3957D307855J177200K137903K711989J283685j837494m164118m335013l350080
3949b068073k070228k56751J349181J149897k93750p09629l34000j623492l618615
3940h475460j687958M534336Q205885M444456j997169l336551M72758L285128
3932E445425K462013P94938J08210p82169j820475j136185N94053K02769k509274
3923C359305l811830j808783P90688J072009l75083j544027j772030j137344K32863
3914d994232J243061O47722o33163m98739Q59562J277363L55819l84895r27550
$$ plain form
3905 -3055052 -5427461 -8508051 -8539229 -3489704 2703348 4589705 2667771 2073845 4417684
3896 4417684 5800915 3711679 1191838 1946614 4809954 5822782 3598952 55151
3888 55151 -2827335 -4666238 -5654353 -5549538 -3842649 -592979 2634403 3237091 422153
3879 422153 -2750903 -2298254 1474861 4004584 2414363 -1013932 -2611213 -2189408 -2052638
3870 -2052638 -2842559 -2868285 -936756 2175240 4879631 5979485 5027712 2749865 778619
3861 778619 -146492 -1233045 -3734619 -6677339 -8099477 -8137201 -8818123 -10478733 -10504765
3852 -10504765 -6921097 -1766904 952110 102708 -1694820 -2105689 -1912650 -2677651 -3351187
3843 -3351187 -1501291 2671035 6051373 6667207 5642708 4298798 1973337 -1428987
$$ packed form
3905c055052k372409l080590l1178N049525O193052J886357j921934n93926K343839
3896D417684J383231k089236k519841P54776K863340J012828k223830l543801
3888E5151k882486j838903r88115J04815J706889L249670L227382O02688k814938
3879D22153l173056M52649L773115K529723j590221l428295j597281M21805J36770
3870b052638p89921k5726J931529L111996K704391J099854r51773k277847j971246
3861G78619r25111j086553k501574k942720j422138l7724o80922j660610k6032
3852a0504765L583668N154193K719014q49402j797528m10869J93039p65001o73536
3843c351187J849896M172326L380338O15834j024499j343910k325461l402324
$$ plain form
3835 -1428987 -3238765 -1466445 1080200 -175748 -4777789 -7184177 -4204917 841897
3827 841897 2779117 570288 -3029973 -5371895 -5362309 -2934505 623225 2955192 3082710
3818 3082710 2509184 2486967 1831095 -645468 -3307639 -3980166 -3708112 -5027679 -7157166
3809 -7157166 -6540190 -2570679 719455 79247 -2741488 -4191133 -4051888 -4716430 -6576594
3800 -6576594 -7094692 -4681575 -1242438 185942 -900634 -2346451 -2370935 -1540255 -1403651
3791 -1403651 -2005977 -1776189 63661 2031037 2184423 873382 455926 2049010 3647385
3782 3647385 2366702 -1800240 -5357350 -4732645 48 5140879 7045270 5513163
3774 5513163 3445573 3531298 5724540 7777873 7553712 4696831 745979 -2024078 -2394931
$$ packed form
3835a428987j809778J772320K546645j255948m602041k406388K979260N046814
3827H41897J937220k208829l600261k341922R586K427804L557730K331967J27518
3818C082710n73526k2217o55872k476563k662171o72527K72054j319567k129487
3809g157166O16976L969511L290134o40208k820735j449645J39245o64542j860164
3800f576594n18098K413117L439137J428380j086576j445817k4484Q30680J36604
3791a403651o02326K29788J839850J967376J53386j311041m17456J593084J598375
3782C647385j280683m166942l557110O24705M732693N140831J904391j532107
3774E513163k067590Q5725K193242K053333k24161k856881l950852k770057l70853
$$ plain form
3765 -2394931 -1223235 -301642 -191323 -47075 269395 -632442 -3413415 -6209468 -6666678
3756 -6666678 -5056451 -3749273 -4027234 -5052155 -5665308 -5372434 -3624619 -153210 3636918
3747 3636918 5575587 5630023 5996325 7556598 8346443 6765446 4233187 2882297 2411168
3738 2411168 1429986 496799 1192015 2955861 3486370 2033475 -64288 -1909989 -3666892
3729 -3666892 -4803211 -4547742 -4376923 -6914931 -11351555 -13086873 -9728743 -4681632 -2487726
3720 -2487726 -3080293 -3491561 -3080370 -3370604 -3938872 -2639410 -15186 385560 -2772985
3711 -2772985 -6181065 -6263217 -3600009 -1232113 -472539 -408114 -340761 -685358 -1724101
3702 -1724101 -2785444 -2755555 -1072703 1447472 2927939 2522413 1916802 3134043 4934219
$$ packed form
3765b394931J171696R21593J10319J44248L16470r01837k780973k796053m57210
3756f666678J610227J307178k77961j024921o13153K92874J747815L471409L790128
3747C636918J938669N4436L66302J560273P89845j580997k532259j350890m71129
3738B411168r81182r33187O95216J763846N30509j452895k097763j845701j756903
3729c666892j136319K55469J70819k538008m436624j735318L358130N047111K193906
3720b487726n92567m11268M11191k90234n68268J299462K624224M00746l158545
3711b772985l408080q2152K663208K367896P59574O4425O7353l44597j038743
3702a724101j061343K9889J682852K520175J480467m05526o05611J217241J800176
$$ plain form
3693 4934219 3696086 -1479850 -6938229 -8941250 -7735049 -5666025 -3589573 -1293501
3685 -1293501 513164 1213526 1861140 3302921 4056596 2542853 55557 -1220329 -1733322
3676 -1733322 -2962338 -3733508 -2132159 -239058 -2238403 -7462040 -10024191 -6788425
3668 -6788425 -1500421 989431 818415 912726 1966096 2602683 2189506 710720 -2243003
3659 -2243003 -5904311 -7668091 -6446069 -4806200 -5300305 -6639718 -6275567 -4768840 -4254500
3650 -4254500 -4138980 -2069557 1648677 4211612 4479394 3633753 2088854 -627030 -2918271
3641 -2918271 -1926525 1916577 4661873 4352398 3439518 4062916 4136413 771381 -4579215
3632 -4579215 -7436848 -6018189 -3230874 -2838141 -5134756 -6961327 -5597949 -2304638
$$ packed form
3693D934219j238133n175936n458379k003021J206201K069024K076452K296072
3685a293501J806665P00362O47614J441781P53675j513743k487296j275886n12993
3676a733322j229016p71170J601349J893101j999345n223637k562151L235766
3668f788425N288004K489852j71016R4311J053370O36587m13177j478786k953723
3659b243003l661308j763780J222022J639869m94105j339413L64151J506727N14340
3650d254500J15520K069423L718234K562935K67782q45641j544899k715884k291241
3641b918271R91746L843102K745296l09475r12880O23398P3497l365032n350596
3632d579215k857633J418659K787315L92733k296615j826571J363378L293311
$$ plain form
3624 -2304638 -1409621 -5295616 -11028685 -13312356 -10398366 -5506681 -2652542 -2879453 -4546518
3615 -4546518 -5327016 -3685092 -283873 1850127 482322 -2560015 -3681898 -3003183 -4199045
3606 -4199045 -8089647 -10245140 -7215182 -1916065 281418 -1427801 -3473079 -3608032
3598 -3608032 -3031181 -3415263 -4804580 -6492774 -7715955 -7366501 -4816941 -1190604 1326224
3589 1326224 1240410 -1680781 -6260562 -9387411 -7685090 -1630552 3824627 4986628 3847512
3580 3847512 4121430 5150700 3717297 299164 -1345639 -376424 369526 151781 1569902
3571 1569902 4622068 4887610 529292 -3482528 -2045478 2628071 4527541 2325278
3563 2325278 -114115 -90960 1576649 3814505 6499854 8266503 7127227 4164577 3204508
$$ packed form
3624b304638Q95017l885995n733069k283671K913990M891685K854139k26911j667065
3615d546518p80498J641924L401219K134000j367805l042337j121883O78715j195862
3606d199045l890602k155493L029958N299117K197483j709219k045278j34953
3598c608032N76851l84082j389317j688194j223181L49454K549560L626337K516828
3589A326224q5814k921191m579781l126849J702321O054538N455179J162001j139116
3580C847512K73918J029270j433403l418133j644803R69215P45950k17745J418121
3571A569902L052166K65542m358318m011820J437050M673549J899470k202263
3563B325278k439393K3155J667609K237856K685349J766649j139276k962650r60069
$$ plain form
3554 3204508 5574476 8063917 7527350 4952235 3189883 2781387 2163254 591594 -1284959
3545 -1284959 -2983916 -4410204 -4912254 -3861909 -2208418 -1973609 -3742943 -5598242 -5050945
3536 -5050945 -1538972 3260028 7095270 8778954 8580965 7574691 6669976 6052309 5486779
3527 5486779 5169549 5931128 8044504 9948439 9222020 5553221 1870540 1188080 2757006
3518 2757006 3098123 941423 -1004565 -147444 2279089 3492249 3417045 3880545 4407007
3509 4407007 2308975 -2295381 -4757306 -1449941 4728347 7082583 3057236 -2704691
3501 -2704691 -3748487 1227762 7705951 10709385 9464153 6714838 4833567 3844459
3493 3844459 2790900 1362250 -352577 -2249857 -3277446 -1441378 3538693 8413367
$$ packed form
3554C204508K369968K489441n36567k575115j762352m08496o18133j571660j876553
3545a284959j698957j426288n02050J050345J653491K34809j769334j855299N47297
3536e050945L511973M799000L835242J683684j97989j006274r04715o17667n65530
3527E486779l17230P61579K113376J903935p26419l668799l682681o82460J568926
3518B757006L41117k156700j945988Q57121K426533J213160p5204M63500N26462
3509D407007k098032m604356k461925L307365O178288K354236m025347n761927
3501b704691j043796M976249O478189L003434j245232k749315j881271r89108
3493C844459j053559j428650j714827j897280j027589J836068M980071M874674
$$ plain form
3485 8413367 9353026 6558200 3885030 3722845 4435702 3580186 1469285 86080 32559
3476 32559 281202 80665 -419320 -986367 -1557551 -1875261 -1525422 -47203 3008362 7026694
3466 7026694 9273529 6920614 1160774 -2767930 -1536509 1919719 2267359 -1250554
3458 -1250554 -4390110 -3854837 -879898 1250604 851702 -1416491 -3406407 -2696837 1077183
3449 1077183 4674327 4023904 -848514 -5587297 -6786583 -5364158 -3799389 -2486355
3441 -2486355 -694227 752029 280678 -1635682 -2648467 -1518258 472618 1192714 -137638
3432 -137638 -2343235 -3263659 -1591623 1718675 4228225 4593612 3858557 3852946 5047015
3423 5047015 6397119 6469278 4261230 -108175 -4918973 -7958806 -8600599 -7818629 -6061162
$$ packed form
3485H413367R39659k794826k673170j62185P12857q55516k110901j383205n3521
3476C2559K48643k00537m99985n67047n71184l17710L49839J478219L055565M018332
3466G026694K246835k352915n759840l928704J231421L456228L47640l517913
3458a250554l139556N35273K974939K130502l98902k268193j989916P09570L774020
3449A077183L597144o50423m872418m738783j199286J422425J564769J313034
3441b486355J792128J446256m71351j916360j012785J130209J990876P20096j330352
3432a37638k205597r20424J672036L310298K509550L65387p35055n611J194069
3423E047015J350104P2159k208048m369405m810798l039833o41793P81970J757467
$$ plain form
3414 -6061162 -2946975 355842 919947 -2065344 -5287594 -5415559 -3474211 -2514122 -2463703
3405 -2463703 -637479 3374537 6900366 8343842 8737568 8532078 6187638 1344896 -3375654
3396 -3375654 -5392770 -4804486 -2731874 424789 3367251 3281818 -469784 -4067988 -3643213
3387 -3643213 -484658 1342141 1386430 2908475 6699690 8986564 6956131 3004798 1123216
3378 1123216 1397988 944504 -966635 -1790629 123154 2603110 1994255 -2636548 -8531258
3369 -8531258 -12030244 -11671854 -8608830 -4628859 -616029 2704691 3590506 664068 -4334499
3360 -4334499 -7131855 -5504323 -1887932 45063 -13687 58487 547516 -294335 -2412068
3351 -2412068 -3447247 -2979965 -3823130 -7175547 -9626361 -7855766 -3798028 -1532534 -838185
$$ packed form
3414f061162L114187L302817N64105k985291l222250j27965J941348R60089N0419
3405b463703J826224M012016L525829J443476L93726k05490k344440m842742m720550
3396c375654k017116N88284K072612L156663K942462q5433l751602l598204M24775
3387c643213L158555J826799M4289J522045L791215K286874k030433l951333j881582
3378A123216K74772m53484j911139q23994J913783K479956o08855m630803n894710
3369h531258l498986L58390L063024L979971M012830L320720Q85815k926438m998567
3360d334499k797356J627532L616391J932995n8750P2174M89029q41851k117733
3351b412068j035179M67282q43165l352417k450814J770595M057738K265494O94349
$$ plain form
3342 -838185 1862853 6807217 9648482 7518957 2438967 -2317231 -5505803 -6215901 -2960961
3333 -2960961 2943136 6488209 4811268 1531218 1893602 5564642 7931803 7125945 5630747
3324 5630747 5332594 5005641 3348216 1193266 -443653 -2000537 -3889521 -5304983 -5528709
3315 -5528709 -5007815 -4546972 -4688927 -5970690 -8206248 -9559877 -8265412 -5356526 -3558547
3306 -3558547 -3244315 -1925523 1572879 4940692 5633979 4185256 2754522 2071165 1455856
3297 1455856 710398 485624 1395696 3580361 6387907 8121725 7313547 4667846 2381221
3288 2381221 1230572 83073 -1299918 -1232560 1048006 3589574 4229385 3198536 1900181
3279 1900181 840259 200206 602913 1508710 540104 -3460996 -7913320 -9099747 -6469494
$$ packed form
3342h38185K701038M944364K841265k129525n079990m756198l188572p10098L254940
3333b960961N904097L545073j676941l280050L62384L671040K367161q05858j495198
3324E630747k98153l26953j657425k154950j636919j556884j888984j415462k23726
3315e528709N20894M60843j41955j281763k235558j353629J294465K908886J797979
3306c558547L14232J318792L498402L367813O93287j448723j430734o83357o15309
3297A455856p45458k24774R10072K184665K807546J733818q08178k645701k286625
3288B381221j150649j147499j382991O7358K280566K541568O39811j030849j298355
3279A900181j059922o40053M02707R05797r68606m001100m452324j186427K630253
$$ plain form
3270 -6469494 -2684744 -340950 -233486 -1748979 -3131675 -2270891 973571 3951386 4184299
3261 4184299 2163506 -139829 -1944857 -2891258 -1371163 3434012 8788696 10785474
3253 10785474 9318813 7855517 8072067 7519737 3557138 -2552642 -6850374 -6922591 -3990385
3244 -3990385 -1298727 -1006965 -2641089 -4489410 -5877532 -7031002 -7301640 -5731708 -3443413
3235 -3443413 -2638892 -2589141 -152978 4237116 5372830 1025680 -3348543 -2183186 1519105
3226 1519105 900722 -3802197 -5747603 -2127140 2367271 3289748 1655770 212743 -138923
3217 -138923 1161755 4403606 6830663 4738824 -457748 -3472901 -3528636 -5328157 -9911714
3208 -9911714 -11610230 -7442908 -2565738 -1750912 -2120229 -126714 696747 -3505276 -7673761
$$ packed form
3270f469494L784750K343794J07464j515493j382696Q60784L244462K977815K32913
3261D184299k020793k303335j805028r46401J520095M805175N354684J996778
3253A0785474j466661j463296K16550n52330l962599o109780m297732p2217K932206
3244c990385K691658K91762j634124j848321j388122j153470k70638J569932K288295
3235c443413Q04521M9751K436163M390094J135714m347150m374223J165357L702291
3226A519105o18383m702919j945406L620463M494411R22477j633978j443027l51666
3217a38923J300678L241851K427057k091839n196572l015153n5735j799521m583557
3208i911714j698516M167322M877170Q14826l69317J993515Q23461m202023m168485
$$ plain form
3199 -7673761 -4327530 3885953 7366685 3852479 487519 1679207 3803602 3565467
3191 3565467 3318695 4874362 4904133 619995 -5034396 -7686041 -7077705 -5265671 -3178190
3182 -3178190 -1927234 -3562471 -7051252 -7088962 -844173 6918500 9402084 6264261 2704043
3173 2704043 1899494 2411587 2111919 818702 -807124 -1861220 -737825 3195902 7495411
3164 7495411 8818425 7339565 6403620 7333589 7314248 3877165 -622760 -1413473 2317708
3155 2317708 5710281 3878537 -2001128 -6024275 -4790599 -1101236 577322 -8735
3147 -8735 -82344 836234 654518 -521950 301611 3645920 5538780 3341191 279832
3138 279832 912079 4504730 6551827 5284676 2959413 1550648 804412 327744 253208
$$ packed form
3199g673761L346231Q213483L480732l514206l364960J191688K124395k38135
3191C565467k46772J555667K9771m284138n654391k651645O08336J812034K087481
3182c178190J250956j635237l488781l7710O244789P762673K483584l137823l560218
3173B704043q04549N12093k99668j293217j625826j054096J123395L933727M299509
3164G495411J323014j478860r35945R29969j9341l437083m499925p90713L731181
3155B317708L392573j831744n879665m023147J233676L689363J678558n86057
3147h735p3609R18578j81716j176468Q23561L344309J892860k197589l061359
3138B79832O32247L592651K047097j267151k325263j408765p46236m76668p4536
$$ plain form
3129 253208 -312387 -2422487 -4616324 -4189553 -1663409 -813601 -3172283 -5536981 -4612407
3120 -4612407 -1481305 660444 1069046 1277100 1837663 1866588 1155737 400813 -493828
3111 -493828 -2315614 -4604801 -5563748 -4443221 -2810265 -2792453 -4666108 -6504155 -5863004
3102 -5863004 -1968329 3178214 6107257 5149960 2327677 1071811 2095923 2756575 932862
3093 932862 -1786353 -2029431 871708 3868481 3989167 1964441 1117513 3164597 6348518
3084 6348518 8030011 8036885 8322046 9662930 10223555 8157608 4614147 2701010 3550455
3075 3550455 4863062 4052685 1775258 1075887 3371976 6624815 7837077 6306911 3636500
3066 3636500 1182647 -1374179 -4803193 -8454596 -10234567 -8567265 -4359406 -812202
$$ packed form
3129B53208n65595k110100k193837M26771K526144Q49808k358682k364698R24574
3120d612407L131102K141749M08602K08054N60563K8925p10851p54924q94641
3111d93828j821786k289187r58947J120527J632956J7812j873655j838047O41151
3102e863004L894675N146543K929043r57297k822283j255866J024112O60652j823713
3093I32862k719215k43078K901139K996773J20686k024726q46928K047084L183921
3084F348518J681493O874K85161J340884N60625k065947l543461j913137Q49445
3075C550455J312607q10377k277427o99371K296089L252839J212262j530166k670411
3066C636500k453853k556826l429014l651403j779971J667302M207859L547204
$$ plain form
3058 -812202 -721069 -3575164 -5731263 -4091905 544050 4428898 5045758 3485912 2461523
3049 2461523 2942909 3613773 3161597 1984887 1360927 1650562 1956449 1391131 114071
3040 114071 -1083775 -1779943 -1955214 -1188361 1297067 5240323 8598798 9163370 6974893
3031 6974893 4466581 4026528 5808378 7863411 7857890 4797273 -54171 -3804491 -4350017
3022 -4350017 -2424363 -417050 853219 2663690 5181001 5879426 3104857 -335796
3014 -335796 -102994 3514056 5611940 3661023 1246733 2657521 6332037 7117309 3829802
3005 3829802 599005 307317 489575 -2330038 -7054458 -9520414 -7918441 -3827036 1146579
2996 1146579 6467929 10426168 10226874 5814553 1231496 296901 2419096 4302987 4347902
$$ packed form
3058h12202R1133k854095k156099J639358M635955L884848O16860j559846j024389
3049B461523M81386O70864m52176j176710o23960K89635L05887n65318j277060
3040A14071j197846o96168j75271P66853K485428L943256L358475N64572k188477
3031F974893k508312m40053J781850K055033n521l060617m851444l750320n45526
3022d350017J925654K007313J270269J810471K517311O98425k774569l440653
3014c35796K32802L617050K097884j950917k414290J410788L674516P85272l287507
3005C829802l230797k91688J82258k819613m724420k465956J601973M091405M973615
2996A146579N321350L958239j99294m412321m583057r34595K122195J883891M4915
$$ plain form
2987 4347902 3386126 2225332 930393 230987 1254739 3466400 4851118 4911180 5822235
2978 5822235 9384926 13819392 14985069 10760032 3496973 -2071594 -3206761 -1310949
2970 -1310949 350905 581630 854832 2032510 2432438 485632 -2377862 -3682437 -3562089
2961 -3562089 -3817429 -4214117 -3103807 -1484772 -2319551 -4908396 -4405623 743085 5130320
2952 5130320 3807067 -269694 -1114311 714197 -307923 -4577016 -6007709 -2073214
2944 -2073214 1744743 1053533 71811 4549953 11533867 13239074 9176630 6840737 9775859
2935 9775859 12197073 8384064 1430043 -1971813 -1187614 -619708 -1701979 -1911352 -787900
2926 -787900 -935379 -2546821 -2682997 -1594894 -3984789 -10713580 -14456258 -8705470 2391205
$$ packed form
2987D347902r61776j160794j294939o99406J023752K211661J384718O0062R11055
2978E822235L562691M434466J165677m225037p263059n568567j135167J895812
2970a310949J661854K30725K73202J177678L99928j946806k863494j304575J20348
2961c562089k55340l96688J110310J619035q34779k588845N02773N148708M387235
2952E130320j323253m076761q44617J828508j022120m269093j430693L934495
2944b073214L817957o91210r81722M478142O983914J705207m062444k335893K935122
2935I775859K421214l813009o954021l401856P84199N67906j082271k09373J123452
2926g87900j47479j611442j36176J088103k389895o728791l742678N750788J1096675
$$ plain form
2917 2391205 8957969 8119457 5700394 5963584 6283478 3405402 -948964 -3768692 -5604274
2908 -5604274 -8133366 -10056222 -9178115 -6578139 -5278482 -5952352 -6690038 -5994809 -3742774
2899 -3742774 -394390 2548152 2674736 -389053 -3447751 -3430666 -1231685 408407 988409
2890 988409 1316777 439836 -2725938 -6034503 -6489276 -5110469 -5162782 -6266984 -5193455
2881 -5193455 -2292894 -1427606 -2627898 -1007283 4605631 8019261 4673876 -930530
2873 -930530 -2027784 301456 5069 -3678126 -5716101 -4061528 -1977227 -910093 2213408
2864 2213408 8024993 10905742 6493003 -910214 -3441480 -112337 2931160 1987841
2856 1987841 429313 2223902 5191406 4327252 -245597 -2908263 -421534 3417945
$$ packed form
2917B391205O566764q38512k419063K63190L19894k878076m354366k819728j835582
2908e604274k529092j922856Q78107K599976J299657o73870p37686O95229K252035
2899c742774L348384K942542J26584l063789l058698J7085K198981J640092N80002
2890I88409L28368q76941l165774l308565m54773J378807n2313j104202J073529
2881e193455K900561Q65288j200292J620615N612914L413630l345385n604406
2873i30530j097254K329240k96387l683195k037975J654573K084301J067134L123501
2864B213408N811585K880749m412739p403217k531266L329143L043497r43319
2856A987841j558528J794589K967504q64154m572849k662666K486729L839479
$$ plain form
2848 3417945 2973425 -1708339 -5457194 -5142189 -3074445 -2694012 -3657443 -3049390 82232
2839 82232 3481885 4584457 3256890 1728715 2581377 6506900 11406809 14076800 13258265
2830 13258265 10506498 7826233 5594795 3459706 1853952 1222733 720438 -706534
2822 -706534 -2430691 -2818635 -1576228 -162922 62335 -814931 -1579676 -868888 1618657
2813 1618657 4155478 4042160 620377 -3594851 -5828431 -6081017 -6070252 -6454990 -6823525
2804 -6823525 -7186699 -7319340 -5678890 -1525238 2665950 3773520 2585051 2698214 5012099
2795 5012099 6791056 6639494 6567013 7694088 7585749 4237176 -233463 -2572104 -2615429
2786 -2615429 -1679388 846569 5457952 8577445 5232470 -3830900 -11386282 -11558660 -6084579
$$ packed form
2848C417945m44520m681764l748855L15005K067744L80433r63431O08053L131622
2839H2232L399653J102572j327567j528175Q52662L925523M899909K669991q18535
2830A3258265k751767k680265k231438k135089j605754o31219n02295j426972
2822g06534j724157l87944J242407J413306K25257q77266p64745P10788K487545
2813A618657K536821j13318l421783m215228k233580k52586J0765l84738l68535
2804f823525l63174j32641J640450M153652M191188J107570j188469J13163K313885
2795E012099J778957j51562p2481J127075j08339l348573m470639k338641m3325
2786b615429R36041K525957M611383L119493l344975r063370p555382j72378N474081
$$ plain form
2777 -6084579 -1431773 -1538733 -4871272 -7336729 -6465141 -3174454 -607324 -1216155 -4396850
2768 -4396850 -7030847 -6599105 -3491767 -20274 2331894 3904856 5136132 4912792 1859622
2759 1859622 -2799702 -5265873 -3265772 811105 2585794 1104911 -422423 555451
2751 555451 2617463 2809010 472391 -2683063 -4767696 -4588196 -1911434 1427635 2054891
2742 2054891 -1263187 -5390034 -6225519 -3540389 -435631 1193739 2293758 4131072
2734 4131072 6518721 8656641 9786735 9024670 6422777 4031194 3846894 4895964 4613930
2725 4613930 2865317 1793739 1645109 174526 -2832605 -3946904 -1010474 3130589
2717 3130589 4225829 1859726 -1209655 -2998557 -3076876 -1150822 2228532 4649754 4315577
$$ packed form
2777f084579M652806j06960l332539k465457Q71588L290687K567130o08831l180695
2768d396850k633997M31742L107338L471493K352168J572962J231276k23340l053170
2759A859622m659324k466171K000101M076877J774689j480883j527334R77874
2751E55451K062012J91547k336619l155454k084633J79500K676762L339069O27256
2742B054891l318078m126847q35485K685130L104758J629370J100019J837314
2734D131072K387649K137920J130094p62065k601893k391583j84300J049070k82034
2725D613930j748613j071578j48630j470583l007131j114299K936430M141063
2717C130589J095240k366103l069381j788902p8319J926054L379354K421222l34177
$$ plain form
2708 4315577 2747408 2441804 2749197 1106873 -2188275 -3888318 -2744959 -1273511 -1709183
2699 -1709183 -3200594 -4315877 -5513759 -7215062 -7769988 -5782708 -2920291 -1905852
2691 -1905852 -2573205 -2267203 206575 3217163 4926092 5293434 5059466 4465947 3814874
2682 3814874 3996986 5412738 7126374 7989987 8016209 7745096 6806438 4359211 894441
2673 894441 -1728507 -2583390 -2977205 -4568897 -6942779 -8242188 -7843987 -7017399 -6833951
2664 -6833951 -6810178 -6141263 -5077587 -4327870 -4100359 -4489031 -5705654 -6959640 -6325714
2655 -6325714 -3162772 337282 1719889 1547707 2099886 3469494 3533637 1808588 553984
2646 553984 1226379 2322750 2039014 918969 294557 -16655 -655758 -979270 -295698
$$ packed form
2708D315577j568169l05604L07393j642324l295148j700043J143359J471448m35672
2699a709183j491411j115283j197882j701303n54926J987280K862417J014439
2691a905852o67353L06002K473778L010588J708929L67342k33968n93519o51073
2682C814874J82112J415752J713636Q63613K6222k71113r38658k447227l464770
2673H94441k622948q54883l93815j591692k373882j299409L98201Q26588J83448
2664f833951K3773O68915J063676P49717K27511l88672j216623j253986O33926
2655f325714L162942L500054J382607j72182N52179J369608O4143j725049j254604
2646E53984O72395J096371k83736j120045o24412l11212o39103l23512O83572
$$ plain form
2637 -295698 573750 962739 2096540 4704376 6231353 3625944 -1565550 -4190220 -1857038
2628 -1857038 2725372 6351670 9029473 11727984 13455482 12857367 10628339 8077409
2620 8077409 5070357 1756728 574297 3413614 7747634 8971016 6505089 4276448
2612 4276448 4581623 4900413 2477977 -907496 -1611871 95855 134680 -3680606 -8688009
2603 -8688009 -10808585 -9012702 -5349016 -1930828 668571 2602822 3791860 4077108
2595 4077108 3514384 1994753 -977255 -5389021 -9580257 -10861520 -8067852 -3208855
2587 -3208855 358080 1461018 1811931 2885406 3520209 1922572 -891305 -1692165 725289
2578 725289 3698865 4034085 1930613 276729 729019 2023051 2223787 1280410 565256
$$ packed form
2637b95698Q69448L88989J133801K607836J526977k605409n191494k624670K333182
2628a857038M582410L626298K677803K698511J727498n98115k229028k550930
2620H077409l007052l313629j182431K839317M334020J223382k465927k228641
2612D276448L05175L18790k422436l385473p04375J707726L8825l815286n007403
2603h688009k120576J795883L663686L418188K599399J934251J189038K85248
2595D077108n62724j519631k972008m411766m191236j281263K793668M858997
2587c208855L566935J102938L50913J073475O34803j597637k813877q00860K417454
2578G25289K973576L35220k103472j653884M52290J294032K00736r43377p15154
$$ plain form
2569 565256 579637 215480 -1468576 -3414690 -3278511 -92756 4323283 7049561 6892007
2560 6892007 5101820 3591649 3154757 3429508 3845599 4210139 4661659 5243731 5500620
2551 5500620 4863460 3730711 3435987 4387497 5145381 4599076 3926304 4293707 3817070
2542 3817070 348519 -3071330 -488343 7596471 12343807 7858114 -120209 -2233759
2534 -2233759 1282835 2504476 -903688 -2756506 491183 4106442 3824779 2729674
2526 2729674 4532728 6444955 4924310 3232225 6125115 11311872 14240201 17623144
2518 17623144 25899850 31819971 21201701 -5509972 -27768006 -28256744 -13707347 -4039459
2510 -4039459 -6796461 -12524801 -12430819 -9081133 -7917454 -7935243 -5910785 -3638225 -4882280
$$ packed form
2569E65256J4381l64157j684056j946114J36179L185755M416039K726278j57554
2560F892007j790187j510171m36892K74751M16091L64540M51520N82072K56889
2551E500620o37160j132749k94724R51510P57884n46305o72772L67403m76637
2542C817070l468551l419849K582987Q084814M747336m485693p978323k113550
2534b233759L516594J221641l408164j852818L247689L615259k81663j095105
2526B729674J803054J912227j520645j692085K892890N186757K928329L382943
2518A7623144Q276706N920121j0618270k6711673k2258034m88738J4549397R667888
2510d039459k757002n728340R3982L349686J163679j7789K024458K272560j244055
$$ plain form
2501 -4882280 -8258373 -8722550 -5140574 -1776802 -1939535 -3781934 -3716189 -1411600 619470
2492 619470 1051579 1018631 1401615 1086408 -740733 -2085672 -350745 3189859 3907905
2483 3907905 -41232 -4564253 -4793832 -1553964 299261 -1043195 -2531500 -1747645 -551441
2474 -551441 -1595352 -4029270 -5165667 -4752085 -4908756 -6361027 -7057769 -4898564 -435844
2465 -435844 3637080 5055208 3863583 2076463 1491358 1942660 2132125 1743991 1464205
2456 1464205 1082262 -411275 -2297589 -2055457 794166 3092050 2437412 975863 1731250
2447 1731250 2953348 321086 -5764793 -9739953 -8618748 -5814957 -5294474 -5955911 -4944555
2438 -4944555 -3293401 -4056039 -6522195 -6605598 -2763983 1998299 4386304 4220697 3096167
$$ packed form
2501d882280l376093m64177L581976L363772j62733j842399O5745K304589K031070
2492F19470M32109l2948L82984l15207j827141j344939J734927L540604P18046
2483C907905l949137m523021k29579L239868J853225j342456j488305P83855J196204
2474e51441j043911k433918j136397M13582j56671j452271o96742K159205M462720
2465d35844M072924J418128j191625j787120n85105M51302J89465l88134k79786
2456A464205l81943j493537j886314K42132K849623K297884o54638j461549P55387
2447A731250J222098k632262o085879l975160J121205K803791N20483o61437J011356
2438d944555J651154p62638k466156q3403L841615M762282K388005j65607j124530
$$ plain form
2429 3096167 2139959 1875718 2418648 3162453 3602844 4319307 5474943 5023945 1071813
2420 1071813 -4226726 -6346659 -4430206 -2365950 -2965238 -4580114 -4983186 -4835857 -4863364
2411 -4863364 -3176705 1186242 5015963 5180185 3679300 3981352 4331876 251355 -6960103
2402 -6960103 -10217480 -6347205 -551022 1113838 -610919 -1036868 1319536 3909520
2394 3909520 4453877 2958875 562853 -1302924 -1535119 -769669 -886192 -1827020 -1030078
2385 -1030078 2135190 3993746 1676357 -1582194 -374139 4636994 6867860 2571651
2377 2571651 -4659227 -9433994 -10913242 -11332965 -11086084 -8590526 -3960078 185925 1828005
2368 1828005 1592074 1196039 1078729 281835 -1812175 -4250509 -5233545 -4049935 -1937785
$$ packed form
2429C096167r56208k64241N42930P43805M40391P16463J155636m50998l952132
2420A071813n298539k119933J916453K064256n99288j614876m03072J47329k7507
2411d863364J686659M362947L829721J64222j500885L02052L50524m080521p211458
2402f960103l257377L870275N796183J664860j724757m25949K356404K589984
2394C909520N44357j495002k396022j865777k32195P65450j16523r40828P96942
2385a030078L165268J858556k317389l258551J208055N011133K230866m296209
2377B571651p230878m774767j479248m19723K46881K495558M630448M146003J642080
2368A828005k35931l96035j17310p96894k094010k438334r83036J183610K112150
$$ plain form
2359 -1937785 -582690 -99979 587164 1467752 923730 -1869097 -5236956 -6869728 -6582305
2350 -6582305 -5858829 -5246054 -4021286 -2428414 -2083095 -3192420 -3289377 -572168 2733321
2341 2733321 2658642 -1326029 -5819723 -8193794 -9102450 -9611719 -8828029 -6293213 -4185714
2332 -4185714 -4324513 -4751268 -2569749 869881 1274543 -2252841 -5799081 -6211521 -4762594
2323 -4762594 -4078421 -4400837 -4489121 -3728105 -1766432 1569246 4501176 4130216 969408
2314 969408 -207365 3246798 7229224 6168606 985990 -2364254 -1409696 171733 -1180851
2305 -1180851 -3954099 -4590162 -2794977 -1596921 -3131862 -5951435 -6576162 -3401227 1085904
2296 1085904 2697007 490324 -1940667 -1063705 2195509 4191909 3294337 920175 -973577
$$ packed form
2359a937785J355095M82711O87143Q80588n44022k792827l367859j632772K87423
2350f582305P23476O12775J224768J592872L45319j109325r6957K717209L305489
2341B733321p4679l984671m493694k374071r08656n09269P83690K534816K107499
2332d185714j38799m26755K181519L439630M04662l527384l546240m12440J448927
2323d762594O84173l22416q8284P61016J961673L335678K931930l70960l160808
2314I69408j176773L454163L982426j060618n182616l350244R54558J581429j352584
2305a180851k773248o36063J795185J198056j534941k819573o24727L174935M487131
2296A085904J611103k206683k430991Q76962L259214J996400q97572k374162j893752
$$ plain form
2287 -973577 -1257607 482617 3099541 3795239 1227229 -2170663 -3295694 -2549633 -2107371
2278 -2107371 -1552351 890044 3716835 3342072 25414 -1918172 -518495 1700069 2958683
2269 2958683 4723847 7021539 6210221 748988 -4857890 -5831494 -3689955 -2860587 -3325517
2260 -3325517 -1573923 2363940 3938534 716426 -3905056 -5057852 -2042635 1751471
2252 1751471 3091506 1918815 715292 1474324 3442371 4283447 3347245 2455822 2947415
2243 2947415 3537138 2293458 -542452 -3115286 -4432959 -4979855 -5443984 -5803953 -5298777
2234 -5298777 -3088813 154994 1560600 -1133184 -5885476 -7875783 -5403557 -1685081
2226 -1685081 183381 984935 2407120 3497415 2799228 1533853 1629837 2402549 2005170
$$ packed form
2287i73577k84030J740224K616924O95698k568010l397892j125031P46061M42262
2278b107371N55020K442395K826791l74763l316658j943586J399677K218564J258614
2269B958683J765164K297692q11318n461233n606878r73604K141539Q29368m64930
2260c325517J751594L937863J574594l222108m621482j152796L015217L794106
2252A751471J340035j172691j203523P59032J968047Q41076r36202q91423M91593
2243B947415N89723j243680k835910k572834j317673n46896m64129l59969N05176
2234e298777K209964L243807J405606k693784m752292j990307K472226L718476
2226a685081J868462Q01554J422185J090295o98187j265375R5984P72712l97379
$$ plain form
2217 2005170 539264 -915776 -2550248 -4280303 -3931714 -350433 3273694 2885814 -664824
2208 -664824 -2883108 -1843540 343998 1640064 2147436 2401944 2737846 3923481 5535995
2199 5535995 4711889 -123881 -5502052 -6871341 -5164386 -4745466 -5799739 -4553307 -1093989
2190 -1093989 -388731 -3745291 -5568833 -1891666 3214503 3891345 895556 -875887 -134454
2181 -134454 316018 -1065576 -3131104 -4960851 -6467809 -6665466 -4500098 -1145944 966023
2172 966023 1021242 -113489 -1692579 -3000977 -2768184 -995276 -159082 -2089852 -4756194
2163 -4756194 -4862395 -2671944 -1246738 -1552468 -1651794 -755708 -715173 -2664729 -5005998
2154 -5005998 -5948770 -5832032 -5635746 -5049794 -3463067 -1523695 -322500 175499 927463
$$ packed form
2217B005170j465906j455040j634472j730055L48589L581281L624127l87880l550638
2208f64824k218284J039568K187538J296066N07372K54508L35902J185635J612514
2199E535995q24106m835770n378171j369289J706955M18920j054273J246432L459318
2190a093989P05258l356560j823542L677167N106169O76842k995789j771443P41433
2181a34454M50472j381594k065528j829747j506958j97657K165368L354154K111967
2172I66023N5219j134731j579090j308398K32793J772908Q36194j930770k666342
2163d756194j06201K190451J425206l05730r9326Q96086M0535j949556k341269
2154e005998r42772J16738J96286N85952J586727J939372J201195M97999P51964
$$ plain form
2145 927463 2698905 5629196 8869744 10133899 7070705 354497 -5588526 -6468859 -2433321
2136 -2433321 2600812 5429276 6094995 6341834 7309799 9153367 11397469 12777845 11808368
2127 11808368 8426862 4191844 106189 -4404303 -9094308 -11171439 -8405466 -2937779
2119 -2937779 1092250 3369478 7168773 12762768 15391452 12074658 6623256 4348152
2111 4348152 4693171 3394682 -42738 -1959073 -946571 230199 -363724 -1152314 -473742
2102 -473742 893623 1870950 2591044 2635593 887912 -1649210 -2099965 -219676 607404
2093 607404 -1390248 -3483294 -3010880 -1479915 -1192609 -893084 1480792 4111257 3780192
2084 3780192 1778383 2740864 7487794 11137916 9528497 4351631 260018 -756225
$$ packed form
2145I27463J771442K930291L240548J264155l063194o716208n943023q80333M035538
2136b433321N034133K828464O65719K46839R67965J843568K244102J380376r69477
2127A1808368l381506m235018m085655m510492m690005k077131K765973N467687
2119b937779M030029K277228L799295N593995K628684l316794n451402k275104
2111D348152L45019j298489l437420j916335J012502J176770n93923p88590O78572
2102d73742J367365R77327P20094M4549j747681k537122m50755J880289Q27080
2093F07404j997652k093046M72414J530965K87306K99525K373876K630465l31065
2084C780192k001809R62481M746930L650122j609419n176866m091613j016243
$$ plain form
2076 -756225 -113297 589063 1045753 866164 -857306 -3560606 -4442415 -1681199 2226607
2067 2226607 2898497 184817 -1160542 1526974 4477580 3303850 203975 513249 3838882
2058 3838882 4603670 1220466 -1726580 -1772154 -2421006 -5692074 -7012529 -2342424 4356691
2049 4356691 6283481 3109157 -239222 -1409885 -1672169 -1153259 1107390 3313064 2703814
2040 2703814 889693 2102246 5987310 7394497 4222632 546356 373674 2674074
2032 2674074 4653129 6076304 7619156 7846412 5011073 539061 -1793432 20149
2024 20149 4058743 6306760 4473588 417157 -1627231 115550 2895109 3296126 1581374
2015 1581374 228794 -130581 -326765 507096 3883008 7983464 8641179 5069322 1329747
$$ packed form
2076g56225O42928P02360M56690j79589j723470k703300q81809K761216L907806
2067B226607O71890k713680j345359K687516K950606j173730l099875L09274L325633
2058C838882P64788l383204k947046m5574o48852l271068j320455M670105O699115
2049D356691J926790l174324l348379j170663k62284N18910K260649K205674o09250
2040B703814j814121J212553L885064J407187l171865l676276j72682K300400
2032B674074J979055J423175J542852K27256k835339m472012k332493J813581
2024B0149M038594K248017j833172m056431k044388J742781K779559M01017j714752
2015A581374j352580l59375j96184Q33861L375912M100456O57715l571857l739575
$$ plain form
2006 1329747 979561 3068779 4691738 4960727 4827561 4753640 4137929 2285404 -645939
1997 -645939 -3110382 -3119866 -880536 568280 -852003 -3157800 -3447279 -2556302 -3071872
1988 -3071872 -4030209 -2274826 1170800 1390401 -2567794 -5150350 -2010730 3921674 7024474
1979 7024474 6194423 4203974 2620213 1080433 67873 939805 3603672 6515935 8633199
1970 8633199 9672684 9105172 6710068 3929647 3182660 5410423 8717068 9766180 7162079
1961 7162079 3776581 4341408 9388498 13250779 10611873 3720863 -293034 1449983
1953 1449983 5078946 6473231 5811227 4750286 3498523 2515004 3239187 4908174 4056910
1944 4056910 -472794 -5143021 -6690621 -6414529 -6895060 -7416654 -5819449 -2615230 -30481
$$ packed form
2006A329747l50186K089218J622959K68989j33166p3921o15711j852525k931343
1997f45939k464443r484K239330J448816j420283k305797k89479Q90977n15570
1988c071872r58337J755383L445626K19601l958195k582556L139620N932404L102800
1979G024474q30051j990449j583761j539780j012560Q71932K663867K912263K117264
1970H633199J039485n67512k395104k780421p46987K227763L306645J049112k604101
1961G162079l385498N64827N047090L862281k638906o891010m013897J743017
1953A449983L628963J394285o62004j060941j251763r83519P24183J668987q51264
1944D056910m529704m670227j547600K76092m80531n21594J597205L204219K584749
$$ plain form
1935 -30481 1510733 3202406 5379974 7395178 8733488 8668523 6487479 3468602 2412858
1926 2412858 3573600 3546706 135632 -4257556 -6203745 -5531279 -3782848 -1306739 1393965
1917 1393965 2274686 830941 -53346 1454099 2535271 133477 -3670207 -4732140 -2930994
1908 -2930994 -767651 1971539 7051149 12554525 14084921 10998804 6897483 4073219
1900 4073219 1939296 874651 2609881 5775345 5676807 516441 -5536454 -7453933 -4996593
1891 -4996593 -1653690 -128922 -482226 -1271878 -1282437 -827798 -1492478 -3735934 -5451136
1882 -5451136 -4400248 -1186410 2068116 4805260 7271848 7926542 5097006 841156
1874 841156 -533243 1743488 3912065 3232040 1329208 780813 1283017 1107558 341641
$$ packed form
1935c0481J541214J691673K177568K015204J338310o4965k181044l018877j055744
1926B412858J160742k6894l411074m393188j946189O72466J748431K476109K700704
1917A393965Q80721j443745q84287J507445J081172k401794l803684j061933J801146
1908b930994K163343K739190N079610N503376J530396l086117m101321k824264
1900D073219k133923j064645J735230L165464r8538n160366o052895j917479K457340
1891d996593L342903J524768l53304p89652j0559M54639o64680k243456j715202
1882e451136J050888L213838L254526K737144K466588O54694k829536m255850
1874H41156j374399K276731K168577o80025j902832n48395N02204j75459p65917
$$ plain form
1865 341641 612519 2448100 4325954 4241568 1945070 -250540 404660 3473422 5057349
1856 5057349 2499607 -2045058 -4677838 -4884067 -4896311 -5162260 -3894897 -778322 2398958
1847 2398958 5118954 8767427 13030100 14804783 12292305 7827213 4878685 3826023
1839 3826023 2397725 -571655 -3310038 -3101572 440742 4547862 6229497 5707053 5654486
1830 5654486 7217008 8986911 10243111 12140302 14416413 14375994 11420146 9205783 10366313
1821 10366313 12379198 12009167 10257409 8850204 5849870 210954 -3144073 178922
1813 178922 5313601 3944165 -2785277 -5895763 -2660805 347600 -537701 -603226 3260279
1804 3260279 6272353 4540567 2248610 3857873 5624391 1968994 -4483101 -6533282
$$ packed form
1865C41641K70878J835581J877854q4386k296498k195610O55200L068762J583927
1856E057349k557742m544665k632780k06229j2244k65949J267363L116575L177280
1847B398958K719996L648473M262673J774683k512478m465092k948528j052662
1839C826023j428298k969380k738383K08466L542314M107120J681635n22444n2567
1830E654486J562522J769903J256200J897191K276111m0419k955848k214363J160530
1821A0366313K012885l70031j751758j407205l000334n638916l355027L322995
1813A78922N134679j369436o729442l110486L234958L008405q85301o5525L863505
1804C260279L012074j731786k291957J609263J766518l655397o452095k050181
$$ plain form
1796 -6533282 -3029880 878698 2205121 2729813 4098245 5570216 6460859 6872880 6322241
1787 6322241 4671229 3580909 4392505 5889663 6606444 7437541 9353345 10991174 11669891
1778 11669891 13985701 19227564 22650535 18522168 8769185 1482398 985215 4090109
1770 4090109 6471116 7902246 9675452 10928272 10135704 7930465 6245135 5940580 6689589
1761 6689589 8076608 9620091 10571613 10712749 10742836 11051988 10696633 8700966 6250597
1752 6250597 6163657 9218814 12067816 10754044 6108710 3113351 4171101 5945153 4668449
1743 4668449 1489068 -457823 -1419326 -3333309 -5008510 -3943289 -1563059 -1315532 -2302957
1734 -2302957 -479746 3943555 6249367 4928581 3670792 4530959 5050808 3766722 2754040
$$ packed form
1796f533282L503402L908578J326423N24692J368432J471971Q90643M12021n50639
1787F322241j651012j090320Q11596J497158P16781Q31097J915804J637829O78717
1778A1669891K315810N241863L422971m128367r752983p286787m97183L104894
1770D090109K381007J431130J773206J252820p92568k205239j685330l04555P49009
1761F689589J387019J543483R51522J41136L0087L09152l55355j995667k450369
1752F250597q6940L055157K849002j313772m645334k995359J057750J774052j276704
1743D668449l179381j946891r61503j913983j675201J065221K380230K47527r87425
1734b302957J823211M423301K305812j320786j257789Q60167N19849j284086j012682
$$ plain form
1725 2754040 2862965 2213737 1249270 3071592 6668878 6673020 2769674 2132065 8396962
1716 8396962 15150243 15446121 11545519 9559685 9985797 9647827 8524670 8748002 10242672
1707 10242672 12021591 14330492 16069369 14656895 11528349 12001588 16474054 18651066
1699 18651066 16113729 14534244 17037353 18668904 16929945 17523434 22817522 25784677
1691 25784677 23643534 25186819 34290148 39518041 33076067 26313072 31031819 40106009
1683 40106009 44216460 48217754 43604948 -14075951 -153860803 -318411761 -395099419
1676 -395099419 -336248038 -211627544 -121389766 -91874813 -83991290 -69814347 -57103559
1669 -57103559 -53095684 -48086710 -37972058 -32293556 -33845111 -32757502 -25674283 -21696693
$$ packed form
1725B754040J08925o49228r64467J822322L597286M142l903346o37609O264897
1716H396962O753281K95878l900602j985834M26112l37970j123157K23332J494670
1707A0242672J778919K308901J738877j412474l128546M73239M472466K177012
1699A8651066k537337j579485K503109J631551j738959N93489N294088K967155
1691B5784677k141143J543285R103329N227893o441974o762995M718747R074190
1683D0106009M110451M001294m612806n7680899j39784852j64550958p6687658
1676c95099419N8851381J24620494R0237778K9514953P883523J4176943J2710788
1669e7103559M007875N008974J0114652N678502j551555J087609P083219L977590
$$ plain form
1661 -21696693 -24764590 -27031247 -24126416 -21590293 -21755996 -18840209 -12092239 -10110026
1653 -10110026 -16052961 -20834578 -17636052 -12274013 -12054358 -13984846 -11887444 -7504827
1645 -7504827 -6681298 -10080754 -14345812 -17814010 -19484473 -16884754 -10427565 -5850795
1637 -5850795 -7142407 -10474457 -10270288 -7607585 -7501929 -10533406 -12701478 -12186419 -11153097
1628 -11153097 -11130864 -10964266 -9974544 -9723137 -11259323 -12890281 -12529439 -11224639 -12196945
1619 -12196945 -15898623 -18072561 -14887269 -8792405 -5769964 -6752388 -6349019 -1923970
1611 -1923970 994864 -3609044 -12940654 -18813034 -17907387 -13568854 -9335106 -6116149
1603 -6116149 -4698062 -5684997 -7283005 -7649968 -8572403 -12154089 -15299963 -13292525 -8018186
$$ packed form
1661b1696693l067897k266657K904831K536123j65703K915787O747970J982213
1653a0110026n942935m781617L198526N362039K19655j930488K097402M382617
1645g504827Q23529l399456m265058l468198j670463K599719O457189M576770
1637e850795j291612l332050K04169K662703J05656l031477k168072N15059J033322
1628a1153097K2233J66598R89722K51407j536186j630958L60842J304800r72306
1619a2196945l701678k173938L185292O094864L022441r82424M03369M425049
1611a923970K918834m603908r331610n872380R05647M338533M233748L218957
1603f116149J418087r86935j598008l66963r22435l581686l145874K007438N274339
$$ plain form
1594 -8018186 -6218210 -9492458 -12529132 -11931851 -10126924 -9069675 -6865712 -3205710
1586 -3205710 -1898250 -4642183 -7663007 -8012984 -8199494 -10804945 -13308580 -12720246 -11347058
1577 -11347058 -13036445 -16591268 -17714771 -15449749 -12182451 -8743763 -4058106 753947
1569 753947 2088901 -1339467 -5997783 -7193504 -4301814 -1457486 -2853297 -7587593
1561 -7587593 -10337062 -7918125 -3433437 -1893778 -3563951 -4894040 -4568986 -4291015 -4195372
1552 -4195372 -2478152 -14803 -364171 -3980748 -7095603 -7764026 -8293772 -9980882 -10447875
1543 -10447875 -8570532 -7121024 -7598502 -7160369 -4031135 -1366445 -1896750 -3109108 -2133947
1534 -2133947 -1340648 -4015869 -7835625 -8033839 -4571249 -977124 1715089 4569041 6210599
$$ packed form
1594h018186J799976l274248l036674N97281J804927J057249K203963L660002
1586c205710J307460k743933l020824l49977j86510k605451k503635N88334J373188
1577a1347058j689387l554823j123503K265022L267298L438688M685657M812053
1569G53947J334954l428368m658316j195721K891690K844328j395811m734296
1561g587593k749469K418937M484688J539659j670173j330089L25054K77971R5643
1552d195372J717220K463349l49368l616577l114855o68423n29746j687110m66993
1543a0447875J877343J449508m77478M38133L129234K664690n30305j212358R75161
1534b133947P93299k675221l819756j98214L462590L594125K692213K853952J641558
$$ plain form
1525 6210599 4384334 969340 -71737 804120 -368114 -3886276 -5720042 -4615014
1517 -4615014 -4296282 -6897841 -9215214 -8208747 -6216360 -7233482 -10588659 -11921573
1509 -11921573 -9416596 -6023605 -5314081 -7208016 -8757526 -8254604 -7257351 -8135543 -10631417
1500 -10631417 -12300149 -12015704 -11058764 -10455573 -9579022 -8310038 -8069366 -9129957 -9411404
1491 -9411404 -8099688 -8023155 -11557634 -16162729 -17338972 -14670741 -11518368 -9703371 -8134503
1482 -8134503 -6289473 -5380603 -5702183 -5897309 -5364250 -4794185 -4115622 -2632133 -1411385
1473 -1411385 -2524016 -5316932 -6545045 -5298172 -4740491 -7183009 -10099598 -9485651 -5359441
1464 -5359441 -1309430 323696 88378 -1355972 -4667721 -9415346 -12527627 -11384919
$$ packed form
1525F210599j826265l414994j041077Q75857j172234l518162j833766J105028
1517d615014L18732k601559k317373J006467J992387j017122l355177j332914
1509a1921573K504977L392991P09524j893935j549510N02922R97253q78192k495874
1500a0631417j668732K84445R56940O03191Q76551J268984K40672j060591k81447
1491i411404J311716P6533l534479m605095j176243K668231L152373J814997J568868
1482h134503J845030R08870l21580j95126N33059N70065O78563J483489J220748
1473a411385j112631k792916j228113J246873N57681k442518k916589O13947M126210
1464e359441M050011J633126k35318j444350l311749m747625l112281J142708
$$ plain form
1456 -11384919 -7632475 -5513570 -6184070 -6185722 -2928318 720892 145001 -4103864 -6726502
1447 -6726502 -4982231 -1943860 -1535017 -3684455 -5970190 -7021362 -6372561 -3863805 -1453125
1438 -1453125 -2704665 -7628735 -10764506 -7894541 -2388820 -814531 -3879749 -6311372
1430 -6311372 -5120804 -3295818 -4549619 -8306860 -11411990 -12089359 -10737510 -8659828
1422 -8659828 -7138225 -6537172 -5842317 -4136488 -2368354 -2299510 -4022669 -6042511 -7420260
1413 -7420260 -8240333 -8441647 -7930500 -7450571 -7713520 -8197352 -8325406 -8896376 -10524361
1404 -10524361 -11799806 -11287736 -10372168 -11546710 -14554033 -16757617 -16761601 -15179159 -12557896
1395 -12557896 -9395492 -7725778 -9602184 -13841983 -16803743 -16543799 -14178009 -11552078
$$ packed form
1456a1384919L752444K118905o70500j652L257404L649210n75891m248865k622638
1447f726502J744271L038371M08843k149438k285735j051172O48801K508756K410680
1438a453125j251540m924070l135771K869965N505721J574289l065218k431623
1430f311372J190568J824986j253801l757241l105130o77369J351849K077682
1422h659828J521603O01053O94855J705829J768134O8844j723159k019842j377749
1413g420260q20073k01314N11147M79929k62949m83832j28054n70970j627985
1404a0524361j275445N12070R15568j174542l007323k203584l984J582442K621263
1395a2557896L162404J669714j876406m239799k961760K59944K365790K625931
$$ plain form
1387 -11552078 -9809411 -9739187 -11226230 -12848667 -13899265 -15518364 -17751596 -17749043 -14055484
1378 -14055484 -10238611 -10052999 -11295112 -9591422 -6241356 -5992469 -8244010 -7737754 -4137465
1369 -4137465 -3313008 -7529919 -11672283 -11780586 -10401712 -10106707 -8378389 -3364002 1078543
1360 1078543 993944 -1802480 -4058206 -6508196 -10095122 -11593135 -8791836 -5944789 -7769834
1351 -7769834 -11360097 -10676949 -6497320 -4887083 -7262499 -8980885 -7590530 -6078230
1343 -6078230 -7201080 -9933944 -12442588 -14039052 -13507994 -9800330 -5187431 -3858578
1335 -3858578 -6636880 -10422734 -12994211 -14717004 -15547339 -14576992 -13143409 -14275740 -17952349
1326 -17952349 -20451288 -19401636 -16196309 -12693731 -9072167 -5893459 -4778668 -5792584
$$ packed form
1387a1552078J742667P0224j487043j622437j050598j619099k233232K553L693559
1378a4055484L816873J85612j242113J703690L350066K48887k251541N06256L600289
1369d137465Q24457m216911m142364j08303J378874K95005J728318N014387M442545
1360A078543q4599k796424k255726k449990l586926j498013K801299K847047j825045
1351g769834l590263O83148M179629J610237k375416j718386J390355J512300
1343f078230j122850k732864k508644j596464N31058L707664M612899J328853
1335c858578k778302l785854k571477j722793q30335R70347J433583j132331l676609
1326a7952349k498939J049652L205327L502578L621564L178708J114791j013916
$$ plain form
1318 -5792584 -7162788 -8336775 -10076255 -11143315 -9069611 -5246021 -4650588 -8524216
1310 -8524216 -11715933 -10011403 -6057702 -4738669 -6293816 -7843706 -8687696 -9802328
1302 -9802328 -10347815 -9136510 -8098136 -9909961 -13061327 -13567222 -11252334 -10054327 -11711748
1293 -11711748 -13263003 -12025520 -9479700 -8310147 -8341750 -7674754 -6095564 -5228572 -6198983
1284 -6198983 -8622486 -11212279 -12439062 -11558627 -9903516 -10002026 -12322894 -14151652 -13137026
1275 -13137026 -10714010 -10032654 -11422764 -12466936 -12296789 -12795471 -14719977 -15609323 -13554379
1266 -13554379 -10745811 -10482363 -12058538 -11819133 -8801803 -6052752 -6048429 -8009295 -10591833
1257 -10591833 -13856439 -16773433 -16068888 -10636039 -4822942 -3691798 -6269928 -7321749
$$ packed form
1318e792584j370204j173987j739480j067060K073704L823590N95433l873628
1310h524216l191717J704530L953701J319033j555147j549890q43990j114632
1302i802328n45487J211305J038374j811825l151366n05895K314888J198007j657421
1293a1711748j551255J237483K545820J169553l1603O66996J579190Q66992r70411
1284f198983k423503k589793j226783Q80435J655111r8510k320868j828758J014626
1275a3137026K423016O81356j390110j044172J70147m98682j924506q89346K054944
1266a3554379K808568K63448j576175K39405L017330K749051M323j960866k582538
1257a0591833l264606k916994P04545N432849N813097J131144k578130j051821
$$ plain form
1249 -7321749 -5334012 -4550640 -8194846 -13490987 -15598949 -13832611 -11299883 -9949881
1241 -9949881 -8860280 -7090219 -5633238 -5611079 -5974801 -4424169 -583611 2630467 1575169
1232 1575169 -4136729 -10832982 -14319212 -13705220 -11321310 -9681634 -9545186 -10435028 -11706448
1223 -11706448 -12947611 -14143717 -15498977 -16679165 -16824185 -16047130 -15964616 -17416762 -18608869
1214 -18608869 -17389374 -14614819 -12823268 -11942799 -9408879 -5126217 -2995262 -5553597
1206 -5553597 -9625193 -10042669 -6386859 -3291851 -4377031 -8229175 -10867732 -10553041 -9171568
1197 -9171568 -9383078 -11225454 -12188370 -10905580 -9740540 -12023553 -17047573 -20332686 -19696361
1188 -19696361 -18386373 -20137693 -23316046 -23013531 -17835087 -11311181 -6813563 -4419045
$$ packed form
1249g321749J987737P83372l644206n296141k107962J766338K532728J350002
1241i949881J089601J770061J456981K2159l63722J550632L840558L214078j055298
1232A575169n711898o696253l486230O13992K383910J639676J36448q89842j271420
1223a1706448j241163j196106j355260j180188j45020P77055Q2514j452146j192107
1214a8608869J219495K774555J791551Q80469K533920M282662K130955k558335
1206e553597m071596m17476L655810L095008j085180l852144k638557L14691J381473
1197i171568k11510j842376r62916J282790J165040k283013n024020l285113O36325
1188a9696361J309988j751320l178353L02515N178444O523906M497618K394518
$$ plain form
1180 -4419045 -3452517 -4840384 -9041223 -13876282 -16670019 -17298300 -17137164 -15984964 -12313869
1171 -12313869 -6422898 -1294744 300636 -1625279 -5052138 -8272953 -10808282 -12667546
1163 -12667546 -13556656 -13045838 -11411530 -9924657 -9582508 -9443878 -7370403 -3268170 -432017
1154 -432017 -2007880 -6715224 -10044150 -9590679 -7160320 -5476008 -5252239 -6198798 -8162002
1145 -8162002 -9694379 -8065762 -3047038 1324895 1324712 -1893272 -4975604 -7424269 -10170301
1136 -10170301 -11041011 -7053238 -987422 126149 -5398168 -11010458 -11082292 -8222900 -8079352
1127 -8079352 -10946533 -12865152 -12181315 -10571244 -9438631 -9320083 -11239631 -14752160 -16206896
1118 -16206896 -13061949 -8597570 -8061522 -11297753 -13850945 -14429647 -15803330 -18223693
$$ packed form
1180d419045R66528j387867m200839m835059k793737o28281J61136J152200L671095
1171a2313869N890971N128154J595380j925915l426859l220815k535329j859264
1163a2667546q89110N10818J634308J486873L42149J38630K073475M102233K836153
1154d32017j575863m707344l328926M53471K430359J684312K23769r46559j963204
1145h162002j532377J628617N018724M371933j83l217984l082332k448665k746032
1136a0170301q70710L987773O065816J113571n524317n612290p1834K859392J43548
1127h079352k867181j918619O83837J610071J132613J18548j919548l512529j454736
1118a6206896L144947M464379N36048l236231k553192n78702j373683k420363
$$ plain form
1110 -18223693 -17795811 -13018376 -7948611 -6512864 -7643755 -8321743 -7850267 -6853257 -5409146
1101 -5409146 -4499960 -6073657 -9295277 -10051452 -6889047 -4130125 -5810267 -9591106 -10632526
1092 -10632526 -9034069 -8897253 -11425082 -13598496 -13478096 -12716899 -13161256 -14086147 -13736804
1083 -13736804 -11568664 -8533409 -6693862 -8182965 -12618803 -16106663 -15165945 -11322376
1075 -11322376 -9258898 -10539228 -12071354 -11308910 -9967208 -10970464 -13872808 -15487919
1067 -15487919 -14246688 -12168378 -12379953 -15495163 -18823701 -19248554 -16748130 -14346252
1059 -14346252 -14251226 -15229283 -14903425 -13451893 -13027906 -14048473 -14489945 -13280967 -12132389
1050 -12132389 -12730829 -13724725 -12313323 -8285617 -4804106 -4762177 -7283181 -8578382 -6110655
$$ packed form
1110a8223693M27882M777435N069765J435747j130891o77988M71476R97010J444111
1101e409146R09186j573697l221620p56175L162405K758922j680142l780839j041420
1092a0632526J598457J36816k527829k173414J20400P61197m44357r24891L49343
1083a3736804K168140L035255J839547j489103m435838l487860R40718L843569
1075a1322376K063478j280330j532126P62444J341702j003256k902344j615111
1067a5487919J241231K078310k11575l115210l328538m24853K500424K401878
1059a4346252R5026r78057L25858J451532M23987j020567m41472J208978J148578
1050a2132389n98440r93896J411402M027706L481511M1929k521004j295201K467727
$$ plain form
1041 -6110655 -1316968 1979223 1347285 -2470374 -6946780 -9984036 -11030433 -11247697 -12741233
1032 -12741233 -16458060 -20528484 -21848548 -19697732 -16558302 -14863518 -14301238 -13079522
1024 -13079522 -10548567 -7644023 -5825010 -6305430 -9074964 -11941638 -12033200 -9186800 -6307720
1015 -6307720 -5378759 -4965503 -3101242 -774643 -599822 -3376632 -7751332 -11961935 -14242986
1006 -14242986 -13144229 -9588556 -7197956 -8286677 -10705187 -10830440 -8396750 -6029485
998 -6029485 -5269453 -5580672 -6200147 -6564261 -6122200 -6030997 -9220754 -15862299 -20797159
989 -20797159 -19274625 -13674388 -10384505 -11363664 -13389094 -14457166 -15444028 -15712296 -12903335
980 -12903335 -7935717 -4935337 -5158066 -6011173 -6787501 -9469376 -12666422 -11640028 -6944538
$$ packed form
1041f110655M793687L296191o31938l817659m476406l037256j046397k17264j493536
1032a2741233l716827m070424j320064K150816L139430J694784N62280J221716
1024a3079522K530955K904544J819013m80420k769534k866674r1562K846400K879080
1015f307720R28961M13256J864261K326599J74821k776810m374700m210603k281051
1006a4242986J098757L555673K390600j088721k418510j25253K433690K367265
998f029485P60032l11219o19475l64114M42061R1203l189757o641545m934860
989b0797159J522534N600237L289883r79159k025430j068072r86862k68268K808961
980a2903335M967618L000380k22729q53107p76328k681875l197046J026394M695490
$$ plain form
971 -6944538 -5943130 -11620917 -16662905 -14146226 -7966238 -5793234 -6853499 -4915910
963 -4915910 72734 2265715 295093 -1400949 -1706197 -4866102 -11719225 -16450129 -15148899
954 -15148899 -11523093 -10592235 -11675351 -11352976 -9370248 -7780047 -7177179 -7122298 -7855866
945 -7855866 -8752119 -7552145 -3964295 -1590899 -3210715 -6276978 -6307972 -2963460 508285
936 508285 2282441 2852914 2038612 -1025806 -5048679 -7221148 -7194247 -7630431 -10293503
927 -10293503 -14065999 -17191373 -18798741 -17624555 -12262616 -4242278 1628825 2073580
919 2073580 -1128439 -4188780 -6156868 -8452901 -10974986 -11741298 -10339218 -9016068 -9535288
910 -9535288 -10895044 -11167851 -10122316 -8908645 -8267830 -8295257 -9303720 -11643724 -14670467
$$ packed form
971f944538J001408n677787n041988K516679O179988K173004j060265J937589
963d915910M988644K192981j970622j696042l05248l159905o853123m730904J301230
954a5148899L625806R30858j083116L22375J982728J590201O02868N4881p33568
945g855866q96253J199974L587850K373396j619816l066263l0994L344512L471745
936E08285J774156N70473q14302l064418m022873k172469K6901m36184k663072
927a0293503l772496l125374j607368J174186N361939Q020338N871103M44755
919B073580l202019l060341j968088k296033k522085p66312J402080J323150n19220
910i535288j359756k72807J045535J213671O40815k7427j008463k340004l026743
$$ plain form
901 -14670467 -16633542 -15934527 -12736468 -9577798 -9660252 -13286030 -16504457 -15331394 -11289256
892 -11289256 -9913124 -12793334 -14568622 -10536693 -4224508 -3025098 -7857880 -12234991
884 -12234991 -11647119 -8816730 -8228934 -10128966 -12496457 -14961093 -17313201 -17274935 -13849930
875 -13849930 -10851413 -12831173 -18483431 -22052846 -20836624 -17428891 -14547940 -11780731
867 -11780731 -8578603 -6771030 -7848644 -10099769 -10706479 -9329469 -7887758 -7918608 -9736023
858 -9736023 -13215129 -17631797 -21110013 -21831422 -20005127 -17620768 -15980360 -14302406 -11328766
849 -11328766 -7750485 -5935445 -6935563 -8887443 -9589605 -9867465 -12294460 -16599941 -19047008
840 -19047008 -17517838 -14551188 -13203605 -12336270 -9197449 -4944287 -3552817 -5747942
$$ packed form
901a4670467j963075O99015L198059L158670q2454l625778l218427J173063M042138
892a1289256J376132k880210j775288M031929O312185J199410m832782m377111
884a2234991N87872K830389N87796j900032k367491k464636k352108L8266L425005
875a3849930K998517j979760n652258l569415J216222L407733K880951K767209
867a1780731L202128J807573j077614k251125o06710J377010J441711l0850j817415
858i736023l479106m416668l478216p21409J826295K384359J640408J677954K973640
849a1328766L578281J815040j000118j951880p02162k77860k426995m305481k447067
840a9047008J529170K966650J347583Q67335L138821M253162J391470k195125
$$ plain form
832 -5747942 -8146858 -8876998 -9981064 -12837108 -14933519 -13665854 -10677602 -9670427 -11450724
823 -11450724 -13423095 -12931291 -9458908 -4754375 -2192908 -4415647 -9914284 -13590487
815 -13590487 -12595093 -9907176 -9921708 -12374653 -13684125 -12836724 -12065138 -12124750 -11095292
806 -11095292 -8681984 -7767879 -9770267 -11723281 -10707252 -8715383 -9690683 -13089500 -14250278
797 -14250278 -11226597 -7573525 -6935432 -7894362 -6721245 -3273833 -914416 -1234305 -2294936
788 -2294936 -2639361 -3653791 -6146366 -7576331 -5802457 -3643413 -5715679 -11236274 -14174076
779 -14174076 -11478224 -7298445 -6960482 -9979175 -12075032 -11800918 -11376127 -11903600 -11729805
770 -11729805 -10179859 -9704947 -12581259 -17270957 -19833412 -18252408 -14164817 -10654455
$$ packed form
832e747942k398916p30140j104066k856044k096411J267665K988252J007175j780297
823a1450724j972371M91804L472383M704533K561467k222739n498637l676203
815a3590487R95394K687917j4532k452945j309472Q47401P71586n9612J029458
806a1095292K413308R14105k002388j953014J016029J991869r75300l398817j160778
797a4250278L023681L653072O38093r58930J173117L447412K359417l19889j060631
788b294936l44425j014430k492575j429965J773874K159044k072266n520595k937802
779a4174076K695852M179779L37963l018693k095857K74114M24791n27473J73795
770a1729805J549946M74912k876312m689698k562455J581004M087591L510362
$$ plain form
762 -10654455 -9307380 -9550212 -10239808 -11110819 -12165347 -12236412 -9797009 -5837920 -4266076
753 -4266076 -7667194 -13551483 -16888455 -16083529 -14210679 -14087092 -14663576 -13669673 -11791108
744 -11791108 -11812404 -14268367 -16346295 -15689926 -13584606 -13036943 -14436039 -14713909 -11179671
735 -11179671 -5057372 -281214 630269 -1604862 -4890653 -7715803 -8919492 -7450234
727 -7450234 -3906422 -1226567 -2007236 -5427884 -8342708 -9242599 -9586077 -11145950 -13667014
718 -13667014 -15681713 -16297967 -15432505 -13372321 -11062173 -10121495 -11567843 -14691214 -17745267
709 -17745267 -19553998 -20050670 -19562248 -18192533 -16019109 -13516975 -11390743 -9897780 -8705946
700 -8705946 -7811831 -8113244 -10057165 -12008746 -11701217 -9685467 -9140241 -10989335 -11705844
$$ packed form
762a0654455J347075k42832o89596q71011j054528p1065K439403L959089J571844
753d266076l401118n884289l336972Q04926J872850J23587n76484R93903J878565
744a1791108k1296k455963k077928O56369K105320N47663j399096k77870L534238
735a1179671O122299M776158R11483k235131l285791k825150j203689J469258
727g450234L543812K679855p80669l420648k914824q99891l43478j559873k521064
718a3667014k014699o16254Q65462K060184K310148R40678j446348l123371l054053
709a7745267j808731m96672M88422J369715K173424K502134K126232J492963J191834
700h705946Q94115l01413j943921j951581L07529K015750N45226j849094p16509
$$ plain form
691 -11705844 -8576168 -5004979 -6535072 -12431175 -15993852 -13966681 -10786700 -11238982
683 -11238982 -13386981 -12669298 -9640721 -8544645 -9790953 -9311851 -5723024 -3281951 -5936914
674 -5936914 -11959353 -16685771 -18026321 -17005235 -14878135 -12314437 -10370263 -9903595 -10310047
665 -10310047 -10423025 -10217040 -10156861 -9489449 -7121498 -4163651 -3649895 -6949813 -11680639
656 -11680639 -14085756 -12904475 -10300045 -9374772 -11210258 -14100063 -15440661 -14516276 -13319673
647 -13319673 -14255809 -17278408 -20008930 -20531759 -19039279 -16616887 -13781010 -10997132 -9451931
638 -9451931 -9970598 -11705980 -13078076 -13602370 -13674903 -13133504 -11591304 -9856110 -9143217
629 -9143217 -8904745 -7643951 -6279732 -8009610 -13406158 -18205745 -18387915 -15583968 -14569863
$$ packed form
691a1705844L129676L571189j530093n896103l562677K027171L179981m52282
683a1238982k147999P17683L028577J096076j246308M79102L588827K441073k654963
674e936914o022439m726418j340550J021086K127100K563698J944174M66668m06452
665a0310047j12978K05985O0179O67412K367951K957847N13756l299918m730826
656a1680639k405117J181281K604430R25273j835486k889805j340598R24385J196603
647a3319673r36136l022599k730522n22829J492480K422392K835877K783878J545201
638i451931n18667j735382j372096n24294p2533N41399J542200J735194P12893
629i143217K38472J260794J364219j729878n396548m799587j82170K803947J014105
$$ plain form
620 -14569863 -16704039 -19088852 -19447307 -18206215 -15907386 -12538464 -10055143 -11278571
612 -11278571 -14580739 -13940805 -7269913 -975973 -2186743 -9161266 -14127490 -13863007 -12184602
603 -12184602 -12511367 -13576407 -13567550 -13419664 -13711824 -12458031 -8952337 -6609581 -8662940
594 -8662940 -13234137 -15836955 -15140216 -13268339 -11826120 -10857357 -10850925 -12419580 -14084231
585 -14084231 -13362706 -10452348 -8391804 -9130393 -11630443 -14298768 -17018317 -19849926 -21599705
576 -21599705 -20935798 -17956764 -14057547 -11140301 -10946714 -13650650 -16890202 -17891824 -16974003
567 -16974003 -17125592 -19481236 -21278940 -19593219 -15375619 -12134269 -11780871 -13398608 -15212005
558 -15212005 -16077819 -15501620 -13786570 -12253316 -12310025 -14119283 -16494577 -17834009 -17098733
$$ packed form
620a4569863k134176k384813l58455J241092K298829L368922K483321j223428
612a1278571l302168O39934O670892O293940j210770o974523m966224K64483J678405
603a2184602l26765j065040Q857J47886k92160J253793L505694K342756k053359
594h662940m571197k602818O96739J871877J442219R68763O432j568655j664651
585a4084231P21525K910358K060544p38589k500050k668325k719549k831609j749779
576b1599705O63907K979034L899217K917246J93587k703936l239552j001622R17821
567a6974003j51589k355644j797704J685721M217600L241350L53398j617737j813397
558a5212005q65814N76199J715050J533254n6709j809258k375294j339432P35276
$$ plain form
549 -17098733 -14703633 -12644476 -12635188 -13866654 -14103725 -13368526 -14350476 -18011355 -21195289
540 -21195289 -20764187 -18108144 -16728919 -16804921 -15534950 -12261805 -9689316 -9657657 -10858170
531 -10858170 -11568336 -11888397 -12170091 -11711967 -10397081 -9598956 -10113533 -10930509 -11198783
522 -11198783 -11602425 -12627277 -13387712 -13515026 -14225606 -15908947 -16654886 -15171710 -13340005
513 -13340005 -13531000 -14942690 -15199956 -14309861 -14100863 -14585625 -14093079 -12833859 -13135750
504 -13135750 -15624876 -17992089 -18383986 -17457400 -16016394 -13196158 -8795041 -5427395 -6001184
495 -6001184 -9828078 -13142702 -13347021 -11480132 -10461565 -11713579 -13710797 -13713253 -11010914
486 -11010914 -8073708 -7732406 -9638158 -10953215 -10497583 -10220961 -11769434 -13550015 -12902334
$$ packed form
549a7098733K395100K059157R288j231466k37071P35199r81950l660879l183934
540b1195289M31102K656043J379225p6002J269971L273145K572489L1659j200513
531a0858170p10166l20061k81694M58124J314886P98125n14577q16976k68274
522a1198783m03642j024852p60435j27314p10580j683341p45939J483176J831705
513a3340005j90995j411690k57266Q90095K08998m84762M92546J259220l01891
504a3135750k489126k367213l91897R26586J441006K820236M401117L367646n73789
495f001184l826894l314624k04319J866889J018567j252014j997218k456K702339
486a1010914K937206L41302j905752j315057M55632K76622j548473j780581O47681
$$ plain form
477 -12902334 -10006692 -7737117 -8067537 -10227085 -12304825 -13290266 -13334329 -13032149 -12818656
468 -12818656 -12598047 -11921068 -10781129 -9853198 -9578501 -9705085 -10379605 -12738409 -17100680
459 -17100680 -21214591 -22105613 -19782513 -17432165 -17353220 -18210894 -17421624 -15116026 -14082204
450 -14082204 -15977150 -19091278 -20409606 -18936942 -16153428 -13714211 -11834761 -10076164
442 -10076164 -8596427 -7784127 -7309866 -6656532 -6318532 -7194277 -8730167 -9169020 -8234531
433 -8234531 -8049286 -10176637 -12998692 -13746129 -12333758 -11098679 -10956024 -10186690 -7707167
424 -7707167 -5355486 -5409327 -7321390 -8761325 -8972033 -8979536 -8778746 -6754318 -2795576
415 -2795576 -70947 -1877540 -7402282 -12282311 -13380717 -11680862 -10234685 -10644287 -12384719
$$ packed form
477a2902334K895642K269575l30420k159548k077740r85441m4063L02180K13493
468a2818656K20609O76979J139939R27931K74697j26584o74520k358804m362271
459a7100680m113911q91022K323100K350348P8945q57674P89270K305598J033822
450a4082204j894946l114128j318328J472664K783514K439217J879450J758597
442a0076164J479737Q12300M74261O53334L38000q75745j535890m38853R34489
433h234531J85245k127351k822055p47437J412371J235079J42655P69334K479523
424g707167K351681n3841j912063j439935k10708p503K00790K024428L958742
415b795576K724629j806593n524742m880029j098406J699855J446177m09602j740432
$$ plain form
406 -12384719 -14469554 -16333994 -17384868 -17137446 -16206990 -16144327 -17565468 -18955510 -18032405
397 -18032405 -14217601 -9414543 -6449887 -6925449 -10298089 -14578573 -17791133 -18968546
389 -18968546 -18176780 -16174821 -14248674 -13662570 -14440551 -15011347 -14027209 -12405190 -12430564
380 -12430564 -14725308 -17358765 -18348112 -17733083 -16551329 -15243931 -14254575 -14840721 -17428523
371 -17428523 -19842642 -19229538 -15838483 -13129769 -13553733 -15565187 -15686208 -12698961 -8835860
362 -8835860 -7042454 -7834936 -9234520 -9560569 -9465146 -10470067 -12147355 -12475209 -11196324
353 -11196324 -10692168 -12326208 -13966978 -13194536 -11274168 -11183259 -12833531 -13593671 -13165951
344 -13165951 -14179955 -17265252 -19209314 -17718742 -14971506 -14223687 -15299737 -15866570 -15230859
$$ packed form
406a2384719k084835j864440j050874K47422R30456O2663j421141j390042R23105
397a8032405L814804M803058K964656m75562l372640m280484l212560j177413
389a8968546P91766K001959J926147N86104p77981n70796R84138J622019k5374
380a2430564k294744k633457r89347O15029J181754J307398R89356n86146k587802
371a7428523k414119O13104L391055K708714m23964k011454j21021K987247L863101
362h835860J793406p92482j399584l26049R5423j004921j677288l27854J278885
353a1196324N04156j634040j640770P72442J920368R0909j650272p60140M27720
344a3165951j014004l085297j944062J490572K747236P47819j076050n66833O35711
$$ plain form
335 -15230859 -14299843 -13258744 -11853823 -10850453 -10762922 -10185830 -7948053 -5993298 -7243396
326 -7243396 -11066651 -13782103 -13590688 -12138482 -10992115 -9607605 -7684968 -6792378 -8180851
317 -8180851 -10962496 -13742058 -16280314 -18326979 -18649166 -16845835 -14767158 -14483088 -15707233
308 -15707233 -16514294 -15805603 -14013390 -12255847 -11758537 -13079423 -14899008 -14765985 -12267354
299 -12267354 -10230658 -11234112 -13993347 -15042534 -13263684 -10803061 -9901598 -10817768 -12880365
290 -12880365 -15636426 -18397639 -20063970 -20063313 -18657347 -16158953 -12799750 -9448061 -7345441
281 -7345441 -6854718 -7372311 -8566263 -10609012 -12986722 -14306083 -13856559 -12473346 -11344564
272 -11344564 -10765528 -10552124 -10859210 -11880343 -13181818 -13867442 -13234625 -11264461 -8948733
$$ packed form
335a5230859R31016J041099J404921J003370Q7531N77092K237777J954755j250098
326g243396l823255k715452J91415J452206J146367J384510J922637Q92590j388473
317h180851k781645k779562k538256k046665l22187J803331K078677K84070j224145
308a5707233q07061P08691J792213J757543M97310j320886j819585J33023K498631
299a2267354K036696j003454k759235j049187J778850K460623R01463r16170k062597
290a2880365k756061k761213j666331O57J405966K498394L359203L351689K102620
281g345441M90723n17593j193952k042749k377710j319361M49524J383213J128782
272a1344564N79036K13404l07086j021133j301475o85624O32817J970164K315728
$$ plain form
263 -8948733 -7988540 -9292003 -11704322 -13187648 -13389428 -13893739 -15634358 -17454310 -17990261
254 -17990261 -17664582 -17612869 -17648355 -16785077 -15250532 -14433856 -14832128 -15299795 -14635138 -13085255
244 -13085255 -11990067 -12427327 -14269151 -16160466 -16553786 -15246447 -13721647 -13495681 -14431352
235 -14431352 -15240068 -15173188 -14352849 -12879621 -10876635 -9352308 -9631986 -11536850 -13301534
226 -13301534 -13857572 -14098416 -15118675 -16272782 -16174227 -14941156 -14061025 -14231224 -14663817
217 -14663817 -14633985 -14393569 -14072519 -12938071 -10723055 -8762775 -8469466 -9143224 -8860272
208 -8860272 -7575260 -7606515 -10264554 -13544615 -14613924 -13540627 -12725728 -13208392 -13730726
199 -13730726 -13563324 -13858953 -15204616 -15954952 -14713391 -12897636 -12734011 -13765827 -13797193
$$ packed form
263h948733R60193j303463k412319j483326k01780n04311j740619j819952n35951
254a7990261L25679N1713l5486Q63278J534545Q16676l98272m67667O64657J549883
244a3085255J095188m37260j841824j891315l93320J307339J524800K25966r35671
235a4431352q08716O6880Q20339J473228K002986J524327k79678j904864j764684
226a3301534n56038k40844j020259j154107R8555J233071Q80131j70199m32593
217a4663817K9832K40416L21050J134448K215016J960280K93309o73758K82952
208h860272J285012l1255k658039l280061j069309J073297Q14899m82664n22334
199a3730726J67402k95629j345663p50336J241561J815755J63625j031816l1366
$$ plain form
190 -13797193 -12851998 -13455560 -16460133 -19062460 -18345804 -15100881 -12484589 -11892871 -11855381
181 -11855381 -10701170 -8864006 -8223833 -9879932 -12880881 -14962724 -14559405 -12194909 -9846901
172 -9846901 -9136723 -10434911 -13230741 -16429905 -18510010 -18619908 -17640362 -16950327 -16129343
163 -16129343 -13590302 -9863499 -8072895 -9890414 -12983884 -14311497 -14249379 -15080624 -16707803
154 -16707803 -16878965 -15288522 -14405356 -15724736 -17744114 -18504719 -18024689 -17318739 -16933917
145 -16933917 -17364288 -18998088 -20643146 -20097343 -17420416 -15556443 -16107523 -16681803 -14723367
136 -14723367 -11980243 -12006780 -14388942 -15076004 -12409617 -9374319 -9080273 -11106916 -13670933
127 -13670933 -16520502 -19465649 -20255354 -16873246 -11081265 -7055697 -6633534 -8038554 -9300547
$$ packed form
190a3797193R45195o03562l004573k602327P16656L244923K616292N91718L7490
181a1855381J154211J837164O40173j656099l000949k081843M03319K364496K348008
172i846901P10178j298188k795830l199164k080105j09898R79546O90035Q20984
163a6129343K539041L726803J790604j817519l093470j327613O2118q31245j627179
154a6707803j71162J590443Q83166j319380k019378p60605M80030P05950L84822
145a6933917m30371j633800j645058N45803K676927J863973n51080n74280J958436
136a4723367K743124k6537k382162o87062K666387L035298K94046k026643k564017
127a3670933k849569k945147p89705L382108N791981M025568M22163j405020j261993
$$ plain form
118 -9300547 -10635974 -12737248 -14751969 -15470007 -15385001 -15997888 -17492660 -18419909 -17631925
109 -17631925 -15495788 -13166588 -11683638 -11976874 -14602176 -18664679 -21688688 -21555303 -18502796
100 -18502796 -14674242 -11924736 -10652166 -10432873 -10829718 -11443479 -11940909 -12336785 -12859062
91 -12859062 -13619182 -14936288 -17514102 -21081603 -23134120 -20962437 -15544041 -11473949 -11705771
82 -11705771 -14052138 -14697924 -13574793 -13570045 -15335888 -16314310 -15348163 -14967952 -17425104
73 -17425104 -20906806 -21983712 -20329914 -18613450 -18395238 -18424056 -17045298 -14471847 -12206504
64 -12206504 -11446800 -12467013 -14566864 -16169896 -15806692 -13669997 -11855041 -12522359 -15705487
55 -15705487 -18972873 -19408539 -16344318 -12305113 -10775614 -12669440 -15432743 -16010300 -14123037
$$ packed form
118i300547j335427k101274k014721p18038Q5006o12887j494772r27249P87984
109a7631925K136137K329200J482950k93236k625302m062503l024009J33385L052507
100a8502796L828554K749506J272570K19293l96845o13761m97430l95876n22277
91a2859062p60120j317106k577814l567501k052517K171683N418396M070092k31822
82a1705771k346367o45786J123131M748j765843r78422R66147L80211k457152
73a7425104l481702j076906J653798J716464K18212k8818J378758K573451K265343
64a2206504P59704j020213k099851j603032L63204K136695J814956o67318l183128
55a5705487l267386m35666L064221M039205J529499j893826k763303n77557J887263
$$ plain form
46 -14123037 -11998067 -11415542 -12000692 -12354860 -12032830 -12098739 -13957714 -17606478 -20981960
37 -20981960 -21484704 -18430712 -13558514 -8986784 -5558573 -3592035 -3929906 -6918120 -11042295
28 -11042295 -13977688 -14782351 -14133762 -13007344 -12333368 -13279744 -16157256 -19216910 -20173722
19 -20173722 -18995451 -17719664 -17496478 -17411584 -16404553 -14689240 -12888177 -11351642 -10818030
10 -10818030 -12140879 -14663801 -16312689 -16046390 -14919396 -14139785 -13618949 -13233351 -13853928
1 -13853928 -15855944
0 -15855944
$$ packed form
46a4123037K124970N82525n85150l54168L22030o5909j858975l648764l375482
37b0981960n02744L053992M872198M571730L428211J966538l37871k988214m124175
28a1042295k935393q04663O48589J126418O73976r46376k877512l059654r56812
19b0173722J178271J275787K23186Q4894J007031J715313J801063J536535N33612
10a0818030j322849k522922j648888K66299J126994P79611N20836L85598o20577
1a3853928k002016
0a5855944
$$ Imaginary data points
##PAGE= N=2
##DATA TABLE= (X++(I..I)), XYDATA
$$ plain form
65535 -6756866 -5332956 -4484170 -4926175 -5859741 -6044774 -4672292 -2078413 -143267 -581938
65526 -581938 -2235722 -2112902 -155997 -255266 -4455226 -8971409 -9174633 -6170399 -4337388
65517 -4337388 -4093386 -2169085 1458775 2455178 -935912 -4772951 -5314247 -3868355 -3251861
65508 -3251861 -3173468 -2302330 -1831447 -3274257 -4805507 -3522530 -113998 2133086 2195390
65499 2195390 1952520 2350698 2103932 556979 -828118 -678950 427311 1038157 479951
65490 479951 -969509 -2473457 -2954304 -1912028 22951 2032575 4160026 6400985
65482 6400985 7316859 5142526 410573 -3799691 -4732591 -2522499 244239 1176868 338098
65473 338098 -78313 1318245 2840012 1584965 -2519263 -6377466 -7813101 -7707306 -7113556
$$ packed form
65535f756866J423910Q48786m42005r33566j85033J372482K593879J935146m38671
65526e81938j653784J22820J956905r9269m199960m516183k03224L004234J833011
65517d337388K44002J924301L627860R96403l391090l837039n41296J445892O16494
65508c251861P8393Q71138M70883j442810j531250J282977L408532K247084O2304
65499B195390k42870L98178k46766j546953j385097J49168J106261O10846n58206
65490D79951j449460j503948m80847J042276J934979K009624K127451K240959
65482F400985R15874k174333m731953m210264r32900K210092K766738R32629q38770
65473C38098m16411J396558J521767j255047m104228l858203j435635J05795N93750
$$ plain form
65464 -7113556 -4997502 -901659 2623005 3110108 1866433 1520298 1559532 -64486 -2115793
65455 -2115793 -1151981 2720112 5324283 4270872 1602236 -286983 -1690337 -3188651
65447 -3188651 -3689762 -2797731 -2266547 -3073532 -3499835 -2048101 51753 1165504 1756472
65438 1756472 2474321 2051088 -364809 -2657907 -2254223 128437 1716346 1546525 773352
65429 773352 188638 -177665 172490 1530346 2731431 2624667 1968270 1784068 912554
65420 912554 -2088800 -5250688 -4491274 978163 6946151 8621008 5210292 -102090
65412 -102090 -3218287 -2165112 1327607 3238306 1576887 -1122235 -1236737 788456
65404 788456 1179115 -1518740 -4399952 -4474548 -2425630 -864292 -826076 -1501432 -2134090
$$ packed form
65464g113556K116054M095843L524664M87103j243675l46135L9234j624018k051307
65455b115793R63812L872093K604171j053411k668636j889219j403354j498314
65447c188651n01111Q92031N31184q06985m26303J451734K099854J113751N90968
65438A756472P17849m23233k415897k293098M03684K382660J587909j69821p73173
65429G73352n84714l66303L50155J357856J201085j06764o56397j84202q71514
65420I12554l001354l161888P59414N469437N967988J674857l410716n312382
65412a02090l116197J053175L492719J910699j661419k699122j14502K025193
65404G88456L90659k697855k881212p4596K048918J561338L8216o75356o32658
$$ plain form
65395 -2134090 -2745731 -3546000 -4436213 -4833873 -4076157 -2661366 -2410218 -3911657 -4536616
65386 -4536616 -1358075 4136232 7095763 5586227 2805492 1847843 1436706 -854771
65378 -854771 -3837997 -4401363 -2425770 -650967 -256904 206696 1401254 1776981 458872
65369 458872 -1019007 -1362790 -1935728 -4503338 -7678348 -7944764 -4269076 276322 2293508
65360 2293508 1945211 1654960 1988013 1076250 -1747653 -4157896 -4005999 -2418366 -1748064
65351 -1748064 -1799878 -601522 1853053 3541807 3994746 4843448 6216412 5780562 2778633
65342 2778633 44824 -115369 504117 -803710 -2992371 -2958005 -632183 893307 -165900
65333 -165900 -2652373 -5100187 -7150141 -8224127 -7561854 -6085551 -5762549 -6532005 -6237643
$$ packed form
65395b134090o11641q00269q90213l97660P57716J414791K51148j501439o24959
65386d536616L178541N494307K959531j509536k780735r57649m11137k291477
65378h54771k983226n63366J975593J774803L94063M63600J194558L75727j318109
65369D58872j477879l43783n72938k567610l175010k66416L675688M545398K017186
65360B293508l48297k90251L33053r11763k823903k410243J51897J587633O70302
65351a748064n1814J198356K454575J688754M52939Q48702J372964m35850l001929
65342B778633k733809j60193O19486j307827k188661L4366K325822J525490j059207
65333a65900k486473k447814k049954j073986O62273J476303L23002p69456K94362
$$ plain form
65324 -6237643 -4232322 -2513350 -2342913 -2363072 -1471975 -1007399 -2104846 -3180659 -2551539
65315 -2551539 -1728128 -3135238 -5727009 -6129323 -3808270 -1907940 -2578897 -4450150 -5651531
65306 -5651531 -6476265 -7350597 -6627325 -2970991 1467578 3024812 1254372 -795964 -1138917
65297 -1138917 -1243377 -3018327 -5509702 -6288456 -4979405 -3622857 -3897470 -5478108 -7131952
65288 -7131952 -8108836 -8092700 -6822793 -4412582 -1549960 1033779 2965170 3971189 3790947
65279 3790947 2669406 1470042 907011 980236 1428203 2274900 3432617 4048865 2907301
65270 2907301 -290020 -4251756 -6991964 -7623118 -7240271 -7632197 -8948186 -9278146 -7138833
65261 -7138833 -3714901 -1538864 -1338013 -1627080 -1422392 -1671420 -3352748 -5605386 -6749924
$$ packed form
65324f237643K005321J718972J70437k0159Q91097M64576j097447j075813O29120
65315b551539Q23411j407110k591771m02314K321053J900330o70957j871253j201381
65306e651531q24734q74332P23272L656334M438569J557234j770440k050336l42953
65297a138917j04460j774950k491375p78754J309051J356548k74613j580638j653844
65288g131952r76884J6136J269907K410211K862622K583739J931391J006019j80242
65279C790947j121541j199364n63031P3225M47967Q46697J157717O16248j141564
65270B907301l197321l961736k740208o31154L82847l91926j315989l29960K139313
65261g138833L423932K176037K00851k89067K04688k49028j681328k252638j144538
$$ plain form
65252 -6749924 -6188229 -4481658 -2559743 -1634707 -2690345 -4998400 -6285355 -5502738 -4165437
65243 -4165437 -3633758 -2676132 200088 3388203 3944044 2040636 686424 1103998 1510339
65234 1510339 983610 1265725 3271371 4622716 2788779 -1279601 -4723572 -6402650
65226 -6402650 -6907191 -6383426 -4689000 -2832062 -2002058 -1669729 -630511 594307 494134
65217 494134 -665467 -1053800 -211773 456015 339717 456744 991512 301425 -2393489
65208 -2393489 -5207478 -5966686 -4918427 -3564557 -2219440 -607268 283129 -683391 -2328627
65199 -2328627 -2331642 -943228 -916023 -2933115 -3755073 -744737 3888028 5965999 5100891
65190 5100891 4422029 5088991 4792601 2506643 939645 1961100 2737407 -83839 -4420668
$$ packed form
65252f749924N61695J706571J921915R25036j055638k308055j286955P82617J337301
65243d165437N31679R57626K876220L188115N55841j903408j354212M17574M06341
65234A510339n26729K82115K005646J351345j833937m068380l443971j679078
65226f402650n04541N23765J694426J856938Q30004L32329J039218J224818j00173
65217D94134j159601l88333Q42027O67788j16298J17027N34768o90087k694914
65208b393489k813989p59208J048259J353870J345117J612172Q90397r66520j645236
65199b328627l015J388414K7205k017092q21958L010336M632765K077971q65108
65190E100891o78862O66962k96390k285958j566998J021455P76307k821246m336829
$$ plain form
65181 -4420668 -5228332 -2108727 69023 -1426129 -3630763 -3313592 -1819194 -1839900 -2836891
65172 -2836891 -3135022 -3866747 -6729864 -9551127 -8484863 -3935937 -72799 1432360
65164 1432360 2900567 5356475 6155812 3620271 334130 -563156 410779 897650 299036
65155 299036 -847273 -2889206 -5719785 -7091314 -5142536 -1612666 -14465 -1362272
65147 -1362272 -3899355 -6136381 -7771569 -8315198 -7287316 -5517709 -4248756 -3399714
65139 -3399714 -2460668 -2017233 -2167782 -880726 2905221 5747342 3411711 -2161347 -4270672
65130 -4270672 -750099 2826117 1374328 -2507486 -2947022 660705 3414459 1599199
65122 1599199 -3806759 -9441359 -12522270 -12048762 -9378283 -7220416 -6519966 -5445633
$$ packed form
65181d420668q07664L119605K177750j495152k204634L17171J494398k0706r96991
65172b836891k98131p31725k863117k821263J066264M548926L863138J505159
65164A432360J468207K455908P99337k535541l286141q97286R73935M86871n98614
65155B99036j146309k041933k830579j371529J948778L529870J598201j347807
65147a362272k537083k237026j635188n43629J027882J769607J268953Q49042
65139c399714R39046M43435j50549J287056L785947K842121k335631n573058k109325
65130d270672L520573L576216j451789l881814m39536L607727K753754j815260
65122A599199n405958n634600l080911M73508K670479K157867P00450J074333
$$ plain form
65114 -5445633 -2953689 -1284049 -2391223 -3978023 -2614590 683314 2103923 1374705
65106 1374705 1735021 3533702 3020674 -996565 -4177752 -3064012 -367805 -316627 -2055266
65097 -2055266 -2049207 -779692 -1956480 -5680226 -7432120 -4979289 -2147079 -3417661 -7572295
65088 -7572295 -9495915 -6818217 -1989371 1804356 4110878 5833172 6441327 4475696
65080 4475696 284947 -3605636 -5380754 -5841975 -6499534 -6934500 -5653077 -2954250 -966806
65071 -966806 -699482 -936151 -592063 -290492 -638708 -760130 -8528 416083 -582553 -1672152
65061 -1672152 -940946 707234 540997 -1712936 -3163726 -2023536 -285302 -747009 -3016413
65052 -3016413 -4300455 -3395902 -2092201 -2502999 -4257078 -4930444 -2858381 843970 3096088
$$ packed form
65114e445633K491944J669640j107174j586800J363433L297904J420609p29218
65106A374705L60316J798681n13028m017239l181187J113740K696207N1178j738639
65097b055266O059J269515j176788l723746j751894K452831K832210j270582m154634
65088g572295j923620K677698M828846L793727K306522J722294O08155j965631
65080D475696m190749l890583j775118m61221o57559m34966J281423K698827J987444
65071i66806K67324k36669L44088L01571l48216j21422P51602M24611r98636j089599
65061a672152P31206J648180j66237k253933j450790J140190J738234m61707k269404
65052c016413j284042R04553J303701m10798j754079o73366K072063L702351K252118
$$ plain form
65043 3096088 1818097 -1824289 -4461251 -4116157 -2413545 -2552207 -5171923 -7194363
65035 -7194363 -5369048 -254366 4420475 6052819 5347560 3975171 1985611 -1004922
65027 -1004922 -3537528 -3562117 -1539637 -26672 -110420 -491130 -405809 -911940 -2284057
65018 -2284057 -2638286 -839227 1239276 1277515 -345398 -1945319 -3441336 -5577411 -7637955
65009 -7637955 -8501256 -8890165 -9901595 -10245306 -7979362 -4439724 -3127196 -4603739 -5721210
65000 -5721210 -4424648 -2157224 -550026 1190784 4000490 6578486 7173000 6000448
64992 6000448 4371020 2915342 1874879 1584785 1597958 962825 251884 1295930 3853950
64983 3853950 4940586 3061920 739934 742720 2039370 2085831 1216922 1657338 3361963
$$ packed form
65043C096088j277991l642386k636962L45094J702612j38662k619716k022440
65035g194363J825315N114682M674841J632344p05259j372389j989560k990533
65027a004922k532606k4589K022480J512965q3748l80710Q5321n06131j372117
65018b284057l54229J799059K078503L8239j622913j599921j496017k136075k060544
65009g637955q63301l88909j011430l43711K265944L539638J312528j476543j117471
65000e721210J296562K267424J607198J740810K809706K577996N94514j172552
64992F000448j629428j455678j040463k90094J3173o35133p10941J044046K558020
64983C853950J086636j878666k321986K786J296650M6461q68909M40416J704625
$$ plain form
64974 3361963 4038057 2818267 1039998 -437902 -2042098 -3617674 -4251837 -4128528 -4243087
64965 -4243087 -4108880 -2193902 932072 2421589 1050769 -1004286 -1606302 -1830814 -3870641
64956 -3870641 -7175964 -8823802 -7299313 -4139831 -1715758 -741125 -434110 -112147 278003
64947 278003 833912 1835881 2840389 2427664 -279361 -4148576 -6925302 -7346590 -5565601
64938 -5565601 -2172336 1557842 2975593 291699 -3959143 -4529592 -19451 4744560
64930 4744560 4883716 1519760 -997034 -1523278 -2127825 -3264378 -3273321 -2348944 -2785363
64921 -2785363 -4676739 -5101910 -2665239 416255 1973357 2494898 2566591 795603 -3429210
64912 -3429210 -7402846 -7835925 -4852324 -1420613 143416 -256965 -1285407 -1353197 -41738
$$ packed form
64974C361963O76094j219790j778269j477900j604196j575576o34163J23309j14559
64965d243087J34207J914978L125974J489517j370820k055055o02016k24512k039827
64956c870641l305323j647838J524489L159482K424073R74633L07015L21963L90150
64947B78003N55909J001969J004508m12725k707025l869215k776726m21288J780989
64938e565601L393265L730178J417751k683894m250842n70449M510141M764011
64930D744560J39156l363956k516794n26244o04547j136553q943R24377m36419
64921b785363j891376m25171K436671L081494J557102N21541P1693j770988m224813
64912c429210l973636m33079K983601L431711J564029m00381j028442o7790J311459
$$ plain form
64903 -41738 1034744 169242 -1505921 -1372571 56930 -727593 -4111896 -5225949 -771333
64894 -771333 5378159 7241120 4839574 2811967 2719055 1853785 -766469 -2444556 -1773949
64885 -1773949 -1068694 -2134666 -3390588 -3327838 -3577811 -5843029 -8219768 -7605600 -4400328
64876 -4400328 -2048662 -2506235 -4385920 -5323382 -4321790 -1791520 1204128 3521035
64868 3521035 4704090 5237045 5503264 5044147 3674957 2582431 2905994 3566996 2154743
64859 2154743 -1741281 -5518521 -6577482 -5258009 -3826558 -3339720 -2797335 -1212048
64851 -1212048 817814 2121811 2656495 3318623 4354701 4779831 3572370 1053682 -1118262
64842 -1118262 -1291687 650101 2941351 3510122 2286962 1478276 2951690 5883554 7870564
$$ packed form
64903d1738J076482q65502j675163J33350J429501p84523l384303j114053M454616
64894g71333O149492J862961k401546k027607r2912q65270k620254j678087O70607
64885a773949P05255j065972j255922O2750k49973k265218k376739O14168L205272
64876d400328K351666m57573j879685r37462J001592K530270K995648K316907
64868C521035J183055N32955K66219m59117j369190j092526L23563O61002j412253
64859B154743l896024l777240j058961J319473J431451M86838N42385J585287
64851a212048K029862J303997N34684O62128J036078M25130j207461k518688k171944
64842a118262j73425J941788K291250N68771j223160q08686J473414K931864J987010
$$ plain form
64833 7870564 7814279 6468872 4654845 2738152 1783792 3013998 5514177 6629559 5673492
64824 5673492 5082409 6407772 7417495 5498451 2100548 747715 1577349 1142673 -2294338
64815 -2294338 -6201327 -7230619 -5011982 -1679800 627627 1039060 115939 -672191 -633046
64806 -633046 -918498 -2645768 -4515193 -4261440 -2032588 83122 1540296 3331143 4551518
64797 4551518 2775388 -1233480 -3261502 -2032934 -1833404 -5775907 -10210430 -10089229
64789 -10089229 -7073615 -7111759 -11323705 -14686199 -13775251 -10717356 -8367043 -6187492
64781 -6187492 -3026346 -252276 582404 605767 1567324 2839525 2792728 1531988 90101
64772 90101 -1553118 -3395323 -3927253 -2439056 -1539671 -4033164 -7772878 -7469809 -2457573
$$ packed form
64833G870564n6285j345407j814027j916693r54360J230206K500179J115382r56067
64824E673492n91083J325363J009723j919044l397903j352833Q29634m34676l437011
64815b294338l906989j029292K218637L332182K307427M11433r23121p88130L9145
64806f33046k85452j727270j869425K53753K228852K115710J457174J790847J220375
64797D551518j776130m008868k028022J228568J99530l942503m434523J21201
64789a0089229L015614l8144m211946l362494R10948L057895K350313K179551
64781f187492L161146K774070Q34680K3363R61557J272201m6797j260740j441887
64772I0101j643219j842205n31930J488197Q99385k493493l739714L03069N012236
$$ plain form
64763 -2457573 1136956 -1574809 -6874868 -6917796 -593992 4388356 1533627 -5925113
64755 -5925113 -9624059 -7103102 -3973523 -5032259 -7747125 -7064380 -3338307 -1359182
64747 -1359182 -2870623 -4513308 -3566847 -1676374 -1249425 -1469535 -383382 1368838 1702416
64738 1702416 546663 -504659 -1104251 -2167393 -3473082 -3694604 -2756784 -2034488 -2145041
64729 -2145041 -2458147 -2786333 -3511908 -3842914 -2062945 1890478 5889109 8249298 9276316
64720 9276316 9701826 9319622 7767785 4997702 547670 -5609069 -10935151 -11626320 -7402908
64711 -7402908 -2661424 -1149408 -1772648 -1683036 -928099 -939418 -527140 2445697 6171835
64702 6171835 6039474 1258811 -3388564 -3745016 -1104069 889761 1465075 2410168 4186048
$$ packed form
64763b457573L594529k711765n300059m2928O323804M982348k854729p458740
64755e925113l698946K520957L129579j058736k714866O82745L726073J979125
64747a359182j511441j642685R46461J890473M26949k20110J086153J752220L33578
64738A702416j155753j051322n99592j063142j305689k21522R37820P22296j10553
64729b145041l13106l28186p25575l31006J779969L953423L998631K360189J027018
64720I276316M25510l82204j551837k770083m450032o156739n326082o91169M223412
64711g402908M741484J512016o23240Q9612P54937j1319M12278K972837L726138
64702F171835j32361m780663m647375l56452K640947J993830N75314R45093J775880
$$ plain form
64693 4186048 4952846 3222242 -58086 -2115234 -568539 4348512 9378266 10930443
64685 10930443 8599173 5070524 2469094 435000 -1730237 -3117764 -2747488 -1392222
64677 -1392222 -295078 632965 1795476 2359850 1480037 75195 -350697 179501 790693
$$ packed form
64693D186048P66798j730604l280328k057148J546695M917051N029754J552177
64685A0930443k331270l528649k601430k034094k165237j387527L70276J355266
64677a392222J097144R28043J162511N64374q79813j404842m25892N30198O11192
$$ [...]
##END NTUPLES=NMR SPECTRUM
##END=
