##TITLE=31Pdec_IPEDM2907
 CDCl3, 24 sc
 29.7.2019
##JCAMPDX= 6.0         $$ Bruker NMR JCAMP-DX V2.0
##DATA TYPE= NMR SPECTRUM
##DATA CLASS= NTUPLES
##ORIGIN= UXNMR, Bruker Analytische Messtechnik GmbH
##OWNER= root
$$ XWIN-NMR		Version 3.5
$$ Mon Jul 29 16:09:14 2019 Russian Standard Time (UT+4h)  she@DPX200
##.OBSERVE FREQUENCY= 81.013821
##.OBSERVE NUCLEUS= ^31P
##.ACQUISITION MODE= SIMULTANEOUS
##.ACQUISITION SCHEME= undefined
##.AVERAGES= 24
##.DIGITISER RES= 17
##SPECTROMETER/DATA SYSTEM= spect
##.PULSE SEQUENCE= zgpg30
##.SOLVENT NAME= CDCl3
##.SHIFT REFERENCE= (INTERNAL, CDCl3, 0, 182.463)
##AUDIT TRAIL= $$ (NUMBER, WHEN, WHO, WHERE, WHAT)
$$ ##TITLE= Audit trail, XWIN-NMR		Version 3.5
$$ ##JCAMPDX= 5.01
$$ ##ORIGIN= Bruker BioSpin GmbH
$$ ##OWNER= she
$$ F:/spectra/data/she/nmr/P31/1/pdata/1/auditp.txt
$$ ##AUDIT TRAIL=  $$ (NUMBER, WHEN, WHO, WHERE, WHAT)
(   1,<2019-07-29 16:08:03.46 +0400>,<she>,<DPX200>,
      <created by zg, POWCHK disabled, PULCHK disabled
       configuration hash MD5:
       00 E9 B6 7A A2 85 ED C7 34 08 36 98 17 FE 4E 26
       data hash MD5: 32K
       6A 67 87 84 91 E3 8C C0 3C 8E 99 A6 38 EC AA 41>)
(   2,<2019-07-29 16:08:06.40 +0400>,<she>,<DPX200>,
      <Start of raw data processing
       efp BC_mod = 2 LB = 1 FT_mod = 6 PKNL = 1 PHC0 = -406.8971 PHC1 = 130.4 SI = 64K 
       data hash MD5: 64K
       51 F4 EE A4 3B 06 F6 89 9D 22 B2 F3 E2 B2 F5 CF>)
(   3,<2019-07-29 16:08:21.07 +0400>,<she>,<DPX200>,
      <pk PHC0 = 2.919699 PHC1 = 0 
       data hash MD5: 64K
       BE 40 E5 46 77 5E A0 C2 67 40 FF 9F 16 D8 19 42>)
$$ ##END=
$$ 
$$ hash MD5
$$ 0C C9 ED 8F AC 82 61 0B DC 0C A0 2B 27 70 95 B8
##$RELAX= 
##$RELAX= 
##$RELAX= 
##$RELAX= 
##$RELAX= 
##$RELAX= 
##$RELAX= 
##$RELAX= 
$$ Bruker specific parameters
$$ --------------------------
##$DU= <F:/spectra>
##$EXPNO= 1
##$NAME= <P31>
##$PROCNO= 1
##$TYPE= <nmr>
##$USER= <she>
##$AMP= (0..31)
100 100 100 100 100 100 100 100 100 100 100 100 100 100 100 100 100 100 
100 100 100 100 100 100 100 100 100 100 100 100 100 100 
##$AQSEQ= 0
##$AQ_mod= 1
##$AUNM= <au_zg>
##$AUTOPOS= <>
##$BF1= 81.014009
##$BF2= 200.13
##$BF3= 200.13
##$BF4= 200.13
##$BF5= 200.13
##$BF6= 200.13
##$BF7= 200.13
##$BF8= 200.13
##$BYTORDA= 1
##$CFDGTYP= 0
##$CFRGTYP= 5
##$CHEMSTR= <none>
##$CNST= (0..31)
1 1 145 1 1 1 1 1 1 1 1 1 1 1 1 1 1 1 1 1 1 1 1 1 1 1 1 1 1 1 1 1 
##$CPDPRG= <waltz16>
##$CPDPRG1= <>
##$CPDPRG2= <waltz16>
##$CPDPRG3= <>
##$CPDPRG4= <mlev>
##$CPDPRG5= <mlev>
##$CPDPRG6= <mlev>
##$CPDPRG7= <mlev>
##$CPDPRG8= <mlev>
##$CPDPRGB= <>
##$CPDPRGT= <>
##$D= (0..31)
0 1 0 0 0 0 0 0 0 0 0 0.03 2e-05 3e-06 0 0 0 0 0 0 0 0 0 0 0 0 0 0 0 0 
0 0 
##$DATE= 1564402082
##$DBL= (0..7)
120 120 120 11 120 120 24 19 
##$DBP= (0..7)
150 150 150 150 150 150 150 150 
##$DBP07= 0
##$DBPNAM0= <>
##$DBPNAM1= <>
##$DBPNAM2= <>
##$DBPNAM3= <>
##$DBPNAM4= <>
##$DBPNAM5= <>
##$DBPNAM6= <>
##$DBPNAM7= <>
##$DBPOAL= (0..7)
0.5 0.5 0.5 0.5 0.5 0.5 0.5 0.5 
##$DBPOFFS= (0..7)
0 0 0 0 0 0 0 0 
$$ [...]
##$SUBNAM2= <"">
##$SUBNAM3= <"">
##$SUBNAM4= <"">
##$SUBNAM5= <"">
##$SUBNAM6= <"">
##$SUBNAM7= <"">
##$SUBNAM8= <"">
##$SUBNAM9= <"">
##$SW= 369.568048894756
##$SWIBOX= (0..15)
0 1 3 0 0 0 0 0 0 0 0 0 0 0 0 0 
##$SW_h= 29940.119760479
##$TD= 32768
##$TD0= 1
##$TE= 0
##$TE2= 300
##$TE3= 300
##$TEG= 300
##$TL= (0..7)
0 120 53 12 22 120 120 120 
##$TP= (0..7)
150 150 150 150 150 150 150 150 
##$TP07= 0
##$TPNAME0= <>
##$TPNAME1= <>
##$TPNAME2= <>
##$TPNAME3= <>
##$TPNAME4= <>
##$TPNAME5= <>
##$TPNAME6= <>
##$TPNAME7= <>
##$TPOAL= (0..7)
0.5 0.5 0.5 0.5 0.5 0.5 0.5 0.5 
##$TPOFFS= (0..7)
0 0 0 0 0 0 0 0 
##$TUNHIN= 0
##$TUNHOUT= 0
##$TUNXOUT= 0
##$USERA1= <user>
##$USERA2= <user>
##$USERA3= <user>
##$USERA4= <user>
##$USERA5= <user>
##$V9= 5
##$VALIST= <valist>
##$VCLIST= <CCCCCCCCCCCCCCC>
##$VD= 0
##$VDLIST= <DDDDDDDDDDDDDDD>
##$VPLIST= <PPPPPPPPPPPPPPP>
##$VTLIST= <TTTTTTTTTTTTTTT>
##$WBST= 1024
##$WBSW= 4
##$XGAIN= (0..3)
0 0 0 0 
##$XL= 0
##$YL= 0
##$YMAX_a= 71610
##$YMIN_a= -70997
##$ZGOPTNS= <>
##$ZL1= 120
##$ZL2= 120
##$ZL3= 120
##$ZL4= 120
##$ABSF1= 0
##$ABSF2= 0
##$ABSG= 0
##$ABSL= 0
##$ALPHA= 0
##$AQORDER= 0
##$ASSFAC= 0
##$ASSFACI= 0
##$ASSFACX= 0
##$ASSWID= 0
##$AUNMP= <proc_1d>
##$AZFE= 0.1
##$AZFW= 0.5
##$BCFW= 0
##$BC_mod= 2
##$BYTORDP= 0
##$COROFFS= 0
##$CY= -3
##$DATMOD= 1
##$DC= 0
##$DFILT= <>
##$DTYPP= 0
##$F1P= 0
##$F2P= 0
##$FCOR= 1
##$FTSIZE= 65536
##$FT_mod= 6
##$GAMMA= 0
##$GB= 0
##$INTBC= 1
##$INTSCL= 5.30512e-09
##$ISEN= 30
##$LB= 1
##$LEV0= 0
##$LPBIN= 0
##$MAXI= 10000
##$MC2= 0
##$MEAN= 0
##$ME_mod= 0
##$MI= 50
##$NCOEF= 0
##$NC_proc= -2
##$NLEV= 6
##$NOISF1= 182.463
##$NOISF2= 159.3651
##$NSP= 0
##$NTH_PI= 0
##$NZP= 0
##$OFFSET= 182.463
##$PC= 4
##$PHC0= -403.9774
##$PHC1= 130.4
##$PH_mod= 1
##$PKNL= yes
##$PPARMOD= 0
##$PSCAL= 0
##$PSIGN= 0
##$REVERSE= no
##$SF= 81.0140089999434
##$SI= 65536
##$SIGF1= 159.3651
##$SIGF2= -187.1042
##$SINO= 113.3802
##$SIOLD= 16384
##$SREGLST= <1H.CDCl3>
##$SSB= 0
##$STSI= 65536
##$STSR= 0
##$SW_p= 29940.119760479
##$SYMM= 0
##$S_DEV= 0
##$TDeff= 32768
##$TDoff= 0
##$TI= <>
##$TILT= no
##$TM1= 0
##$TM2= 0
##$TOPLEV= 0
##$USERP1= <user>
##$USERP2= <user>
##$USERP3= <user>
##$USERP4= <user>
##$USERP5= <user>
##$WDW= 1
##$XDIM= 65536
##$YMAX_p= 368932133
##$YMIN_p= -2812701
$$ End of Bruker specific parameters
$$ ---------------------------------
##NTUPLES= NMR SPECTRUM
##VAR_NAME=  FREQUENCY,     SPECTRUM/REAL,   SPECTRUM/IMAG
##SYMBOL=    X,             R,               I
##VAR_TYPE=  INDEPENDENT,   DEPENDENT,       DEPENDENT
##VAR_FORM=  AFFN,          ASDF,            ASDF
##VAR_DIM=   65536,         65536,           65536
##UNITS=     HZ,            ARBITRARY UNITS, ARBITRARY UNITS
##FACTOR=    0.456856943014862, 1,           1
##FIRST=     14782.0589164792, 0,            0
##LAST=      -15158.0608439998, 0,           0
##MIN=       -15158.0608439998, -2812701,    0
##MAX=       14782.0589164792, 368932133,    0
$$ Real data points
##PAGE= N=1
##DATA TABLE= (X++(R..R)), XYDATA
$$ [...]
41710a14794m9819N7802J14846O1066n688J2635O6730M7113m0855q5074l5651
41699B8311K4947O541o1147p6349n267Q3350J16691R7148O6984L6467j5224q3942
41687B18510j25168j04364m2641K255l741l7746m9066j8482J8970J5980k9378
41676a54871p0280o2436m971O6346J07354Q8358J5569o1278q6477n5958j7562
41665b36206n752m863Q183K0505J3433O332K7432N6746M4426j4636o5210o0360
41653b09970j5227K1116K6408K1932L5724N9383N0197j2269p8889p2951J0284
41642a64262Q5553Q5472M4987L5396N5076N1001K1533J4209K5128q295r0624j31022
41630B4152p1014K1713N0731K5371K1861N0437N1523J1369j1425Q926J6193l3037
$$ y = [-114794, -164613, -106811, 8035, 69101, 63413, 76048, 142778, 189891, 149036, 63962, 28311, 53258, 59799, -1348, -77697, -82964, 386, 117077, 214225, 281209, 317676, 302452, 218510, 93342, -11022, -53663, -51408, -55149, -92895, -141961, -160443, -141473, -125493, -154871, -225151, -287587, -292558, -226212, -118858, -30500, -14931, -76209, -162686, -218644, -236206, -241958, -246821, -238638, -218133, -204700, -198368, -170936, -114190, -69764, -84400, -149610, -209970, -225197, -204081, -177673, -155741, -120017, -60634, -10437, -22706, -101595, -174546, -164262, -78709, 6763, 51750, 87146, 142222, 193223, 214756, 228965, 254093, 245798, 155174, 24152, -46862, -25149, 25582, 50953, 72814, 123251, 174774, 186143, 174718, 183644, 199837, 166800]
41618A66800r0793q7918l6305L99O548J4777K2501q391n5971l1203Q2709J59063
41606A42216Q1984p2438j17059q735R3835O0057l8726o0575l573K7167M388k552
41594A05989K3506J6585l4173m4844J2955L9424l5824j23339j06030k4997o424
41583a77172m9439l2709O9914J27776N3786n7390p1930p850J6073l0767o0245
41572b19953j3359N5297O4025J2257l1918k0271K6476M6011O22p7294j11455o5457
41560c35019J4372N9463N9491M7474K7961k2606q8790j13688p7578j9468L9387
41549d09001J24932K24636K46022J33842k1829q3257m4214j7678n4455q0407l6437
41538a7846K4003L3995K3596N0006P6853K1414r9981j68796j17351j2135L9133
$$ y = [166800, 76007, -11911, -48216, -47817, -41269, -26492, -3991, -12382, -68353, -99556, -16847, 142216, 224200, 151762, 34703, 25968, 119803, 179860, 141134, 80559, 76986, 104153, 108541, 105989, 129495, 146080, 111907, 67063, 80018, 119442, 83618, -39721, -145751, -170748, -177172, -226611, -259320, -189406, -61630, -7844, -65234, -137164, -145014, -128941, -159708, -219953, -233312, -178015, -113990, -101733, -133651, -153922, -127446, -81435, -80813, -158107, -269562, -335019, -320647, -261184, -201693, -154219, -126258, -148864, -237654, -351342, -428920, -448388, -409001, -284069, -59433, 186589, 320431, 298602, 215345, 171131, 153453, 98998, 18591, -17846, 6157, 40152, 63748, 113754, 190607, 212021, 112040, -56756, -174107, -186242, -147109]
41527a47109R586m3173n3349p20P9832J19494P3265k3551q1840n8722l092J6850
41515a12529l409k3767k6882k1821m739K8745M2036q756r0093j02878j0376R7551
41503b36918J12762M1598k3071k9846l536K7917O1868P3492K2677o5259j00674
41492a18990n0093J6215M3149P3374J36287J42280J1477j48629j50891m845Q0481
41481B9815M611q2106l0345O8654L8366r5242j46246n3720M8994N4383J4124J1189
41469a37523K9432J9785L10J0955L1164J6234k3925m4259l4328j6960p55J9132
41457a30738L1226K1763O156R470K4514K0893j1598n4872q8780j00301p5840j3278
41445c61385N7988R2163P0884K4518N412L6870Q4108Q4417K0006n1040o1799k1996
$$ y = [-147109, -137523, -180696, -234045, -234765, -154933, -35439, 37826, 14275, -67565, -126287, -129379, -112529, -115938, -139705, -166587, -188408, -193147, -164402, -122366, -131122, -221215, -324093, -334469, -236918, -124156, -82558, -105629, -135475, -139011, -111094, -49226, 24266, 46943, -18316, -118990, -169083, -152868, -109719, -36345, 99942, 242222, 253699, 105070, -45821, -50666, 29815, 34426, -47680, -78025, -9371, 28995, -66247, -212493, -266213, -217219, -162836, -148712, -137523, -108091, -88306, -87996, -77041, -45877, -29643, -53568, -97827, -132155, -149115, -149870, -130738, -99512, -77749, -71593, -62123, -37609, -16716, -28314, -83186, -171966, -272267, -348107, -361385, -303397, -211234, -140350, -115832, -110420, -73550, 10558, 94975, 114981, 63941, 2142, -19854]
41433a9854L229o941p622K1789L1802j3807o3301m3084L5117R1564Q2687L4094
41421A45673j3093l3729j1694L7093M5084l2789j25773j10286J3497R5611L4925
41410D4519p7408r0422o053M4815P699l5682k4475j3269m9917n9986M3951J91872
41398b4356K14341P0143q8199j09860k5028K6590j0175n6962l0690M4954P7577
41387H8335K4853n2637o3148M47M3194j0384j03447j11625j5797O5718M5568j1023
41375i9946L997P4603R5544M0848n750R416L5040Q018n3046q6156o4340k635O7029
41362B2622R9584O3020p933l0903J7238N9848K7457m3641p4909o5812p7130j13300
41350a23859j02532q589J01931J37484Q7226J5009k6118l6242l6780l5711l3957
$$ y = [-19854, -16625, -23566, -31188, -9399, 22403, 8596, -54705, -97789, -62672, 28892, 111579, 145673, 132580, 98851, 87157, 124250, 169334, 136545, 10772, -99514, -86017, 9594, 44519, -32889, -123311, -129364, -84549, -76850, -112532, -137007, -150276, -200193, -260179, -216228, -24356, 189985, 260128, 171929, 62069, 37041, 63631, 53456, -3506, -34196, 10758, 88335, 113188, 60551, -2597, -2150, 41044, 30660, -72787, -184412, -200209, -134491, -88923, -99946, -95949, -21346, 74198, 115046, 109296, 118712, 153752, 161770, 108724, 22568, -41772, -44407, 22622, 122206, 185226, 177293, 146390, 163628, 223476, 250933, 207292, 132383, 66571, -10559, -123859, -226391, -234980, -133049, 4435, 91661, 106670, 80552, 44310, 7530, -28181, -62138]
41339f2138l6785l7840j3162L7479N8700j567r7847j13781j4220R0794R1254K9930
41327f9183K2373O4694M3930n6176r5241J7198J65216J72817L7449q7012j02263
41316A13802n4027j6980O308M2257P5340O8332K1200k7373m8674n3856p1360r8376
41304d3407q9195j4740P4080Q7555J4315n3553m2278Q272J7119j8491m0422l0742
41292a31487j9799j1153K2750P0556Q2126N1229L2061N3099P2062M1452k9241
41281B33655r8964j37126j20712m0804N8809R7947N2314j1285k9847k9353o0867
41270h6233r0027l1790J04593J85532J09818n1534j28650n4549N8988O4071m3852
41259C6367j30013r3128J4470O2463N610p2068p1277P308Q0801Q8424M5196p39
$$ y = [-62138, -98923, -136763, -149925, -112446, -53746, -55313, -153160, -266941, -281161, -190367, -99113, -69183, -46810, 17884, 61814, 5638, -89603, -72405, 92811, 265628, 303077, 216065, 113802, 59775, 42795, 49103, 91360, 166700, 235032, 256232, 228859, 180185, 126329, 54969, -43407, -132602, -147342, -73262, 14293, 28608, -24945, -67223, -58951, -41832, -60323, -100745, -131487, -151286, -162439, -139689, -69133, 12993, 64222, 96283, 149382, 221444, 262896, 233655, 134691, -2435, -123147, -163951, -105142, -7195, 45119, 33834, 3987, -25366, -86233, -176260, -208050, -103457, 82075, 191893, 140359, 11709, -42840, 16148, 80219, 36367, -93646, -186774, -172304, -109841, -104231, -176299, -247576, -240268, -159467, -71043, -25847, -26586]
41247b6586k8165m3028m1524p294N0821Q7738P0635K4394N084L2628O9501O5051
41235B59255O283p0491j05709o7483M845K7249l0865r8069r0816k7223Q215l910
41223a88719j376M0752O3523K7459j8409j8452Q076K1785L4482O1186N8480j1967
41211G6820r7605j09463l9100M1782P4522N1225p721n6464m2815J4943K1095n4230
41199a27011q9616K0533J68389J49964l4953j61922r2396M7658P0929j8016p5541
41188a41982l6371L5737P0306O1998L3690L447j2137j1679k1174n5083p8434m6681
41176a98363K5388P0839M6149k4957q2229q5979m4339M870L5256N0602O0894N8559
41164h3310L6946J3487O194M044p095r908J1479K6320j404m3598m2649m671J1114
$$ y = [-26586, -54751, -97779, -139303, -146597, -95776, -8038, 62597, 86991, 92075, 124703, 194204, 259255, 265538, 195047, 89338, 21855, 26700, 53949, 23084, -74985, -165801, -193024, -184809, -188719, -190095, -149343, -85820, -58361, -76770, -95222, -87146, -65361, -30879, 30307, 88787, 76820, -20785, -130248, -169348, -127566, -53044, -1819, -9540, -66004, -108819, -93876, -72781, -127011, -216627, -196094, -27705, 122259, 87306, -74616, -167012, -119354, -48425, -66441, -141982, -178353, -142616, -72310, -10312, 23378, 26825, 14688, 3009, -18165, -73248, -151682, -198363, -172975, -102136, -55987, -80944, -163173, -249152, -293491, -288621, -253365, -202763, -141869, -83310, -46364, -32877, -26683, -22639, -29734, -39642, -28163, -1843, -3247, -46845, -89494, -94165, -83051]
41151h3051p687j3515R101K0062R694K3982P1034Q2693J7791o3743q4954n4966
41139g3559l1563k6830j1372J6742K5327J057k9358k8745J3516O2536N9501q005
41127c0753o7376m2944L0835M8681p948m0256J0886O9181M5273k0932k4325M3095
41115A3417Q1866K8562n9999q3178k1264M0205J4417o8029q2664J9476J18677
41104A486P6491o0757j18221m2310L6788J9746k0909J4241Q0743O7691k5764r2521
41092f3296o1345L5338J13526J11124L8255k1272j662M6162J8729p5750j22070
41081A7739q2835m8219o0664l7484N7666J14814N4324l1724l5904o597k8101n0098
41069a37083R840R7332J13481Q1758O4344J4456j09186j82712q1531P7685Q7263
$$ y = [-83051, -90738, -104253, -95152, -75090, -65396, -41414, 29620, 112313, 130104, 66361, -18593, -73559, -105122, -131952, -143324, -126582, -101255, -100198, -129556, -158301, -144785, -82249, -22748, -30753, -98129, -141073, -110238, -61557, -69505, -109761, -98875, -29694, 15579, -5353, -29678, 13417, 95283, 123845, 63846, -19332, -40596, -391, 14026, -54003, -136667, -117191, 1486, 77977, 17220, -101001, -143311, -106523, -86777, -107686, -93445, -12702, 54989, 29225, -63296, -124641, -89303, 24223, 135347, 173602, 152330, 150668, 196830, 215559, 139809, 17739, -65096, -113315, -173979, -211463, -153797, -38983, 15341, -16383, -52287, -58884, -86985, -137083, -127243, -29911, 83570, 165328, 229672, 244128, 134942, -47770, -129301, -51616, 35647]
41058C5647k1676m5372L8320N2589m1622p2379K8281J00896M0013l7866j9646
41047E7185K2600R59k6339J498R867o1221j14174m9380N6786P3422J3212k6434
41035d2019l0353m2629n1938k2028K3380M6737O4987Q7956O6708j1681o5148m2831
41023a8859j7286n3292q3919l0973M6219N0591J2825K1231N6706L8376k0326l8187
41011c6894o442K2676M2760O7802N4508j9437n8615J9340J11045N8591q4035j12832
40999E8467J860O4005l2081j38817r9946J7598O2124K9914J2751J1486l5117q5823
40987a33579k7980J22387J98273J08089l0301n9882l997o790r6617j43242p1894
40976a45533J0275j7003r2023o9662M2020R2556K7438l6301n990N4040M7973j0481
$$ y = [35647, 13971, -31401, 6919, 59508, 17886, -54493, -26212, 74684, 114697, 76831, 57185, 79785, 80744, 54405, 55903, 65770, 4549, -109625, -159005, -102219, -28797, -15585, -42019, -72372, -115001, -166939, -188967, -165587, -118850, -53863, 34093, 100801, 89120, 23972, -18859, -36145, -89437, -173356, -204329, -158110, -107519, -94694, -73463, -16757, 21619, 1293, -36894, -43336, -20660, 22100, 89902, 144410, 124973, 66358, 85698, 196743, 255334, 171299, 58467, 60327, 124332, 92251, -46566, -146512, -128914, -66790, -36876, -24125, -12639, -47756, -133579, -161559, -39172, 159101, 267190, 236889, 177007, 173010, 166220, 69603, -73639, -145533, -135258, -152261, -244284, -313946, -271926, -179370, -151932, -188233, -194223, -140183, -92210, -102691]
40964a02691n5759o8746m5614L3159J27384J31408K7370n5860k4884M4683N5059
40953F5509M5349P8322R0683J3969o3562l5522J7339l8210j29704q6188N0471
40942H456P6348k8130o9772J4191N6931k3251p4219O801Q3448K7197n6552k7110
40930e662M5475K7820l0529m258O8004O0534o908j8936J5594j929n0042k1544
40918G7619N2247K5900r7867j39130k2866J01089R6821L1235K3401M9872K4453
40907B22774l4522m7198j3453P233Q033J9077J9971k3865o6089l3491L5338K1548
40895A15356q9124j64684j11847o053K6274k0805n6781l6611P020M3103O8119
40884b26033O4057J4301l4270n884Q7563J38314Q2140j9936p5908p4770n7111
$$ y = [-102691, -158450, -227196, -272810, -239651, -112267, 19141, 46511, -9349, -34233, 10450, 65509, 110858, 189180, 279863, 293832, 230270, 194748, 212087, 173877, 44173, -42015, 8456, 84804, 56674, -13098, 1093, 58024, 34773, -39446, -32645, 50803, 78000, 21448, -5662, 39813, 67633, 37104, 32846, 100850, 161384, 154476, 135540, 151134, 149205, 99163, 77619, 129866, 155766, 57899, -81231, -104097, -3008, 93813, 125048, 148449, 198321, 222774, 188252, 141054, 127601, 134834, 142867, 161944, 181915, 158050, 91961, 58470, 93808, 115356, 26232, -138452, -250299, -256352, -230078, -250883, -307664, -344275, -337255, -294152, -226033, -161976, -147675, -181945, -187829, -100266, 38048, 120188, 100252, 24344, -50426, -107537]
40873a07537l4339K15K4657J8322O392J6388K3978K676j0798K4959O4373K8779
40861E8065o4594j17006q7813l1045J2128O4152J29733J48478P3651n5349j52586
40850b2186j61053q1259K7693P6120L0069l4532k6581L0117M8612L7955Q2315
40839G270J56138J17069o0726j98114j52378j7095L8173J2695J2136L2157j7364
40828g0039j11781j15383L727J15583J20044O8026M4275M1830J8559p613M033
40817A11261L4978K7955l3515j06344j33253q8782q70O5618P1076M4027L2410
40806B4561K9224k998m9642n6372k2418k576n192K3864Q5901R2401K052q7915
40794C0890o9964J4101L5446l7211j13122j22796q5956l0980N4010J54206J94034
$$ y = [-107537, -141876, -141661, -117004, -98682, -92290, -75902, -51924, -49248, -60046, -35087, 29286, 58065, -6529, -123535, -211348, -242393, -230265, -166113, -36380, 112098, 185749, 130400, -22186, -183239, -264498, -236805, -160685, -130616, -165148, -191729, -161612, -113000, -75045, 7270, 163408, 280477, 219751, 21637, -130741, -147836, -109663, -96968, -84832, -52675, -70039, -181820, -297203, -293476, -177893, -57849, 10177, 54452, 96282, 114841, 107228, 111261, 146239, 174194, 140679, 34335, -98918, -187700, -188570, -122952, -51876, -7849, 24561, 53785, 50787, 1145, -55227, -77645, -80221, -85413, -61549, 24352, 116753, 118805, 30890, -39074, -24973, 10473, -26738, -139860, -262656, -348612, -379592, -325582, -171376, 22658]
40783B2658J27916J6435m1719k4120J1781J2710k4875p3420r8959q0276l4650
40772a86519q603j7047j9675R461L0172Q890R7O7603J47915J06801n1481j51519
40760f3905q1705M4093N1649m7894r5878k5940O2765P2158K9713J4168M3434Q0559
40748H3217R3293P0490K1791j4034k091K8468M146q9025j66756j43435l3485P2714
40736g4707J05109O1526j2241o0722n4547j0970K8471M5139N2389N8876M9518
40725A87841J0316m7182r0744q7449l1397L3958M5948n57l7881j8047K0703K2252
40713G761l465k3566n1481r3984q9579k653P8664O4120K3973P2576J39366O1571
40701A83303j08077j31226L1883J26263K753j34750o1843J02185R8954n5599j27505
$$ y = [22658, 150574, 167009, 125290, 101170, 112951, 125661, 100786, 27366, -71593, -151869, -186519, -195122, -212169, -231844, -222383, -192211, -183321, -183224, -115621, 32294, 139095, 87614, -63905, -145610, -101517, -49868, -97762, -193640, -219580, -156815, -84657, -54944, -40776, 2658, 83217, 176510, 247000, 268791, 254757, 252666, 281134, 285280, 196255, 29499, -113936, -147421, -74707, 30402, 91928, 79687, 18965, -35582, -46552, -18081, 27058, 79447, 138323, 187841, 198157, 150975, 60231, -27218, -58615, -24657, 21291, 20734, -17147, -35194, -14491, 7761, 4296, -19270, -70751, -164735, -254314, -256967, -178303, -114183, -90210, -17634, 121732, 183303, 75226, -56000, -24117, 102146, 104899, -29851, -91694, 10491, 109445, 53846, -73659]
40690g3659m6958K9374Q925k5114n531K2237K8013M8667P7730N3994j1265l5820
40678G0593j6497l6316r9806j07280k7791M2997M0880J7750K3213K7537J0601
40667e4119Q526K5489J4325j7388o267K7904j1668j04933r4334N7719J60455P0516
40655G6225p6247p3872L1922K9852j11013j89951p8632R8329J46398M7597n1005
40644a50397l4705N9471J10152O2667j1273j8149K3203J6344m9337o7491J5124
40633d4391R8855P8286M575k156N6693P2523O399o4463p7853o1725n6876m8592
40621c8725j2776K5035J6401m6356j11794j08462j2809J08916J51604Q6717m438
40610E3313l9356l1851l7969n3527l3482J7881N1299N2990N0659M6419J3572l7022
$$ y = [-73659, -120617, -91243, -82318, -107432, -112963, -90726, -62713, -14046, 63684, 117678, 106413, 70593, 54096, 17780, -82026, -189306, -217097, -174100, -133220, -115470, -92257, -64720, -54119, -45593, -20104, -5779, -23167, -29434, -1530, -13198, -118131, -212465, -154746, 5709, 76225, -22, -73894, -41972, -12120, -123133, -313084, -391716, -293387, -146989, -99392, -150397, -185102, -125631, -15479, 47188, 35915, 17766, 40969, 57313, 7976, -59515, -44391, 54464, 132750, 137325, 135169, 191862, 264385, 270784, 206321, 128468, 66743, 9867, -38725, -51501, -26466, -10065, -56421, -168215, -276677, -289486, -180570, -28966, 57751, 53313, 13957, -17894, -55863, -109390, -142872, -124991, -73692, -20702, 29957, 76376, 89948, 52926]
40598E2926n2976j5193L6630O3415O2850L9434q769n9916p5310n6644n1798p9575
40586a44926r0109l4956N1101Q0003J9417n9601o1016J9259Q0526L9357n6648
40575a57593q3102p313O0783K0927p3881r3155j1167P2173Q5925P2455Q9015J05815
40563H0882O4950q300l2913K93Q300n2369j03008n2571N3181Q0160r61o9140l6417
40550f7913K1213n022p6350p3862L222M5096K2504K0237N8670L6483q5010j79290
40538b80022j30289K1Q1088R3539Q9996O6498J439m6472j5378L4017N213o2094
40526a62444n0311L2098N9352o04m0527o106J6192l8003q7107k5755J13145J97106
40514G036J47490M920j20134j36973n5744J4781j913l9934R535J11637J20356
$$ y = [52926, -50, -15243, 21387, 84802, 147652, 187086, 178317, 118401, 43091, -13553, -65351, -144926, -235035, -269991, -218890, -138887, -119470, -179071, -240087, -220828, -140302, -100945, -157593, -240695, -248008, -187225, -166298, -240179, -333334, -344501, -272328, -186403, -113948, -24933, 80882, 145832, 137532, 104619, 104912, 113212, 60843, -42165, -94736, -41555, 38605, 37644, -31496, -67913, -46700, -51722, -128072, -201934, -198712, -153616, -131112, -110875, -52205, -15722, -100732, -280022, -410311, -410290, -329202, -235663, -145667, -79169, -77730, -124202, -139580, -105563, -100350, -162444, -212755, -180657, -121305, -121909, -162436, -168542, -152350, -190353, -277460, -303215, -190070, 7036, 154526, 159446, 39312, -97661, -153405, -138624, -140537, -180471, -170936, -59299, 61057]
40503F1057N278q9459n6434L3775P0678O3915P3650Q1746M2143j2008k2020j3840
40491B38481m8314r6800p2215K8388J05681Q8340J1059m7970n5756l7693l1636
40480H1565l9184k4928K0453L8853j6574q0199m8244M3151M4506o4044j10222
40469a54867K86J08416M3776r3262q8842L9146Q4915K918l7244L7501Q3234O884
40457C2861o6430j4974P3780O4599n284k5267j2747m6733q8828m6587M0361M9801
40445d5448j9298n8298m6565o6179j12522o7741Q9668K09219J80156Q5702N2375
40434B01069N8445P479q7640j22501o8713r797j0230l5204j8570M4173R2261O9083
40422A19855p941m9968J93P0920L3258j10270j94247j04337O1356J31913R0906
$$ y = [61057, 66335, -23124, -79558, -45783, 24895, 88810, 162460, 244206, 286349, 274341, 252321, 238481, 190167, 93367, 21152, 49540, 155221, 243561, 254620, 206650, 150894, 113201, 81565, 42381, 17453, 37906, 76759, 60185, -20014, -68258, -25107, 19399, -44645, -154867, -154581, -46165, -2389, -95651, -184493, -145347, -60432, -57514, -94758, -57257, 25977, 32861, -33569, -48543, 25237, 89836, 84552, 59285, 46538, -195, -89023, -135610, -95249, -45448, -64746, -123044, -169609, -235788, -348310, -416051, -326383, -117164, 62992, 148694, 201069, 259514, 266993, 179353, 56852, -11861, -21658, -31888, -67092, -85662, -41489, 50772, 119855, 111914, 61946, 62139, 133059, 166317, 56047, -138200, -242537, -181181, -49268, 41638]
40411D1638M7601L6054p304p6689o9152L3936R9440L4999o3400n6287L0086N6319
40399A07241j3607o9505k7068O0206R1012M5141k1189o2988p7791o6364j5738
40388e0650N9529R5849M6635l7904n4181J3127N6895K325p0613m5886L7199L3265
40376H5590q0399j60729j12831j4499L2387M9684R0673J07077L0202q3070j10113
40365a66028l2440O2210J16742J35665J03576p828j46127j98051j28100j8299
40355b78680M7975O8854P4447O8095M6456K3180N273j5948l7253m2259l1909k1768
40343i3537j1936O807K7115L8451M6990M9737K4005j5894k424Q1799J38549P7246
40331C66908m2304r0399n3471k6709m6667n6253k8991j411K3651P8857J23376
$$ y = [41638, 89239, 125293, 117989, 41300, -27852, 6084, 105524, 140523, 77123, 20836, 50922, 107241, 93634, 24129, -2939, 57267, 148279, 193420, 172231, 109243, 31452, -34912, -50650, 8879, 104728, 151363, 113459, 59278, 72405, 129300, 131625, 61012, 15126, 52325, 85590, 5191, -155538, -268369, -282868, -250481, -200797, -110124, -3047, 27155, -55915, -166028, -198468, -136258, -19516, 116149, 219725, 211897, 65770, -132281, -260381, -278680, -230705, -161851, -87404, -19309, 27147, 50327, 55600, 39652, 2399, -39860, -71769, -93537, -105473, -98666, -71551, -33100, 13890, 63627, 87632, 71738, 69314, 151113, 289662, 366908, 324604, 234205, 180734, 154025, 107358, 51105, 22114, 20703, 44354, 123211, 246587]
40320B46587O4377q0714j70154j30023m3445k434J0474L6440N2239L8611L5616
40309E7574N6862L8850n1393j37521j30558l7483P3988J44206J22043o009j45970
40298a5411j60852n0386M3416M8060M2329P7872Q2285K1147j2745K0548J1258
40287A07521q5694j20132N17J05440K2081j12335n7585J28060J78966M8667n0364
40276A65142j7439J5680l5429p6479m6142k1283l5732r428O5445P5526L183j5950
40264F7094N7605P3955l7912j22678o2232J6883k5443q8872j9687R6175O5128
40253B0016q1901j29426j1331J12408J11496L0643l8938p2139o2268M544Q7029
40242b9867J05174N1384J449j930N888n011j3935p107q705l3954o5393q3358p4242
$$ y = [246587, 310964, 230250, 60096, -69927, -113372, -115806, -105332, -68892, -16653, 21958, 57574, 114436, 153286, 101893, -35628, -166186, -203669, -129681, 14525, 136568, 130559, -15411, -176263, -226649, -183233, -135173, -92844, -14972, 67313, 88460, 75715, 96263, 107521, 21827, -98305, -97788, 7652, 29733, -82602, -140187, -12127, 166839, 215506, 165142, 147703, 163383, 127954, 51475, 5333, -15950, -51682, -61110, 4335, 79861, 83044, 67094, 124699, 198654, 160742, 38064, -24168, -7285, -32728, -121600, -141287, -45112, 20016, -61885, -191311, -202642, -90234, 21262, 51905, 12967, -59172, -121440, -116896, -29867, 75307, 126691, 128140, 126210, 132098, 127087, 113152, 106045, 97340, 63386, -2007, -85365, -159607]
40229a59607k0581O3485J10330P8766K8584L5657O1592R157j07791j66609j16012
40218a83029l5857Q125M7442R9762R6043K816p9863m8249M1827N1133m1113j18196
40206a59159r2372P690J10363J64360J24343j9177j63931j55921J2379J53776
40196a7649J17485j1848n2841L287R465p7988j29980o7230J4828K4243K5081R1482
40184g1665J37935N5440p3416p8902K4905O4427j2139p2043l6239J1378N040N106
40172d0173M6302M7868k3969o0469L885N5431j1041j01133p6312J3058K7639j7807
40160a36721k582P1165R5260O4339O8770R3940L0893r9622j38577m9444Q116n8698
40148e3161j20897m6228P9710R0575p012o1003J267J01086J37226Q9265J39p3211
$$ y = [-159607, -180188, -116703, -6373, 72393, 100977, 136634, 198226, 207383, 99592, -67017, -183029, -218886, -210761, -163319, -63557, 32486, 35302, -44561, -92810, -50983, 150, -40963, -159159, -251531, -243841, -133478, 30882, 155225, 136048, -27883, -183804, -171425, -17649, 99836, 87988, 35147, 38434, 47899, -30089, -160069, -227299, -212471, -188228, -163147, -71665, 66270, 121710, 48294, -30608, -5703, 58724, 46585, -25458, -61697, -50319, -45279, -40173, 6129, 53997, 30028, -30441, -26556, 28875, 17834, -83299, -159611, -146553, -118914, -136721, -139303, -68138, 27122, 91461, 160231, 254171, 285064, 185442, 46865, -2579, 5537, -53161, -174058, -220286, -140576, -50001, -57013, -118016, -116749, -15663, 121563, 210828, 210967, 137756]
40136A37756r1370n9157k1162j4271l8554p3634q9916n2257L4794R5902O9180
40125a02689J2138L3033J16631J29873K3309r2212j14823p9866n7030l5006Q569
40114a58073K6987p482k3607L6887J02788P5951j2915n8056l5032N38K2375L9300
40102I661L5131J261j3637J9854L7949j4647p0762m3344K2052L0437R981M3842
40090F7778Q3579J8784r4547q6278L7330P6611l7612j26119o3471J5063m3596
40079a52478j40880r0771P1707J52339R7798L3532K8645J2785n4573r5271m6583
40068a83750L3830N8662K6934m061p112j048j2137m5271p1110m0931N2805J39231
40056e3958J38758O5016L967p496j7233n7073p6569k4324N2321N4436l2528j09305
$$ y = [137756, 46386, -12771, -33933, -48204, -86758, -160392, -250308, -302565, -267771, -171869, -102689, -90551, -57518, 59113, 188986, 212295, 120083, 5260, -74606, -131636, -166642, -158073, -131086, -138568, -162175, -125288, -22500, 53451, 40536, -17520, -52552, -52014, -29639, 9661, 44792, 46053, 32416, 52270, 90219, 75572, 4810, -38534, -16482, 13955, 23936, 67778, 151357, 170141, 75594, -10684, 26646, 103257, 65645, -60474, -123945, -108882, -152478, -293358, -384129, -312422, -160083, -62285, -28753, -108, 12677, -41896, -137167, -183750, -149920, -91258, -64324, -68385, -75497, -76545, -88682, -133953, -205063, -245994, -193189, -53958, 84800, 149816, 153783, 146287, 129054, 71981, -4588, -28912, 23409, 77845, 45317, -63988]
40044f3988q6921M468O9608Q2697J02823J48477J37237J1297j36209j59292o3595
40033D6602k017n2562j16214q5808p958J0821k0781o912P0999J22018P5281l1302
40021B167r7934n8705N6838J32535P4809n9419j07148j3390Q4390N6102l3445
40010C6800m6616N607J2089k9775k6417J6702m818q8234r8412P088R4386O2424
39998e9176j3341k7754j608K555K10J8692J5631l2204n1963Q243P3696O3616K9760
39985B6357N1030P1423q324j32324j45152k9396O7102N4656J0749K4732N6282
39974D7135K1072o3411j01122n4944O982Q328l2553l0545L8171Q4965L1412n7940
39962a02450n5273L2047O2688j5919q0813l2334N3114O5181L1865K9285L0952
$$ y = [-63988, -150909, -146441, -76833, 5864, 108687, 257164, 394401, 405698, 269489, 110197, 46602, 44585, -7977, -124191, -209999, -217957, -207136, -227917, -234829, -163830, -41812, 33469, 2167, -95767, -154472, -97634, 34901, 109710, 50291, -56857, -70247, 14143, 70245, 36800, -9816, -4209, 7880, -21895, -48312, -31610, -36428, -124662, -223074, -215986, -121600, -59176, -72517, -100271, -101879, -99324, -99114, -80422, -64791, -96995, -148958, -140715, -67019, -3403, 26357, 77387, 148810, 140486, 8162, -136990, -166386, -99284, -44628, -33879, -9147, 47135, 68207, 4796, -96326, -151270, -144288, -135960, -168513, -199058, -160887, -75922, -44510, -102450, -157723, -125676, -62988, -78907, -159720, -192054, -138940, -73759, -41894, -12609, 18343]
39951A8343j1054l3797K6935Q1426J8659q0428o0937L5177M0494l2993j2656J09102
39939I8271J37961J8415n8848R060N5433n4281j73252j18582K6278P0138K2069
39928C2662J2108K4336m4764j37713r8722M0946Q0247l3667j22824o1165N2491
39917b56065P8271L1592L406P288M732r23J4992L6345L1029J775k9212n0292m9761
39904a76823j7784K1742K7695O262Q502M7164O9883L7982j6725l8447j2011L4414
39892h146N5085J3048p2982j11842l3278R7813J36751M8902l7646j1546O7678
39881A43837O4762l5851j15190q4911P107M9137m767r9350j47488j13106k9098
39870c64918N1373J03270J23923J04712M2626k6931m8756j0280M1923N6147K1215
$$ y = [18343, 7289, -26508, 427, 81853, 100512, 20084, -40853, -5676, 34818, 1825, -10831, 98271, 236232, 254647, 195799, 204859, 260292, 206011, 32759, -85823, -59545, 10593, 32662, 44770, 69106, 24342, -113371, -212093, -171147, -90900, -124567, -247391, -308556, -256065, -177794, -146202, -142796, -135508, -130776, -131699, -116707, -80362, -49333, -47558, -76770, -127062, -176823, -194607, -172865, -145170, -138908, -130406, -83242, -13359, 24623, 7898, -30549, -42560, -8146, 46939, 59987, -12995, -124837, -158115, -60302, 76449, 125351, 87705, 76159, 143837, 208599, 172748, 57558, -27353, -20246, 28891, 24124, -75226, -222714, -335820, -364918, -313545, -210275, -86352, 18360, 60986, 34055, -14701, -24981, 16942, 73089, 94304]
39859I4304m3768j09817j36912r0252J4769J04874J12016L7623n5619j03543q6332
39848b62657l3537N063N134j0989r965K758l595k3377p393O2140J24132J03867
39836d8419J2692n5663l5214L3827N6902K850n8694m6532L0694R1650Q9971O2718
39824A36782O0128O8628L8627l2355q3666o0609K0610Q1260N2532m9802j27869
39813A04266j04753k0950J4572k8468o5383k8336L9611P0434P6941R4898Q1519
39802B34351k0830j48999j64814m5156P5926Q2497P892m6125m5184k6124j8340
39791a14906j5794l327K3063M7663L7645j8929p4868o1728K5121J13415J31820
39780H9175P1262k3193q3718o0183J9594N2282j2376p4290r839J23861J40943
$$ y = [94304, 50536, -59281, -196193, -286445, -271676, -166802, -54786, -17163, -72782, -176325, -262657, -296194, -291131, -285997, -296986, -306951, -304193, -307788, -331165, -338558, -276418, -152286, -48419, -35727, -91390, -126604, -92777, -35875, -33025, -91719, -138251, -107557, -15907, 74064, 136782, 196910, 265538, 304165, 271810, 188144, 127535, 148145, 229405, 281937, 232135, 104266, -487, -21437, -6865, -35333, -100716, -129052, -89441, -19007, 57934, 152832, 234351, 213521, 64522, -100292, -145448, -69522, 12975, 20867, -25258, -70442, -96566, -114906, -130700, -134027, -110964, -63301, -25656, -44585, -119453, -181181, -156060, -42645, 89175, 160437, 137244, 53526, -6657, 12937, 65219, 52843, -21447, -31286, 92575, 233518]
39769B33518j843j29960j03553l533K9186J0747L4585P2931K6662p3872r2479
39758B389j1873K8216m4853j19632p8774K3198N6746J0814j8905P911L4526K1950
39746h8287J0242M0016Q2039Q3749M0638j7107p2997j14488j03735j8947Q0809
39735g8068R7603K1356m3040j1784O4167P4151q95p8727r7808p5142m1902L201
39723a66888N2743O6321K6660k2699l2365p496J8142L6064N3989N7365K2167l9486
39711F4517p7800n5621R686N5513K9623n0860j03325o5587K7783Q4342O3315Q084
39699a0330k8622m1676m1958j8580L2782P4386N7399j6025q0173o2189L8379J25010
39687B8403R3912k9223r2162p779J11600R9122k8995j00808m0948M3761N4230
$$ y = [233518, 231675, 101715, -1838, -5371, 23815, 34562, 69147, 142078, 168740, 94868, 2389, -9484, 18732, -26121, -145753, -224527, -201329, -144583, -133769, -152674, -144763, -110237, -88287, -78045, -38029, 44010, 127759, 168397, 151290, 78293, -36195, -139930, -158877, -78068, 19535, 40891, -2149, -13933, 50234, 124385, 123490, 44763, -53045, -128187, -170089, -166888, -114145, -47824, -21164, -43863, -76228, -83724, -65582, -29518, 24471, 81836, 104003, 64517, -13283, -68904, -59218, -3705, 25918, -24942, -128267, -193854, -166071, -81729, -18414, -10330, -38952, -80628, -122586, -141166, -108384, -33998, 23401, 7376, -72797, -134986, -96607, 28403, 122315, 93092, 930, -6849, 104751, 203873, 174878, 74070, 33122, 76883, 131113]
39676A31113K9357K4562l117q9538j52666j06672j0216J8713k0482l7896j3406
39665b30248p140l1443l1173R308M3525N4247P4071J03120R3257L4118k1164l8486
39653E1992m3040n3597m1074J2934O5927O3126J0816k9508j2781L7376N1361l570
39641A09962o9373n8619K6749Q7960N9062j5369o2954p3162n5556J0828J07558
39630F7086J30445J9995j13054j11249J0303Q9368M7536k9472n0050l3067l2821
39619d980m7532m6294j8602K9714P4485O7863J178m4939j493O1558K4656q1223
39607A4391j07887k8399K4151p614j2364O8738J10071J7521q5287n1843L7719
39596b0803J6925p3343n3851P7108J31231M2923l2332Q103N0351j8291j03736
$$ y = [131113, 160470, 185032, 181915, 92377, -60289, -166961, -177177, -158464, -178946, -216842, -230248, -237388, -268831, -300004, -290696, -247171, -192924, -118853, -15733, 77524, 111642, 90478, 51992, 8952, -44645, -85719, -72785, -6858, 56268, 67084, 37576, 24795, 62171, 113532, 109962, 40589, -18030, 8719, 96679, 155741, 140372, 77418, 4256, -51300, -40472, 67086, 197531, 217526, 104472, -6777, 3526, 92894, 140430, 110958, 60908, 27841, -4980, -52512, -98806, -117408, -87694, -13209, 54654, 55832, 10893, 9400, 70958, 95614, 14391, -93496, -121895, -97744, -105358, -117722, -48984, 61087, 78608, -6679, -58522, -20803, -3878, -77221, -131072, -53964, 77267, 120190, 87858, 95961, 146312, 128021, 24285]
39585B4285o4041N3372R6294M4790l380k9673r6022j63638j03295O8929J45338
39574b7041J5956j39911r1717J11842K16968J21392k1200n8260k5398j7172k1724
39563F3735J1907M7872K4629k5208l1801j6696m6000q8243n0432M7844P1479k5504
39551a6418j13217o7612N5187J08268N3930j5297k4944k959j2900o3101j01863
39540b00926p5918J4169J02766J11310L2430m8071m2079L2033O7868R481o8313
39529f5250n6308L7600R6491O0564R350K9287O9153K1838q9114j28685n9320J381
39517g3013k6098o3411k6918K0915j0956o9242m2939M0816O1462J1691j41M9949
39505a27885N9489j2904o5670j9814N4966N5789k402l0050M220N3528O8976M7132
$$ y = [24285, -39756, 13616, 109910, 154700, 151320, 121647, 25625, -138013, -241308, -172379, -27041, -11085, -150996, -242713, -130871, 86097, 207489, 186289, 128029, 102631, 85459, 63735, 75642, 123514, 148143, 122935, 91134, 74438, 28438, -59805, -110237, -62393, 9086, -16418, -129635, -197247, -142060, -33792, 20138, 4841, -20103, -23062, -35962, -99063, -200926, -276844, -262675, -159909, -48599, -16169, -64240, -106319, -74286, -6418, 3063, -65250, -121558, -83958, 12533, 73097, 82447, 111734, 180887, 202725, 113611, -15074, -74394, -73013, -99111, -162522, -189440, -168525, -179481, -248723, -291662, -250846, -189384, -177693, -177834, -127885, -68396, -81300, -146970, -166784, -111818, -56029, -58431, -88481, -84261, -30733, 38243, 85375]
39493H5375K2705L2997O7383O3587m771o8840o1941l4897o9171j11992m5522Q7287
39481c7800J03761l0983j20100k6882J16548J18196K500p5855q3404r7058j11813
39470b42890m5710Q1915J45317J00939M1879L6185L5285j0535n2015k4761L7355
39459A02964M6069j7057q1955q9221o0206m8669m9489k461R8168J52358P7851
39448A28352m6824o4718K8282N7724o8295j96316j40431L1492Q2946m7722j59063
39437c94573q3681P3179R6078k9814j08445j7479J31540J68800R6840M3162M4752
39426B0359K1136m2931m8605K5250L8262q6085j86924q5836J19169J83266P9218
39415C6279K916L1324K7342p1549j22235l6346N0566P818p9779q0762l0687j5451
$$ y = [85375, 108080, 141077, 208460, 272047, 267276, 198436, 136495, 101598, 32427, -79565, -125087, -37800, 65961, 34978, -85122, -112004, 4544, 122740, 125240, 49385, -34019, -131077, -242890, -288600, -206685, -61368, 39571, 81450, 117635, 152920, 142385, 90370, 65609, 102964, 149033, 131976, 50021, -39200, -99406, -148075, -197564, -200025, -101857, 50501, 128352, 81528, 16810, 45092, 102816, 34521, -161795, -302226, -270734, -187788, -235510, -394573, -478254, -405075, -308997, -338811, -447256, -464735, -333195, -164395, -67555, -24393, 20359, 41495, -1436, -50041, -24791, 13471, -72614, -259538, -345374, -226205, -42939, 36279, 39195, 70519, 97861, 26312, -95923, -132269, -81703, -73885, -153664, -234426, -265113, -280564]
39403b80564Q437R8898J61759Q8205m1236p4092k2274k368k0986o001J7341k5234
39391i8115q3199m5789N6080R2944M8210J0737n102m6815o8768Q761J08197P3041
39379E0182o7641j26429n5784K546j1212R204R2174R8335k4616j11137l2666R5238
39367h1806J02179J1293m6006m0898k7916j2375K2908L2029k3419p3340k6083
39356a63434Q1452J22128M6008o5884r9486j4343J19135J62806M0450j50260k15483
39345a36911q2194J22296K23647J61638q034j74768k16687r3636O7654Q9092k3705
39334g1608q2964M331J06654Q8440R498j1123j14n0916j29285j15327K183J07952
39322a42279J17752M8895m5799j18185j15519k2143Q9880J19822N1040l6135n3859
$$ y = [-280564, -272127, -173229, -11470, 76735, 35499, -38593, -60867, -63235, -84221, -90222, -72881, -98115, -181314, -227103, -171023, -78079, -29869, -19132, -24234, -71049, -139817, -131056, -22859, 50182, -17459, -143888, -199672, -197126, -208338, -199134, -106960, -8625, -33241, -144378, -177044, -81806, 20373, 31666, -14340, -55238, -83154, -95529, -72621, -40592, -64011, -137351, -163434, -81982, 40146, 86154, 20270, -79216, -93559, 25576, 188382, 228832, 78572, -136911, -219105, -96809, 126838, 288476, 280442, 105674, -111013, -204649, -136995, -47903, -71608, -154572, -150241, -43587, 44853, 54351, 43228, 43114, -7802, -137087, -252414, -250231, -142279, -24527, 24368, -21431, -139616, -255135, -277278, -187398, -67576, -16536, -52671, -106530]
39311a06530J5489J05204J14382J4703r0938q4949o467R14p5605q3136L9388J32536
39299b5009N9644o7920o6572L2825O0637m519k9357K1022L0686m2283p5731J3647
39287i2930J25396J25106L4080k7633j9034l538k9993p3409r4082r2803q4572
39276b33412n4603J9744J07020J25517M2374n7021n2378O1066J61087J48198N1806
39265C19398l2715n8045m5498l5778n0361p2706n7250P342N2220O419q5828j07492
39253a60294l2633M6299O8063P0085P6082L7614n3252j05677o1703R455K5725
39242h0236J0091J6260K7467J4015P235L2101M8237L4264L6198N4134j209j36374
39230F2183j88484n1498J24679J29527k574o7012p123M0620j713m8330j7489N0039
$$ y = [-106530, -91041, 14163, 128545, 143248, 52310, -32639, -39106, -38192, -113797, -196933, -157545, -25009, 34635, -33285, -99857, -67032, -6395, -10914, -40271, -19249, 11437, -30846, -106577, -92930, 32466, 157572, 191652, 164019, 144985, 141447, 111454, 38045, -56037, -148840, -233412, -288015, -268271, -161251, -35734, 6640, -50381, -102759, -41693, 119394, 267592, 319398, 286683, 228638, 183140, 147362, 97001, 24295, -32955, -25613, 26607, 33026, -52802, -160294, -192927, -146628, -78565, -8480, 67602, 105216, 51964, -53713, -115416, -105961, -80236, -70145, -53885, -26418, -12403, -5168, 26933, 75170, 109434, 145632, 199766, 198557, 62183, -126301, -177799, -53120, 76407, 73833, 6821, -302, 40318, 38605, -9725, -27214, 22825]
39218B2825P6467M0229l5102r7742q2007R932P2764L6069j6950J7772Q0918M5817
39206A70992n8818r5716n1034l0721m2985J0690J15118J22885M567q1223m0921
39195B2834J6095j3205n0748N710R3202R0534J2309l8356l7068l3418l3157k978
39183C1754L8089L6751L372M944N7262R3644N9493q534k9608R933K9666l6183
39171B90583j31074j40017n7535J363j2733m305Q4808J40304N2854p7818q7182
39160E9248j2470j4235q4383o3469N8320J01841L966p2537j6935N8735M0509O396
39148F4986N4599J04518L7865q3126j08041k9002L1649J1185m0809n9832k2062
39137c8070N3814R3366K3364r8385j08901K8280J36086P5050m2380l5268N4227
$$ y = [22825, 99292, 139521, 104419, 6677, -75330, -65398, 7366, 43435, 26485, 44257, 125175, 170992, 112174, 16458, -34576, -65297, -108282, -97592, 17526, 140411, 144978, 63755, 22834, 38929, 25724, -25024, -19314, 73888, 164422, 176731, 138375, 101307, 67889, 34732, 31754, 69843, 106594, 109966, 114910, 172172, 265816, 325309, 316775, 287167, 297100, 326766, 290583, 159509, 19492, -38043, -36680, -49413, -53718, 31090, 171394, 224248, 146430, 59248, 46778, 32543, -51840, -115309, -56989, 44852, 48818, -23719, -40654, 18081, 58590, 64986, 119585, 224103, 261968, 178842, 70801, 41799, 73448, 84633, 43824, -16008, -38070, 15744, 109110, 132474, 34089, -74812, -46532, 89554, 164604, 122224, 86956, 141183]
39126A41183L7305j13363k26540j92907q3877J1636J05600K07796K37638J31860
39116B56331l1944j05936m3322N6855P3791j316p3020p1468l4957l1984m1805
39105d8775Q917J02711J29326N3362k1756j1923K4121m595p4456j04823r3419
39094d1310r0859q8192l4604N7397J15546J05014N3790K66k6163k274N1544O4601
39082A64756M784o5029p6351n0059l7081k4779J3636L3775j4374p8040o5500J1095
39070a83167O1144N7277M2791K1538l6370q7834m9553M6377O3028l3455j02175
39059b00399l2400Q7411R9249j653p9391n3525K0636O2167O3474N3737L1567j7798
39047C3075p0929q2010m6263r653p181k1907k0087J378K4575M0180L8795L203
$$ y = [141183, 178488, 65125, -161415, -354322, -438199, -426563, -320963, -113167, 124471, 256331, 224387, 118451, 75129, 131984, 205775, 204459, 131439, 59971, 25014, -6970, -48775, -39858, 62853, 192179, 245541, 223785, 211862, 235983, 231388, 156932, 52109, -41310, -132169, -220361, -254965, -197568, -82022, 22992, 76782, 77048, 50885, 48611, 100155, 164756, 169540, 104511, 28160, -21899, -58980, -83759, -70123, -36348, -50722, -128762, -194262, -183167, -122023, -64746, -21955, -417, -36787, -124621, -174174, -127797, -64769, -98224, -200399, -232799, -145388, -46139, -47792, -127183, -180708, -160072, -97905, -34431, 19306, 50873, 33075, -37854, -119864, -166127, -175780, -182961, -204868, -224955, -223577, -199002, -158822, -120027, -116824]
39035a16824m9239m8417M0877J31582R5478o0016j75332j30904P902Q1495K7924
39024a95474o2134o4467L5220J21948Q3508m0492r2628q858Q4826O3623J216L8280
39012c5432J23960Q3391p3602j34282j8966Q6501L3149o1438l0885O7031P4560
39001A13987O3l1363k210R097R8K5667N2596M482p7054p8873o240K7813q929m0079
38987a0945l5321m1701n5331j2884O7286P9763M931m5066k741N1385K5154m3707
38975a9177n6071M547O3564N5523j0968o8593n5284J8474P2162M8948j6889n8651
38963b2415o3031m8836j0085M9273O9694J0574o4640o6161r252K3999K1510L5164
38951g4206O0916L8824l0741p7342p2383n5172m3163j0020L9712O3424N6508N4447
$$ y = [-116824, -166063, -214480, -173603, -42021, 53457, -6559, -181891, -312795, -304893, -223398, -195474, -257608, -322075, -286855, -164907, -81399, -121891, -214519, -223377, -138551, -74928, -73712, -35432, 88528, 171919, 98317, -35965, -54931, 31570, 64719, 3281, -27604, 39427, 113987, 114050, 82687, 80477, 89574, 89672, 115339, 167935, 172417, 95363, 16490, 10250, 38063, 29134, -10945, -46266, -87967, -143298, -156182, -88896, -9133, -4202, -49268, -52009, -624, 24530, -19177, -75248, -70701, -7137, 48386, 37418, -31175, -86459, -67985, 4177, 53125, 36236, -22415, -85446, -134282, -144367, -95094, -25400, -14826, -79466, -145627, -154879, -130880, -109370, -74206, -13290, 25534, -5207, -82549, -154932, -210104, -253267, -263287, -223575, -160151, -103643, -49196]
38939d9196N6913L1381r378j8045K4o142m1661o3093n7895m1948L976R5637J59642
38926F0215J02246l5649j08802o5600k883l559l2121k6319P331L2255L8035K6254
38914h597M659N200L9326M4605l5382j31182j19214j2544M6262K054l5474K2656
38902a77631J05118R9017J4825m7609l8413N544L0570K6631K9359O9926J13724
38891B31061Q4312j7997q3689m5922J0525r885m7723m100N5272k663j23373j23127
38879g7309L096O1398j7778o8415J9038J13658P2927l2079o3576l6263l8838n7887
38867a22028k9778K2218L5353J8588R148l372j6171K6860J14997J20997p081j14741
38855E4990n0508Q7660Q8031n6385j51255r9226j0616L330j7343O320N4631O2797
$$ y = [-49196, 7717, 39098, 29720, 11675, 11699, 5557, -36104, -99197, -157092, -199040, -195064, -99427, 60215, 162461, 126812, 18010, -47590, -50473, -54032, -86153, -112472, -105141, -72886, -34851, -8597, -3938, 1262, 40588, 85193, 49811, -81371, -200585, -213129, -166867, -164813, -200287, -177631, -72513, 26504, 41329, -6280, -44693, -39149, -8579, 18052, 47411, 117337, 231061, 315373, 297376, 213687, 167765, 178290, 168405, 120682, 116582, 171854, 169191, 45818, -77309, -74213, -12815, -30593, -99008, -79970, 33688, 106615, 74536, 10960, -25303, -64141, -122028, -151806, -129588, -94235, -75647, -66499, -69871, -86042, -59182, 55815, 176812, 169731, 54990, 4482, 92142, 180173, 123788, -27467, -126693, -137309, -133979, -151322, -145002, -90371, -27574]
38843b7574L1649R984J3038K0729K9654N0589O2653K3048n9978j05716n6071K9275
38831B1280L6419m0753q1791j6610O7466O5053J3499R231L2714q181r8574j25156
38819a25403n4752L1043P8135J03690R7936K3449p6241j07311p7403p3880q5386
38808b66123j4865J07713J18184j6931j16476n3973O1824Q0605K5551n854j5929
38797i6274m9532p3251l6070L4692R1674J30735J25751K1873j26024j48650L44
38786a24732J41450J21512K8529J8367O6096N5616j229j9855k6139r0272j40320
38775B9023m5105J39111K04745J02899M2944K02756M54155M86527J77487k44117
38765A550425m42510l42116j70294j28604j52756r2702P569P15q2041q1289p811
$$ y = [-27574, 4075, 14059, 27097, 47826, 77480, 128069, 190722, 213770, 153792, 48076, -7995, 21280, 57699, 16946, -64845, -81455, -13989, 51064, 64563, 73794, 106508, 98327, -247, -125403, -180155, -149112, -70977, 32713, 130649, 154098, 77857, -29454, -106857, -180737, -266123, -280988, -173275, -55091, -72022, -188498, -242471, -180647, -100042, -74491, -80345, -96274, -145806, -219057, -255127, -220435, -128761, 1974, 127725, 149598, 23574, -125076, -124732, 16718, 138230, 166759, 185126, 251222, 306838, 305609, 285754, 259615, 169343, 29023, -16082, 123029, 327774, 430673, 473617, 676373, 1130528, 1617055, 1794542, 1550425, 1107915, 765799, 595505, 466901, 314145, 221443, 229012, 229727, 147686, 66397, 58586]
38754E8586k4934j23514j01775P1217J63797N6408p4147p3982l4198m1509K567
38743a21484J23057J22172p8573k21662j04588P3130M9951o1996k2369Q2769K2833
38732a36760j14989o6253J18360J45649r708q1215J2780O7578j973l2953M0248
38721e9236O0482l7014r5947l1136L1629J3781J7342Q7901R5261j9899j04080
38710d0916l4524Q3301R5287J8784l5769l0918R066O0918Q0111K2545o3187p4321
38698I0377j2096J7552k2718n7210l8844k998K7597N9969N8058r255o4752j7701
38686B7979O3749M1630n7821q1425K109Q1240J06809J16738Q0771n6580j92061
38675A33138j60136j2779M2827j0162J2257J31212J31411n8361j96179q4674J32268
$$ y = [58586, 33652, -89862, -191637, -120420, 43377, 99785, 25638, -48344, -82542, -124051, -121484, 1573, 123745, 45172, -176490, -281078, -207948, -157997, -219993, -242362, -159593, -136760, -251749, -318002, -199642, -53993, -63701, -144916, -132136, -64558, -66531, -99484, -59236, 1246, -35768, -131715, -162851, -131222, -117441, -100099, -12198, 83063, 63164, -40916, -75440, 7861, 103148, 121932, 86163, 55245, 64311, 125229, 205340, 227885, 164698, 90377, 78281, 95833, 73115, 15905, -22939, -25937, 1660, 61629, 119687, 110432, 45680, 27979, 91728, 133358, 75537, -5888, -3779, 77461, 184270, 301008, 381779, 325199, 133138, -26998, -39777, 3050, -7112, 5145, 136357, 267768, 209407, 13228, -71446, 60822]
38664F0822J93133O5185q2334j19263m4518O4170J03150K7922p4984q6604j9015
38653H7664K9152L8320M3549Q893q6451j11846K9510J52808J9138k39338k61225
38642b89826j7959J37999L8801p1538P385J23763R9023K9369M8265P0341m062
38631A71561o8708j3276O2505L7926j5646L658L5666K033l3662j3020j2720p1281
38619H5036p0900M4744J18200J8558j31556j42437k4709Q7847J45783J69342J52386
38608D52294J06955R4088J30212J83535K85960M64339N51009L20963j30572m28797
38598B029986m15153l08441k86129k44046j09236l7887j05426j27246n566O0198
38588D51054n8985j58333o1599N6468p052j22567q9359P502R493K68R0594J33303
$$ y = [60822, 253955, 319140, 236806, 117543, 73025, 137195, 240345, 268267, 193283, 106679, 87664, 116816, 155136, 198685, 207578, 121127, 9281, 38791, 191599, 210737, -28601, -289826, -307785, -169786, -130985, -202523, -195138, -71375, 27648, 57017, 105282, 175623, 171561, 102853, 89577, 152082, 190008, 174362, 178020, 213686, 215719, 182057, 169037, 156317, 85036, 14136, 58880, 177080, 195638, 64082, -78355, -103064, -15217, 130566, 299908, 452294, 559249, 653337, 783549, 967084, 1253044, 1717383, 2268392, 2589355, 2458783, 2029986, 1614833, 1306392, 1020263, 776217, 666981, 629094, 523668, 396422, 390856, 451054, 392069, 233736, 172137, 228605, 221553, 98986, 9627, 17129, 26622, 26890, 117484, 250787]
38576B50787q333j36270k0675J76272J55225j1532j4970J67728K67823J81124
38566A007179Q8332J37416K70978L49519K58148l1747l48721m10478j91512j5017
38556A114097j00888k58367k42432j40745j28256j13355L5261J57092O3573q1920
38546C04060k7752J15112P6444r0457j28767l6709j0544n2586k0676M3537P503
38535A79165m4768L7699J38832O1666p9146l6426J17626J13651m5904j32397j07071
38524B02927j04761j03502R70R4578R776j18966n8621R0250P9617q262P3503K20501
38512C78010J25891j39681k08448l2671P9069K0931q841L7251j1165j31211r4988
38501A4147R4027J84148J15631O3779N2342m8976j63494q8310Q6775R1139k9669
$$ y = [250787, 242454, 106184, 85509, 261781, 417006, 405474, 390504, 558232, 826055, 1007179, 1095511, 1232927, 1503905, 1853424, 2111572, 2079825, 1731104, 1320626, 1129114, 1114097, 1013209, 754842, 512410, 371665, 243409, 130054, 165315, 322407, 385980, 304060, 276308, 391420, 467864, 377407, 248640, 211931, 201387, 148801, 128125, 171662, 179165, 134397, 172096, 310928, 372594, 293448, 257022, 374648, 488299, 442395, 309998, 202927, 98166, -5336, -4366, 90212, 99988, -18978, -77599, 12651, 92268, 84006, 157509, 378010, 503901, 364220, 155772, 123101, 202170, 223101, 214260, 251511, 240346, 109135, 14147, 108174, 292322, 407953, 471732, 524074, 475098, 311604, 223294, 310069, 401208, 371539]
38490C71539M185J70230J84510M2379j154L7920q6744k89240k12494J11931K49634
38479E82696P9504n0703K5475O2333n7053j06433O888O5984j1579l6009L4619
38468E95722J2162r8935p9284M7522L5491p3705J292K01860J77690n4424j13206
38457F52185M2388N5547j19497j25264Q9174J53100j1562m8278J29794J83934
38447A001521L4687N438J46752J28085o6545o8440J27910J12203j27943j46302
38437A147366Q9521J18940r0570n3781K50272K71878m7340j14347J93147K91763
38427B056849K9533l1025K52916L16729M0945K0976L63079M32637J30542J25288
38417C738469M88225N02470J64526L24983R63390J044662N31747O32167J505980
$$ y = [371539, 375724, 545954, 730464, 772843, 771689, 809609, 722865, 433625, 221131, 333062, 582696, 662200, 611497, 636972, 699305, 642252, 535819, 542707, 608691, 597112, 561103, 595722, 607884, 508949, 429665, 477187, 512678, 438973, 440265, 642125, 819815, 765391, 652185, 694573, 750120, 630623, 505359, 594533, 747633, 736071, 687793, 817587, 1001521, 1036208, 1041646, 1188398, 1316483, 1249938, 1181498, 1309408, 1421611, 1293668, 1147366, 1236887, 1355827, 1265257, 1211476, 1461748, 1733626, 1686286, 1571939, 1765086, 2056849, 2086382, 2055357, 2308273, 2625002, 2665947, 2686923, 3050002, 3482639, 3613181, 3738469, 4226694, 4729164, 4893690, 5218673, 6182063, 7226725, 7758472, 8390639, 9896619]
38408I896619J843989J384511J501191K486282K898780K634713L658527O375644
38400C2680256Q654142J0081651J3271657J8973167K4980224L2850749M8344343
38393A89836189O7881271P1168168M0046505j5350226o0849738p2367093n7276938
38386A63088138l8527966k7660626k1036466j4488626r820385q274716p194705
38379C6084648n002242l508650l690718l719256k545587j654980j955520k131721
38371A1875974j317859o33751q85397j140733o86406k88062n01920o25942k42238
38362E553666o9357m45072n82124j15373J49421k18391m57112r2346J77304j47753
38352C752863m32443j46457J72928j124k50781j33289j1248k17245l46563j00970
$$ y = [9896619, 11740608, 13125119, 14626310, 17112592, 20011372, 22646085, 26304612, 32680256, 41334398, 51416049, 64687706, 83660873, 108641097, 141491846, 189836189, 257717460, 328885628, 368932133, 353581907, 292732169, 220365076, 163088138, 124560172, 96899546, 75863080, 61374454, 51554069, 43279353, 36084648, 31082406, 27573756, 23883038, 20163782, 17618195, 15963215, 14007695, 11875974, 10558115, 9924364, 9038967, 7898234, 7211828, 6923766, 6421846, 5795904, 5553666, 5484309, 5039237, 4457113, 4341740, 4491161, 4272770, 3815658, 3723312, 3900616, 3752863, 3320420, 3173963, 3346891, 3345767, 3094986, 2961697, 2950449, 2733204, 2386641, 2285671]
38342B285671O8969j46975k69528M6854K98800M5441k74292j55688Q9415p794
38332A980873k13959j20331Q0212M5418l5160J20138K68166J02532j30042p6148
38322B021699R4342O4680m6510j1618K1380j09022j54142Q5840K93227J49144
38312B409020q0980j2607J86940J42915n3219p0822N0476N7758J504Q3801K11148
38301B925934J80210J05754K07588L66787L35692K06219K39135L93783M43616
38292E404718M11923M94711O78300Q05487R06425J120672J401508J612424J800015
38283A4636183K072322K322027K343914K101629J632199Q57479k25018j313817
38275B4426918k053092k397350k500307k407271k113652j762320j501198j270969
$$ y = [2285671, 2354640, 2207665, 1938137, 1984991, 2283791, 2329232, 2054940, 1899252, 1988667, 1980873, 1766914, 1646583, 1726795, 1772213, 1737053, 1857191, 2125357, 2227889, 2097847, 2021699, 2116041, 2180721, 2134211, 2122593, 2143973, 2034951, 1880809, 1966649, 2259876, 2409020, 2328040, 2315433, 2502373, 2645288, 2592069, 2521247, 2571723, 2629481, 2630985, 2714786, 2925934, 3106144, 3211898, 3419486, 3786273, 4121965, 4328184, 4567319, 4961102, 5404718, 5816641, 6311352, 6989652, 7795139, 8701564, 9822236, 11223744, 12836168, 14636183, 16708505, 19030532, 21374446, 23476075, 25108274, 25965753, 25740735, 24426918, 22373826, 19976476, 17476169, 15068898, 12955246, 11192926, 9691728, 8420759]
38267H420759r79509p41675o95301p27927o50879n12258m72618m89381l96005
38258B755206k10333j11637j60192k42632k52238j72602m6900K4851m2423j65212
38248A375888j53570j050Q0035l537q8663o3639m3072r2514o9106P6533J31833
38237A149138j9922j54967p4027N8444J7662r4119o8946K5794J2082m2958L7177
38226H45358J97046K51260K03056J84402J98281J69731J22815P8272o5690l18763
38216A865768m49855l08079j04153r9936k07918j92153p8290m1161n1845K3505
38206C55883J10707N2178p0167o4447K2781P750q0962p4917L027L53n1429o59
38194B10098J14472J25729M3968J6328L8965j897p1602n3394J258l0191p7220
$$ y = [8420759, 7441250, 6699575, 6004274, 5276347, 4625468, 4113210, 3640592, 3151211, 2755206, 2544873, 2433236, 2273044, 2030412, 1778174, 1605572, 1558672, 1583523, 1541100, 1375888, 1222318, 1221268, 1301303, 1297766, 1209103, 1145464, 1102392, 1009878, 940772, 1017305, 1149138, 1129216, 974249, 900222, 958666, 976328, 882209, 813263, 839057, 851139, 808181, 845358, 1042404, 1293664, 1496720, 1681122, 1879403, 2049134, 2171949, 2250221, 2184531, 1865768, 1415913, 1107834, 1003681, 903745, 695827, 503674, 425384, 384223, 332378, 355883, 466590, 518768, 448601, 384154, 406935, 414685, 333723, 258806, 261833, 262186, 210757, 210098, 324570, 450299, 494267, 510595, 549560, 547663, 476061, 422667, 423925, 393734, 316514]
38183C16514M808J41537J56635Q3083N9168L1615j09202k21326j07165Q9557Q0432
38172E25656o2639l0547J52861J53205p8506k10295r8879L354o8365j29529l3625
38161A22691O2564J6332m5600J1175Q8698O4618K288p291J324K8L8087P8501o969
38148D26446j81253k22381o4584Q5599Q0455K4374J9955j2428j13193j37242n507
38137i9759J20415R4417J5150K2601N7841J3435m7749k0704L4560N904n9931l8414
38125I7766N9711J12434P0567k328l2797O03O5059Q9275L6642k8345k6008O320
38113D48899j5345n3652j3214N7910L1182m8512o107J45007J82955M2429n1329
38102G20223P8618L05925L99504K87555L0475k70769m48297l62279j26559k8716
$$ y = [316514, 321322, 462859, 619494, 702577, 761745, 793360, 684158, 462832, 355667, 445224, 525656, 463017, 432470, 585331, 738536, 660030, 449735, 350856, 354210, 285845, 156316, 122691, 185255, 201587, 155987, 167162, 255860, 320478, 322766, 315475, 316799, 316827, 354914, 433415, 426446, 245193, 22812, -41772, 43827, 124282, 148656, 168611, 156183, 42990, -94252, -99759, 20656, 115073, 130223, 152824, 210665, 224100, 176351, 155647, 190207, 196111, 136180, 97766, 157477, 269911, 340478, 338150, 305353, 305956, 371015, 460290, 496932, 468587, 442579, 448899, 433554, 379902, 366688, 424598, 455780, 407268, 401161, 546168, 729123, 771552, 720223, 798841, 1104766, 1504270, 1791825, 1822300, 1551531, 1103234, 740955, 614396, 585680]
38092E85680j26159j58937J6227J73638Q2340j26889j90050j04791m6947m8003
38082E6109j1595N4099O0159K5732L7094P0407L4394n5513j00964p6174l1162
38071F2586P549K9598L810m9436l5816O1407J12195L4833n4621j8411Q8353J21397
38059C63444O3506q321p4227j39129j40797m6179M1906K7540j0200M9437J48044
38048B75024J36195K1987m9761l1348j1650l7679n8413m8676m6555n4487k3641
38037G0996M6519R0603P2421K3102j5205k2777M407M0238L6931j357J088Q0121
38025D27087J52554J14879k0468j43092j59354n6631Q6929J34339J7288j44461
38015D09070j60668l3938L7810l1794q7640n698R1757M7233o4423o9181K1323
$$ y = [585680, 459521, 300584, 316811, 490449, 572789, 445900, 255850, 151059, 104112, 56109, 44514, 98613, 158772, 184504, 221598, 292005, 326399, 270886, 169922, 93748, 62586, 70135, 99733, 103543, 54107, 18291, 79698, 191893, 226726, 172105, 153694, 242047, 363444, 426950, 418629, 344402, 205273, 64476, 18297, 60203, 87743, 77543, 126980, 275024, 411219, 433206, 383445, 352097, 340447, 302768, 244355, 195679, 149124, 94637, 70996, 117515, 208118, 280539, 303641, 288436, 265659, 270066, 310304, 347235, 345878, 346966, 427087, 579641, 694520, 674052, 530960, 371606, 314975, 401904, 536243, 553531, 409070, 248402, 214464, 252274, 220480, 132840, 127142, 218899, 266132, 201709, 132528, 153851]
38004A53851N7750Q233k8808k0152k5889n4822m8517l60L5822M1461L5779J6106
37992A70454j4016j2466J7541o867r7536j16269K0181J65149J36358j2926j02235
37981A47368j10947j38080j45875m966K11861K47190L3444j74797j43579M1959
37971c6422J37080O1336n9765r2402k3175P0415J01897M3425n1402j03300q7302
37960c9615l2876L4707J01454J27673O8444n7790j61640j57636m1490R2517J20389
37949E4137K1309p1273k9236P6237O6226n7616r3293L5878J36086M7268r6138
37938H9585q8889J6714K5947o3998q3781Q847P8711N0575n74j989L8597J05942
37926A75687J80961J85144O7760o7382o3812P7691K20123K79900K57808J41359
$$ y = [153851, 211601, 219834, 191026, 170874, 144985, 90163, 41646, 41286, 77108, 118569, 154348, 170454, 156438, 143972, 161513, 154646, 57110, -59159, -38978, 126171, 262529, 249603, 147368, 36421, -101659, -247534, -252500, -40639, 206551, 239995, 65198, -78381, -36422, 100658, 161994, 102229, 9827, -13348, 57067, 158964, 202389, 150987, 47687, -39615, -72491, -37784, 63670, 191343, 259787, 201997, 40357, -117279, -158769, -66252, 54137, 75446, 4173, -25063, 51174, 117400, 59784, -33509, 2369, 138455, 185723, 89585, 696, 17410, 43357, -20641, -104422, -95575, -16864, 33711, 33137, 31148, 69745, 175687, 356648, 541792, 609552, 542170, 478358, 556049, 776172, 1056072, 1313880, 1455239]
37916A455239n6950k15115k30649j85026k02425k15953r2623P4303O4504r9860
37906B95445j66917n7762K9297k4261p9606k3315L5775n577m7141K0973J10484
37895H7395Q7483j0953o3359m7557r646L6819O7280J7023r6892j40478n2947M7251
37883g8581M9089J3330L4388O6992K9074l2098k5385J7234M738m6416m8091L430
37871a2296L3709K2302J9211M6854P1738O1856J5955m2388o9060m2289j7024o1736
37859B6832j27472q9675M7616J24405O3871o688K8473Q0036J4040j10470j29736
37848g8768k9091N5429N1778J9557J8404L9244O6055R6339R5452K3894q1336j26702
37836A50255p0423L9902J25491J27439L2477r4838j39721o0626M5361O3148J0224
$$ y = [1455239, 1398289, 1183174, 952525, 767499, 565074, 349121, 256498, 330801, 395305, 295445, 128528, 70766, 100063, 75802, -3804, -27119, 8656, 3079, -44062, -23089, 87395, 174878, 163925, 100566, 53009, 43363, 80182, 147462, 164485, 67593, -72885, -125832, -78581, -29492, -16162, 18226, 85218, 114292, 82194, 56809, 74043, 78781, 32365, -15726, -12296, 21413, 43715, 62926, 109780, 181518, 243374, 259329, 216941, 147881, 105592, 88568, 26832, -100640, -190315, -142699, -18294, 45577, 38889, 67362, 147398, 161438, 50968, -78768, -107859, -52430, -652, 18905, 37309, 76553, 142608, 238947, 334399, 358293, 276957, 150255, 79832, 119734, 245225, 372664, 405141, 310303, 170582, 109956, 155317, 218465, 228689]
37825B28689o549M4777Q7462O3317J3807J0566N6836R2409Q0600O2854J06846
37814H41614J99854K34056J35657k9750j42738j83484k11570k26047j70299p1684
37804C75609l3745o2892m9061L2204N2737n1642j47336j02853N040K4862l1209
37793A1714l8911J6807L5349j2652m1552P68N8948O4039J6430m0005o6012m7252
37781d2329j3133k2115q5800j32995r4060P528Q9410J03350N8416n825l2563J6955
37769a53161J04097J39381R6701L7814J490m1657q9381p3558J2579O2104Q776
37758A05185o7068o9810k3541J0482L9657O6748L3642m7816m4351P6651J18932
37747A98711n8279k59852k00972N6196J87659R2518j892N4644J21082N5686m2072
$$ y = [228689, 222140, 266917, 354379, 417696, 431503, 442069, 498905, 591314, 671914, 734768, 841614, 1041468, 1275524, 1411181, 1381431, 1238693, 1055209, 843639, 617592, 447293, 375609, 341864, 278972, 229911, 262115, 314852, 263210, 115874, 13021, 18061, 42923, 11714, -27197, -10390, 24959, 12307, -29245, -28477, 30471, 94510, 110940, 70935, 4923, -42329, -55462, -77577, -163377, -296372, -390432, -382904, -293494, -190144, -131728, -137553, -170116, -153161, -49064, 90317, 187018, 224832, 226322, 184665, 95284, 21726, 34305, 96409, 105185, 38117, -31693, -55234, -44752, -5095, 61653, 95295, 47479, 3128, 79779, 198711, 140432, -119420, -320392, -264196, -76537, 15981, 14089, 68733, 189815, 245501, 203429]
37736B03429l6948L208l8259q8951j2640J22238J13638o1202j94809j38286J1410
37725a17172P5286L1823J542N0001J07632R0529K3507l070L8673Q5571P4304Q472
37713D67098o9663j23187j24864p1727j3973j2672m6822k9023N5585J05794N2576
37702A89122k9558l6671P163J560o6004j06155n8199M5942J34308J48468O8927
37691B98903n2187j12985p3870j1604q394m0954m3941j8238O570M9221J14017
37680A06538J15535q856j55843j60546k3164R7537J07033O3695M2012L3296Q850
37669B26087j9592l4125l4731j9162K304r748n7896o4602J5317Q6147L3035q3906
37657C9128r5442K9819J44047J30829K5410q5545j54085j44334m4089P0546R6705
$$ y = [203429, 166481, 169689, 131430, 42479, 29839, 152077, 265715, 204513, 9704, -128582, -117172, -41886, -10063, -8521, 41480, 149112, 239641, 263148, 260078, 298751, 384322, 458626, 467098, 397435, 274248, 149384, 77657, 63684, 51012, 4190, -24833, 30752, 136546, 189122, 159564, 122893, 130056, 131616, 65612, -40543, -98742, -52800, 81508, 229976, 298903, 246716, 133731, 59861, 48257, 39863, -1091, -45032, -63270, -56700, -7479, 106538, 222073, 213217, 57374, -103172, -126336, -28799, 78234, 141929, 183941, 217237, 226087, 206495, 172370, 137639, 118477, 120781, 111033, 53137, -11465, 3852, 89999, 123034, 39128, -56314, -26495, 117552, 248381, 273791, 188246, 34161, -110173, -154262, -83716, 12989]
37646A2989M8634K7567M6956K4569m1791m9029K3921O2363R802l4363R612O4477
37634B05707K9231o3064j17053j11328p3788n884P9614J15859O0097l6956r7068
37623a4633r5461m1853M2531R6199N9371j6487o609R4207J38516M9677n4795n6699
37611A93964k2840o8669j44713j15662J2798J02662Q9817M1022J3993r993m0039
37600E2340l3648K1894O2938K6412o6805j32561j09357j6777O2347O5950K1663
37589d5604Q106M7458P9308N1370j3718o1525o7751l7950N473J9814j8633n6851
37577i0503j3789R1039J34474N4761n3400o3572K0354Q6621O1687k0045p4048
37566A33579n8455j3571r792m8351n2520N979L8539j9678p2957k653J12901R3089
$$ y = [12989, 61623, 89190, 136146, 160715, 118924, 69895, 93816, 156179, 165981, 131618, 141230, 205707, 234938, 171874, 54821, -56507, -130295, -136179, -56565, 59294, 119391, 82435, -14633, -110094, -151947, -109416, -13217, 46154, 29667, 23058, 117265, 255781, 305458, 250663, 193964, 171124, 102455, -42258, -157920, -145122, -42460, 47357, 88379, 102372, 92379, 52340, 18692, 40586, 103524, 129936, 63131, -69430, -178787, -195564, -133217, -67267, -45604, -37498, 9960, 89268, 140638, 126920, 65395, -2356, -40306, -34833, -15019, -33652, -90503, -104292, -13253, 121221, 175982, 122582, 59010, 79364, 165985, 227672, 207627, 133579, 75124, 61553, 51761, 3410, -49110, -43131, -4592, -24270, -97227, -99880, 13021, 106110]
37554A06110m8758j08374j6985M9284l7241j53960j34873r750R1066J26293J13748
37543b3440M8470k4975L042J21539J44770r541j42093n4386J30167J43361l2624
37532C04290j75766j64156p9614p052N3236Q0912L7807k0631m957M3130J0195
37521G7394p8594q5772O011P0043N3387L6599N3635L4844k9351m2548K2190N9408
37509A77246Q501n0838m7541k8046m4520n9273l6130j4923k1657q977M2357O3653
37497b0148J4393l5849j8969K3074K0050j1429j5244L669N336l916J2958N5236
37485B9161Q3814O9869J7503l7746m7844q983R531m6780j15337q8020K0664Q2119
37473c2049M1785j7619l0628m0149p5088o0907N1608J62364J39446M768j01804
$$ y = [106110, 57352, -51022, -68007, -18723, -55964, -209924, -344797, -354547, -263481, -137188, -23440, 25030, 55, 3097, 124636, 269406, 259865, 117772, 63386, 193553, 336914, 304290, 128524, -35632, -115246, -122298, -69062, 11850, 49657, 29026, 24069, 67199, 77394, -1200, -86972, -80961, -10918, 42469, 79068, 132703, 167547, 138196, 95648, 117838, 177246, 185747, 134909, 87368, 59322, 14802, -44471, -80601, -95524, -117181, -126158, -83801, -20148, -5755, -41604, -60573, -37499, -17449, -28878, -44122, -40453, -35117, -39033, -26075, 29161, 112975, 182844, 200347, 162601, 114757, 105774, 115305, 68525, -46812, -134832, -114168, -32049, 9736, -7883, -38511, -78660, -153748, -214655, -163047, -683, 138763, 143531, 41727]
37462D1727j09369o9638l8793k61P2988J41712J30343K3888r3327j19096n0924
37451g0750J6554K5905K6492O2425O9406j6447j08197o8923O0817R7964o199r2678
37439c631n0557K0301l869o8946n7493Q369K7371O986L5471J03088J02680J1124
37427A30894o0527k8813N1555Q2614N2294J4621q847m3792r2490j06700n6055
37416f5246R742J3557l9751o3327j5853L6423L0541R909L7871O9050J7490q2909
37404d2503j12038m6220K0994M1131N6235O7496J1597q6918r3685K8305J27765
37393b7841P7349m2545p8331j8699L6972M1248J8697r236k1796J4130P1548N6730
37381A18226m1856r4796k0518P5238P0148K1021L4371N0808m3361j67042j36101
$$ y = [41727, -67642, -137280, -176073, -176334, -103346, 38366, 168709, 192597, 99270, -19826, -70750, -54196, -28291, -1799, 60626, 130032, 113585, 5388, -63535, -2718, 95246, 89047, -3631, -54188, -33887, -37756, -106702, -164195, -155826, -128455, -121469, -85998, 17090, 119770, 130894, 70367, 41554, 93109, 175723, 228017, 242638, 233791, 189999, 97509, -9191, -65246, -55504, -41947, -81698, -145025, -160878, -124455, -93914, -84005, -46134, 22916, 40406, -42503, -154541, -200761, -179767, -138636, -82401, -14905, -3308, -90226, -183911, -155606, -27841, 49508, 6963, -71368, -90067, -53095, -11847, 6850, -2386, -24182, -10052, 61496, 118226, 76370, -18426, -38944, 36294, 106442, 127463, 161834, 212642, 169281, 2239, -133862]
37370a33862K4391R4985M371p3808k1922M6552J3681l8867O072Q7613P9515O980
37358I5701j4667J5702P475l5777j6502P4375J23718P0240j3499n1633o2629p2997
37346A19507m4476K9594N0271m9326j55568j02412P3871J57737N4472q1545q3864
37335c1739M25L1567N982J3907M7260K4981k4772Q082J01248R6746m5067j60215
37323F8405j22641j7406J8204j1651l0224k6091j0082N0304J34816J23487j9834
37312A57287j28694n6765Q0882P4365m9930p5975N8301J80917J60742O2356j5254
37301D48232p4915j31463j37922p7973j4735J3090L5706N1817J0704n6228l1478
37290C4835Q2201J00816p3462k53327k00390K3246J28217O047j27106n1875J46753
$$ y = [-133862, -109471, -14486, -10115, -83923, -105845, -59293, -45612, -84479, -78407, 9206, 88721, 95701, 81034, 96736, 104211, 68434, 51932, 126307, 250025, 320265, 306766, 255133, 192504, 119507, 75031, 104625, 154896, 105570, -49998, -152410, -78539, 79198, 133670, 52125, -31739, -31314, 253, 6235, 20142, 67402, 92383, 67611, 75693, 176941, 273687, 228620, 68405, -54236, -71642, -53438, -65089, -95313, -121404, -131486, -81182, 53634, 177121, 157287, 28593, -28172, 52710, 127075, 77145, 1170, 59471, 240388, 401130, 463486, 448232, 373317, 241854, 103932, 25959, 11224, 24314, 60020, 111837, 122541, 66313, 34835, 117036, 217852, 144390, -108937, -309327, -286081, -157864, -151817, -278923, -330798, -184045]
37279a84045K16671R5379k8276n780P3453N5024l2094m7864N15l3644j55390j63636
37267b09687L3142K22204J71135l3385j29441o0498J3468K3382N7484J24621J02953
37256C15378k3777j02534n9062q362l2691m5939J5882N7279L732m9783q641N7202
37244A18684O0320N5354R7330R2209l0986j37272p9774L9058K2304r7530j28299
37233A1398m8313j3150n7913n0179M2900Q7020L1676J098N7188Q0669r205j01445
37221C1744q1069j4203j3931m8293j8740O4206J10596Q6918J9777o6299j22786
37210e2080o9176Q5694J88649J21596k5145p3944k044O0024L5402k3319n5738
37199A89919p0314q3438p6807l9182J4013O8250J01006O4251m8106j34581q5278
$$ y = [-184045, 32626, 128005, 99729, 93949, 167402, 222426, 190332, 142468, 142983, 109339, -46051, -209687, -176545, 45659, 216794, 183409, 53968, -6530, 6938, 30320, 87804, 212425, 315378, 291601, 189067, 130005, 121643, 88952, 43013, 58895, 116174, 119906, 70123, 61482, 118684, 179004, 234358, 331688, 423897, 392911, 255639, 175865, 214923, 237227, 139697, 11398, -36915, -50065, -107978, -158157, -115257, -28237, 3439, 4537, 61725, 142394, 133189, 31744, -49325, -63528, -77459, -125752, -144492, -80286, 30310, 117228, 137005, 70706, -52080, -121256, -35562, 153087, 274683, 249538, 175594, 173550, 233574, 268976, 245657, 189919, 119605, 36167, -40640, -79822, -65809, 2441, 103447, 167698, 119592, -14989, -100267]
37188a00267N3362J14990L2761p8991r6982m2571n161j317P355J8587N146p073
37176a00161L2534J01586J17593N8166l231p127O390l4273j16048j47787p9126
37165a71484K9998P7377L6063k0906j4144M5552P4388K2499o4751j04488p0067
37154a59963r80O1511J05119J13350N6098n3697j32535j08157j6113L7555J0608
37143h7204l2685k5868J3200L5234M1543N3517M3275k4512r9582q5038K0907J07435
37131c9778J02145N5896L4264J3292m0932o5532J4910J35920J48282K7830q4263
37120C02034q0255k1772k3206q5676j23659r9352m5982J3046Q4892J48482J44836
37109B13388M9625q0375j52269j16116l008R8268J12067M5687j7890j3371L5191
$$ y = [-100267, -46905, 68085, 100846, 21855, -75127, -117698, -122859, -124176, -116821, -98234, -93088, -100161, -67627, 33959, 151552, 209718, 206487, 199360, 205750, 171477, 55429, -92358, -171484, -141486, -64109, -28046, -48952, -63096, -17544, 56844, 79343, 14592, -89896, -159963, -160943, -99432, 5687, 119037, 175135, 121438, -11097, -119254, -135367, -97812, -87204, -119889, -145757, -132557, -97323, -55780, -2263, 41012, 16500, -83082, -168120, -147213, -39778, 62367, 118263, 152527, 165819, 124887, 59355, 74265, 210185, 358467, 386297, 302034, 221779, 200007, 176801, 91125, -32534, -131886, -177868, -164822, -79930, 68552, 213388, 263013, 182638, 30369, -85747, -88755, 9513, 121580, 167267, 149377, 136006, 171197]
37098A71197N5830K1094l2093o0291n4604k8252K993K2428J6291j6991o5140r9845
37086f7383p8491J6425J24907J43270M8293n3786n3364K3033O1817K2074k9976
37075A56819l4397n677J8542K4996P564l4431o7880n4993j7457p828j6237J2972
37063a8007O3969N0217l5143p7054q692P4130N5304k4092l5401M1418R9857O4004
37051B50510l0656j08001j26185q4492j9109J1860r576k9310J370M7664N0592
37040d5333K7213L3720N8705M2732j4064n6989p6443j02205j05007j9495J19153
37029a38013J80247J17386L2399R354j804o0348j01635m1544N9601O7436k2977
37018A00102p8121k2305O7329Q8606M4004m140l5487o4310p4870l8157J7167J9025
$$ y = [171197, 227027, 248121, 216028, 155737, 101133, 72881, 75874, 98302, 114593, 97602, 32462, -67383, -145874, -129449, -4542, 138728, 187021, 133235, 79871, 102904, 164721, 186795, 156819, 122422, 116745, 135287, 160283, 167847, 133416, 65536, 10543, -6914, -14742, -30979, -18007, 45962, 96179, 61036, -16018, -24710, 49420, 104724, 80632, 45231, 86649, 186506, 250510, 219854, 111853, -14332, -98824, -117933, -106073, -115649, -144959, -143589, -95925, -45333, -18120, 15600, 74305, 117037, 102973, 45984, -30459, -132664, -237671, -257166, -138013, 42234, 159620, 192019, 201373, 199569, 139221, 37586, -3958, 55643, 123079, 100102, 21981, -324, 67005, 155611, 199615, 195475, 159988, 95678, 20808, -17349, -182, 18843]
37006A8843m4071q6483l3650O5974R3238J5615o8509o1786J1338N7030M2931J8628
36994B9098K4992M3490L8589N012l5541n4186l2226J3193L0672n385n1782n3767
36982d7841k6010k3501m7710m7728j1513J4684Q248M571L0620O2836P0949N1683
36970C9288Q302m5946o0666K73P0943L9802p8796j33083m5980O6463O8467j760
36958g2693k1265J3616J0147l6775l4655L0775N3392j8614q6602m7987N2476J00461
36946e7724P8508O3541Q8396R5699L4198o7171j39164j37658n6360P1564J58589
36935A32418J09414n9578j87529j33048M3999J48619R9559J0341q865j1470q8929
36924E4931j82713j56392j1050J08876J16164O1404R798l4402n9484l0436J8663
$$ y = [18843, -25228, -111711, -145361, -79387, 13851, 29466, -39043, -100829, -89491, -32461, 10470, 29098, 54090, 97580, 136169, 141181, 105640, 51454, 19228, 32421, 63093, 57708, 5926, -47841, -73851, -97352, -145062, -192790, -204303, -189619, -181371, -176800, -146180, -83344, -12395, 39288, 47590, 1644, -59022, -58749, 12194, 51996, -26800, -159883, -205863, -139400, -70933, -72693, -93958, -80342, -70195, -106970, -141625, -110850, -57458, -76072, -162674, -210661, -158185, -57724, 20784, 84325, 172721, 268420, 302618, 235447, 96283, -41375, -97735, -26171, 132418, 241832, 182254, -5275, -138323, -94324, 54295, 153854, 164195, 155330, 143860, 54931, -127782, -284174, -295224, -186348, -70184, -8780, 1018, -33384, -92868, -123304, -104641]
36913a04641j786q0939q8212K4883J28502J07089K7793O124J5800k7132q0224
36902g2743m1253N1728O0271k5959o6803P23O4613K0585p3282r8414m0638K4874
36890a96298N1562M9949L4113M569k6401l4918j2048K6280N1447M2718R734p311
36878f604K1073P2679Q9517L3871p5847j69690j66055m5238J01330J41663N2026
36867D8725n1112o0489k513L3352K4657O595r063k1172N391P4803R1881k7558
36855A13497j97999k37129j02124O0591J19263R7889P8144O9012L9706M999L457
36844D9306L0598M8798L9029P446l5812p6042q9164n8416N375N7133L6134o9103
36832e4718j61396j07558Q1771K18965J65259J8117l4470K0774M7518M967j1265
$$ y = [-104641, -106427, -187366, -275578, -250695, -122193, -15104, 12689, 18813, 34613, 7481, -72743, -113996, -62268, -1997, -27956, -94759, -94036, -29423, -8838, -82120, -180534, -221172, -196298, -144736, -94787, -60674, -56105, -82506, -117424, -129472, -103192, -51745, -9027, 707, -6604, 14469, 87148, 176665, 210536, 134689, -35001, -201056, -246294, -144964, -3301, 48725, -2387, -62876, -65389, -32037, -7380, -785, -9848, -31020, -25629, 49174, 141055, 113497, -84502, -321631, -423755, -363164, -243901, -146012, -67868, 1144, 40850, 45849, 49306, 79904, 128702, 167731, 175177, 139365, 63323, -25841, -84257, -78882, -21749, 14385, -54718, -216114, -323672, -241901, -22936, 142323, 160440, 125970, 146744, 194262, 199229, 187964]
36821A87964K5891J6817p0386j20570o6521j0038m5783r6132m4896O5387J00448
36810e7819L0568n9529j06550j04986m9132N2942J30660J13663L5406l767K9671
36799A1127P2447O4349K0600j689K3966N8373L1479o6689j44188j12849k3808
36788f6882o411o7181p2318K8728J01019L4546o9638n4257M6599O8554k3710r2448
36776a73399l6826Q0936J37714Q8015j4908p5959l9260M4662O3451n605n4429
36765A4392j4139K7018k3248q7070m1601N8327O3318r445k527R8637J26553K0228
36753B30443o0432k787O7853L648j13957j08054R990P0581J0103o4418o7867m4791
36741f9688n5520p2000m0423K6270P0325O2919K1042k1557l5940j1559L2577O2291
$$ y = [187964, 213855, 230672, 160286, 39716, -26805, -36843, -82626, -178758, -223654, -158267, -57819, -27251, -86780, -193330, -298316, -347448, -294506, -163846, -50183, -14777, -18544, 11127, 83574, 147923, 168523, 166834, 190800, 249173, 280652, 213963, 69775, -43074, -66882, -73293, -140474, -212792, -184064, -83045, -48499, -118137, -172394, -125795, -57241, -80951, -173399, -210225, -129289, 8425, 96440, 81532, 5573, -33687, 10975, 74426, 68821, 14392, 253, 27271, 4023, -83047, -124648, -66321, -3003, -12448, -14975, 83662, 210215, 230443, 170011, 167224, 235077, 238725, 124768, 16714, 26704, 97285, 107388, 42970, -24897, -69688, -125208, -197208, -237631, -211361, -141036, -78117, -57075, -78632, -114572, -126131, -93554, -31263]
36729c1263O3038M8773L1348k165o5313j30025j32397m3972O9546R9899K5315
36718f7216n1162l0639N1670Q6154M9417J7941K5880J5166l8320n4056K3535J08438
36706A36808Q6896o382m1431K695J3879o0022j20508p7300N681J0971n6006r4112
36694a98831p2253n6036p0847m9332M5482J32386J12295M304q2257p9859j0029
36683c24977P5131J36077J40663P6309k2026r2389j00386n4772J3925O3539N7934
36672c0972J3156o892J4720N877p5561j40514r2569m207k3146j20059j06474O3785
36660e02856J97080J48126L1691J7701O8040M9259r340K2492J17375J09922k8189
36649B21301j31457r5550j4029M333J069N4349J16368Q3658l0468j02890o4800
$$ y = [-31263, 31775, 80548, 111896, 109731, 44418, -85607, -218004, -261976, -192430, -92531, -67216, -118378, -149017, -97347, -11193, 38224, 56165, 82045, 97211, 58891, 4835, 28370, 136808, 223704, 217322, 175891, 178586, 192465, 132443, 11935, -65365, -59684, -48713, -104719, -198831, -271084, -327120, -397967, -447299, -401817, -269431, -157136, -152832, -235089, -314948, -324977, -249846, -113769, 26894, 103203, 81177, -11212, -111598, -166370, -152445, -88906, -30972, -17816, -24708, -9988, -4111, -79672, -220186, -312755, -316962, -340108, -460167, -566641, -502856, -305776, -157650, -125959, -108258, -40218, 9041, -299, 22193, 139568, 249490, 221301, 89844, -5706, -19735, -15402, -14333, 40016, 156384, 240042, 209574, 106684, 41884]
36638D1884J9492M5979m770n9350n3635j4891j3904m8229l8306L5872P4713L305
36626a1840r4403q4985J7737P8845M0020k7036n6536n8021m1862Q137O6009P3417
36614i0518M0682L5912N6376K6157n1203o5413K3405J01997P0764j1800l4145
36603A02214N013K3765j6879q6572j33955j13501k5521M0608p761j05652p7316
36592c95557R7431K07942J09010m8500l9359R3913J17188k9673j50756r0730O4521
36581f4570J38075P8873l8110j29333j50106q9672J5675R2921R1817K1871o8128
36570a00687j19439q8671R113R3483J02577O8227N5521N4419O650p6141j12590
36559a07538p6322l0936j9050l673M2860P4223N0444J4266J7624K5016k5608r5959
$$ y = [41884, 61376, 107355, 102585, 43235, -10400, -25291, -39195, -87424, -125730, -89858, -15145, -11840, -106243, -191228, -173491, -94646, -54626, -81662, -138198, -196219, -238081, -229944, -163935, -90518, -49836, -13924, 42452, 68609, 17406, -48007, -24602, 77395, 148159, 136359, 102214, 107227, 130992, 114113, 27541, -106414, -219915, -245436, -204828, -212589, -318241, -395557, -298126, -90184, 18826, -29674, -69033, 24880, 142068, 112395, -38361, -129091, -64570, 73505, 152378, 114268, -15065, -165171, -254843, -239168, -146247, -54430, -32559, -100687, -220126, -308797, -299684, -206201, -103624, -35397, 20124, 74543, 81193, 5052, -107538, -183860, -214796, -233846, -237519, -194659, -120436, -69992, -55726, -38102, -13086, -38694, -134653]
36547a34653p9173L4616J18085P7040j3590k0847M5533N0335m7771j13043l1657
36536a15125J02245J08923j9674j12582o2613M8805R5241N8352j2688r1187j49261
36525a49564j25933o961J12824J25022L6442n2428o4130L870R9257J42190Q0726
36514B01315l7790j01693p4808l1598k0460N294O1195O0117k9918p5626K8980
36503a4992J56067J06799p8719j66090o2010Q3680J23403P8885K3451l5623r0463
36492A24388q6239j7212L7341L2364J2058Q33m4549j17260j18045j1799Q3069
36481a05051N7775k5544l8277K2732N5993J8485l4588m6641j3479M1392Q0908
36470A3705O3952p733p5252r2542p3537l8269K7196J07187J20702K6019q7682
$$ y = [-134653, -213826, -179210, -61125, 15915, 2325, -18522, 27011, 77346, 29575, -83468, -115125, -12880, 96043, 76369, -36213, -98826, -50021, 45220, 103572, 90884, -303, -149564, -275497, -282458, -169634, -44612, -8170, -60598, -124728, -120858, -21601, 120589, 201315, 163525, 61832, -12976, -44574, -65034, -59740, 1455, 61572, 31654, -43972, -14992, 141075, 247874, 169155, 3065, -58945, 24735, 148138, 227023, 250474, 214851, 124388, 38149, 20937, 58278, 90642, 102700, 103533, 58984, -58276, -176321, -188120, -105051, -47276, -72820, -111097, -88365, -32372, -13887, -48475, -95116, -108595, -67203, 13705, 77657, 69924, -5328, -97870, -171407, -209676, -182480, -75293, 45409, 71428, -16254]
36459a6254r6778k992P8240O8439l916o8424q2996m6510O041K6934J0984P198
36447a20034M1310O4117K6132l5026m4777R42M4976O0759O1742L7159l7115j19652
36435a9467j18098j3815Q7683P4346l4057j03748l9069J05434J78863J01049m6336
36424A72785j22993j00649o8250p2850n1328L8369J14171Q4013m290l1703J2024
36413c0701K6711l3319r9757j04885o1175n518N2664R9182J02926O7781L7494
36402E1403K4793l847n0941o4391k3899J7328J9938K1392N6953Q0345L6591l1995
36390A33670l8793J0768K5466k6790o5854j9830P0661J15126R2147N1438K6598
36379C74607O396j4837j8869j0431l1616r7939j55446j40434o0665J9924N9640
$$ y = [-16254, -113032, -116024, -37784, 30655, 26739, -41685, -124681, -171191, -165150, -138216, -127232, -120034, -78724, -14607, 11525, -23501, -68278, -67336, -22360, 38399, 100141, 137300, 100185, -19467, -137565, -151380, -63697, 10649, -23408, -127156, -166225, -60791, 118072, 219121, 172785, 49792, -50857, -119107, -191957, -243285, -204916, -90745, -6732, -11022, -42725, -30701, -3990, -37309, -137066, -241951, -303126, -308644, -255980, -156798, -53872, 13909, 51403, 76196, 72349, 21408, -42983, -66882, -49554, -29616, -8224, 48729, 129074, 165665, 133670, 94877, 105645, 131111, 104321, 38467, 18637, 89298, 204424, 296571, 348009, 374607, 381003, 366166, 347297, 336866, 305250, 207311, 51865, -88569, -149234, -129310, -69670]
36368f9670O1372L2952k1462p1738p7063m0927l766K5475P3392J25019J13174
36357A46758K1054o9154q0538l8324o536J5274N8806R7382P8047J8204j6549j6723
36345B07701k6268m6398l5051m621k1794q7566j10033l6529O4241R6709N1684
36334E2075j4799n5622m7457Q807O4725O0131J3413M979L9372K0805p6771j27097
36322e7439l9026P4918N6305m6844n4565N3200J07189K6882n7455k5030N6278
36311I4413O9063K9521J1621l345o3648j11439n8145M8701P8153J4524l4170j8996
36299E6253j806j4520r718J5731j0413q6386r3515J3884J02828N6922l2727j0426
36287a3893R3048J13387J3367p6928p5572m3658l9922l1892l981j5428p4071p5031
$$ y = [-69670, -8298, 24654, 3192, -68546, -145609, -186536, -190302, -164827, -91435, 33584, 146758, 167812, 98658, 18120, -20204, -26740, -11466, 47340, 144722, 222769, 240973, 224424, 207701, 181433, 135035, 99984, 95363, 73569, -13997, -124030, -160559, -96318, 391, 52075, 37276, -18346, -65803, -56996, 7729, 67860, 81273, 86252, 125624, 146429, 69658, -57439, -96465, -21547, 34758, -12086, -66651, -13451, 93738, 120620, 63165, 38135, 94413, 163476, 192997, 204618, 201273, 137625, 26186, -31959, 16742, 94895, 109419, 75249, 56253, 54447, 39927, 30209, 45940, 35527, -50859, -144374, -130490, -27662, 29260, -3467, -13893, 79155, 192542, 205909, 128981, 53409, 9751, -30171, -62063, -66044, -81472, -155543, -230574]
36275b30574L6141J42371J15880K0240J2348Q9920R4665k8131j27148o4404P8540
36264A39848J12414k089j14715r7396m941J7692o0493j13483l0525J21354J65016
36253A32682L7258j21096j35974j2519Q6655N3889m8350r6104n6531J0191N2687
36242i7212P1040P2750M3797k1224r2247j25689r9323j9225Q7376J72561J82019
36231A74623R9826j9315q7121o5998o125J4439k0355n1433k3279M1769O5271P525
36219A29827p8831j05908n0922K7513P3303R1965J01901P3390k2031j25287j37067
36208b2147o1203j3027m7362o7558K1166J43660J49055L4983m4254K648Q8757
36197A84718Q9178N415o6262o9865l5198k0976n4331j08249j19668n3875M2151
$$ y = [-230574, -194433, -52062, 63818, 84058, 96406, 186326, 280991, 252860, 125712, 61308, 139848, 252262, 250173, 135458, 38062, 33121, 50813, -9680, -123163, -153688, -32334, 132682, 169940, 48844, -87130, -99649, -12994, 40895, -7455, -103559, -160090, -149899, -97212, -26172, 46578, 90375, 69151, -23096, -148785, -248108, -267333, -179957, -7396, 174623, 274449, 255134, 168013, 102015, 95890, 110329, 89974, 38541, 15262, 57031, 122302, 129827, 50996, -54912, -105834, -78321, -5018, 86947, 188848, 262238, 240207, 114920, -22147, -83350, -96377, -143739, -211297, -190131, -46471, 102584, 137567, 93313, 95961, 184718, 273896, 279311, 213049, 143184, 107986, 87010, 32679, -75570, -195238, -249113, -206962]
36186b06962Q5064N6348J3810P99J961q43M828J6564M082k5872j4757N5783J12704
36173A03509Q0502k0168j03897j14755n9051J5226M4974K291n9253n7058P620
36162a60060N1862L8107J6091J6770N890j6686J4959J00067J21696K0089r1078
36151A17707q9134k3187o496k2344J2960O6788L9168m4832o0280J1749N8884K1125
36139H2108m0062o2962m7164O694Q9750J22735L9519p2116o5304L2054N2391k8704
36127A08939m7241N5686J07713j3086j57538j26229K8679J01507M1614j8209K263
36116H4098L8166K6139K974K0353N3797M3284k0368q2807q7832m0275K410J0946
36104E0885K4798O9055P5287k3062j43347j29660J6057J18857Q2646R350J910
$$ y = [-206962, -121898, -65550, -51740, -50941, -48980, -49823, -44995, -28431, -24349, -50221, -64978, -9195, 103509, 184011, 163843, 59946, -54809, -113860, -98634, -53660, -51369, -110622, -167680, -160060, -108198, -70091, -54000, -37230, -31340, -48026, -33067, 67000, 188696, 208785, 117707, 28573, 5386, -1110, -23454, -10494, 56294, 95462, 50630, -9650, 2099, 60983, 82108, 42046, -20916, -68080, -61386, 28364, 151099, 190618, 118502, 53198, 85252, 137643, 108939, 61698, 117384, 225097, 212011, 54473, -71756, -43077, 58430, 100044, 81835, 84098, 122264, 148403, 151377, 171730, 225527, 268811, 248443, 165636, 77804, 37529, 39939, 50885, 75683, 144738, 220025, 196963, 53616, -76044, -59987, 58870, 141516, 150866, 152776]
36093A52776L049o1385j16255o0061M3426N2880k9222p1076j8034M7127M3076
36082a3699j6682p1132p8105l9198m036j8889m4099M575R9318J02535o332n1755
36070a37499O8667J83047R2093j02348j38253Q592J09455M4193o2268q7129o7953
36059h9403n8003k4964K9908K6947l6763m6915L2565P9971K1759l5924R777Q5726
36047e319P8976K3912J6156L8334J3956l8619m4788j4240j5766n1316p0235p2821
36035a41770q8809q7140k1869N7606O0972J0296J8320J04600J50508P4815m3061
36024I4468p3460o202N3160K7629m3347o1567R793R7921R7712q042j26428j57255
36012i5618r2173j869M3036K1738l1621n1247j457O7257O6962l042m0264J2001
$$ y = [152776, 155825, 94440, -21815, -81876, -38450, 14430, -14792, -85868, -103902, -56775, -13699, -30381, -101513, -179618, -218816, -222852, -241741, -285840, -281265, -181947, -79412, -85744, -137499, -68832, 114215, 206308, 103960, -34293, -25701, 83754, 127947, 65679, -21450, -89403, -147406, -172370, -142462, -115515, -152278, -199193, -166628, -86657, -64898, -100822, -91045, -5319, 73657, 97569, 113725, 152059, 166015, 127396, 82608, 68368, 52602, 1286, -68949, -141770, -230579, -317719, -339588, -281982, -221010, -210714, -192394, -87794, 62714, 137529, 94468, 21008, 14806, 67966, 95595, 52248, -9319, 474, 98395, 196107, 188065, 61637, -95618, -187791, -189660, -146624, -124886, -156507, -207754, -209211, -141954, -74992, -78034, -118298, -106297]
36000a06297O5570R610j13527j47415k9908J20393J48837M1747p2280p2688K6901
35989a29057J02867O4503m4728j09685q6324l0404Q569M4256Q4121Q8413M7164
35978C9695K1174M3117N0653n595n9472l2164K4168M079p0747p9936J595P0165
35966F732O1087K2700J55k9466o4728m2403M4571R4808L9794m6590n8082m530
35954B4048L0841K2679P433J303l910L681L0646L8618J7l7512j4454M1122N1804
35941A96316L456n5555j00219j29612j08395j0021R2517R1918J1297j2931O0546
35930C9317J09894M5143m9275n6237r925k2121r1719j15249n7355Q911K6967J7849
35918a53800J0683M711J1288M8229Q0096M7797k8841o3997l5975r973j1113J3666
$$ y = [-106297, -40727, -31117, -144644, -292059, -321967, -201574, -52737, -10990, -83270, -155958, -129057, -26190, 38313, -6415, -116100, -202424, -232828, -224259, -180003, -95882, -7469, 39695, 60869, 103986, 154639, 149044, 89572, 57408, 81576, 85655, 14908, -65028, -63433, 6732, 67819, 90519, 90674, 61208, -3520, -45923, -1352, 93456, 133250, 86660, 28578, 24048, 54889, 77568, 85001, 86304, 82394, 86075, 116721, 155339, 155356, 117844, 103390, 144512, 196316, 199772, 144217, 43998, -85614, -194009, -204030, -111513, -19595, -8298, -21229, 39317, 149211, 194354, 145079, 88842, 78917, 56796, -34923, -150172, -207527, -198616, -171649, -153800, -143117, -138406, -127118, -78889, 1207, 49004, 20163, -43834, -79809, -89782, -100895, -87229]
35906h7229O5373M7625p0621j59342j02043K3428O2269J1276p843M2808Q3157
35895i1142P1597N0308L1496k2516r0355r8575n9589o1317q9983k6571J20212
35884b66435J57162l702j64226j11245O3210J10665M422n7276R622P0843L5632
35873a51328k052L5112O0552j798n5778N081R4495O1185n8883r7404k5377J2030
35861a24165n5744j12240n0138N9958Q9854M4682K5483N6770O0742q174r0901
35850a03873j01979k6787P6438J39168J33570P8146M004p4236j36921j29359j5909
35839a57738J26997J55599M3588o1139l9423K5783m938q4804n3834P5917J11461
35828A37469j0510j08763m5671N8007L7619m7782m5504J7382N232o1103m3654
$$ y = [-87229, -21856, 25769, -44852, -204194, -306237, -282809, -220540, -209264, -217107, -174299, -91142, -19545, 30763, 62259, 39743, -50612, -149187, -208776, -270093, -360076, -386647, -266435, -109273, -112975, -277201, -388446, -325236, -214571, -210149, -267425, -257803, -186960, -151328, -153380, -118268, -57716, -59514, -115292, -110211, -15716, 45469, -13414, -110818, -136195, -124165, -179909, -292149, -342287, -282329, -192475, -147793, -122310, -65540, -4798, -12972, -103873, -205852, -232639, -156201, -17033, 116537, 194683, 198687, 124451, -12470, -141829, -157738, -30741, 124858, 168446, 107307, 67884, 93667, 88729, 3925, -49909, 26008, 137469, 126959, 18196, -27475, 30532, 68151, 20369, -25135, -7753, -2521, -63624, -107278]
35817a07278M1023L0770q6382j22666K188J24360J02247J8463p830k4031r9586
35806a28722j37146k4216J33892J37891p572j12197q5455k0086L799K0236N5960
35795a63616O2453J9656j3073N91J8113M808j2597j3205j7198k2368R173O7699
35783e9564Q3434L3559j8917k7975k2411k3197M209O0870O9366p046p6758m0516
35771b4946N4629P5512j2222j04467r5792P651J08240J05970j7446j63394j88746
35760b55011n7152J05911J52352P5404j5144m5547l4655j6094J5421O6277J09831
35749A01593J11125N6499l9270j24516j28732l9899N1480M7606k5850n6453j1693
35738e8110K0091k0509o7302l9111K9966M8554L108m7371p3050q1361m9420N2056
$$ y = [-107278, -66255, -35485, -121867, -244533, -242345, -117985, -15738, 2725, -5105, -29136, -128722, -265868, -290084, -156192, -18301, -25873, -138070, -223525, -243611, -239812, -219576, -163616, -101163, -81507, -94580, -93989, -75876, -71068, -83665, -96870, -114068, -136436, -127263, -59564, 23870, 57429, 38512, 10537, -11874, -35071, -30862, 30008, 99374, 92328, 15570, -24946, 29683, 105195, 92973, -11494, -107286, -99635, 8605, 114575, 97129, -66265, -255011, -312163, -206252, -53900, 21504, 6360, -39187, -73842, -89936, -74515, -8238, 101593, 212718, 269217, 229947, 105431, -23301, -63200, -11720, 35886, 10036, -46417, -58110, -38019, -58528, -125830, -164941, -134975, -86421, -83313, -130684, -203734, -285095, -334515, -282459]
35726b82459J68376J91407J00636q914n9813o6416n0638J1157R9316J11694N244
35715B19590j04139r1917j1105k876o8280p7871L981O4341L8570P918L7398N5405
35703G1015q542p7867m1281O1425R0620R767p3563o2849J7480P3434M5490m2225
35691F2904j05117q4221k2975j4490n9633n7910K2963P2004P617p5327m4442O5572
35679b33055J20698R7053P3949O1430r16q7469r6268k8582p94m7658o7456r656
35667b18724L3756m233m2214J1675J01970J05553K711j09809j30037l0276J18977
35656a60651J79691P4889r4446j50393o9103L539j4576l9328K5L9448K4691K4544
35644a81670Q7117J22468N7550k1049k1203j5652r2679j53273n6711J14912J54317
$$ y = [-282459, -114083, 77324, 177960, 169046, 109233, 42817, -7821, 3336, 102652, 214346, 219590, 115451, 23534, 12429, 9553, -58727, -136598, -132617, -68276, -29706, -21788, 15610, 71015, 62473, -15394, -56675, 4750, 95370, 105137, 31574, -31275, -13795, 59639, 105129, 62904, -42213, -126434, -149409, -163899, -223532, -281442, -258479, -186475, -178858, -254185, -298627, -233055, -112357, -15304, 58645, 120075, 119159, 31690, -64578, -93160, -93954, -141612, -209068, -218724, -184968, -189201, -231415, -219740, -117770, -12217, -9506, -119315, -249352, -279628, -160651, 19040, 93929, -517, -150910, -220013, -216474, -231050, -270378, -270353, -230905, -206214, -181670, -94553, 27915, 85465, 64416, 43213, 27561, -65118, -218391, -275102, -160190, -5873]
35633e873M7443k1696K6973P4276L1534k9839l2198j1800j9487l2142k3717j7119
35621a3645j9151L09L4698M0250K0573R801k1185j11547j73062p3896J22874J94426
35609A0445Q3649j1406L6215P6796m3148j88784j33085P3189J63888M4920j00827
35598A1852j03544r470N2806N3420L4570J2239j5460k6963q634J2127Q474l383
35586A8034L360J8384R073l3040q1973j04309q4126k8961L6738Q1261P6489J8889
35574g0181m7883n6066O310N7354J3200r2413j42376q8873R88O0147R3916J09641
35562a56236P2076j2344n4623n099N6367L9744j0001R242Q0651Q7551o411j04260
35550c343j10530l3014N9912J10391R2024K5781j9325P58L6474R870o3988r4483
$$ y = [-5873, 41570, 19874, 46847, 121123, 152657, 122818, 90620, 78820, 59333, 27191, 3474, -13645, -32796, -32487, 2211, 42461, 63034, 72835, 51650, -59897, -232959, -306855, -183981, 10445, 94094, 82688, 118903, 195699, 152551, -36233, -169318, -96129, 67759, 112679, 11852, -91692, -101162, -48356, 5064, 39634, 51873, 36413, 9450, 816, 12943, 21417, 18034, 21394, 39778, 48851, 15811, -66162, -170471, -254597, -283558, -246820, -165559, -89070, -70181, -118064, -174130, -167820, -110466, -97266, -189679, -332055, -420928, -419940, -359793, -265877, -156236, -84160, -96504, -151127, -156226, -99859, -60115, -70116, -60874, 19777, 107328, 100917, -3343, -113873, -146887, -86975, 23416, 115440, 141221, 121896, 122654, 159128, 168998, 105010, 10527]
35538A0527m8480J2774L3003K0800K376j3501j5931m692j8750p6030j00732j5503
35526b14139J00943Q4710n8620j22173P516J68756J54390O788o6581P45P6451
35515A38786N3709k1585o5161o7988n5064k6415J4410L9248L7102K5242L946l8758
35503C7472o7123k0630P5837J05686J3684j02841j17438l6820K7429J2158m1348
35492a13934o4484l2688K9954O7772K9984o1505j02601k5044R6453J29715O6213
35481A9835K3636N6750P4136m270j05077j07474k5320K3661l348l6774k8592j3229
35469a26066j5734k163L6717M2087j5029o7705n0962j106J5246J0492K7023L2518
35457a14682k5408r0619n0101Q3696J66163J23739M4919K0135R660m7437r6057
$$ y = [10527, -37953, -25179, 7824, 28624, 31000, 17499, 1568, -3124, -21874, -97904, -198636, -214139, -113196, -28486, -87106, -209279, -201763, -33007, 121383, 128171, 61590, 62335, 138786, 192495, 170910, 105749, 37761, -17303, -43718, -29308, 9940, 47042, 72284, 76230, 37472, -29651, -50281, 25556, 131242, 144926, 42085, -75353, -112173, -84744, -72586, -113934, -178418, -211106, -181152, -113380, -83396, -144901, -247502, -272546, -176093, -46378, 19835, 43471, 100221, 174357, 170087, 65010, -42464, -67784, -44123, -47471, -84245, -112837, -126066, -141800, -143963, -107246, -65159, -80188, -147893, -198855, -199961, -184715, -174223, -147200, -114682, -140090, -230709, -280810, -197114, -30951, 92788, 137707, 157842, 167502, 120065, 24008]
35446B4008n1261M4389P2832J7742k6394j0086J7287J4207L240J035j4308l9833
35434E2858l8097j7495l2628p2341m6803O1591J34368P9576l0242p3274n2456
35423c4943m6225n1704o860O7709Q2993K8020j9083k3246j7431M54O3032J17148
35411A59864N8800q2511j43761o6042J9108J1806j0239K7954L9077n4121j33447
35400a73512o2566O4387O5770k1929k0900O0118M5879o0336m4087J39077K32874
35389B24775O9498j53823j72598l2926M2117J1886O631N2436M9735j0359k5115
35378F2257K6920N6327L1723J2164N438m1771j00868p7225M478K158j08015j64854
35366b91268o4308Q3896J32576R4477O0515M2228J3535R159N5032P7758Q650q3054
$$ y = [24008, -27253, 17136, 89968, 107710, 81316, 71230, 88517, 102724, 105964, 106999, 92691, 52858, 14761, -2734, -35362, -107703, -154506, -92915, 41453, 121029, 90787, 17513, -34943, -81168, -132872, -139732, -72023, 10970, 38990, 19907, -3339, -20770, -20316, 42716, 159864, 218664, 136153, -7608, -73650, -54542, -42736, -52975, -25021, 14056, -40065, -173512, -236078, -171691, -105921, -127850, -148750, -88632, -42753, -103089, -147176, -8099, 224775, 294273, 140450, -32148, -65074, -22957, -11071, -4440, 47996, 97731, 87372, 62257, 89177, 145504, 177227, 189391, 194829, 153058, 52190, -25035, -20557, -18399, -126414, -291268, -355576, -271680, -139104, -44627, 15888, 58116, 71651, 80810, 135842, 213600, 222250, 139196]
35354A39196q4161j4472J4863j9308m4259l8486n1374p8334n2180J8440L1482
35343a78593l9482p4516J9963J57140J79472O5892o2808j14166j06103q3502m6130
35332b82833P238L5204J4860M057O7094J50706J22148m0680j80689j51375j3033
35321b67303N7362J5216j6140L9246R6830O7737N388K322L2298J0654m6182m5663
35309d8235K0089N5779J1259m8163m1048K9460R2727Q3497q29p9721n6744M5811
35297F3882P6311m2668j67274j14271N8991J20348l81j21727r3828Q306N1650
35286a60661M0542L5085J4611m4468o5296J2834R9383P5346j7234m9298r705J0483
35274e8378o361K404L5289K4592k9899o2483o7807q8276q8248N006J34426J53433
$$ y = [139196, 55035, 40563, 55426, 36118, -8141, -46627, -98001, -176335, -228515, -210075, -178593, -218075, -292591, -272628, -115488, 63984, 129876, 67068, -47098, -153201, -236703, -282833, -275595, -240391, -225531, -221474, -154380, -3674, 118474, 77794, -102895, -254270, -267303, -209941, -194725, -210865, -171619, -74789, -7052, -1664, 658, 32956, 43610, -2572, -48235, -28146, 27633, 38892, -9271, -50319, -20859, 71868, 155365, 154536, 74815, 18071, 63882, 140193, 97525, -69749, -184020, -125029, -4681, -5062, -126789, -220617, -212311, -160661, -120119, -85034, -70423, -114891, -180187, -167353, -67970, 7376, -9858, -59156, -68861, -58378, -64739, -62335, -27046, -2454, -32353, -94836, -162643, -250919, -339167, -334161, -199735, -46302]
35262d6302N3396j7613K943J0387n0322p5303l343N3274N883m4014J5122J00311
35250D419P9171j389j7758m27n7228j39517j06745J2993N2803q229j6976P0968
35238a27915J08612K4689m2132J6514R1521M4596o8856j13491q8107p1040n0618
35227b76227K5278R9397P2235j8631m4842M249J3765n0307p8587l057Q4907P0197
35215a01623k2259p4696l4947L7008N7248R316m6034l8546K6732O4837J6763o3562
35203a69763p6804j3828M3277N1095N5792R3118J14959O5075k3599o3497j8994
35192E6831O5375J25471J27687P0533k3547j11060j47347j20087o0322j2074J2013
35181a6527L6442P3635Q4290K4027p1361j02643l4298N1849P3492N7656O4869
$$ y = [-46302, 7094, -10519, -7576, 2811, -47511, -122814, -126157, -72883, -67000, -111014, -95892, 4419, 83590, 82201, 64443, 64016, 6788, -132729, -239474, -226481, -173678, -181907, -198883, -127915, -19303, 5386, -36746, -20232, 71289, 115885, 47029, -66462, -154569, -225609, -276227, -250949, -151552, -79317, -97948, -142790, -138541, -124776, -175083, -253670, -256727, -171820, -101623, -123882, -198578, -233525, -196517, -139269, -129953, -175987, -214533, -187801, -122964, -106201, -169763, -246567, -260395, -217118, -166023, -110231, -17113, 97846, 162921, 139322, 75825, 56831, 122206, 247677, 375364, 445897, 422350, 311290, 163943, 43856, -16466, -28540, -16527, 19915, 93550, 177840, 201867, 130506, 27863, -6435, 45414, 118906, 176562, 241431]
35170B41431O1323k7225j59392j97638r8576K4403O1709L3007P718n482k4414
35159h3136k5202J3892M9929K7513l7220p6921m9324L7837J33133J48572L2163
35148A71236j27074j54492j3910J17477Q6651k1539l6038K2540o878j34555j80217
35137b76799n4075J02135J28657N6926J0925J5159J1114j4469k6893k1003j0883
35126g9206J8903P2351R0722K4578p0378q9871j9649N1836N0791j0215o9042p1977
$$ y = [241431, 302754, 275529, 116137, -81501, -180077, -155674, -93965, -60958, -53240, -58722, -83136, -108338, -94446, -44517, -17004, -54224, -131145, -180469, -142632, -9499, 139073, 171236, 44162, -110330, -124240, -6763, 79888, 58349, 22311, 44851, 37973, -96582, -276799, -330874, -228739, -100082, -43156, -32231, -17072, -5958, -20427, -47320, -68323, -79206, -60303, 12048, 102770, 127348, 56970, -32901, -52550, -714, 50077, 39862, -29180, -101157]
$$ [...]
##END NTUPLES=NMR SPECTRUM
##END=
