##TITLE=31Pdec_IPEDM2511
 CDCl3, 24 sc
 26.11.2020
##JCAMPDX= 6.0         $$ Bruker NMR JCAMP-DX V2.0
##DATA TYPE= NMR SPECTRUM
##DATA CLASS= NTUPLES
##ORIGIN= UXNMR, Bruker Analytische Messtechnik GmbH
##OWNER= root
$$ XWIN-NMR		Version 3.5
$$ Thu Nov 26 10:37:03 2020 Russian Standard Time (UT+4h)  she@DPX200
##.OBSERVE FREQUENCY= 81.013821
##.OBSERVE NUCLEUS= ^31P
##.ACQUISITION MODE= SIMULTANEOUS
##.ACQUISITION SCHEME= undefined
##.AVERAGES= 24
##.DIGITISER RES= 17
##SPECTROMETER/DATA SYSTEM= spect
##.PULSE SEQUENCE= zgpg30
##.SOLVENT NAME= DMSO
##.SHIFT REFERENCE= (INTERNAL, DMSO, 0, 182.463)
##AUDIT TRAIL= $$ (NUMBER, WHEN, WHO, WHERE, WHAT)
$$ ##TITLE= Audit trail, XWIN-NMR		Version 3.5
$$ ##JCAMPDX= 5.01
$$ ##ORIGIN= Bruker BioSpin GmbH
$$ ##OWNER= she
$$ F:/spectra/data/she/nmr/P31/1/pdata/1/auditp.txt
$$ ##AUDIT TRAIL=  $$ (NUMBER, WHEN, WHO, WHERE, WHAT)
(   1,<2020-11-26 10:36:06.29 +0400>,<she>,<DPX200>,
      <created by zg, POWCHK disabled, PULCHK disabled
       configuration hash MD5:
       00 E9 B6 7A A2 85 ED C7 34 08 36 98 17 FE 4E 26
       data hash MD5: 32K
       FD 38 3B 24 FE E7 20 BB AF F3 AA 2E 89 F1 35 12>)
(   2,<2020-11-26 10:36:08.56 +0400>,<she>,<DPX200>,
      <Start of raw data processing
       efp BC_mod = 2 LB = 1 FT_mod = 6 PKNL = 1 PHC0 = -2412.532 PHC1 = 163.0008 SI = 64K 
       data hash MD5: 64K
       EF D2 EB 93 61 64 AD 64 12 3D F6 59 CD 05 6E D9>)
(   3,<2020-11-26 10:36:22.93 +0400>,<she>,<DPX200>,
      <pk PHC0 = -9.32153 PHC1 = 0 
       data hash MD5: 64K
       50 0D 84 12 32 EA 6D 93 ED 03 75 8B 14 75 85 D7>)
(   4,<2020-11-26 10:36:34.45 +0400>,<she>,<DPX200>,
      <abs ABSG = 5 
       data hash MD5: 64K
       80 73 FE 20 40 E0 2E 78 F0 3D EB 3E B3 20 16 AB>)
$$ ##END=
$$ 
$$ hash MD5
$$ 1E 7B F9 39 2C B7 23 29 DC 4C 43 71 CC 44 30 F4
##$RELAX= 
##$RELAX= 
##$RELAX= 
##$RELAX= 
##$RELAX= 
##$RELAX= 
##$RELAX= 
##$RELAX= 
$$ Bruker specific parameters
$$ --------------------------
##$DU= <F:/spectra>
##$EXPNO= 1
##$NAME= <P31>
##$PROCNO= 1
##$TYPE= <nmr>
##$USER= <she>
##$AMP= (0..31)
100 100 100 100 100 100 100 100 100 100 100 100 100 100 100 100 100 100 
100 100 100 100 100 100 100 100 100 100 100 100 100 100 
##$AQSEQ= 0
##$AQ_mod= 1
##$AUNM= <au_zg>
##$AUTOPOS= <>
##$BF1= 81.014009
##$BF2= 200.13
##$BF3= 200.13
##$BF4= 200.13
##$BF5= 200.13
##$BF6= 200.13
##$BF7= 200.13
##$BF8= 200.13
##$BYTORDA= 1
##$CFDGTYP= 0
##$CFRGTYP= 5
##$CHEMSTR= <none>
##$CNST= (0..31)
1 1 145 1 1 1 1 1 1 1 1 1 1 1 1 1 1 1 1 1 1 1 1 1 1 1 1 1 1 1 1 1 
##$CPDPRG= <waltz16>
##$CPDPRG1= <>
##$CPDPRG2= <waltz16>
##$CPDPRG3= <>
##$CPDPRG4= <mlev>
##$CPDPRG5= <mlev>
##$CPDPRG6= <mlev>
##$CPDPRG7= <mlev>
##$CPDPRG8= <mlev>
##$CPDPRGB= <>
##$CPDPRGT= <>
##$D= (0..31)
0 1 0 0 0 0 0 0 0 0 0 0.03 2e-05 3e-06 0 0 0 0 0 0 0 0 0 0 0 0 0 0 0 0 
0 0 
##$DATE= 1606372565
##$DBL= (0..7)
120 120 120 11 120 120 24 19 
##$DBP= (0..7)
150 150 150 150 150 150 150 150 
##$DBP07= 0
##$DBPNAM0= <>
##$DBPNAM1= <>
##$DBPNAM2= <>
$$ [...]
##$SUBNAM3= <"">
##$SUBNAM4= <"">
##$SUBNAM5= <"">
##$SUBNAM6= <"">
##$SUBNAM7= <"">
##$SUBNAM8= <"">
##$SUBNAM9= <"">
##$SW= 369.568048894756
##$SWIBOX= (0..15)
0 1 3 0 0 0 0 0 0 0 0 0 0 0 0 0 
##$SW_h= 29940.119760479
##$TD= 32768
##$TD0= 1
##$TE= 0
##$TE2= 300
##$TE3= 300
##$TEG= 300
##$TL= (0..7)
0 120 53 12 22 120 120 120 
##$TP= (0..7)
150 150 150 150 150 150 150 150 
##$TP07= 0
##$TPNAME0= <>
##$TPNAME1= <>
##$TPNAME2= <>
##$TPNAME3= <>
##$TPNAME4= <>
##$TPNAME5= <>
##$TPNAME6= <>
##$TPNAME7= <>
##$TPOAL= (0..7)
0.5 0.5 0.5 0.5 0.5 0.5 0.5 0.5 
##$TPOFFS= (0..7)
0 0 0 0 0 0 0 0 
##$TUNHIN= 0
##$TUNHOUT= 0
##$TUNXOUT= 0
##$USERA1= <user>
##$USERA2= <user>
##$USERA3= <user>
##$USERA4= <user>
##$USERA5= <user>
##$V9= 5
##$VALIST= <valist>
##$VCLIST= <CCCCCCCCCCCCCCC>
##$VD= 0
##$VDLIST= <DDDDDDDDDDDDDDD>
##$VPLIST= <PPPPPPPPPPPPPPP>
##$VTLIST= <TTTTTTTTTTTTTTT>
##$WBST= 1024
##$WBSW= 4
##$XGAIN= (0..3)
0 0 0 0 
##$XL= 0
##$YL= 0
##$YMAX_a= 130945
##$YMIN_a= -134029
##$ZGOPTNS= <>
##$ZL1= 120
##$ZL2= 120
##$ZL3= 120
##$ZL4= 120
##$ABSF1= 182.463
##$ABSF2= -187.1042
##$ABSG= 5
##$ABSL= 3
##$ALPHA= 0
##$AQORDER= 0
##$ASSFAC= 0
##$ASSFACI= 0
##$ASSFACX= 0
##$ASSWID= 0
##$AUNMP= <proc_1d>
##$AZFE= 0.1
##$AZFW= 0.5
##$BCFW= 0
##$BC_mod= 2
##$BYTORDP= 0
##$COROFFS= 0
##$CY= -3
##$DATMOD= 1
##$DC= 0
##$DFILT= <>
##$DTYPP= 0
##$F1P= 0
##$F2P= 0
##$FCOR= 1
##$FTSIZE= 65536
##$FT_mod= 6
##$GAMMA= 0
##$GB= 0
##$INTBC= 1
##$INTSCL= 5.30512e-09
##$ISEN= 30
##$LB= 1
##$LEV0= 0
##$LPBIN= 0
##$MAXI= 10000
##$MC2= 0
##$MEAN= 0
##$ME_mod= 0
##$MI= 50
##$NCOEF= 0
##$NC_proc= -3
##$NLEV= 6
##$NOISF1= 182.463
##$NOISF2= 159.3651
##$NSP= 0
##$NTH_PI= 0
##$NZP= 0
##$OFFSET= 182.463
##$PC= 4
##$PHC0= -2421.854
##$PHC1= 163.0008
##$PH_mod= 1
##$PKNL= yes
##$PPARMOD= 0
##$PSCAL= 0
##$PSIGN= 0
##$REVERSE= no
##$SF= 81.014009
##$SI= 65536
##$SIGF1= 159.3651
##$SIGF2= -187.1042
##$SINO= 113.3802
##$SIOLD= 16384
##$SREGLST= <1H.CDCl3>
##$SSB= 0
##$STSI= 65536
##$STSR= 0
##$SW_p= 29940.119760479
##$SYMM= 0
##$S_DEV= 0
##$TDeff= 32768
##$TDoff= 0
##$TI= <>
##$TILT= no
##$TM1= 0
##$TM2= 0
##$TOPLEV= 0
##$USERP1= <user>
##$USERP2= <user>
##$USERP3= <user>
##$USERP4= <user>
##$USERP5= <user>
##$WDW= 1
##$XDIM= 65536
##$YMAX_p= 309274538
##$YMIN_p= -7409312
$$ End of Bruker specific parameters
$$ ---------------------------------
##NTUPLES= NMR SPECTRUM
##VAR_NAME=  FREQUENCY,     SPECTRUM/REAL,   SPECTRUM/IMAG
##SYMBOL=    X,             R,               I
##VAR_TYPE=  INDEPENDENT,   DEPENDENT,       DEPENDENT
##VAR_FORM=  AFFN,          ASDF,            ASDF
##VAR_DIM=   65536,         65536,           65536
##UNITS=     HZ,            ARBITRARY UNITS, ARBITRARY UNITS
##FACTOR=    0.456856943014862, 1,           1
##FIRST=     14782.0589164895, 0,            0
##LAST=      -15158.0608439895, 0,           0
##MIN=       -15158.0608439895, -7409312,    0
##MAX=       14782.0589164895, 309274538,    0
$$ Real data points
##PAGE= N=1
##DATA TABLE= (X++(R..R)), XYDATA
$$ [...]
41505h6279K09035J20580O1087J42138J89515R851k30871k17903J9263J52848
41495C69264M7778j14278j87479k16438k11332q6018J01709J38804o791j04493
41485b69274l7804N920j10468j89517r636K73490L16589P7790j47193j36583L6711
41474a89975J83526J97934P1462j18460k19212j50423l9957n9876j43268o4445
41464e32694J77235K88630J02874j42071j23460J10422K20663N5363j66287j69945
41454a79270M0633K34433K28788L8487j81854k68464j59423M9838J68013Q7585
41444E8766q2487j16903O0676K61876K46596K1003j71908j63538m4748J2965k211
41433H0087L021K6007j4210r5219r9104r698N7038M6633L4142N6137L5282n9652
$$ y = [-86279, 122756, 243336, 304423, 446561, 636076, 645927, 415056, 197153, 216416, 369264, 417042, 302764, 115285, -101153, -312485, -398503, -296794, -157990, -164781, -269274, -307078, -301158, -411626, -601143, -610779, -337289, -20700, 57090, -90103, -226686, -189975, -6449, 191485, 262947, 144487, -74725, -225148, -265105, -324981, -468249, -532694, -355459, -66829, 36045, -106026, -229486, -119064, 101599, 156962, -9325, -179270, -138637, 95796, 324584, 363071, 181217, -87247, -246670, -196832, -28819, 58766, -23721, -140624, -79948, 181928, 428524, 449527, 277619, 114081, 69333, 82298, 80087, 83108, 109115, 94905, -314, -99418, -109116, -52078, -5445, 28697, 84834, 120116, 60464]
41421F0464j32485j22070r6697r3696k7251J21681J90363P3532p1863n8700K0361
41410a36361n3892k52189l26763j78645M8160K28852L71552M48310L52540R4146
41400E95710j54907k76007l01953k64596j30324O5360K07046K73901L33930L29895
41390F78055J17760k04277k89418k6319K32773J51811j05071j46716N4620J68844
41380F32062L1755j54893j69359n6925O553l7527j01635p5988N3424J55804O2592
41369C45863j98961l58185k10999J00813K71556K16146R1139K310p9778j37478
41359D2426q8996J2632o380j60453k43671j29532N8744J66518K06004K23691J55474
41348B36457l0863j91644j72594k1082J07225J57720J54875P4495r2755k22843
$$ y = [60464, -72021, -194091, -290788, -384484, -411735, -290054, -99691, -26159, -98022, -156722, -136361, -190253, -442442, -769205, -947850, -899690, -670838, -299286, 149024, 501564, 595710, 440803, 164796, -137157, -401753, -532077, -466717, -259671, 14230, 348160, 678055, 795815, 591538, 302120, 275801, 508574, 660385, 555314, 408598, 463218, 632062, 663817, 508924, 339565, 282640, 289193, 251666, 150031, 74043, 127467, 283271, 345863, 146902, -211283, -422282, -321469, -49913, 166233, 257372, 259682, 179904, 42426, -46570, -33938, -40318, -200771, -444442, -573974, -515230, -348712, -142708, 80983, 236457, 205594, 13950, -158644, -179726, -72501, 85219, 240094, 314589, 221834, -1009]
41338a009j83150m0960J8853l3194m4365O8710J99106K16703J25713Q041q2057
41327B52391j15488p3109J0479N7863M9610N1015R9315J32110P8768l2806j15304
41316C94844j27589r4422n5741l7541m1011k5777N5633J66541J79906L1416j53059
41305B93200j70894P137J75905J25748j12548l06278k89364j33141k3088j3012
41295d46335J8674J55728K82159K26463K0794j17597p9916j333l1523j00927n0437
41284a24250R2655J40439K2411j29313j87823j67255j10727P33J49088K25364
41274h8678J78253J09156J13407J27203N2983n4829p3910j7260M556j5827J3780
41263C48834Q5697O3633j02950k67088k56575p9922R6702J34864N1491k2577o810
$$ y = [-1009, -184159, -225119, -206266, -239460, -283825, -215115, -16009, 200694, 326407, 334448, 252391, 136903, 63794, 74273, 132136, 181746, 232761, 332076, 464186, 542954, 510148, 394844, 267255, 172833, 117092, 79551, 38540, 12763, 68396, 234937, 414843, 446259, 293200, 122306, 129443, 305348, 431096, 318548, 12270, -277094, -410235, -433323, -446335, -427661, -271933, 10226, 236689, 257483, 139886, 59970, 58637, 27114, -73813, -124250, -31595, 108844, 131255, 1942, -185881, -353136, -463863, -463130, -314042, -88678, 89575, 198731, 312138, 439341, 492324, 437495, 363585, 346325, 350881, 335054, 348834, 434531, 498164, 395214, 128126, -128449, -208371, -111669, 23195, 74686, 52109, 45299]
41252D5299K2375m5981j38391n4058J94511K96900O9052k23525k21506l426O7656
41241H906o0187q5363Q5359J66022R835j13210J6467J80785J02833p5826m6177
41230A89444J44184J86065J1772j44679j40567p1686l8628k6547k4055m9342o0020
41219b4059j1118L2546L815k2891K6299M5959o7174j70016p4745J07262J24347
41208b9775P472k016J01547Q5186p8017j47560n4409j5296j05369j00884R0673
41197b48448K08274O4350j23686q3813R1030J39809L6884o2956j08193j29951
41187b16700q3925N3902J57950J24762M8632M0986K5768q4603j70623r5149L2478
41176a66522K9808m6073j9874P2369N0975p7534j28920m6895M4339P1187P1381
$$ y = [45299, 67674, 21693, -116698, -170756, 23755, 320655, 389707, 166182, -55324, -58750, 8906, -51281, -136644, -51285, 114737, 124572, 11362, 27829, 208614, 311447, 235621, 189444, 333628, 519693, 531465, 386786, 246219, 174533, 135905, 109358, 85303, 35961, -24059, -35177, -2631, 1184, -21707, 4592, 50551, -16623, -186639, -261384, -154122, -29775, -22303, -24319, 77228, 162414, 84397, -63163, -117572, -132868, -238237, -339121, -248448, -40174, 24176, -99510, -183323, -92293, 47516, 84400, 21444, -86749, -216700, -300625, -246723, -88773, 35989, 84621, 125607, 151375, 66772, -103851, -199000, -166522, -136714, -182787, -202661, -130292, -79317, -156851, -285771, -332666, -288327, -217140, -145759]
41165a45759M9789j2659l8415M5656J29367O6725m7493o184J38115J22721q7077
41154B14786k10655q0027J16837J37652K429j22907j68829j51123o9644M9897
41144b81584J21946J05938N4305N594n7335j12097j02648p0361j09481j53870
41134e99593j7232K72807M07420K10364p8454j26063L6180R6887q0448l02499
41124a80631l25878j22946J39977K73047K05633L5227p5267q2600q1017j02582
41114c17037l3620J66623L03113J76359j09956k68826k12336j08830o8779j148
41104d74437J54471K57280J59166n8074j76201j02798O6368J89042J80742L1735
41094B27294j64640k31350p9905J34475J52187o1300k39607j41210J40064K97101
$$ y = [-145759, -95970, -108629, -147044, -101388, 27979, 94704, 47211, 41027, 179142, 301863, 214786, 4131, -75896, 40941, 178593, 181022, 58115, -110714, -261837, -331481, -281584, -159638, -53700, 605, 6199, -51136, -163233, -265881, -336242, -445723, -599593, -616825, -344018, 63402, 273766, 195312, 69249, 105429, 202316, 121868, -180631, -506509, -629455, -489478, -216431, -10798, 24429, -50838, -133438, -214455, -317037, -350657, -184034, 119079, 295438, 185482, -83344, -295680, -404510, -473289, -474437, -319966, -62686, 96480, 38406, -137795, -240593, -174225, 14817, 195559, 227294, 62654, -168696, -248601, -114126, 38061, -23239, -262846, -404056, -263992, 33109]
41084C3109J93855L797m3483N5728J10535p668k09387k91822j70290K0126P7229
41073b28271k4338j07787m2888P1543O6745l5277p1978j1385J6151k8875j6762
41062d13122J02277J69486O6662p4391p1152L8672J00875J00232J15527J15527
41052B50593K0773q8317n3239R1241J44517M5335n4035m0010K7466O1669M9685
41041D55678j9573j43683k02278p2089J19553R4821j45494k48568m829L19700
41031A53238L43238P2222j80830k41787j88926j10011p212O8423K2752r7465j11627
41020b77985L7723J80889J52459R092q0756p8606q4372j34545j28502l059J27335
41009b80327J15308J0809k074J00299J28814m430j08970m999J74883J87548N7098
$$ y = [33109, 226964, 230761, 187278, 243006, 353541, 345873, 136486, -155336, -325626, -305500, -228271, -252609, -360396, -403284, -331741, -264996, -300273, -372251, -383636, -367485, -396360, -413122, -310845, -141359, -74697, -149088, -220240, -181568, -80693, 19539, 135066, 250593, 271366, 183049, 129810, 221051, 365568, 410903, 356868, 316858, 344324, 405993, 455678, 436105, 292422, 90144, 18055, 137608, 232429, 86935, -161633, -166462, 153238, 496476, 568698, 387868, 146081, -42845, -152856, -160068, -91645, -68893, -166358, -277985, -240262, -59373, 93086, 102178, 21422, -57184, -141556, -276101, -404603, -407662, -280327, -165019, -154210, -156284, -55985, 72829, 68399, -40571, -45570, 129313, 316861, 373959]
40998C73959p639J7123j5205q5206l0810Q2659o268k73061l51310j15759P8620
40987c32897k0364j34271M7880K93241J95912j24126k01364K3542J49635m609
40977a07421j60670r5180M4740P9796P4022J02631P1403m6900q2782L1708R8647
40966I994r642j03975l587J23227K8993j74730j65198R4277L09638K91191J62935
40955E63123R8982P3942l7250k49499m35707m40400k14423J00053K51554J38347
40945a51278n5925r4248N155M5443j4909k0461P7052J13900P637o7721L6607J67958
40933D9210R5637j12125j87039p6517J3681k934L3291J84890K30985J7082k29065
40922A7096j88051Q0910K35297J44125N312j9167J26j7017n046O6927P7287m3604
$$ y = [373959, 366320, 383443, 368238, 283032, 252222, 334881, 328613, 55552, -295758, -411517, -332897, -353261, -487532, -439652, -146411, 49501, -74625, -275989, -252447, -102812, -107421, -268091, -363271, -318531, -238735, -164713, -62082, 9321, -37579, -120361, -88653, 9994, 352, -103623, -107210, 16017, 45010, -129720, -294918, -200641, 108997, 400188, 563123, 662105, 736047, 698797, 449298, 13591, -426809, -641232, -541179, -289625, -151278, -207203, -301451, -296296, -250853, -265762, -286223, -209171, -95271, -87634, -155355, -118748, 49210, 144847, 32722, -154317, -230834, -217153, -220087, -186796, -1906, 229079, 246161, 17096, -170955, -90045, 145252, 289377, 294689, 275522, 275648, 258631, 253585, 320512, 397799, 354195]
40910C54195j60794j30464j0648N8022N6938M2155Q965n9674j08475r8414q5210
40899a33404j02352p9544J4437Q3568P9879J07912K07915K17190M2473j15287
40889C22787n7931N8491k5765k09259j76572O0598J60865J774j50233r2107M8334
40878e9018J13961J55678K10331J43397q7669k65638k21614r9412j00459j57268
40868c67711r2526N3754J04427N0245L7827J05263J35995O1543m8917r9485n9531
40857a19116L7716J11641Q8784o52m2877j038L9183L0615M3069J08613J26772
40846D22710K2372j27227k17052k37325j87638l1838J55420J84455L6117m3172
40836b3178Q9796K16434J01463r8072p5485J14835J47334l1549j23416K2552J74479
$$ y = [354195, 193401, 62937, 52289, 110311, 167249, 209404, 218369, 158695, 50220, -48194, -133404, -235756, -315300, -300863, -217295, -137416, -29504, 178411, 395601, 438074, 322787, 264856, 323347, 297582, 88323, -88249, -27651, 133214, 134988, -15245, -107352, -59018, 54943, 210621, 420952, 564349, 476680, 211042, -10572, -109984, -210443, -367711, -460237, -406483, -302056, -251811, -213984, -108721, 27274, 88817, 39900, -59585, -119116, -81400, 30241, 119025, 118373, 75496, 74458, 113641, 144256, 187325, 295938, 422710, 445082, 317855, 100803, -136522, -324160, -355998, -200578, -16123, 19994, -23178, 66618, 283052, 384515, 286443, 210958, 325793, 473127, 441578, 318162, 340714, 515193]
40825E15193R8733j01245j82828r7468L1963J18672J44870Q4465p2889k62144
40815B77322l84121l77919k34752o595J84373K27236J39714M0267J743P395L6369
40804h8968Q6888J10777L6052j17323k29306k08327o5754J23421K56616K33813
40794A37889O0723r6874p5463Q1240J87280J57837O3420k7947j10096j49507r5868
40783A32634N383N3832N1462P4531J00763M0088o5253p4628m045k4785j54453
40772A35529j85855k4085J32657R1508n3119j01155m2543O568K2723M4201L0878
40761E7307o2819j57216j51055p7837j5197O0412J64583J64044l9088k56535j93756
40750e07157J27528L58738K77647N0044l8413N5286J49337J11373o280p6073n7966
$$ y = [515193, 613926, 512681, 329853, 232385, 264348, 383020, 527890, 612355, 539466, 277322, -106799, -484718, -719470, -726065, -541692, -314456, -174742, -134475, -132732, -125337, -88968, -2080, 108697, 144749, 27426, -201880, -410207, -475961, -352540, -95924, 137889, 198612, 101738, 26275, 107515, 294795, 452632, 516052, 488105, 378009, 228502, 132634, 138017, 191849, 243311, 317842, 418605, 458693, 393440, 318812, 314767, 289982, 135529, -50326, -74411, 58246, 149754, 96635, -4520, -47063, -40495, -17772, 26429, 57307, -5512, -162728, -313783, -391620, -406817, -346405, -181822, -17778, -56866, -313401, -507157, -379629, -20891, 256756, 306800, 268387, 323673, 473010, 584383, 578103, 502030, 444064]
40739D44064k9300o3405j10887o3573N9906R7044l2841j95986k33043j71491j18903
40728d18415n1696J07540K73306K70451J06487k9190l9636k11L6980R7956J19411
40717D72983k4777k49636k65531J747K34061J58122m9072m4077J50632K03068
40707E87520o199k29675k43441j16416j0215N4034J06061R4020m375p2596j4407
40696A44311P3534M5912m4701k0945J22190J74444R119k20783k73826j14474Q5130
40685b0089J82685J90516J69803J15536K588j25292j92541j89342j57101r3811
40675a17048L0562J53106J31602m9446j89422j08860R2214J64859O6895K083Q0232
40664B56777J43624L7766j24646j41864m0154n673o6739o9163L6594J05944M8080
$$ y = [444064, 414764, 351359, 240472, 176899, 236805, 333849, 301008, 105022, -128021, -299512, -418415, -470111, -362571, -89265, 181186, 287673, 258483, 218847, 218636, 255616, 353572, 472983, 448206, 198570, -66961, -65214, 168847, 326969, 277897, 233820, 384452, 587520, 581321, 351646, 108205, -8211, -18426, 35608, 141669, 235689, 231314, 158718, 144311, 217845, 263757, 219056, 198111, 320301, 494745, 503864, 283081, 9255, -105219, -20089, 162596, 353112, 522915, 638451, 641039, 515747, 323206, 133864, -23237, -117048, -86486, 66620, 198222, 148776, -40646, -149506, -57292, 107567, 174462, 176545, 256777, 400401, 438167, 313521, 171657, 131503, 125830, 59091, -10072, 26522, 132466, 180546]
40653A80546l7615o2627j03628k23103k88612j47715J11720K62159K47746K07465
40643A46336K00831J16203q7439k32017j50117M8611J07100k1020j14558k2415
40633h485J01688K7714j83619k32094o905K26565J78576p0246k00742j01005L5268
40622b33285N1427L8450J16976K04666J56394J3783n5990r585M0349J9389j9425
40611C23149r194L3032M5560m633r7703j71301j70332j16642q7304q9749l1376
40600c76493J22672K42027J82723n861j30259q0076P7943J97608J70119p510k04733
40589A88160k57405j65421j00298j35234j08447R9621L04852K60494M9621l8834
40579I7109L0783J7313j48418k18505l8073J84460J86343J6529r0070n0756K5196
$$ y = [180546, 142931, 80304, -23324, -246427, -535039, -682754, -571034, -308875, -61129, 146336, 347167, 463370, 375931, 143914, -6203, 42408, 149508, 128488, 13930, -8485, 93203, 120917, -62702, -294796, -301701, -75136, 103440, 33194, -167548, -268553, -233285, -181858, -143408, -26432, 178234, 334628, 348411, 292421, 282836, 323185, 342574, 323149, 313955, 346987, 392547, 387914, 290211, 118910, -51422, -168064, -255368, -345117, -376493, -253821, -11794, 170929, 165068, 34809, -45267, 32676, 230284, 400403, 392893, 188160, -69245, -234666, -334964, -470198, -578645, -479024, -174172, 86322, 135943, 97109, 127892, 145205, -3213, -221718, -259791, -75331, 111012, 127541, 37471, -13285, 11911]
40568A1911K8587n9394j87638k47409j53651J6251P9366Q39n7099l322N3304M2625
40556d75630Q4946K41438L17137J36230j42287k31816j28066n3120o9951l6325
40546c57444P5227R7564l0791j25320k8247J48549J82403L9929j00436q3617N2419
40535a29764J45396J04380L694l3068j252J1506r59M6736J36829J10612p7844
40524C16266k29403j68656j0147K5664m5563l0573R9593J54604J9234j85773k72809
40513c27563j82422P899J57847J53371K6937m0127N7877J83558J45368k2884j41721
40502A8140j67553j78565j37481O3803L19189L50406J09168j13315r0528M7024
40492B20288O2406l9435q9344m2625n657m1244r4264q4709J3128J51303K16909
$$ y = [11911, 40498, -18896, -206534, -453943, -607594, -591343, -511977, -511138, -568237, -571559, -518255, -475630, -390684, -149246, 167891, 304121, 161834, -69982, -198048, -251168, -321119, -357444, -282217, -184653, -215444, -340764, -369011, -220462, -38059, 1870, -98566, -182183, -129764, 15632, 120012, 123706, 90638, 89386, 100892, 99933, 146669, 283498, 394110, 316266, 86863, -81793, -91940, -66276, -111839, -142412, -42819, 111785, 131019, -54754, -327563, -509985, -502086, -344239, -190868, -163931, -204058, -146181, 37377, 182745, 159861, 18140, -149413, -327978, -465459, -401656, -82467, 267939, 377107, 263792, 173264, 220288, 282694, 243259, 153915, 111290, 105633, 64389, -29875, -114584, -101456, 49847, 266756]
40481B66756J17565r6009k55137k54026j36656Q508J36311K02345J56411L5120
40471A81188m4620m0181l2388p5095j09252q3297m1704k3186J5683R2103J17941
40460d2808K8233r0642r8917K1283J62066K17388J61140M1202o3497j11178j27616
40449I6654j30819o8445Q2173K05408J75135N2265p125n075o3903j58354j31153
40438D6761O551O0964j158J3962J47921J55016q0835k88447k02470L7627J44514
40427D0406J17533J28312J59832Q1694m8249p8790o3224j48224k47670j55021
40417b13401O9944J61114P5407K7617Q5195P5054m2674n2990J30527K63628J34802
40406G14223j06503j84622q6049j4953p4648j71872j84096r6609J731K466r9906
$$ y = [266756, 384321, 288312, 33175, -220851, -357507, -348999, -212688, -10343, 146068, 181188, 136568, 96387, 63999, -11096, -120348, -203645, -245349, -268535, -252852, -160749, -42808, -14575, -105217, -204134, -182851, -20785, 196603, 357743, 398945, 335448, 224270, 96654, -34165, -102610, -20437, 184971, 360106, 412371, 405246, 400171, 336268, 177914, 46761, 53312, 114276, 113118, 127080, 275001, 430017, 349182, 60735, -141735, -104108, 40406, 157939, 286251, 446083, 527777, 479528, 400738, 337514, 189290, -58380, -213401, -143457, 17657, 93064, 120681, 205876, 280930, 238256, 185266, 315793, 579421, 714223, 607720, 423098, 337049, 322096, 247448, 75576, -108520, -205129, -203398, -200932, -300838]
40395c00838j59990m2908J66605K42519J21935j3417j519R8861J35364O3866m8579
40384B61899j23059j15627m6757m127k9147k5328Q9261J85316P9200j36979j81419
40373d6767k6764M0690r5885j60940N7364L15461K60231m1998k37347k08018j34156
40362b78129j04051n592J73835K50742J44808L0436O1068J31339O8279p3235q6354
40351C13146O5178J71408O4066j39964j92895p0602j5006j57852k69112p8874
40341c10507K50940K82143m6194k67187o0751K46733J67668k02867l42985r7802
40331c80809J36306O2428j09071p2340J03079J67321J13479J17905J92824J75229
40321E06351J7879j35422j70148j25851q2346n7033m6207o6010j10748j26604
$$ y = [-300838, -460828, -503736, -337131, -94612, 27323, 13906, 12387, 111248, 246612, 310478, 261899, 138840, 23213, -23544, -27671, -56818, -82146, 7115, 192431, 271631, 134652, -46767, -73531, -32841, -128726, -289666, -232302, 83159, 343390, 301392, 64045, -143973, -278129, -382180, -387772, -213937, 36805, 181613, 212049, 273117, 404456, 472735, 399500, 313146, 378324, 549732, 613798, 473834, 280939, 210337, 195331, 37479, -231633, -310507, -59567, 222576, 176382, -90805, -151556, 95177, 262845, 59978, -283007, -380809, -244503, -182075, -291146, -363486, -260407, -93086, 20393, 138298, 331122, 506351, 524230, 388808, 218660, 92809, 10463, -46570, -92777, -158787, -269535, -396139]
40311c96139n4585J12823K98050L56931K02663n2159j70602p8547K6337m0553
40301B04219j69050j29040N2333J20617o94q6605J9610J43209N7181j41697j63345
40290i3262M5130K31255K00340L9244p6204j15559j33336j16063l0902N3755M1794
40279D6192k8427k7872N9679J02817K1224q8021q1651M5440J69065J80544P2607
40268D71597p1416j23284n79K14075K90009Q6117k38907l60586j58998J38711
40258B46739K36033J03623m4590n6447p259m7708j79916k53334j59124L1401J47391
40247A6809J15571L2898K1841N8253J8342j09169j67068m8948J18985J34065O023
40236A97602n8484L5933J38103Q6362n8330j27489r4957p0607r2279p4160K6945
$$ y = [-396139, -450724, -337901, -39851, 317080, 519743, 467584, 296982, 218435, 244772, 204219, 35169, -93871, -41538, 79079, 78385, -8220, 11390, 154599, 211780, 70083, -93262, -48132, 183123, 383463, 422707, 346503, 230944, 97608, -18455, -49357, 4398, 46192, 17765, -10107, 49572, 152389, 173613, 85592, 3941, 49381, 218446, 398990, 471597, 400181, 276897, 276318, 490393, 780402, 866519, 627612, 267026, 108028, 246739, 482772, 586395, 541805, 485358, 478099, 430391, 250475, -2859, -161983, -130582, 16809, 132380, 165278, 187119, 245372, 263714, 154545, -12523, -61471, 57514, 191579, 197602, 139118, 175051, 313154, 399516, 341186, 213697, 118740, 48133, -44146, -118306, -91361]
40225i1361J17767R1445k7878j13185p6981L9101J05864M3297p7885j09233j4260
40214a13309Q5418R0982M9884J8265o9999k40771l02703p2268K71248L35757N6368
40203A08872j95440j42975L3103M1417n8070j970K20429L45366K16295m8469k52439
40192B66119k95067j71075K4280J03852k9939k23838k45195q5833O3973J00662
40182d92061P6020J5134j08806k09192j24717J23577L10794K99249J68855J8680
40172G7533j46575k63291j74435J20341L66270L48484J40983n2341j44522j32785
40162A39662k06J82098K08699j0926k67666k99251j25953L2557P3325M9735j2454
40151c0380j13239j44098P289K18023K20208k2552k21487j29240J44339K84204
$$ y = [-91361, 26406, 117851, 89973, -23212, -100193, -61092, 44772, 88069, 10184, -99049, -113309, -27891, 63091, 112975, 131240, 61241, -179530, -482233, -554501, -283253, 52504, 108872, -86568, -229543, -196440, -155023, -213093, -215063, 5366, 350732, 567027, 518558, 266119, -28948, -200023, -175743, -71891, -101830, -325668, -570863, -656696, -592723, -492061, -416041, -400907, -509713, -718905, -843622, -720045, -409251, -110002, 58853, 77533, -69042, -332333, -506768, -386427, -20157, 328327, 469310, 416969, 272447, 139662, 139456, 321554, 530253, 519327, 251661, -47590, -173543, -140986, -67661, -17926, -30380, -143619, -287717, -280428, -62405, 157803, 135251, -86236, -215476, -71137, 213067]
40141B13067J49908r3855j96999j04900P783k0194j16261q6503P5531J58889O6001
40130E2467k3610M4154J23699J3173j81960k04347o5739j43l8559K3336K01289
40119e6240K29709J7121j44306k7702J61269J27947l8891n5061O3304M8107j44612
40108A80645k60582j69268l8830q793K1766J40288K05164P9851j00758j19310
40098f9827j0772K0502n3351o2230M6876J10860K6167p7782m6330P2711J32751
40087H9575J03718N1522r374r9904j67073j31774k4698M5362M5344L3111L6087
40076b8104K4806k877j7885k9839n8242n7058J4872P7472K4743q5729r9601q833
40064b46275N3490N4333P8281Q6664p6717l56503m36215j72451J62979K64132
$$ y = [213067, 362975, 269120, 72121, -32779, -24996, -45190, -161451, -247954, -172423, -13534, 52467, 28857, 73011, 196710, 209883, 27923, -176424, -242163, -242306, -280865, -257529, -56240, 173469, 190590, 46284, 18582, 179851, 307798, 268907, 213846, 277150, 325257, 180645, -79937, -249205, -288035, -296828, -275062, -134774, 70390, 150241, 49483, -69827, -80599, -60097, -113448, -175678, -128802, -17942, 8225, -69557, -115887, -43176, 89575, 193293, 244815, 235441, 135537, -31536, -163310, -188008, -142646, -97302, -64191, -28104, -3298, -6175, -24060, -53899, -112141, -169199, -154327, -76855, -52112, -137841, -237442, -246275, -192785, -138452, -60171, 26493, -50224, -406727, -842942, -1015393, -852414, -588282]
40054e88282J91495J68365J87069J01697l9929o9871j8857n6660j58837j32825
40044d16635K7547J03522N118j00771q2317k3907k2018p002J09559K57293K92775
40033A43164J74559j5506j54600j56969m6931M2528J8308n4530o5087k1293P177
40022a29180K1181K8592l8703j66159j50351J06743L30467K12230q8555j55661
40012b9396L0508R0343q5844j54554N6499K16576L9220k40297k53791n2861O3503
40001c20094L3616J5199N8568R3312J04072Q1194m9979k39996k51240r727J98139
39990b86936J34215k3690j6382M8264n2480j84721p5217J63384J94034M2213L5252
39979b2064J95342J96762l2398j60990k6128J00666j272j46328q9280R9220K16477
$$ y = [-588282, -396787, -228422, -41353, 60344, 20415, -49456, -68313, -124973, -283810, -416635, -389088, -285566, -280448, -381219, -463536, -487443, -509461, -516463, -406904, -149611, 143164, 317723, 302217, 147617, -9352, -56283, -13755, 4553, -49977, -115064, -136357, -129180, -107999, -79407, -118110, -284269, -434620, -327877, 2590, 214820, 126265, -29396, 1112, 91455, 5611, -148943, -92444, 124132, 163352, -76945, -330736, -383597, -320094, -286478, -271279, -212711, -119399, -15327, 65867, 15888, -224108, -475348, -485075, -286936, -152721, -176411, -192793, -144529, -197009, -381730, -456947, -293563, -99529, -57316, -22064, 173278, 370040, 337642, 176652, 150524, 251190, 249918, 103590, 14310, 113530, 330007]
39968C30007K06787P3051k02784m59556l80267M3387L49862J92350j62108k35622
39958b44893k7323Q1757k2570o5611Q2683J60613m3803l02243k41456J14807L51442
39947a56597K06446r4269j53678O6254K19059P5680j62732j81364o519Q3039O398
39936i8283l6845O1590J43758P2087m6315n9220q501j7323p6274r1278m7617j700
39924b05921J6568O729j8903l567R6242J88359J29186k9410o7984N7331J23519
39913B92149O761j02471k5125J00264P0980k5143P728R5277K1251j60369j82286
39902I9016j4045P1743o6529k23350j62805O8827K56088K75466J50963j6434r7158
39891C41782k4620J00110R5235o6389k07121j67127J4233J68647J66868M56k20472
$$ y = [330007, 536794, 609845, 407061, -52495, -432762, -389375, -39513, 152837, -9271, -244893, -272216, -190459, -213029, -278640, -195957, -35344, -79147, -381390, -622846, -508039, -156597, 49849, -44420, -198098, -131844, 87215, 162895, 163, -181201, -187720, -104681, -98283, -135128, -73538, 70220, 142307, 95992, 36772, 28271, 10948, -65326, -156604, -204221, -205921, -189353, -182624, -201527, -205094, -108852, 79507, 208693, 179283, 111299, 168630, 292149, 298910, 196439, 171314, 271578, 342558, 317415, 325143, 420420, 441671, 281302, 99016, 84971, 156714, 90185, -133165, -295970, -227143, 28945, 304411, 455374, 438940, 341782, 317162, 417272, 512507, 446118, 238997, 71870, 86103, 254750, 421618, 422074, 201602]
39880B01602l37747k82459j37303j2277Q2213J60413J61378O5247J1652J11551
39870B4270K19228J22270r4417j45930J743P9579l7475j44452q3056m027o9375
39859a31642j48385m1099J84129L07333K64604J27060p9788l00812l29272m1330
39849a89202L12964L33995j1023l35394l22750n9845J59665J71577J8044j51826
39839g3795j82164k7036J74642K30178J22113P006j7463j1189l4384m1064N192
39828A52036L5675j7209j09516j58192j46435q9979J9977J59941K29248J54379
39818B29925j636j13164j42547j37823j05618J2494K08532L31695K25660n9439
39808D48079k66061j99769L2751J44126K6555j22592q8273P1959J42539O2385
$$ y = [201602, -136145, -418604, -555907, -568184, -485971, -325558, -164180, -98933, -87281, 24270, 243498, 365768, 271351, 125421, 127164, 206743, 169268, 24816, -58240, -62267, -131642, -280027, -321126, -136997, 170336, 434940, 562000, 482212, 181400, -147872, -189202, 123762, 457757, 446734, 111340, -211410, -271255, -111590, 59987, 78031, -73795, -255959, -282995, -108353, 121825, 243938, 250944, 233481, 222292, 187908, 146844, 152036, 187711, 170502, 60986, -97206, -243641, -333620, -313643, -153702, 75546, 229925, 228289, 115125, -27422, -165245, -270863, -258369, -49837, 281858, 507518, 448079, 182018, -17751, 15000, 159126, 185681, 63089, -25184, 46775, 189314, 251699]
39798B51699l6486n9394m8057n0554n0435m6215n9472m5036N9766J77880J52510
39787B46206J58q0702j4108M0139k7878q9594j9628P0790L0377o9708q4204n9289
39775e7441j06592j32502K2372K41231K35321q665j79657r4333P3751J13092P1876
39764A78453Q6645J10742O215j96007k98265j76443P3197K21208J20756j32185
39754e684k78856j95383l8710J2057M1408K12527L97348L11413Q225j29058K1413
39743C56700J15974q2531k91556j59703J60669K51897N2387j26516r4470M7896
39733B30747J67258K12507J16216j23069k94017j94997K7081N2628j22324j90524
39723a18494k9967J36444J27582K9878m4358j18302j68912q0455R7978J35302
$$ y = [251699, 215213, 155819, 107762, 57208, 6773, -39442, -98914, -143950, -84184, 93696, 246206, 246364, 165662, 151554, 191693, 163815, 74221, 54593, 125383, 155760, 86052, 1848, -57441, -164033, -296535, -274163, -32932, 202389, 193724, 14067, -80266, -6515, 106577, 178453, 265098, 375840, 382055, 186048, -112217, -288660, -215463, 5745, 126501, -5684, -284540, -479923, -518633, -506576, -465168, -252641, 144707, 456120, 464345, 335287, 356700, 472674, 390143, 98587, -61116, 99553, 351450, 403837, 277321, 182851, 230747, 398005, 610512, 726728, 603659, 309642, 114645, 141726, 194354, 72030, -118494, -148461, -12017, 115565, 145443, 101085, -17217, -186129, -266584, -168606, -33304]
39713c3304l809n2373J22535K65855J29587j38447k46196j75859r1083j7327J08365
39702a32056K15481J96185J08340M7315m9155k22090k78903o7047J75868J07969
39692A01907j59507j89526J00537L04253J63734n8437l6941J23752J23405m6723
39682D26454j49057r3473k911M6663R1687R9253l9466k81891l93225k30600N9721
39671d66845K30646K25720J68076J25741M0962j01401j86429j29399j7419J8763
39661i1585m1L3044J01997R1325R322J851J02695J55206O1998o6416j20119j62560
39649A16717k43062k17846K3878K87704K82649L3750j62545j60391q9701o0441
39639a89288m777J21648K06106J49433J1189r4613j13728j9231J72544L03051
$$ y = [-33304, -37113, -89486, 33049, 298904, 428491, 290044, 43848, -132011, -223094, -240421, -132056, 83425, 279610, 387950, 435265, 386110, 164020, -114883, -181930, -6062, 101907, -57600, -247126, -146589, 157664, 321398, 262961, 226020, 349772, 473177, 426454, 277397, 183924, 181013, 227676, 319363, 418616, 379150, 97259, -295966, -526566, -466845, -236199, -10479, 157597, 283338, 324300, 222899, 36470, -92929, -110348, -91585, -91626, -58582, 43415, 134740, 144062, 145913, 248608, 403814, 465812, 399396, 279277, 116717, -126345, -344191, -320313, -32609, 250040, 283790, 121245, -39146, -128847, -189288, -194065, -72417, 133689, 283122, 294311, 199698, 85970, 66739, 239283, 542334]
39629E42334J72289j72837m16345l43109q5270J00225J45341J36804J13457N8922
39619B51811K081k4343n8309j19678j24384j6706Q6649L2028j35660k13680r8804
39608d18995J12704K62679K61524J06911j10338k26998j47063K8195J00507J1935
39598a8939j02941j07076j2887P6942R9302O4824K1663K2726Q8087J67911J71035
39587D70647N8396j05204k07581j91338r9129k5599j9838l0646L3723J78461K81692
39576C43584K17248J0587j68971j88965r7272m7168q9647j07442O37J35875J11853
39565A20319o4951j74508r2142L6859M1884k484O7687J87575J41549p3814k16769
39554b8795j61281m9988j2509L2186J61299K46137J47597l6118j10136o6463l8901
$$ y = [542334, 714623, 541786, 125441, -217668, -302938, -202713, -57372, 79432, 192889, 251811, 253892, 229549, 171240, 51562, -72822, -89528, -2879, 29149, -106511, -320191, -418995, -306291, -43612, 217912, 324823, 214485, -12513, -159576, -131381, -30874, -18939, -121880, -228956, -241843, -164901, -65599, -775, 20888, 43614, 131701, 299612, 470647, 529043, 423839, 216258, 24920, -74209, -99808, -119646, -150292, -116569, 61892, 343584, 560832, 571419, 402448, 213483, 116211, 69043, -20604, -128046, -127409, 8466, 120319, 55368, -119140, -211282, -174423, -132539, -135023, -67336, 120239, 261788, 187974, -28795, -190076, -240064, -252573, -220387, -59088, 187049, 334646, 298528, 188392, 121929, 83028]
39543H3028n3979k4274M6830M6706m6640j03925l0457R1656R8445o5390k69548
39532b27548k99032o6283K56499L84084K35381J8342n1306K317L8795L9679O9497
39521D00425R4016K3224j04666j56370j07905n9340n2093k9029J3839n607r7117
39510h0623j41674n0820J14415K26586K15855R0456q4673k11743k34451j90289
39500c46961j25045P16K08209L52723K53410k3493j94190j21219K3568L8710l3094
39489C3334l6703K7527L4500l8436p8176j7396P3841Q9722L592j19756j70259
39478a98210p2075J18841K22547J19566q5983j72169o8033P4694R8828L2025L66
39467G0397L4923O4018N7044N8959P5819L9705o6348j44773j15798l5397J158
$$ y = [83028, 29049, 4775, 51605, 98311, 51671, -52254, -82711, 8945, 107390, 42000, -227548, -526580, -592863, -336364, 47720, 283101, 301443, 250137, 252454, 291249, 330928, 400425, 494441, 517665, 412999, 256629, 148724, 89384, 37291, 8262, 22101, 16494, -80623, -222297, -273117, -158702, 67884, 283739, 374195, 289522, 77779, -156672, -346961, -472006, -471290, -263081, 89642, 343052, 319559, 125369, 4150, 27718, 66428, 33334, -3369, 24158, 58658, 20222, -57954, -75350, -1509, 88213, 91805, -27951, -198210, -270285, -151444, 71103, 190669, 104686, -67483, -135516, -60822, 38006, 70031, 70397, 105320, 169338, 226382, 285341, 361160, 400865, 334517, 189744, 73946, 38549, 39707]
39456C9707j163M016j6464r5054j23205K0345K17795K07061k7109j76893l1023
39445A8013K25659K80922J04381q5268j42363j00762l6708M275r462n0632k2924
39434A85131R5613J80332J39207N1323K476o7694j84917j80290M1854K25073O5204
39423E53312k92716m07113j64912J01889J52977J23030J63662J59197m250j68534
39413B16542j39707r77L3618n8276j28440j01429k6080M4646Q8390Q1353K7847
39402C7487k6385n7215o7934k7127P8063J34146K5774j20636m7215K21394L27564
39391D77916O9486k90556l72839j45775J25464K32424J57984k139r9596l4820
39381A17549R3842Q4619n4341r5786K1016P2969m2060j02053K5612J00551o2060
$$ y = [39707, 38544, 42560, 26096, -68958, -192163, -171818, 45977, 253038, 225929, 49036, 18013, 243672, 524594, 628975, 543707, 401344, 300582, 263874, 268149, 258687, 208055, 185131, 280744, 461076, 600283, 651606, 654082, 586388, 401471, 221181, 263035, 488108, 553312, 260596, -146517, -311429, -209540, -56563, 66467, 230129, 389326, 385076, 216542, 76835, 75858, 109476, 51200, -77240, -178669, -204749, -160103, -71713, 9640, 37487, 11102, -46113, -114047, -141174, -63111, 71035, 96809, -23827, -71042, 150352, 477916, 547402, 256846, -115993, -261768, -136304, 96120, 254104, 251965, 152369, 117549, 211391, 296010, 241669, 145883, 166899, 239868, 197808, 95755, 121367, 221918, 159858]
39370A59858j94975R25K97525K56408o3995k00835j0694J70373R6737q3964j58432
39359B68931j17374k6724O9750P7191m9034j35704j1479J55337P9259j39759j46867
39348B3527N9702J23208l2555p6035R5511J26283j57481l75383j86502J67116
39338b32609K77244J74122J26369J38642O0190l9619j1887L4730p6950k16654
39328B33578j36501Q3062J44507L167j17307j07140m6412K8419J21881J22439
39318C29693l6989j51148j1289J93943J27799j21780j58637N1109J11158j21262
39308B12597k71104o1697K30002K14954l5683j69478p9111M7428O3061k659o0281
39297H8029l5611R0586K01142J23632j02878k06995o0037J10908N3749j39017
$$ y = [159858, -35117, -34192, 263333, 519741, 455746, 254911, 244217, 414590, 511327, 427363, 268931, 151557, 124833, 194583, 271774, 222740, 87036, 75557, 230894, 310153, 170394, 23527, 83229, 206437, 173882, 97847, 193358, 319641, 162160, -213223, -399725, -232609, 44635, 218757, 345126, 483768, 543958, 504339, 492452, 527182, 450232, 233578, 97077, 180139, 324646, 327813, 210506, 103366, 56954, 85373, 207254, 329693, 292704, 141556, 130267, 324210, 452009, 330229, 171592, 222701, 333859, 212597, -58507, -120204, 109798, 324752, 289069, 119591, 40480, 87908, 150969, 148310, 88029, 52418, 143004, 344146, 467778, 364900, 157905, 97868, 208776, 262525, 123508]
39287A23508j99989q8486O414k0925r0934j04680l6585R7736K24819K25621R4640
39276B31139j834L3800N1076j03705k84710k31928J5565J61047Q5625k4957j4574
39265h3456L9838L0953j574j973k0479q9667j27313o9958K0440P1726R9959J12429
39253a9075M9686p7948j31480l8742P3683P2370K1808M3881Q0162q530j62242
39242i6427j60433M1377K08754J41470n4784j24932j0111R5460K8099j16513j09849
39231a57889R2088K57948J60369j17837k63986j20693J23713J83827K6441j17908
39221F6073n2238J61495K78222J36021j55909l08208j69194P9057J35618k8453
39211A42484j45264m4864J11956J01665l2429q4634K869J17335J72802J48462
$$ y = [123508, -76481, -164967, -158553, -179478, -270412, -375092, -411677, -313941, -89122, 136499, 231139, 229305, 263105, 314181, 210476, -74234, -306162, -290597, -129550, -43925, -68882, -83456, -43618, -12665, -14239, -16212, -36691, -126358, -253671, -323629, -303189, -231463, -131504, -19075, 30611, -47337, -178817, -217559, -143876, -71506, -49698, -5817, 74345, 65815, -96427, -256860, -215483, -6729, 134741, 79957, -44975, -55086, 40374, 68473, -48040, -157889, -65801, 192147, 352516, 234679, -29307, -150000, -26287, 157540, 183981, 66073, 13835, 175330, 453552, 589573, 433664, 125456, -43738, 35319, 170937, 142484, -2780, -47644, 64312, 165977, 133548, 48914, 51783, 169118, 341920, 490382]
39201D90382J3359j91336k73659j17593P6852L6684j44150j11894J84605L71235
39191C34485J91894j32085k51997j41794J14Q1124J23744J09464L1010k0835k104
39180C23020j7181j11310j27530L0161J65939P3252j05532q6116J08110K10521
39170D63334J43500O5201L4018l9264j18188o3028N1703r518k17122k59976m8563
39159B097J31853J11472R8668K38856K86332L0321k64434k27927K7286J02007
39149E36531m8659j03782M6452J43989L0643j13605j19157q9054j51165k12453
39139h0260j46260j7890O5547J55367L04755L54116J20412k58975m16972k17662
39129a37822O9775J30586j4019r8920O004J56246J65180M8138l1823O905Q2686
$$ y = [490382, 503741, 312405, 38746, -78847, -1995, 34689, -109461, -221355, -36750, 334485, 526379, 394294, 142297, 503, 617, 81741, 205485, 314949, 345959, 325124, 323020, 305839, 194529, 66999, 97160, 263099, 336351, 230819, 144703, 252813, 463334, 606834, 672035, 706053, 666789, 548601, 485573, 537276, 527758, 310636, 50660, 2097, 133950, 245422, 344090, 582946, 869278, 899599, 635165, 407238, 434524, 536531, 487872, 384090, 430542, 574531, 605174, 491569, 372412, 283358, 132193, -80260, -226520, -244410, -178863, -23496, 281259, 635375, 755787, 496812, 79840, -137822, -68047, 62539, 48520, -50400, -44396, 111850, 277030, 325168, 293345, 300250, 382936]
39118C82936Q8392K4802l6377o1805p4029q6519p1659K755J19777J92428J16052
39107E96753j06096k95211k45067K2434K40051K07613L9382j0268R3837J36694
39097F80122j7596k22531k49049q2956Q0758R2364n527q0892p1866n975P5115
39086A91967J37282J24044k938j66798k06522p2265Q4721J13675Q3730J54089
39076D40985K72711K15897m2182k29912j61287j0845k8211j49343j28850M7916
39066B26879J52948Q4803q490k923L5537K1056j6432m4808r8698j47369p1027
39055A31476J19491K10020P6777r3724n7949J20658J67774N708j47334r8050Q3509
39044E18356K01216J69878M3289r1463j66603j44940n2137L2011N4305K8812j7492
$$ y = [382936, 471328, 496130, 459753, 397948, 323919, 237400, 165741, 168496, 288273, 480701, 596753, 490657, 195446, -49621, -27187, 212864, 420477, 459859, 449591, 543428, 680122, 662526, 439995, 190946, 107990, 188748, 281112, 275585, 194693, 122827, 116852, 191967, 329249, 453293, 450355, 283557, 77035, 4770, 89491, 203166, 286896, 440985, 713696, 929593, 887411, 657499, 496212, 485367, 457156, 307813, 178963, 226879, 379827, 464630, 456140, 453217, 488754, 509810, 493378, 448570, 349872, 202503, 131476, 250967, 460987, 537764, 444040, 386091, 506749, 674523, 680231, 532897, 434847, 518356, 719572, 889450, 932739, 841276, 674673, 529733, 477596, 509607, 563912, 592724, 575232]
39033E75232p6342j07410m1484R9807J67631O8271q1598j08065m1111n6943j70673
39022B27315j92762m8028Q1310N9623L2591J56210K78670J71947n3596j05213
39012F08067m937l7206j99864j62102J12647J85825j47610m19063j62794L26984
39002I9947M25489J18380o4009O4058J36562m7477j94703p9198P8391M4950l9376
38991E43014O633N6246l3263j01716R522J15027J111j59488r0774Q9240O8015
38980E03567j07839j16105P5325J68412O2282r937N6728M8426j47148k85681j44302
38969A03728J16374J98823Q2824k4572j0935O8931J40035J52662N8058j11370
38959G74558k02617j15040M5496J03748M6536j616K1567O9022J02132J27206J22930
$$ y = [575232, 498890, 391480, 349996, 449803, 617434, 685705, 604107, 496042, 454931, 397988, 227315, 34553, -13475, 67835, 127458, 160049, 316259, 594929, 766876, 713280, 608067, 603130, 565924, 366060, 203958, 316605, 502430, 354820, -64243, -227037, 99947, 525436, 643816, 579807, 643865, 780427, 732950, 538247, 459049, 537440, 582390, 543014, 549647, 605893, 572630, 470914, 480436, 595463, 596574, 437086, 346312, 435552, 503567, 395728, 279623, 354948, 523360, 585642, 575705, 632433, 680859, 533711, 248030, 103728, 220102, 418925, 501749, 477177, 466242, 535173, 675208, 827870, 885928, 774558, 571941, 456901, 502397, 606145, 652681, 651065, 672632, 741654, 843786, 970992, 1093922]
38948A093922M6729p2660j40370j15337n6051k6195j4721K0369P1127Q1677K2773
38937I11263n9686q6405m0387o78m7252j42523j64947p6662Q848k0473j04429
38926A76669p7617R7892K55790K27247N9763m3808J3247J15594J22396O3816O0314
38915A071303J09403Q8035m0397j64189k00007j89239j58921m3435J44940K19551
38905H37044O2333j50927j68859k6614L9582j0004J8886J74764K37682Q8892o2023
38894A040756p514J09664K0798k28929l33541j75739K9807P1742M145j3298K7097
38883E44988J5587o5086r8329j658J49825K06369J19776n214m4041L38K5843j2608
38871H35790m4517K414R3379J28970N7289p8691j67644j08090O6461J48451l0833
$$ y = [1093922, 1140651, 1067991, 927621, 812284, 756233, 730038, 715317, 735686, 806813, 888490, 911263, 851577, 765172, 724785, 724107, 676855, 534332, 369385, 292723, 301571, 281098, 176669, 99052, 196944, 452734, 679981, 739744, 695936, 709183, 824777, 947173, 1010989, 1071303, 1180706, 1268741, 1228344, 1064155, 864148, 674909, 515988, 472553, 617493, 837044, 899377, 748450, 579591, 552977, 592559, 582555, 601441, 776205, 1013887, 1102779, 1040756, 1033242, 1142906, 1163704, 934775, 601234, 425495, 455302, 527044, 531189, 517891, 544988, 560575, 495489, 397160, 395502, 545327, 751696, 871472, 866258, 822217, 822555, 848398, 835790, 791273, 793687, 887066, 1016036, 1073325, 994634, 826990, 718900, 785361, 933812, 902979]
38860I02979l20700l52390k0989L09277K63540k5185j18261Q2282K16715M3982
38850I81250j93993j64377N5159J32911l603j01917M089J80093K26532J18206
38840A234350n5165k09851k50267r4935J69752K96344J60991o6624j57926j14362
38830I12307p3436m3526N8279J73301J49959J7485l5225J3413k6382j87226k11130
38819G47819M0337K89793K09395r7949k67172j92297o6627J6001J44546K75615
38809A099461K03855n6539j93296n6000R8467J9069j46113j22846L9797R3049
38799I78904J5964M52Q0164Q5382l6395j32708j12713n9787k9186M3497J63856
38788I97430K11356J34592M0137Q295j4125o3392p6120m3085o2572j31069p1652
$$ y = [902979, 582279, 229889, 208900, 518177, 781717, 756532, 638271, 720553, 937268, 981250, 787257, 622880, 678039, 810950, 807347, 705430, 709519, 889612, 1116144, 1234350, 1179185, 969334, 719067, 624132, 793884, 1090228, 1251219, 1184595, 1026669, 912307, 838871, 795345, 853624, 1026925, 1176884, 1194369, 1159144, 1172557, 1146175, 958949, 747819, 788156, 1077949, 1287344, 1189395, 922223, 729926, 663299, 679300, 823846, 1099461, 1303316, 1246777, 1053481, 997481, 1095948, 1115017, 968904, 846058, 885855, 978904, 994868, 995320, 1075484, 1160866, 1124471, 991763, 879050, 819263, 790077, 833574, 997430, 1208786, 1343378, 1383515, 1391810, 1377685, 1314293, 1238173, 1195088, 1132516, 1001447, 929795]
38777I29795J75759L66896K53123n6485k36985j61103K7154J74266K39948K07639
38767A920007Q9415M952N9656J59361J38110L3785K144r680j91751m39147l61928
38756A404924J06359M56688K47003k62790m64556k16030Q3877J45322R4722R7787
38746A693306P1289p2964j93743j31919L7633J41072J44791J15370P8287M7900
38736A931022O4060Q0386l0119k30919k68292l9489J69767N5740k40967l26112
38726A165077j13289J10616J48056J03557R8099O8851l9998j22414p6440M1638
38716A383753J25961J37427N1283j39455l04174k49971l831J70769J34824M7620
38706A354206O3900Q3872k0661j39518j06314J6002O8242P7676J54357K14897
$$ y = [929795, 1105554, 1472450, 1725573, 1669088, 1432103, 1271000, 1298154, 1472420, 1712368, 1920007, 2009422, 2014374, 2074030, 2233391, 2371501, 2405286, 2407430, 2397750, 2205999, 1766852, 1404924, 1511283, 1967971, 2214974, 1952184, 1487628, 1271598, 1355475, 1500797, 1595519, 1693306, 1764595, 1691631, 1497888, 1365969, 1403602, 1544674, 1689465, 1804835, 1883122, 1931022, 1995082, 2075468, 2045349, 1814430, 1546138, 1506649, 1676416, 1732156, 1491189, 1165077, 1051788, 1162404, 1310460, 1414017, 1512116, 1580967, 1540969, 1418555, 1342115, 1383753, 1509714, 1647141, 1698424, 1558969, 1254795, 1004824, 1000993, 1171762, 1306586, 1354206, 1418106, 1501978, 1481317, 1341799, 1235485, 1251487, 1319729, 1397405, 1551762, 1766659]
38696A766659R1769j38296k18598r9235L578m0025j09828q1563j1976R098O361
38685A177944K4622L6177K5262L4426N9141K6266n8190p3309L1775J44001J55248
38674A583363J03228O0092L607r1659j36457l2261J54084K35021J16418r5731
38664A899705k01571j02012R3254J63783K9519j30793r7822R0651J92083R4016
38654B030813o4131j22415q2445r583P4078J22123N4712q4772j18560P780J04657
38643A912257N770j77539k13011m9244J73050L07432K78303R1764j04031j08192
38633B116559M6103O5775j64647l26205j15472K32869K42281q1097k41483M307
38623A778990L11018K85498P823j92865k03242j25593j5461J30864K47459K66288
$$ y = [1766659, 1858428, 1720132, 1501534, 1402299, 1405877, 1365852, 1256024, 1174461, 1162485, 1171583, 1177944, 1202566, 1238743, 1264005, 1298431, 1357572, 1383838, 1325648, 1252339, 1284114, 1428115, 1583363, 1686591, 1746683, 1750290, 1658631, 1522174, 1489913, 1643997, 1879018, 1995436, 1899705, 1698134, 1596122, 1689376, 1853159, 1882678, 1751885, 1654063, 1744714, 1936797, 2030813, 1966682, 1844267, 1761822, 1752239, 1826317, 1948440, 2003152, 1918380, 1799820, 1807600, 1912257, 1918027, 1740488, 1527477, 1478233, 1651283, 1958715, 2237018, 2328782, 2224751, 2116559, 2162662, 2228437, 2063790, 1737585, 1622113, 1854982, 2097263, 2016166, 1774683, 1778990, 2090008, 2375506, 2383329, 2190464, 1987222, 1861629, 1846168, 1977032, 2224491, 2490779]
38613B490779K32708K01410J19028m3021j56371j05624J2377L5958o119K5726
38603B806851J23749J56093R9992N3034M0646P280j9369M1614J30573R4762m3646
38592C491579q0921M9544J65295J36619R4955J95956L47870L62174K56067K01160
38582E220298K32354K11105P7315l9263p054J28686K08894J27781q8527k97441
38572E774148l19909r4337K13942L37641J89658m6793j53344j16889o0451k4403
38562E699263M0758R6299J0273k08891l28308j71822J10908K18243Q9862o1293
38552E495292j06078j59547k97796l45013j43471J24143J49378l4281q9783J00665
38542D693509K47224R8983j79462k65979j25727K3301O3070N8771N5811K2840
$$ y = [2490779, 2723487, 2924897, 3043925, 3000904, 2844533, 2738909, 2751286, 2787244, 2781125, 2806851, 2930600, 3086693, 3186685, 3239719, 3280365, 3287645, 3268276, 3309890, 3440463, 3535225, 3491579, 3410658, 3460202, 3625497, 3762116, 3857071, 4053027, 4400897, 4763071, 5019138, 5220298, 5452652, 5663757, 5741072, 5701809, 5694755, 5823441, 6032335, 6160116, 6071589, 5774148, 5454239, 5359902, 5573844, 5911485, 6101143, 6054350, 5901006, 5784117, 5723666, 5699263, 5740021, 5836320, 5846593, 5637702, 5309394, 5137572, 5248480, 5466723, 5556585, 5495292, 5389214, 5229667, 4931871, 4586858, 4443387, 4567530, 4716908, 4682627, 4592844, 4693509, 4940733, 5039716, 4860254, 4594275, 4468548, 4491849, 4554919, 4613690, 4669501, 4692341]
38532D692341j5444J1989O9857M7605m3331o9935O671Q4758J17905J76770K62794
38521E341980K44378P0432j10212j46646o6100M1502J69593K99592L05571J24478
38511F274568q0058j01101L0760J16878Q6031M4084N5190N2977j1011p4069n3776
38500F340473O1173K17140L12781K44264M0811q7535K5869K63355L58332K48766
38490H025429J23161J22128J91651K56777L27004L61141K39804j4104j74969j11500
38480I346522K2575M6617L8331J67635L78210M64588L91144L03734K59929J80128
38470A1599413P3895Q7456K64225M43225M75085L89001K73840J48944M9694R1193
38460A3895971L03068N02902M91620L22519K30533L20092M64545N17999M90217
$$ y = [4692341, 4676897, 4688886, 4758743, 4806348, 4763017, 4693082, 4699753, 4784511, 4902416, 5079186, 5341980, 5586358, 5656790, 5546578, 5399932, 5333832, 5375334, 5544927, 5844519, 6150090, 6274568, 6194510, 6093409, 6124169, 6241047, 6327078, 6371162, 6426352, 6479329, 6468318, 6394249, 6340473, 6401646, 6618786, 6931567, 7175831, 7216642, 7129107, 7154976, 7418331, 7776663, 8025429, 8148590, 8270718, 8462369, 8719146, 9046150, 9407291, 9647095, 9632991, 9458022, 9346522, 9369097, 9415714, 9454045, 9621680, 9999890, 10464478, 10855622, 11159356, 11419285, 11599413, 11673308, 11760764, 12024989, 12468214, 12943299, 13332300, 13606140, 13755084, 13804778, 13895971, 14199039, 14701941, 15193561, 15516080, 15746613, 16066705, 16531250, 17049249, 17539466]
38451A7539466M71469M96103N43082N88868N93139N03853L58822L25472N31006
38442B1951280Q67791J073731J023338Q47572P38080P35816P77864Q55268J005962
38433B9876702J195888J334339J408958J497135J627486J736271J794982J871149
38425D2342910J997725K086634K081310K123228K416649K927043L357209L493173
38417F2825881L477896L635198M065421M545988M857090N076188N443719O018800
38409I9946181O629327P152419P658392Q210669Q710460R095547R551245J0301827
38401A67256067J1253035J2070497J2599868J2968479J3238339J3227000J2800436
38394B55413721J2109831J1329019J0304769Q701556O441799L813643J160200
$$ y = [17539466, 18010935, 18507038, 19050120, 19638988, 20232127, 20735980, 21094802, 21420274, 21951280, 22819071, 23892802, 24916140, 25763712, 26501792, 27237608, 28015472, 28870740, 29876702, 31072590, 32406929, 33815887, 35313022, 36940508, 38676779, 40471761, 42342910, 44340635, 46427269, 48508579, 50631807, 53048456, 55975499, 59332708, 62825881, 66303777, 69938975, 74004396, 78550384, 83407474, 88483662, 93927381, 99946181, 106575508, 113727927, 121386319, 129596988, 138307448, 147402995, 156954240, 167256067, 178509102, 190579599, 203179467, 216147946, 229386285, 242613285, 255413721, 267523552, 278852571, 289157340, 297858896, 304300695, 308114338, 309274538]
38387C09274538j380837l829428o195047q390412j0240546j1578837j2391855
38380B55267576j2840892j3078559j3090699j2796427j2249120j1626582j1036069
38373A68549228j0424899r697027q864611q076020p501761p160355o868100o440748
38365A03515707n933510n552705n329040n066932m665769m265101l963641l640304
38357F5098705l228302k918855k847686k804129k553463k250144k171905k203709
38349D4120512k006547j607894j371540j400638j432677j360410j371921j467925
38341C2100960j339034r27262o44953p56313r54688q80239o80383o72032p71509
38332B4474547p02010n27848n17907o30413n87919l81837k73290l25542l37644
$$ y = [309274538, 307893701, 304064273, 297869226, 289478814, 279238268, 267659431, 255267576, 242426684, 229348125, 216257426, 203460999, 191211879, 179585297, 168549228, 158124329, 148427302, 139562691, 131486671, 123984910, 116824555, 109956455, 103515707, 97582197, 92029492, 86700452, 81633520, 76967751, 72702650, 68739009, 65098705, 61870403, 58951548, 56103862, 53299733, 50746270, 48496126, 46324221, 44120512, 42113965, 40506071, 39134531, 37733893, 36301216, 34940806, 33568885, 32100960, 30761926, 29834664, 29189711, 28433398, 27478710, 26598471, 25918088, 25246056, 24474547, 23772537, 23244689, 22726782, 22096369, 21508450, 21126613, 20853323, 20527781, 20190137]
38323B0190137k46646k17528k96430l24089k51905k18227k40765j51573O6314
38314A8309288J83042Q9239k1047J4936P0574n767q7674M0367L28815N15553M68004
38303A9905330L04111K03612K27674L21133M10244M81204N74318O93656P64525
38294B3885807P44559P29018Q39772J041557J188664J229658J237468J260856
38286C2157359J285365J319080J373033J388007J333614J321668J425195J451497
38278D3054818J157458O60697L30302K47207J06603k63938o40630q13281r27765
38269D2911471j195065j534821j759118j876171j950265j877744j598616j355094
38261B9764577j418299j668175j745698j544892j276060j109700j032678j004621
$$ y = [20190137, 19943491, 19725963, 19429533, 19105444, 18853539, 18635312, 18394547, 18242974, 18309288, 18492330, 18581569, 18560522, 18575458, 18646032, 18640265, 18552591, 18592958, 18921773, 19437326, 19905330, 20209441, 20413053, 20640727, 20961860, 21372104, 21853308, 22427626, 23121282, 23885807, 24630366, 25359384, 26199156, 27240713, 28429377, 29659035, 30896503, 32157359, 33442724, 34761804, 36134837, 37522844, 38856458, 40178126, 41603321, 43054818, 44212276, 44872973, 45203275, 45450482, 45557085, 45293147, 44652517, 43839236, 42911471, 41716406, 40181585, 38422467, 36546296, 34596031, 32718287, 31119671, 29764577, 28346278, 26678103, 24932405, 23387513, 22111453, 21001753, 19969075, 18964454]
38253A8964454r88147q66213n92492l81470m76434p64419r08754q35199p69104
38244A2382222p96399p49621n88492n16748n82738n21416k03553P2846P558k39885
38234H263774l16922k12410j87799k92493l04801j41612l505m4659j54488j71286
38224F433799j14961q4178o8509K332J09581J63598J23826J6693j20614k35193
38214F226374k42450j14399K8946J7546j56208l08860k94607j82566j28415j39403
38204D705958r9639j0369l2988k20601l59139k26821P3167K18036Q2221j27181
38194D002644j77049q0222J2887M5068N0756K0241q9386k35001k94268k00732
38184C054938q660J67650K27293J26210p5087k16835j74847j0263P6008k9762
$$ y = [18964454, 17976307, 17110094, 16517602, 16136132, 15659698, 14895279, 13986525, 13151326, 12382222, 11585823, 10836202, 10247710, 9730962, 9148224, 8626808, 8423255, 8496101, 8503659, 8263774, 7946852, 7734442, 7546643, 7254150, 6949349, 6807737, 6804232, 6759573, 6605085, 6433799, 6318838, 6234660, 6166151, 6168483, 6278064, 6441662, 6565488, 6582181, 6461567, 6226374, 5983924, 5869525, 5898471, 5916017, 5759809, 5450949, 5156342, 4973776, 4845361, 4705958, 4606319, 4595950, 4562962, 4342361, 3983222, 3756401, 3829568, 4047604, 4129825, 4002644, 3825595, 3745373, 3758260, 3803328, 3854084, 3874325, 3784939, 3549938, 3255670, 3054938, 3046278, 3213928, 3441221, 3567431, 3492344, 3275509, 3100662, 3090399, 3166407, 3136645]
38174C136645k13510k61441j16430L8252j3420k38293l46563j27308K53158M05275
38164B516365J82461j43690k51605j72547j60367k52653k15789L7753K37093J28739
38154A905760j16442j27064J10872K15633j4303k69300j64162J93450L47640J29459
38144B211543j55455k10523j24389j11703j23268K1323K39346K35158l8263k41651
38134A702118r5461K28495L34901J17651j47055j98708j00386p8656j81402k32686
38124A348811j06738Q8407J67947J22213R1083J17495Q2469o6279j74818r8537
38114A572053N3047O4339m4655l2229J84594L66826K75611P668j37268m0241J35196
38103B404941J92872J16005J2974l7816l3908J008N0589R5298J01420M0802o8284
$$ y = [3136645, 2923135, 2661694, 2545264, 2583516, 2570096, 2331803, 1985240, 1857932, 2111090, 2516365, 2698826, 2555136, 2303531, 2130984, 1970617, 1717964, 1502175, 1539928, 1777021, 1905760, 1789318, 1662254, 1773126, 1988759, 1974456, 1705156, 1540994, 1734444, 2082084, 2211543, 2056088, 1845565, 1721176, 1609473, 1486205, 1507528, 1746874, 1982032, 1943769, 1702118, 1606657, 1835152, 2170053, 2287704, 2140649, 1941941, 1841555, 1762899, 1581497, 1348811, 1242073, 1330480, 1498427, 1620640, 1711723, 1829218, 1911687, 1845408, 1670590, 1572053, 1625100, 1689439, 1644784, 1612555, 1797149, 2163975, 2439586, 2447254, 2309986, 2269745, 2404941, 2597813, 2713818, 2726792, 2688976, 2655068, 2656076, 2706665, 2801963, 2903383, 2944185, 2875901]
38092B875901j44822r8617P1775K40598K48566O3386j60433k23800j08661j4035
38082B749858j05358k76503k85390j16160k4691j51784k89145j97822R427N3633
38072A366065n1124l6605J39596J94012j3075k23088j69695L1990J06459K6783
38062A371318m3960o8359j22843j62963p2338Q5808J13847j6365j20703q7687
38052H75755j1467k832m4445q4454j18236j23523n5247M2103N1179l3145o6654
38041D29034K8063J30984R6309m2816j34224j05237j8365L1636J4363k1744m115
38030D03888P2669J17627N3835o0261r4270j8318P3094R9032O0188j5520q4036
38019F07928n9278Q2976J80703M1411k42611l28035o2972K75170L17413M8572
$$ y = [2875901, 2731079, 2632462, 2704237, 2944835, 3193401, 3256787, 3096354, 2872554, 2763893, 2749858, 2644500, 2367997, 2082607, 1966447, 1941756, 1789972, 1500827, 1303005, 1312432, 1366065, 1314941, 1278336, 1417932, 1611944, 1598869, 1375781, 1206086, 1238076, 1344535, 1371318, 1327358, 1258999, 1136156, 973193, 900855, 986663, 1100510, 1084145, 963442, 875755, 864288, 861456, 817011, 732557, 614321, 490798, 435551, 477654, 528833, 495688, 429034, 457097, 588081, 684390, 641574, 507350, 402113, 383748, 415384, 429747, 408003, 403888, 476557, 594184, 648019, 587758, 493488, 475170, 548264, 647296, 707484, 691964, 607928, 548650, 631626, 812329, 853740, 611129, 283094, 220122, 495292, 812705, 861277]
38009H61277k27527k66003p6634J80177L37946L03009J24647k5271l6080J0045
37999A185586k3454j13092j19148j2467P5041M1516m6038m5624P7283J94900J47095
37988A361598o3582k35457j94738k9534L4904j3865L8803K30207K65479l1893
37978A361922l48823k81198L7954R9107k15183m34913j94303K45291L91426J72058
37968H33338q5292j53059q8708O91R8404J68172J21374m1199j86408j99323r6326
37957C71664K7135Q9237O5760J3362L4417J47148K22079J35901m6892j54415j39215
37946G66181r8852p9203j4927J05397J72709J25763M9229J3369n6099k21686l49706
37935D12175k49570L6333K40346J87969j0055j21549n6519Q4200J60639J33814
$$ y = [861277, 633750, 367747, 291113, 471290, 809236, 1112245, 1236892, 1211621, 1175541, 1185586, 1162132, 1049040, 929892, 917425, 992466, 1033982, 987944, 942320, 1019603, 1214503, 1361598, 1298016, 1062559, 867821, 838287, 873191, 859326, 898129, 1128336, 1393815, 1361922, 1013099, 731901, 769855, 868962, 653779, 218866, 24563, 269854, 661280, 833338, 748046, 594987, 506279, 506970, 605374, 773546, 894920, 853721, 667313, 467990, 371664, 398799, 488036, 553796, 567158, 601575, 748723, 970802, 1106703, 1059811, 905396, 766181, 667329, 588126, 573199, 678596, 851305, 977068, 1026297, 1039666, 983567, 761881, 412175, 162605, 198938, 439284, 627253, 617198, 495649, 439130, 523330, 683969, 817783]
37925H17783P3297O1107R7019J09741O3860J1150J783L46l9129o2106J9112J66926
37913A320889K43113J98222J21725Q6758P1476O8326J24970K04375J54951o0429
37903B534376k37115j85647j2160M0627m3675o8668K3011M8070j15120l24514
37893A659185l70115k23123j829J74331K05917L0424k57406m14089l09762r6456
37883C97077Q420R775N2753J38532J24748r403j02182n8309R447l1578j32185
37872D07095j48204m5170Q4764J61261J75737J32944K4176j17740j96011j35785
37862C43067J1446R3344K2264j04782j11571K5736J34913Q4580k3904p679J14889
37851E82303J46703J6380j09908q9503k1958p2835j86916j61669K4559J54706
$$ y = [817783, 891080, 952187, 1049206, 1158947, 1222807, 1233957, 1235740, 1236086, 1196957, 1134851, 1153963, 1320889, 1564002, 1762224, 1883949, 1970707, 2042183, 2110509, 2235479, 2439854, 2594805, 2534376, 2297261, 2111614, 2099454, 2140081, 2096406, 2027738, 2050749, 2098819, 1983699, 1659185, 1289070, 1065947, 1064118, 1238449, 1444366, 1474790, 1217384, 803295, 493533, 397077, 405497, 415272, 468025, 606557, 731305, 721902, 619720, 561411, 570858, 539280, 407095, 258891, 213721, 298485, 459746, 635483, 768427, 792603, 674863, 478852, 343067, 354513, 447857, 470121, 365339, 253768, 279504, 414417, 498997, 475093, 467414, 582303, 729006, 745386, 635478, 545975, 524017, 451182, 264266, 102597, 127156, 281862]
37841B81862R1120k3235M160J16505J10451k8600r5947J0017J26856P9196o3363
37830F09022j15263n1982O102J9808N6215J03987N3687r7999j90432j18534K2843
37819B97454R3229Q7506P7506Q3658J01065J51081K00248J27741r5516k77033
37809H46939k04785O4301K63743K43363R8998j0465l1283J5271R4239J40752R0043
37798A611116j7091l8632R6358K74269L16968J86584J6714n4754l5458l3660r3223
37787B229191j42286j25733r8247j04912o1436R5903K09696P3805k02473k73303
37777A600205o6093Q1836n6473k43378j84906j5185l4466j73255j24652J03036
37767H86669J93508N4871o8182m4787k2525o7791l2089R9287R8378r8337k22501
$$ y = [281862, 372982, 349747, 353907, 470412, 580863, 552263, 456316, 466333, 593189, 672385, 609022, 493759, 441777, 447879, 467687, 523902, 627889, 681576, 583577, 393145, 274611, 297454, 390683, 478189, 555695, 639353, 740418, 891499, 1091747, 1219488, 1123972, 846939, 642154, 706455, 970198, 1213561, 1312559, 1302094, 1270811, 1286082, 1380321, 1521073, 1611116, 1594025, 1555393, 1651751, 1926020, 2242988, 2429572, 2446286, 2391532, 2356074, 2322414, 2229191, 2086905, 1961172, 1862925, 1758013, 1696577, 1792480, 2002176, 2075981, 1873508, 1600205, 1534112, 1615948, 1559475, 1316097, 1131191, 1116006, 1081540, 908285, 783633, 886669, 1080177, 1135048, 1066866, 1022079, 999554, 931763, 899674, 998961, 1097339, 999002, 776501]
37756G76501j12982R820n4765j30722l112J65770J06470p8010p8035J00210J49017
37745H50162m4677k49048k53330j13176J6591P9466Q9958O5920L5897J4107l2501
37734D59369j07849j22136r290J39863J73274O6321p3743j35338o5671J00562
37724D25362K06583J00813j15632j43276Q8555K54985Q9090j97907k12616N3713
37714E49670K49199J64984o9185k41745k51036q3199J52117K06300l9937l35947
37704C01221l40854r4479O8067L3372K5339J83649L35071K71487K2068k27692
37694E77249l09206j45787J57377L12232J43199j49000k39367j26607n8647r0338
37684G1105n8895L9366L1879o1110l2313J02435J06249j5333L521J58071J15758
$$ y = [776501, 663519, 673339, 618574, 487852, 484740, 650510, 756980, 678970, 600935, 701145, 850162, 805485, 556437, 303107, 189931, 206522, 285988, 375946, 441866, 477763, 491870, 459369, 351520, 229384, 220094, 359957, 533231, 599552, 525809, 390471, 324800, 425362, 631945, 732758, 617126, 473850, 562405, 817390, 906480, 708573, 495957, 549670, 798869, 963853, 894668, 652923, 401887, 318688, 470805, 677105, 637168, 301221, -39633, -134112, -66045, -32673, -7334, 176315, 511386, 782873, 804941, 577249, 268043, 122256, 279633, 591865, 735064, 586064, 346697, 220090, 161443, 71105, 12210, 51576, 83455, 22345, -9968, 92467, 198716, 183383, 186904, 344975, 460733]
37673D60733j56902k35013M7937K48212K9866k55102j58976J09495O8435k10236
37663e1551k47867L9302K58357J98804N9608J2087r025l0294M3935J62171J15580
37652E51107j10542k57801j52260Q8154K55319K54163Q7790j48312k48433q5680
37642B33505J70986K26841M4006j40024j54104m8313O7451J26979P2448p5782
37632E23993j47501l2393R3232r418k47037l02503j08311Q3834J06192M7099l443
37621C744p3424j17080l358K12112K76358J07724p0803p4553K506J0415j4072
37610B59569K8181J01877J02533J0041j00974j20220K1508K15153J87728j44018
37600E61378m24924k60194J90940L78347J22251j83842j99730n0469L2733P2057
$$ y = [460733, 303831, 68818, 116755, 364967, 394833, 139731, -19245, 90250, 158685, -51551, -299418, -260116, -1759, 197045, 256653, 268740, 259715, 229421, 273356, 435527, 551107, 440565, 182764, 30504, 118658, 373977, 628140, 715930, 567618, 319185, 233505, 404491, 631332, 675338, 535314, 381210, 332897, 400348, 527327, 599775, 523993, 376492, 344099, 437331, 427913, 180876, -121627, -229938, -146104, -39912, 7187, 3744, -69680, -186760, -190118, 21994, 298352, 406076, 335273, 260720, 263226, 273641, 259569, 287750, 389627, 492160, 502201, 401227, 281007, 302515, 517668, 705396, 561378, 136454, -123740, 67200, 445547, 567798, 383956, 184226, 133757, 166490, 238547]
37590B38547J23768P1057r8150j34197O6279J98328J1359k45731k03852L4230
37580F1638Q4099r4321j77242j8279J75052K12683J45719P5161R43p3639q4706
37569C07108j7180N7050P1939J1504j02343j81088j08686Q6687J98595R7969q4244
37558C37311j50630q9645o200N6712Q0984J1022j12297j17756K9941J17142J8781
37547A75365p5045j524N8033q6077k24358p2632J92614J85105l4575o3796J29721
37536A82831J48121j22964k85575r3115J46244R7951p5885n1166J13274J28993
37526A88709k2934r8026j196J01773O7822m3312r2802m0091K4798j4274j45741
37515g5274k02465p0667J17081J44654K7929l4005J963p568o6551Q570K16347
$$ y = [238547, 362315, 433372, 335222, 201025, 267304, 465632, 476991, 231260, 27408, 61638, 145737, 51416, -125826, -144105, 30947, 243630, 389349, 464510, 465453, 391814, 307108, 289928, 346978, 418917, 430421, 328078, 146990, 38304, 124991, 323586, 421555, 337311, 186681, 97036, 90836, 147548, 228532, 239554, 127257, 9501, 39442, 156584, 175365, 100320, 98796, 156829, 70752, -153606, -226238, -33624, 151481, 116906, 53110, 182831, 330952, 207988, -77587, -170702, -24458, 73493, -2392, -53558, 59716, 188709, 165775, 67749, 66553, 168326, 236148, 192836, 100034, 59943, 84741, 70467, -75274, -277739, -348406, -231325, -86671, -58742, -92747, -90784, -98352, -164903, -156333, 60014]
37504F0014K63348N184k76328k56703j1668J52814J29700L2969n5794j16610q0027
37493a53101P4268J83478Q0169j50075k71548k03346o0266M3852P6587M0768o45
37482c39859P0199K49514L32948J72799q2546j80419j00444j3684m16j4989m7727
37471D5376r7988n6816J41297L03855J85168j11738k18184j5196K05635J69529
37461E50938m3847j98646k18024j62324o8591L7348R2083Q3186Q2695R7421J4696
37450B66935j85920k99815j42372J55782K77978J21157r6187j41065l6337L9040
37440d0804J4265j5943L1875J01255Q8422O690j9829P0384J76001J44354m9441
37429E07229k66209l28534j77432O2862J81725R9315k5292R428J58034J81052
$$ y = [60014, 323362, 328546, 52218, -204485, -216153, -63339, 66361, 99330, 43536, -73074, -153101, -78833, 104645, 184814, 34739, -236809, -440155, -500421, -456569, -379982, -339214, -339859, -269660, -20146, 312802, 485601, 403055, 222636, 122192, 108508, 108092, 93103, 45376, -52612, -109428, 31869, 335724, 520892, 409154, 190970, 175774, 381409, 550938, 507091, 308445, 90421, -71903, -140494, -103146, -11063, 72123, 154818, 252239, 266935, 81015, -218800, -361172, -205390, 72588, 193745, 97558, -43507, -79844, -40804, -26539, -42482, -10607, 90648, 179070, 185760, 165931, 236315, 412316, 556670, 507229, 241020, -87514, -264946, -202084, -20359, 78956, 53664, 63092, 221126, 402178]
37419D02178J1567j23950n1246Q2998O5159l3222j874J23239J11252o1205j52787
37408C72109m2909Q9985O5047m8579r1421m7019N045K9565K2039k9793q9555r0637
37396A43877o3666j04590j69766r0919J22294K09095L2520j73364j30235P6256
37386a48498J53998N1601k1821K7505N7457k8281j15536p7736L5780J01819Q8212
37375A24500L3196l9705j01429q5083L7954J80697K07698Q2057q6593j52812q9269
37364A11211j0679k1939p3550m0044P2200J15050L0145m6299L413Q8581O2030
37353B90119m0946o9809P220R4078J34641J29243M0476j35235k45837j40113P0976
37342A34813J28350N549o2439L0192R8411m712j39566j14695K5073J15997J24893
$$ y = [402178, 413745, 289795, 238549, 321547, 386706, 353484, 351610, 474849, 586101, 524896, 372109, 329200, 419185, 484232, 435653, 344232, 297213, 302258, 331823, 353862, 324069, 234514, 143877, 80211, -24379, -194145, -285064, -162770, 46325, 78845, -94519, -224754, -148498, 5500, 57101, 35280, 62785, 120242, 91961, -23575, -101311, -65531, 36288, 124500, 157696, 117991, 16562, -68521, -30567, 150130, 357828, 439885, 353292, 200480, 111211, 100532, 78593, 5043, -35001, 37199, 152249, 182394, 136095, 139508, 228089, 290119, 249173, 179364, 186584, 280662, 415303, 544546, 585022, 449787, 203950, 63837, 134813, 263163, 268712, 206273, 236465, 334876, 330164, 190598, 75903, 100976, 216973, 341866]
37331C41866J13455Q7477M1415K6918K9055p7751k85760l41507r9354J77872J52604
37320A66290q0727j48921J8532J29679M6370k7256M4902J01222J8949m9169J9911
37309B39782O9447l6640j23058n931J30922J0043k34006k08664J20629L46528
37299C09052K04791q5685j85908p4085L7587K9073n3078j25941j33723n7753M0169
37288i5501N3538k5117p8000l1791M4705O9052O1319N9294K7917n4514j14697
37277h3795q9773l8218m8072r7813r9050k2751R3841K06406K60968K05050P4923
37266C61716n608J3978M2499J4002K050O0002Q0493l3755j76818j94130j21877
37255D2552p3974n654J56711K47912N1432k76861l38539r2727O0101p7407j75625
$$ y = [341866, 455321, 542798, 584213, 611131, 640186, 562435, 276675, -64832, -164186, 13686, 166290, 85563, -63358, -44826, 84853, 131223, 103967, 148869, 250091, 269040, 219871, 239782, 309229, 272589, 149531, 143600, 274522, 284565, 50559, -158105, -37476, 309052, 513843, 428158, 242250, 168165, 205752, 234825, 181747, 55806, -77917, -135670, -95501, -41963, -67080, -145080, -176871, -132166, -63114, -1795, 57499, 85416, 30902, -83795, -173568, -211786, -259858, -357671, -456721, -479472, -385631, -179225, 81743, 286793, 361716, 356108, 370086, 412585, 426587, 428637, 488639, 569132, 535377, 358559, 164429, 42552, -31422, -37076, 119635, 367547, 418979, 142118, -196421, -289148, -229047, -306454, -482079]
37244d82079N3992L40475K75470k3031j18654L3585P3535j09617k04270m3265
37234b03859J09951K7579j16215r3060j0011n4351j12525J2821J95010J63117
37224h1543k4456o5761P1030J04941n8991j68002o7040M4320j7897r7200J2606
37213c47993J82872J41905q9308k32043j52038J4267J00649P1209l6601j46321
37203d93402j45576j9827O7083L279m1986J36356L67495K64262j72048m50114
37193d84478k34687J99905L69013J94773k2037p1195J723J01380J84895J84068
37183D23360M9436j21167j72634j10187p0398q7786n9157N4217J57133J80706
37173B43523J58575J07192j7208j80525k30254r1559Q6892Q6384j18015l18779
$$ y = [-482079, -428087, -87612, 187858, 164827, 46173, 79758, 153293, 43676, -160594, -203859, -93908, -66329, -182544, -275604, -285615, -339966, -452491, -439670, -244660, -81543, -105999, -171760, -100730, 4211, -54780, -222782, -289822, -245502, -263399, -360599, -347993, -165121, -23216, -112524, -344567, -496605, -482338, -381689, -310480, -347081, -493402, -638978, -658805, -591722, -588443, -630429, -494073, -126578, 137684, -34364, -484478, -719165, -519260, -150247, 44526, 22489, -48706, -46983, 54397, 239292, 423360, 472796, 351629, 178995, 68808, -1590, -89376, -148533, -94316, 62817, 243523, 402098, 509290, 492082, 311557, 81303, -10256, 76636, 163020, 45005, -273774]
37163b73774k96917n2893J87242K08832N1048m6388L7131J44180R0486m3089m3754
37152c7896P8385R5160p0471k05964j20123R3137K14441J77819O8281m2086j24510
37141A26173j43214r8272o2275p6910p7649j5549K8247k5105p8357J7041J88722
37130b17148J84138o6744k91719j96479J48550L81795K87384K4175j15544n7441
37120H0967L8556L7378l2277q6841r7189n4838M2568J12548K5661j85853k86281
37109d05601j31867J07720J79333R0397L3006N8569O4282M7639J05122J82393
37099C30993J07472q4184j38682J9387J55604J08647K6776N8244P6448o2021k15665
37088C83019j77883k2981L7184K612J8173P0961L6817n2089o6629m6479j21154
$$ y = [-273774, -570691, -623584, -436342, -227510, -176462, -222850, -185719, -41539, 48947, 5858, -37896, 40489, 135649, 65178, -140786, -260909, -167772, 46669, 224488, 292769, 250683, 126173, -17041, -115313, -177588, -254498, -332147, -347696, -319449, -344554, -422911, -405870, -217148, -33010, -99754, -391473, -587952, -439402, -57607, 229777, 253952, 138408, 80967, 119523, 156901, 124624, 37783, -59406, -114244, -71676, 40872, 66533, -119320, -405601, -537468, -429748, -250415, -160018, -127012, -68443, -4161, 43478, 148600, 330993, 438465, 354281, 215599, 234986, 390590, 499237, 526013, 584257, 660705, 598684, 383019, 205136, 182155, 219339, 221951, 240124, 311085, 347902, 295813, 229184, 182705, 61551]
37077F1551k10348j11739J14854J72233j0634j48597m3650J22110J00115m6382
37067d87q0341M2935J50272J17568j312q7238q7022l5618k715j4904l1314k2358
37055e2534k6846n9689l3327R9311J91297P8097j30297j60855J5427J40095P6106
37044A36785j4975n064j8646j40940j77235L8021K98992K94927P7249n5457m4683
37033C88974r5264k32330k08099N2136K39251Q6875k24762l15874j10127J30498
37023b88722J84179O7637j01526k28441k16110j6121K30040K65742L8299j84813
37013b49836j42844P9524J94676J17184K8151N0118Q1290K4003k5081M4628J36012
37002C37825Q1294q7172j81773j28335k3996M3846P3150N7480j3681o4170o235
$$ y = [61551, -148797, -260536, -145682, 26551, 15917, -132680, -176330, -54220, 45895, -487, -80828, -37893, 112379, 229947, 228635, 141397, 54375, 18757, 16042, 1138, -30176, -52534, -79380, -139069, -172396, -73085, 118212, 196309, 66012, -94843, -79416, 60679, 136785, 121810, 116746, 98100, -42840, -220075, -182054, 116938, 411865, 489114, 433657, 388974, 293710, 61380, -146719, -94583, 144668, 231543, 6781, -309093, -419220, -288722, -104543, -36906, -138432, -366873, -582983, -599104, -369064, -103322, -65023, -249836, -392680, -313156, -118480, -1296, 26855, 76973, 158263, 182266, 157185, 201813, 337825, 419119, 331947, 150174, 21839, -2157, 41689, 114839, 172319, 158638, 94468, 88233]
36991H8233Q1278K3002j70861k69337j33484R3052J86934J03214m6152j42326
36981a86447j12814L6146J65398J14663n7373r7238Q6554K59736J86939l9696
36971C55868j62339j12302j5839M7336Q9503Q8725J1724p6747r1649o7543o9195
36960b458l8585Q6376J80146Q3093j03379j28994J1289O9391l7179r0374M2708
36949G2034J68523Q6431q3204j16977o0607j15940k53046k24529K8166K41869
36939b57280J92489n322r0558j6291M5798M611k1941Q4867K38705K50068P8965
36928E04111j16467j78646j11606k4840P843p599k9302k4620l766k5942j24176
36917a35010k19109j92392p0514k2954j13259j73890m2577J80090K61776J61051
$$ y = [88233, 169511, 192513, 21652, -247685, -381169, -288117, -101183, 2031, -44121, -186447, -299261, -263115, -97717, 16946, -40427, -137665, -51111, 208625, 395564, 355868, 193529, 81227, 65388, 112724, 202227, 290952, 302676, 225929, 134280, 66737, -2458, -41043, 45333, 225479, 308572, 205193, 76199, 87488, 156879, 119700, 29326, 72034, 240557, 326988, 243784, 126807, 66200, -49740, -302786, -527315, -499149, -257280, -64791, -70113, -160671, -176962, -131164, -126553, -148494, -63627, 175078, 425146, 504111, 387644, 208998, 97392, 72552, 80395, 72796, 43494, 18874, 15108, -10834, -135010, -354119, -546511, -617025, -639979, -753238, -927128, -969705, -789615, -527839, -366788]
36907c66788N0023M3847Q1962Q7918Q0614P9597L7301o8422j71845k01366j46824
36896d93983k2305J42833K50207J80652m7786k53759k77340j30187O1652J87078
36886d02938J99350J23166M5990L2003L4425k4662j00176p5039L3494P7474K2460
36875c4453J1311J10378J75738R5608l948L2972J14167L9726j59069k46411j32755
36864C264J0819K7092j7008K2700J36417J82497Q6405o6079j30423o4001K2824
36853B14507j0820j54410k30819j09544J07146J92361P8269n8141k3334J46950
36843A52165K33953J10628r6878j67101p1989j3054j24637k46878j34974J55228
36833b03537K91178J14973j29298j37767N2320J77110J37362O0657L3011l267
$$ y = [-366788, -316765, -272918, -190956, -103038, -22424, 57173, 94474, 26052, -145793, -347159, -493983, -516288, -373455, -123248, 57404, 9618, -244141, -521481, -651668, -590016, -402938, -203588, -80422, -34432, -2429, 31996, 7334, -92842, -167881, -134387, -56913, -34453, -23142, 87236, 262974, 358582, 354634, 387606, 501773, 541499, 382430, 136019, 3264, 14083, 41175, 24167, 46867, 183284, 365781, 452186, 386107, 255684, 191683, 214507, 203687, 49277, -181542, -291086, -183940, 8421, 86690, 28549, 5215, 152165, 386118, 496746, 399868, 232767, 160778, 147724, 23087, -223791, -358765, -203537, 87641, 202614, 73316, -64451, -12131, 164979, 302341, 362998, 396009, 392742]
36823C92742p1134p9252J6985J22689J38001P3155j8597j09823j52477q2886N8173
36812B87576J20769M4934l5310J1988J03125N2009j46855k87358k14059m556J49999
36801H2262J65477J05196M6426j3837j03433j77164j36504L5049J99608J88156
36791C91236K993j59055j28515K5342P4050p2131k26832j60813P3007J74029j3468
36780b0157k72724k92605p9029Q5990O2594J5349J06246K38336K39109J31122
36770B14231M2407k5514j29771j74205j5147K35918K70545Q978k47025j99278
36760a8861P1911K50582J86878J3705p5195l1535N4677P9558K0848o3648j18843
36749C70077j45250j44047o9942P7377J70268R1846p2339j32825o7340j1236J3681
$$ y = [392742, 321608, 242356, 259341, 382030, 520031, 593186, 574589, 464766, 312289, 229403, 287576, 408345, 453279, 417969, 429957, 533082, 585091, 438236, 150878, -63181, -67737, 82262, 247739, 352935, 399361, 385524, 282091, 104927, -31577, 3472, 203080, 391236, 394229, 235174, 106659, 132001, 206051, 133920, -92912, -253725, -180718, -6689, -20157, -292881, -585486, -664515, -578525, -515931, -500582, -394336, -156000, 83109, 214231, 256638, 231124, 101353, -72852, -87999, 147919, 418464, 427442, 180417, -18861, 53050, 303632, 490510, 504215, 429020, 397485, 452162, 531720, 552568, 488920, 370077, 224827, 80780, 10838, 88215, 258483, 350329, 277990, 145165, 77825, 66589, 80270]
36738H0270J17791K44135J42104k05862m08835j74008K21195K79372k5245k56610
36728A4307j74763j4634l8742j47700j14163L3746R1175J7485j3964J16450L04095
36717G3292L42387J49222j45425l19395k67581q3699P4364J44577J36536L5615
36707A39893j39549k38655j13486J46869K84409K04665P0585J9573k0495j34351
36697B19458k22313j57688j1438N4685L7133N9102J34953J38421J2246j31462
36687A33097j62040r0543l0983m7029q0452l7709O6276J02102J1622o5392K8238
36676a72813J99917K03435J4006j15187m8743K2543p2701j69320m4846J65074
36666a8635J49104p1491j55304L5966K43263K13651K8325r2505r8520q0392q1636
$$ y = [80270, 198061, 442196, 584300, 378438, -30397, -204405, 16790, 296162, 270917, 14307, -160456, -175090, -213832, -361532, -475695, -441949, -350774, -333289, -347253, -230803, 73292, 415679, 564901, 419476, 100081, -167500, -251199, -176835, -32258, 104278, 139893, 344, -238311, -351797, -204928, 79481, 284146, 354731, 374304, 353809, 219458, -2855, -160543, -171981, -117296, -80163, -21061, 113892, 252313, 264559, 133097, -28943, -119486, -150469, -197498, -277950, -315659, -249383, -147281, -135659, -201051, -172813, 27104, 230539, 244545, 129358, 80615, 103158, 30457, -138863, -183709, -18635, 130469, 58978, -96326, -60360, 182903, 396554, 424879, 332374, 233854, 153462, 71826]
36655G1826p2934k4906P4031J93525K25461Q4917j29789k12465j12722J9021P2448
36644A88413R2741J17239Q7388n918o9175p3074r2794j17371l4487J08770Q3136
36633B84868j43908k68203q9816J52857J46849j6056l7634P3886M8866j60383
36623h674k92255j78328N7064K24926K54013J31802j00032k71307k23382l8018
36613d44191P2931Q2981J26930J99754J64010N3086N2686J42441Q6073j39736
36603C96965k47272j04825L1342n3033j73619p1290J57000K29549R9231o4004
36593B00044j62796j94191j13120P4148J85841P7470j07802j30691j1887L7569
36583a45415l4289q6568n2132J228M6441J07730J19701N90j47262j33565K3719
$$ y = [71826, -1108, -26014, 48017, 241542, 467003, 551920, 422131, 209666, 96944, 115965, 188413, 281154, 398393, 485781, 479863, 410688, 337614, 244820, 127449, 92962, 201732, 284868, 140960, -127243, -217059, -64202, 82647, 66591, 28957, 102843, 151709, -8674, -300929, -479257, -422193, -197267, 56746, 188548, 88516, -182791, -406173, -444191, -371260, -288279, -161349, 38405, 202415, 255501, 308187, 450628, 536701, 396965, 149693, 44868, 76210, 23177, -150442, -221732, -64732, 164817, 264048, 200044, 37248, -156943, -270063, -195915, -10074, 67396, -40406, -171097, -182984, -145415, -179704, -266272, -318404, -317176, -270735, -163005, -43304, -42714, -189976, -323541, -299822]
36572b99822J15472O0430j2383j7661k2758n5283j9079J15722K16186J67645J9507
36561B67976j04676j24426j4144J62454K29859P8692j35105j57775k262P9309
36551B79902k26n7843p45Q785j12102j55864L7198K63316K33530J815j42891r5489
36539B59386L633M3195L7149m737q3661j19339m3488M9948L4701j6829N5095J91174
36527D06227J62327o1811k37380j98725o3111P360M1950J26965K01168J48986
36517E33956K275r4085o6511L5456J18471J03193k6567j60579j36201L6111J21337
36506D66856m1716k80877k95528o8310J21734R5670k2731o1130n0565q3765q4833
36495c05195O6121K52177K05305r4187l12081j63814K16960M45707L32220K2797
$$ y = [-299822, -184350, -123920, -136303, -153964, -176722, -232005, -251084, -135362, 80824, 248469, 267976, 163300, 38874, 24730, 187184, 417043, 495735, 360630, 202855, 200593, 279902, 279676, 221833, 221088, 229873, 117771, -38093, -895, 262421, 495951, 497766, 354875, 259386, 263019, 306214, 343363, 338626, 254965, 135626, 92138, 142086, 176787, 159958, 215053, 406227, 568554, 506743, 269363, 70638, 7527, 14887, 56837, 183802, 384970, 533956, 536231, 442146, 375635, 411091, 529562, 632755, 606188, 445609, 309408, 345519, 466856, 425140, 144263, -151265, -219575, -97841, -2171, -24902, -86032, -136597, -220362, -305195, -239074, 13103, 218408, 124221, -187860, -351674, -134714, 310993, 643213, 666010]
36485F66010k36961l23354k36794m6127J23233J58161P0049k9332p7309r5044
36475b7468p0115N7025K39007K98818J60239j9099o5839l5653r0315k13405k30222
36464B973p7766J23331K60672L16276K47932j4487l76108n55922l87596l1952
36454d92647K21237K62322J62631j3765k24302l38815k21411N4019K32025J79184
36444a79522L8489J1536R2952J24166M6469k5429J1811R2083O8045q0052j95728
36433D820j30276O8695K07582J72680L6900p0524j12108j05601l1480J11033K08443
36422C60164J34582n4233j59193r9274n658j6135j03507j71518j94606j74236
36412d83614p5753P7841J51840O9351m8144m2019O0844J29207J49155J91932K24104
$$ y = [666010, 429049, 105695, -131099, -177226, -53993, 104168, 174217, 144885, 67576, -27468, -97583, -40558, 198449, 497267, 657506, 638407, 572568, 536915, 446600, 233195, 2973, -74793, 48538, 309210, 625486, 873418, 858931, 482823, -73099, -460695, -492647, -271410, -9088, 153543, 139778, -84524, -423339, -644750, -590731, -358706, -179522, -141033, -129497, -36545, 87621, 134090, 108661, 120472, 212555, 280600, 200548, 4820, -125456, -56761, 150821, 323501, 360401, 289877, 177769, 72168, 40688, 151721, 360164, 494746, 440513, 281320, 182046, 176388, 160253, 56746, -114772, -309378, -483614, -559367, -481526, -329686, -260335, -308479, -350498, -289654, -160447, -11292, 180640, 404744]
36401D04744J45683j4538j32371j85590k17729j54133Q5088L09816K20701j03379
36391C58292k26888M993K07412N1158k24156k09891L2967J24920j9207j40142
36381d0542j09129n3193k8288N3761J46302P2910j23804j68658J9333J92058J68268
36370A29018O6400J7303n5390j98555k51089j12754M0749L4808j2277Q9103K56206
36359C522K67093J18472P30j1234j2923n4586p2147k7475L2643N3206R179r3048
36347B13432j76232j35170J780O7761M793l3834M8018R8797j7094j41530o2060
36336a31339J05207P5991j24201j68616O0926K73044J77873j26482l08416j99026
36326c65039P4284K55306J86145o4517k57923k18473j1331J57831J73796P1232
$$ y = [404744, 550427, 535889, 403518, 217928, 199, -153934, -68846, 240970, 461671, 358292, 131404, 136397, 343809, 394967, 170811, -39080, -6113, 118807, 99600, -40542, -149671, -202864, -231152, -177391, -31089, 41821, -81983, -250641, -231308, -39250, 129018, 195418, 212721, 157331, -41224, -292313, -405067, -364318, -329510, -341787, -252684, 3522, 270615, 389087, 389817, 378583, 365660, 311074, 238927, 211452, 244095, 297301, 306480, 213432, 37200, -97970, -96190, -28429, -23636, -57470, -9452, 89345, 72251, -69279, -131339, -26132, 49859, -74342, -242958, -182032, 91012, 268885, 142403, -166013, -365039, -290755, -35449, 150696, 86179, -171744, -390217, -401548, -243717, -69921, 1311]
36316A311o3227j38471p7135Q7148J90802J37883L5853R936L514o8600j12210
36305F804l0407K9243j02108k54523j35789J52478K16189o448j48148j9993J23893
36294a68809Q7335N9252J89232K42401J8696k20704j46225Q1492Q3966q9725o7051
36283F9860J81391K66378J2344k68125k60681n7780Q5885J18253J15423O8903
36273C31851l6719q5242K5178J85807J99996M6088j23204j96936j90239j46252
36263A0328q2685k8835o824K2483R3081J19920j7291k46509l11372j06482J26545
36252d27641J02971r2064j18868J02538K60533J23903j18502j80789j12989j27461
36242e88369j58882L2269L69010M71150K28117j3516J4857J22139L5317j39193
$$ y = [1311, -61916, -200387, -277522, -190374, 428, 138311, 174164, 184100, 187614, 119014, 6804, -23603, 5640, -96468, -350991, -486780, -334302, -118113, -124561, -272709, -292702, -168809, -81474, -22222, 167010, 409411, 428107, 207403, 61178, 142670, 226636, 136911, 69860, 251251, 517629, 529973, 261848, 1167, -56613, 29272, 147525, 262948, 331851, 295132, 209890, 235068, 420875, 620871, 666959, 543755, 346819, 156580, 10328, -72357, -101192, -108016, -85533, 7548, 127468, 110177, -136332, -447704, -554186, -427641, -324670, -416734, -535602, -433064, -172531, -48628, -167130, -347919, -460908, -588369, -747251, -714982, -345972, 125178, 353295, 339779, 354636, 476775, 512092, 372899]
36232C72899j33426J7339O3765l0697q4455n5337p9554j59361j21938N4708J49948
36221f109L8737j03960p1244P5189J24341K5340p1161l6675Q1580J31913L2935
36210B20886j28677j80181o4368P3709O0490p9377j58909p4946Q3356J75805J58898
36199H6686P1505l0673q8379o4134M553L5416J1899K357M2905P0471K0589o1369
36187A01826p1272Q893P6134L6725n9951o5794P1481K05783J48234r1019k96287
36176F4753k91174j11303Q2322J69447J21190r033r1203j7211J42448J84184M2608
36165B87028j03847r1699n361j6728j07492j22990l0242N3060N3221J3128p997
36154g9919J5661R1114J61162J10297n9084j46613j5081J56759R3294j61468k85421
$$ y = [372899, 239473, 256812, 320577, 289880, 205425, 150088, 70534, -88827, -210765, -156057, -6109, 32628, -71332, -142576, -67387, 56954, 82294, 11133, -25542, 56038, 187951, 220886, 92209, -87972, -152340, -78631, -18141, -97518, -256427, -331373, -248017, -72212, 86686, 158191, 127518, 39139, -24995, -20442, 14974, 26873, 29230, 72135, 142606, 163195, 101826, 30554, 39447, 115581, 152306, 92355, 26561, 98042, 303825, 452059, 361040, 64753, -226421, -337724, -255402, -85955, 35235, 26202, -65001, -82212, 60236, 244420, 287028, 183181, 91482, 86121, 69393, -38099, -161089, -191331, -138271, -85050, -71922, -79919, -64258, 26856, 188018, 298315, 239231, 92618, 77537, 234296, 327590, 166122, -119299]
36143a19299j31898R6338J68816J05358M9188L8377J3776n1333j17284j25510
36133g3471n7717J5704q348j00752r0683P0387J72491N3920r9623j9080J98964
36122F1792K26640K8395j05599m9572P321m0595m3654N5780O3889j02641k18233
36111a16477j13916M5928O1394L274O483J8655j8339N499J18114J06942j11616
36100E941k29919Q271L35565L15780n851k18519j90841j63599k40558k24436j8035
36089f26201J85969K25083J79882J56759J09616o175j04942j04471l9199K7182
36079C503P1786O7615K781n1003k6068Q538m2768j03503k9294J22708J44146j0741
36067A57700j67365j85440p9683Q8856K35818K13674q835j74742k9266K55362
$$ y = [-119299, -251197, -154859, 13957, 119315, 168503, 206880, 220656, 169323, 52039, -73471, -131188, -115484, -123832, -224584, -315267, -244880, -72389, -18469, -118092, -137172, 61792, 288432, 316827, 211228, 161656, 168977, 128382, 84728, 140508, 204397, 101756, -116477, -230393, -184465, -123071, -119797, -113314, -94659, -112998, -107499, 10615, 117557, 5941, -223978, -215707, 119858, 435638, 429787, 211268, 20427, -143172, -383730, -608166, -626201, -440232, -215149, -35267, 121492, 231108, 224933, 119991, 15520, -23679, 3503, 75289, 142904, 145685, 94682, 68614, 77152, 34384, -69119, -98413, 24295, 168441, 157700, -9665, -195105, -274788, -185932, 49886, 263560, 254725, 79983, 50717, 306079]
36057C06079K75472N881j67851p2120K3878o7899j31815J5313J54519M5465j36348
36046B50574r5417Q8793J24064j4102j19474j39589j70943j62577K1481K80914
36036F3724L49314J87020J3483n7605j29250k43460k78805j90579r9209o1448
36026d46815J1112J21579J16445l6323j24886r566J34406Q6616o0766m9386J29590
36015a27994K19965R6687o0764o4757J1333K883n1353R281J45559J17169j39239
36004A58770l49086k65823k7940O2698j605K2310J72284J97738K448j49248l8020
35993b15474J64387J78817L4471n6596o9246j17827j57226m5754J45358J90327
35983E1237P1306l816L4284K0727j13468j90674p9138R2325J44928R2909M7593
$$ y = [306079, 581551, 587432, 419581, 347461, 371339, 303440, 171625, 186938, 341457, 386922, 250574, 155157, 243950, 368014, 353912, 234438, 94849, -76094, -238671, -217190, 63724, 413038, 600058, 613541, 555936, 426686, 183226, -95579, -286158, -385367, -446815, -435703, -314124, -197679, -234002, -358888, -368454, -234048, -147432, -208198, -257584, -127994, 91971, 188658, 127894, 63137, 74470, 77353, 26000, 35281, 180840, 298009, 158770, -190316, -456139, -484079, -421381, -422986, -400676, -228392, -30654, -28206, -177454, -215474, -51087, 127730, 162201, 105605, 36359, -81468, -238694, -284448, -139090, 51237, 122543, 118727, 153011, 173738, 60270, -130404, -209542, -117217, 27711, 120620, 168213]
35972A68213L0932O969k2119m9114q3501q0937J7424J28966Q1071j16627k39238
35961a57961j74212p5667o6546j0660K17388M21686L09807o5150l43123l12037
35951b56475j06316N3453J18325J53163J72073J28972J6828r3439j23819q5031
35941b2266o2671p8232l5434J02071J72203L6856j30404n2119J75226J62620j39289
35930A28561k91992m4114K53730K16809K7243M8651J68445N2392j77511j28428
35920B53786J10364N0214l34915m78526j16040K89566K82287M6942k6870M0084
35910A16892L0734p132O3324J07904m7159k31640j71211N3487J53638R2742M2848
35899B04427J1519j16913k55799j95358L2450J84821J67180P9815k5990j43078
$$ y = [168213, 199145, 206114, 183995, 134881, 51380, -29557, -12133, 116833, 197904, 81277, -157961, -332173, -407840, -474386, -485046, -267658, 154028, 463835, 398685, 55562, -256475, -362791, -309338, -191013, -37850, 134223, 263195, 280023, 186584, 62765, -22266, -84937, -163169, -198603, -96532, 75671, 112527, -17877, -69996, 105230, 267850, 128561, -163431, -207545, 46185, 262994, 290237, 338888, 507333, 559725, 382214, 253786, 364150, 414364, 79449, -399077, -515117, -225551, 56736, 103678, 76808, 116892, 147626, 140494, 203818, 311722, 264563, 32923, -138288, -84801, 68837, 161579, 204427, 215946, 99033, -156766, -352124, -319674, -134853, 32327, 112142, 86152, -56926]
35889e6926j39025Q2713L12450K62136J4557j05829o1819j03506k50895k25868
35879b72012K2226J68613M9019o4693N8462K18419J38856q3366j75959j14429
35869e4864n9882m1930K0411R5351Q2808J0777j2048J9246L0982K1053M4887J03089
35857B59880J47402J43587O8195o7492j53650p9389O6483P0489p5806j41216l6643
35846B01840K8159q1005j62352k0589J67062J18386r1008j50979n926R4784R765
35835A08137j11951r3208M2305J53512J47387L0307j05100j45525p9604j3854
35825f7594j2619j3715L1739O5175N3931O6666J08636N6861j06749j90008q2111
35814h9788M8995L4735l7982n9833j31408k83793k40337J63146N50982M56619
$$ y = [-56926, -195951, -113238, 199212, 461348, 475905, 370076, 308257, 204751, -46144, -272012, -249786, -81173, -32154, -96847, -38385, 180034, 318890, 235524, 59565, -54864, -114746, -156676, -136265, -40914, 41894, 52671, 40623, 59869, 90851, 111904, 156791, 259880, 407282, 550869, 619064, 551572, 397922, 318533, 385016, 455505, 379699, 238483, 201840, 229999, 148994, -13358, -33947, 133115, 251501, 160493, 9514, 3588, 98372, 108137, -3814, -97022, -54717, 98795, 246182, 276489, 171389, 25864, -53740, -67594, -80213, -93928, -62189, 2986, 56917, 123583, 232219, 289080, 182331, -7677, -89788, -40793, -6058, -44040, -103873, -235281, -519074, -759411, -596265, -45283, 411336]
35804D11336L8535j50577q305N4110j22114k06522k7960J06284k0628j37221K4961
35793c8101K36923J37835j85904l52452k33736l1241P6233Q6785N5753L8664R5231
35782a14010J97664K10891P6782q6692j60491j58142j01154N1482K32320K30938
35772C79588n606k23374j93242k2243N4907K6512K7775N7241J2885p8740r9913
35761f4210n7265o2785j36211j92364j86405j26720M954K01579L47748L27295
35751E5616J77558K7487o1312r2303n7550J6711L0902n3518j18113n3966N6038
35740g2450N9835l0962p6513k3175N7674J06735J24663J06243L2565q1167j89457
35729A3991k38643j69132J7120J75111J40048k7619q5491M1653J51755R8193J0841
$$ y = [411336, 449871, 299294, 290989, 345099, 222985, 16463, -11497, 94787, 74159, -63062, -38101, 198822, 336657, 150753, -201699, -435435, -466676, -390443, -303658, -247905, -209241, -114010, 83654, 294545, 371327, 284635, 124144, -33998, -135152, -83670, 148650, 379588, 373982, 150608, -42634, -64877, -9970, 16542, 44317, 101558, 114443, 35703, -64210, -121475, -184260, -320471, -512835, -699240, -825960, -821006, -619427, -271679, 55616, 233174, 260661, 199349, 107046, 49496, 66207, 97109, 43591, -74522, -128488, -72450, -12615, -43577, -120090, -143265, -85591, 21144, 145807, 252050, 284615, 203448, 13991, -224652, -393784, -376664, -201553, -61505, -89124, -174615, -132962, 18793, 116986, 127827]
35718A27827L9000R4907M8748k1704l924P150j05528k09715j19410N9332P5899
35707g418n3801q8487K4717P8147l9635j77857j63385o358J69856K47839J67540
35696A51158K698n4189O5861J58049J9433k19926k73036j21798K015R015K9924
35685b30796J10081J28601O1426M2351R6552P7632m5658r2751K6959J41577Q0149
35674C96123p6217j44159r2496j8181J7400J1697l7323j15483j62324j12203M8323
35663b84843K47742L27960J60834j50911l00481j40107R8416J21736j3287m4342
35653B2717M7171L8650j16585j96961p9273Q5873J37812J02306N0826j6780p6395
35642f39o2361n070q377o0726n1115K3119O4669P5781J21284J23239l2680k03725
$$ y = [127827, 166827, 261734, 310482, 288778, 284854, 292004, 186476, -23239, -142649, -83317, -7418, -61219, -149706, -124989, -46842, -86477, -264334, -427719, -434077, -264221, -16382, 151158, 153856, 99667, 165528, 323577, 343010, 123084, -149952, -271750, -269735, -260720, -230796, -120715, 7886, 69312, 111663, 208215, 285847, 240189, 147438, 174397, 315974, 396123, 319906, 175747, 83251, 65070, 82470, 94167, 56844, -58639, -220963, -333166, -284843, -37101, 290859, 451693, 300782, 301, -139806, -41390, 80346, 67059, 22717, 69888, 108538, -8047, -205008, -284281, -198408, -60596, 41710, 92536, 75756, -639, -63000, -68070, -76447, -137173, -188288, -165169, -100500, -24719, 96565, 219804, 187124, -16601]
35630a6601j21552J60338K81892R6441j51015k36068k11429j64501o3365M2913
35620c82947J2750p9145K1800K73618K91713l9153l15577k25113j0638j8532j44640
35609f15864r6230Q8657J70282J31820J10801R1411L262m2575O2179J64586Q4454
35598A52783n6418m5187M6026R067j29428j98261j92370j85555r5430J39716L14707
35587b40350K35827Q3927J26616K28414P5738k28862k73545n492J74891L3809
35577B10973k00276k49726j33541P859J24709J83623J32237K4941j9918j8643
35567F2238p5645j53506j19684K444O9988O8083P1268K8382j22645k05235j4786
35556c89098K76736L05645P7020o6027k7976o1968k27408k26012O4139L25373
$$ y = [-16601, -138153, 22185, 304077, 400518, 249503, 13435, -197994, -362495, -425860, -382947, -370197, -449342, -427542, -153924, 137789, 98636, -216941, -442054, -452692, -471224, -615864, -712094, -623437, -453155, -321335, -210534, -119123, -115861, -158436, -96257, 68329, 152783, 96365, 51178, 97204, 106271, -23157, -221418, -413788, -599343, -694773, -555057, -240350, -4523, 79404, 206020, 434434, 510172, 281310, 7765, 2273, 177164, 210973, 10697, -239029, -372570, -364711, -240002, -56379, 75858, 100799, 80881, 62238, -13407, -166913, -286597, -284153, -214165, -146082, -74814, -46432, -169077, -374312, -389098, -112362, 193283, 270303, 204276, 176300, 114332, -113076, -339088, -274949, 50424]
35546E0424K82541P8653m4080r5839j51205j33588k4616L422j04606j30473L3996
35535b35371J43892J1704j25665K1362K85053K64919p4512l67469l42174p9406
35525d97667J76073K38905O8266j78273k29021L524K79530L26835J75898M6434
35515D10504J5922j0881q2875j39227j29397o3944J8624N6993J4053k8289N4514
35504A15997K07088K21393N6323q4820r5194j25466k52146k72171o2391J28926
35494a62461N3239j13585p5839N2637m9797l02069k86029P6897L68413K93437
35484a45157O2302r178N5931O8318K8762N8922J33040J14412r629j05659q1119
35473A70945J7265P2675J0204j21466j61330q139K04410K25914K6675j29173m6551
$$ y = [50424, 332965, 411618, 367538, 271699, 120494, -13094, -37710, -34288, -138894, -269367, -235371, -91479, -79775, -205440, -184078, 100975, 365894, 291382, -76087, -418261, -497667, -321594, -82689, -14423, -192696, -421717, -418193, -138663, 188172, 364070, 410504, 426426, 415545, 332670, 193443, 64046, 102, 18726, 75719, 89772, 61483, 115997, 323085, 544478, 600801, 515981, 420787, 295321, 43175, -228996, -291387, -162461, -109222, -222807, -298646, -246009, -295806, -597875, -883904, -807007, -438594, -145157, -82855, -92033, -36102, 32216, 60978, 119900, 252940, 367352, 357723, 252064, 170945, 188210, 260885, 271089, 149623, -11707, -19846, 184564, 410478, 437153, 307980, 261429]
35462B61429J04069K2502k64965l97753j61529K05541L06976Q3627j45231j14592
35452i9926Q2527J87002J21879R469o8597j40362j87648j18368M7585J32533L9428
35441E522r7185j10897l6576q650k3386L0693J53163K10656J34836n79j15483
35430A42114k02193k32885j24754J11461K83010K05623m0844j74868o3981J04424
35420G107R2524m9942q4053K6852N8313q5633j77690l1955J59575J16958o6163
35409c4107q1642O7035Q5761o2938n6688K16703L85296J36330k76351l78803j25570
35398a24974J18699J25627J7047l3156l4727p0143j34041j58209j09703k1227
35388d24807M9520R0028J46020K14951J78755k9860k38771k08208J7588J59187
$$ y = [261429, 365498, 388000, 123035, -274718, -436247, -230706, 76270, 159897, 14666, -99926, -17399, 169603, 291482, 300951, 232354, 91992, -95656, -214024, -166439, -33906, 5522, -91663, -202560, -239136, -247786, -271172, -240479, -87316, 123340, 258176, 257597, 142114, -60079, -292964, -417718, -306257, -23247, 182376, 141532, -33336, -97317, 7107, 99631, 49689, -34364, -7512, 50801, -34832, -212522, -244477, -84902, 32056, -34107, -115749, -48714, 37047, -25891, -82579, 134124, 519420, 655750, 379399, 596, -124974, -6275, 119352, 136399, 103243, 68516, -1627, -135668, -293877, -403580, -424807, -375287, -285259, -139239, 75712, 254467, 224607, -14164, -222372, -204784, -45597]
35378d5597J17879P2061J05434N3775j49737k84421j79303L0647J65776K41319
35368A27833K60734Q6958k40032l78514j67826P1545L5125r1508k2648J00172
35358b18161K4085q1383N7823K26009N1588k47279j27717L39785N04660J56886
35348F86296j79820j34658q046j30932k91776j70655J07908K32092J68789M8948
35338C28146j04406k41781j82432O7478J83250k162j84190o5662J42160Q0792
35328B1193j29638p2588K70985M52163J98141k26086l98479k42739k6220J4634
35318a38634p7053r9614J989N6288m7405j30606J7694K55708K53647J3703j21252
35307a5535j7732P0863j0785n9289O1750J22190o4091k65601k03722j1592L9767
$$ y = [-45597, 72282, 144343, 249777, 303552, 153815, -130606, -309909, -279262, -113486, 127833, 388567, 475525, 235493, -143021, -310847, -239302, -204177, -295685, -318333, -218161, -194076, -275459, -217636, 8373, 59961, -187318, -315035, 24750, 529410, 686296, 506476, 371818, 363772, 232840, -58936, -229591, -121683, 110409, 279198, 328146, 223740, -18041, -200473, -132995, 50255, 48093, -136097, -201759, -59599, 21193, -108445, -181033, 89952, 542115, 740256, 514170, 115691, -127048, -153268, -138634, -215687, -315301, -313312, -257024, -304429, -435035, -417341, -161633, 92014, 105717, -15535, -33267, 37596, 26811, -32478, 29272, 151462, 87371, -178230, -381952, -393544, -353777]
35296c53777K4631J63580L31291K14859j22909k77168j03569R9566P6324n0339
$$ y = [-353777, -329146, -165566, 165725, 380584, 257675, -19493, -123062, -23496, 52828, 2489]
$$ [...]
##END NTUPLES=NMR SPECTRUM
##END=
