##TITLE=31Pdec_IPEDM2
 CDCl3, 24 sc
 22.7.2019
##JCAMPDX= 6.0         $$ Bruker NMR JCAMP-DX V2.0
##DATA TYPE= NMR SPECTRUM
##DATA CLASS= NTUPLES
##ORIGIN= UXNMR, Bruker Analytische Messtechnik GmbH
##OWNER= root
$$ XWIN-NMR		Version 3.5
$$ Mon Jul 22 14:03:24 2019 Russian Standard Time (UT+4h)  she@DPX200
##.OBSERVE FREQUENCY= 81.013821
##.OBSERVE NUCLEUS= ^31P
##.ACQUISITION MODE= SIMULTANEOUS
##.ACQUISITION SCHEME= undefined
##.AVERAGES= 24
##.DIGITISER RES= 17
##SPECTROMETER/DATA SYSTEM= spect
##.PULSE SEQUENCE= zgpg30
##.SOLVENT NAME= Tol
##.SHIFT REFERENCE= (INTERNAL, Tol, 0, 182.463)
##AUDIT TRAIL= $$ (NUMBER, WHEN, WHO, WHERE, WHAT)
$$ ##TITLE= Audit trail, XWIN-NMR		Version 3.5
$$ ##JCAMPDX= 5.01
$$ ##ORIGIN= Bruker BioSpin GmbH
$$ ##OWNER= she
$$ F:/spectra/data/she/nmr/P31/1/pdata/1/auditp.txt
$$ ##AUDIT TRAIL=  $$ (NUMBER, WHEN, WHO, WHERE, WHAT)
(   1,<2019-07-22 14:02:11.54 +0400>,<she>,<DPX200>,
      <created by zg, POWCHK disabled, PULCHK disabled
       configuration hash MD5:
       00 E9 B6 7A A2 85 ED C7 34 08 36 98 17 FE 4E 26
       data hash MD5: 32K
       FB B0 97 CA 62 A2 79 78 E9 65 BC 29 25 F9 03 78>)
(   2,<2019-07-22 14:02:14.39 +0400>,<she>,<DPX200>,
      <Start of raw data processing
       efp BC_mod = 2 LB = 1 FT_mod = 6 PKNL = 1 PHC0 = -2902.936 PHC1 = 83.79891 SI = 64K 
       data hash MD5: 64K
       19 8C 73 A9 D7 B6 1D B3 FB DC 79 D2 70 8B 39 46>)
(   3,<2019-07-22 14:02:44.89 +0400>,<she>,<DPX200>,
      <pk PHC0 = 133.7341 PHC1 = -323 
       data hash MD5: 64K
       95 6B 7B E8 B7 6C 8D 34 29 67 B6 A2 36 8F 1B D9>)
(   4,<2019-07-22 14:02:47.85 +0400>,<she>,<DPX200>,
      <abs ABSG = 5 
       data hash MD5: 64K
       7C 41 05 49 2A CF 08 4F 1A 97 E6 F2 C2 FC 31 93>)
$$ ##END=
$$ 
$$ hash MD5
$$ C3 B5 97 3A 83 8E F0 C8 C8 5D 67 66 6E 68 B9 82
##$RELAX= 
##$RELAX= 
##$RELAX= 
##$RELAX= 
##$RELAX= 
##$RELAX= 
##$RELAX= 
##$RELAX= 
$$ Bruker specific parameters
$$ --------------------------
##$DU= <F:/spectra>
##$EXPNO= 1
##$NAME= <P31>
##$PROCNO= 1
##$TYPE= <nmr>
##$USER= <she>
##$AMP= (0..31)
100 100 100 100 100 100 100 100 100 100 100 100 100 100 100 100 100 100 
100 100 100 100 100 100 100 100 100 100 100 100 100 100 
##$AQSEQ= 0
##$AQ_mod= 1
##$AUNM= <au_zg>
##$AUTOPOS= <>
##$BF1= 81.014009
##$BF2= 200.13
##$BF3= 200.13
##$BF4= 200.13
##$BF5= 200.13
##$BF6= 200.13
##$BF7= 200.13
##$BF8= 200.13
##$BYTORDA= 1
##$CFDGTYP= 0
##$CFRGTYP= 5
##$CHEMSTR= <none>
##$CNST= (0..31)
1 1 145 1 1 1 1 1 1 1 1 1 1 1 1 1 1 1 1 1 1 1 1 1 1 1 1 1 1 1 1 1 
##$CPDPRG= <waltz16>
##$CPDPRG1= <>
##$CPDPRG2= <waltz16>
##$CPDPRG3= <>
##$CPDPRG4= <mlev>
##$CPDPRG5= <mlev>
##$CPDPRG6= <mlev>
##$CPDPRG7= <mlev>
##$CPDPRG8= <mlev>
##$CPDPRGB= <>
##$CPDPRGT= <>
##$D= (0..31)
0 1 0 0 0 0 0 0 0 0 0 0.03 2e-05 3e-06 0 0 0 0 0 0 0 0 0 0 0 0 0 0 0 0 
0 0 
##$DATE= 1563789730
##$DBL= (0..7)
120 120 120 11 120 120 24 19 
##$DBP= (0..7)
150 150 150 150 150 150 150 150 
##$DBP07= 0
##$DBPNAM0= <>
##$DBPNAM1= <>
##$DBPNAM2= <>
$$ [...]
##$SUBNAM3= <"">
##$SUBNAM4= <"">
##$SUBNAM5= <"">
##$SUBNAM6= <"">
##$SUBNAM7= <"">
##$SUBNAM8= <"">
##$SUBNAM9= <"">
##$SW= 369.568048894756
##$SWIBOX= (0..15)
0 1 3 0 0 0 0 0 0 0 0 0 0 0 0 0 
##$SW_h= 29940.119760479
##$TD= 32768
##$TD0= 1
##$TE= 0
##$TE2= 300
##$TE3= 300
##$TEG= 300
##$TL= (0..7)
0 120 53 12 22 120 120 120 
##$TP= (0..7)
150 150 150 150 150 150 150 150 
##$TP07= 0
##$TPNAME0= <>
##$TPNAME1= <>
##$TPNAME2= <>
##$TPNAME3= <>
##$TPNAME4= <>
##$TPNAME5= <>
##$TPNAME6= <>
##$TPNAME7= <>
##$TPOAL= (0..7)
0.5 0.5 0.5 0.5 0.5 0.5 0.5 0.5 
##$TPOFFS= (0..7)
0 0 0 0 0 0 0 0 
##$TUNHIN= 0
##$TUNHOUT= 0
##$TUNXOUT= 0
##$USERA1= <user>
##$USERA2= <user>
##$USERA3= <user>
##$USERA4= <user>
##$USERA5= <user>
##$V9= 5
##$VALIST= <valist>
##$VCLIST= <CCCCCCCCCCCCCCC>
##$VD= 0
##$VDLIST= <DDDDDDDDDDDDDDD>
##$VPLIST= <PPPPPPPPPPPPPPP>
##$VTLIST= <TTTTTTTTTTTTTTT>
##$WBST= 1024
##$WBSW= 4
##$XGAIN= (0..3)
0 0 0 0 
##$XL= 0
##$YL= 0
##$YMAX_a= 125927
##$YMIN_a= -134517
##$ZGOPTNS= <>
##$ZL1= 120
##$ZL2= 120
##$ZL3= 120
##$ZL4= 120
##$ABSF1= 182.463
##$ABSF2= -187.1042
##$ABSG= 5
##$ABSL= 3
##$ALPHA= 0
##$AQORDER= 0
##$ASSFAC= 0
##$ASSFACI= 0
##$ASSFACX= 0
##$ASSWID= 0
##$AUNMP= <proc_1d>
##$AZFE= 0.1
##$AZFW= 0.5
##$BCFW= 0
##$BC_mod= 2
##$BYTORDP= 0
##$COROFFS= 0
##$CY= -3
##$DATMOD= 1
##$DC= 0
##$DFILT= <>
##$DTYPP= 0
##$F1P= 0
##$F2P= 0
##$FCOR= 1
##$FTSIZE= 65536
##$FT_mod= 6
##$GAMMA= 0
##$GB= 0
##$INTBC= 1
##$INTSCL= 5.30512e-09
##$ISEN= 30
##$LB= 1
##$LEV0= 0
##$LPBIN= 0
##$MAXI= 10000
##$MC2= 0
##$MEAN= 0
##$ME_mod= 0
##$MI= 50
##$NCOEF= 0
##$NC_proc= -1
##$NLEV= 6
##$NOISF1= 182.463
##$NOISF2= 159.3651
##$NSP= 0
##$NTH_PI= 0
##$NZP= 0
##$OFFSET= 182.463
##$PC= 4
##$PHC0= -2769.202
##$PHC1= -239.2011
##$PH_mod= 1
##$PKNL= yes
##$PPARMOD= 0
##$PSCAL= 0
##$PSIGN= 0
##$REVERSE= no
##$SF= 81.0140089999434
##$SI= 65536
##$SIGF1= 159.3651
##$SIGF2= -187.1042
##$SINO= 113.3802
##$SIOLD= 16384
##$SREGLST= <1H.CDCl3>
##$SSB= 0
##$STSI= 65536
##$STSR= 0
##$SW_p= 29940.119760479
##$SYMM= 0
##$S_DEV= 0
##$TDeff= 32768
##$TDoff= 0
##$TI= <>
##$TILT= no
##$TM1= 0
##$TM2= 0
##$TOPLEV= 0
##$USERP1= <user>
##$USERP2= <user>
##$USERP3= <user>
##$USERP4= <user>
##$USERP5= <user>
##$WDW= 1
##$XDIM= 65536
##$YMAX_p= 298428271
##$YMIN_p= -5947440
$$ End of Bruker specific parameters
$$ ---------------------------------
##NTUPLES= NMR SPECTRUM
##VAR_NAME=  FREQUENCY,     SPECTRUM/REAL,   SPECTRUM/IMAG
##SYMBOL=    X,             R,               I
##VAR_TYPE=  INDEPENDENT,   DEPENDENT,       DEPENDENT
##VAR_FORM=  AFFN,          ASDF,            ASDF
##VAR_DIM=   65536,         65536,           65536
##UNITS=     HZ,            ARBITRARY UNITS, ARBITRARY UNITS
##FACTOR=    0.456856943014862, 1,           1
##FIRST=     14782.0589164792, 0,            0
##LAST=      -15158.0608439998, 0,           0
##MIN=       -15158.0608439998, -5947440,    0
##MAX=       14782.0589164792, 298428271,    0
$$ Real data points
##PAGE= N=1
##DATA TABLE= (X++(R..R)), XYDATA
$$ [...]
41867A1868J2683l1103l4039l610K4856L3408K5260J3138J6542M2489N9709K4577
41855A95778n3171j03137p5015k756L6281J1451l4630m2878r59N2871P6025O0345
41843A20205K5481j0466l7008l7214J756N6487P4799L3992k8238n7393l8802J223
41831A04822K7406J5623l0682o7357m4923K1357N3318J1488m4096l6960J6380
41820B6376L5296o803n3400n1649j4814J2975J4306M729N770K3770M3576M1846
41808H1978J4815j5141k9229l3290l7730l6519k2159j985J6115L3355M3100L1735
41796D5045R522O745K3384K3019m065k0284r782j1602m4682n9623k0467K2113
41784d0677Q788k6124j2180L4406L7510q319k7682J4960O7992P5929L8077k4747
$$ plain form
41867 11868 24551 -6552 -40591 -44201 -19345 14063 39323 52461 69003 111492 171201 195778
41855 195778 142607 39470 -35545 -38301 -2020 9431 -25199 -68077 -69036 -16165 59860 120205
41843 120205 145686 135220 98212 60998 62754 119241 194040 228032 199794 142401 103599 104822
41831 104822 132228 147851 117169 49812 4889 26246 79564 91052 46956 9996 26376
41820 26376 61672 54869 1469 -50180 -64994 -52019 -37713 -32984 -27214 -3444 40132 81978
41808 81978 96793 81652 52423 19133 -18597 -55116 -77275 -79260 -63145 -29790 13310 45045
41796 45045 54567 61312 84696 107715 103650 83366 73584 61982 17300 -42323 -62790 -40677
41784 -40677 -31889 -58013 -70193 -35787 1723 -6596 -34278 -19318 48674 124603 162680 137933
41772A37933r2276j22358p6773J0711N4922K9469k014J3044M3683L6737j052k3862
41760H164j5344K826J1615J3832K0640L3577L5572M079n1756q0224m3895K1157
41748c9757M1153j144m6885m1647J941L5147L6046K2432J8378K4435K0758k217
41736F8640k4015k1719j0618k3223m8153m0514m052K527l0240k8302M2725R7669
41724a9275N5445k4256k9423K8907M5939r62l0480o496J5254N835J0420M2914
41712I3822M1657j8804o4437l1421L4051M8522P395l1709l8957k9300j7419l056
41700i656J2303K2793K2804O113k1674l2850q920K4165K6561j3k6255m6518o6381
41687i7528o1238j1207M1029L9998J0339J9375N8685N5144j784m1712l0806j0188
$$ plain form
41772 137933 45657 -76701 -153474 -142763 -87841 -58372 -60386 -47342 -3659 33078 32026 8164
41760 8164 -7180 -4354 7261 21093 41733 75310 110882 114961 63205 -17019 -60914 -39757
41748 -39757 1396 252 -46633 -88280 -86339 -51192 -15146 7286 25664 50099 70857 68640
41736 68640 44625 22906 12288 -10935 -59088 -99602 -103654 -101127 -131367 -159669 -116944 -19275
41724 -19275 36170 11914 -17509 11398 57337 56375 25895 19399 34653 40488 50908 93822
41712 93822 135479 116675 52238 20817 54868 103390 110785 79076 40119 10819 -6600 -9656
41700 -9656 2647 25440 48244 54357 32683 -167 -9087 15078 41639 41626 15371 -31147 -97528
41687 -97528 -158766 -169973 -128944 -88946 -78607 -59232 -547 54597 52813 11101 -19705 -29893
41675b9893l770J1929K9009N382l6286j9366M5893N2786k5791p7992l2529K8808
41663e1820K0517p087J7977M5429k322p7020p8322j8584J4428J0607K5453N1872
41651d8872L3522j3180j5303K3398K3727k7473m9185k151M6540L1064k0264m0533
41639e8710j4746K1950L7169K6612J2456K4065N6791O0585M281o5654p7400l1131
41627c732Q747R232k066j988m326j5106j0548J7813L8626K6038k386j6855k0210
41614B3239l4772n5853m6353J1469P3063O8648n473o3806l5027L7395N4584O144
41602C3258k3434L749K4909k599k2957J1599M1085o456q3869r1816l4608j055
41590a52194j2227k036M7037O0210l475p2302o2748L969M4378L1270R711J1898
$$ plain form
41675 -29893 -33663 -21734 7275 12657 -23629 -42995 2898 55684 29893 -48099 -80628 -51820
41663 -51820 -31303 -38390 -20413 25016 22694 -54326 -132648 -151232 -136804 -126197 -100744 -48872
41651 -48872 -15350 -28530 -43833 -20435 3292 -24181 -73366 -75517 -28977 2087 -18177 -58710
41639 -58710 -73456 -51506 -14337 12275 24731 48796 105587 166172 170453 104799 27399 -3732
41627 -3732 5015 14247 12181 10193 5867 -9239 -19787 -1974 36652 62690 60304 43449 23239
41614 23239 -11533 -67386 -113739 -102270 -29207 39441 33968 -29838 -64865 -27470 27114 33258
41602 33258 9824 13573 38482 35883 12926 24525 65610 59154 -24715 -116531 -151139 -152194
41590 -152194 -164421 -166457 -119420 -59210 -62685 -134987 -197735 -193766 -149388 -118118 -108407 -96509
41578i6509J4312q418k9757o523M7917O9789L4194o360l462J1814j1017m5672
41566b9692l2220Q390K591l7452j9639O2251R3069J9365n3567k8123L2430K1159
41554C8562l5673m1629l48Q905j8474j6945J7710K3439j0222k8546j2378O031
41542f9568K0924M8537N2999j6969j14630j25573k8931O8424Q0799L6969N70j5175
41530f1624j9150n271J7532J7726n458j2825Q643K2007K384k5511k9613q651K1960
41517g7851M4426L8488M899k1251j9790k2246m8732m8376K0652Q9297N7388m3969
41505b7065q2731j9055M7209L9641R37r826p416j6182r645K4676L7435l208m7633
41492g2863l8587M780L0199L0967K9781K5807P622j2344j6910j2316r584n588
$$ plain form
41578 -96509 -82197 -90615 -120372 -126895 -78978 -9189 25005 18645 15183 26997 15980 -29692
41566 -29692 -61912 -53522 -50931 -88383 -108022 -45771 47298 66663 13096 -15027 17403 38562
41554 38562 2889 -38740 -39088 -30183 -48657 -65602 -47892 -24453 -34675 -63221 -75599 -69568
41542 -69568 -48644 -107 52892 35923 -78707 -204280 -233211 -164787 -83988 -47019 -46449 -61624
41530 -61624 -80774 -86045 -68513 -50787 -56245 -69070 -60427 -38420 -36036 -61547 -91160 -99811 -77851
41517 -77851 -33425 5063 9962 -11289 -31079 -53325 -102057 -150433 -129781 -40484 16904 -27065
41505 -27065 -109796 -128851 -81642 -42001 -41064 -50890 -58306 -74488 -84133 -59457 -22022 -25230 -72863
41492 -72863 -111450 -106670 -76471 -45504 -15723 10084 17706 5362 -11548 -23864 -33448 -39036
41480c9036k562j4026l4288l6087j2361J3944K8902L8043L5890J1107j5754j0117
41468c6345J7514K2142m791k9815m0556n2136n1883q265N8833Q7364O2423K9985
41456E4470J7212R861Q967L0090M4744J0668l6785k1935L5332L2791m4859r0016
41444E0540m4016J4935J0565j8541j3096L883n356j4450J640P168j4458p101N3971
41431B5684R1013M3091k5508k9472J711p050l9919l2083N161J0813j2688j5077
41419A5676L017J288j6426j7097j1490k8759m4270j5285L6311N7271N2693N9761
41407I2690N8406j57q9548j24074p9581j9921K932N716K0634M3297M8891K5058
41395a5657j5038l3808l368M3873L9612j9269n0912r579M0659L1596q40P318K9805
$$ plain form
41480 -39036 -41598 -55624 -89912 -125999 -138360 -124416 -95514 -57471 -21581 -10474 -26228 -36345
41468 -36345 -18831 3311 -1480 -31295 -71851 -123987 -175870 -184135 -125302 -37938 24485 54470
41456 54470 71682 81543 90510 120600 165344 176012 139227 117292 152624 185415 140556 50540
41444 50540 6524 21459 32024 13483 387 4270 -1086 -15536 -13896 -6728 -21186 -28287 25684
41431 25684 116697 159788 134280 104808 106519 99469 59550 27467 32628 43441 30753 15676
41419 15676 18693 19981 3555 -13542 -25032 -53791 -98061 -113346 -77035 -19764 32929 92690
41407 92690 151096 150939 61391 -62683 -142264 -162185 -159253 -153537 -132903 -89606 -40715 -15657
41395 -15657 -30695 -64503 -67871 -23998 15614 -3655 -54567 -64146 -23487 8109 7269 14587 44392
41382D4392N987l7282l0293P540l476n8007o5410N27N8200M5182k266k3610j2465
41369g0981Q111K6977L4589J9123p383j6676o522q93q615j5961j4308l117K0809
41356c4847M6178M2825P951j5113j633J2334l872j8362k821J000m4546q5006m9842
41343a45754K5537N0574J9768N63N971j1936n1303n1357R0M5392N2251M4754L4484
41330A9034N341k7552k5852k03L260j2543n501J6426M847l1393l1712Q046K6659
41317e1143N621o618R632J7296L907P95Q069q798l6395k2762J9621K2224j3457
41304e2008q468N0559P5302K0798m2860m9879k6639j1571J1445M6398M9303J4791
41292G7171M423L3988L0745l6743q7282n5670M805K4250K3993L9208L1052k5499
$$ plain form
41382 44392 50379 13097 -17196 -9656 -13132 -71139 -136549 -136022 -77822 -32640 -34906 -58516 -70981
41369 -70981 -62870 -35893 -1304 17819 10436 -6240 -12762 -13655 -22270 -38231 -52539 -55656 -34847
41356 -34847 11331 54156 62107 46994 45361 57695 53823 35461 32640 33640 -10906 -95912 -145754
41343 -145754 -120217 -69643 -49875 -49312 -43341 -55277 -106580 -157937 -157847 -112455 -60204 -15450 19034
41330 19034 24375 -3177 -29029 -29232 -25972 -38515 -44016 -27590 -22743 -54136 -85848 -77802 -51143
41317 -51143 -45522 -52140 -42508 -25212 -21305 -20510 -12441 -21239 -57634 -80396 -60775 -38551 -52008
41304 -52008 -60476 -9917 65385 86183 43323 -6556 -33195 -44766 -33321 13077 62380 77171
41292 77171 81594 115582 146327 109584 22302 -33368 -28563 -4313 19680 58888 89940 64441
41280F4441n5784R99O8466M2614l8219n9183j6813o969n0159o4193j4884K7897
41268a01787J1501k0233p431L8010O4202N0401J4159k1241m2174m2832k1759J6709
41256f2475M8989L2895l9686r6309n3193N7045J04670M0805l2074k1533J8049
41245b817l544n0872l1333L2773L6605k6722n4310p789K8889k230m0405j6048
41233a37803L5841L9470l958k9850r506K1622K4283L007j1100n538k518k3415
41221i9465m3818j5034N6595R4082M9660j9554k9609R706K1607j1130k7884J000
41209a3844K8622J4839j5521k6714k3286j5455R448M2888L6018k6968q0006n5871
41197a25850J4289M2289Q223j8645J0961N4748M4779j3380m9044k2645K5534L4480
$$ plain form
41280 64441 8657 9656 78122 120736 82517 23334 6521 -448 -50607 -114800 -129684 -101787
41268 -101787 -90286 -110519 -117950 -79940 -15738 34663 48822 27581 -14593 -57425 -79184 -62475
41256 -62475 -13486 19409 -20277 -116586 -169779 -112734 -8064 32741 667 -20866 -2817
41245 -2817 -6361 -57233 -88566 -55793 -19188 -45910 -100220 -108009 -79120 -81350 -121755 -137803
41233 -137803 -101962 -62492 -66450 -96300 -105806 -84184 -59901 -56894 -67994 -73532 -76050 -99465
41221 -99465 -143283 -158317 -101722 -7640 42020 22466 -7143 2563 24170 13040 -14844 -13844
41209 -13844 14778 29617 14096 -12618 -35904 -51359 -41911 977 36995 10027 -69979 -125850
41197 -125850 -111561 -69272 -61049 -79694 -68733 -13985 30794 17414 -31630 -54275 -28741 5739
41185E739L050j5853P064L8522L2386q365m2462m6345l0947j1197Q870J9616P042
41172c2880j8169k1572O885L0506J7134p903L115M1202M2870j6072p3009n8546
41160h6439O577M1459J7936j0556K530L3945L9033J7019n397j9320k5263j0957
41148E67K1145L1894l031m3772l8814m595O454j007K2448O7771N9218k5468r9280
41135f470p6860R068N4590J9275l5763l5913J9070O3249M4399j6112n0718l0047
41123d2232N511J2246N148J7839L5163K0858j1355j9058r109k2931n0392l7398
41111i5710J4720L9329J2317j0278R090L0180J3020j4418j2322N813R181Q34o357
41098d601j7212k5042o048K7580K6413j3834l2829l876J8235q024l9714k7292
$$ plain form
41185 5739 8789 -7064 0 38522 70908 62543 20081 -26264 -57211 -68408 -59538 -39922 -32880
41172 -32880 -51049 -72621 -65736 -35230 -18096 -25999 -22884 18318 61188 45116 -27893 -86439
41160 -86439 -79862 -38403 -20467 -31023 -28493 5452 44485 61504 56107 36787 11524 567
41148 567 21712 53606 50575 6803 -32011 -36606 -30152 -31159 -8711 59060 118278 92810 -6470
41135 -6470 -83330 -74262 -19672 -397 -36160 -72073 -53003 10246 54645 38533 -12185 -42232
41123 -42232 -36721 -24475 -19327 -1488 33675 54533 43178 24120 15011 -7920 -58312 -95710
41111 -95710 -80990 -41661 -29344 -39622 -30532 -352 12668 -1750 -14072 -8259 922 1756 -4601
41098 -4601 -21813 -46855 -52903 -25323 1090 -12744 -45573 -49449 -31214 -39238 -78952 -106244
41086a06244M018J1325Q871K0657J9257j6712l9523k806N2392N8122K3735M302
41074C7394M350r293l1143k9362q977L648J1734K3587J4757k2760l8555j677K9147
41061a7150m022m7397j5118N8719O1315k2077q5706o1047M683M2174M2724K6469
41049a6433L269j2269m911R736O418j618J1728K7107J0301j6936r393J4758J992
41036B3749l2565k0662L7387O0046J1891m1554l5069J1336L9486K7809p339l9231
41024C5284m3075j8748k417j7200k8602L2L4152J9145k0996k1439O219n868n0699
41011a14212m5069K7872Q3323O9944L7361L0685J7421k7907n5184j9927L5154
41000C9461M3110N889k8736l8477k9539r540M398j0040l7559k9086K4560O7666
$$ plain form
41086 -106244 -102226 -90901 -82030 -61373 -42116 -58828 -98351 -101157 -48765 9357 33092 37394
41074 37394 41744 32451 1308 -28054 -37031 -33383 -21649 1938 16695 -6065 -44620 -46297 -17150
41061 -17150 -21172 -68569 -83687 -24968 36347 14270 -71436 -132483 -127800 -85626 -42902 -16433
41049 -16433 -13164 -25433 -30344 -20608 -14190 -15808 -4080 23027 33328 16392 6999 21757 23749
41036 23749 -8816 -29478 7909 67955 79846 38292 3223 14559 54045 81854 74515 35284
41024 35284 -7791 -26539 -28956 -46156 -74758 -74726 -40574 -21429 -42425 -63864 -57645 -63513 -114212
41011 -114212 -159281 -131409 -48086 21858 59219 89904 107325 79418 24234 4307 39461
41000 39461 82571 88460 59724 21247 -8292 -17832 -13434 -23474 -61033 -90119 -65559 2107
40988B107N4294M263l7298n0135l0355J7239N8752N3751J4488r205j1288l0119
40976C6494n9609m1965K6737O9076M2005o65n109L288j0503k0686j797J0756j1086
40963C6936k4321Q355L8723R815l9913l6324O620J4516k0926l5177l877K2549
40951b3024O248k7510m4332m6329m0931j2446M3473Q6840P0025J383n3352m3675
40939h3630M430K1738j0084l3154k984L8879L0924l958O753O0401P4887J8519
40927A22721m0672m2744j4574k508R08J4020J4194j4290l2496n350L3583L1585
40915F4377l907k7813k8322k3928j5886O453L0816L5233K2186P597o572k1347
40903C8887k3463n188J7864K8020K2744N22l8301o8097n7094k0353n611j5919
$$ plain form
40988 2107 56401 60664 23366 -26769 -57124 -39885 18867 72618 87106 77901 66613 36494
40976 36494 -23115 -65080 -38343 30733 72738 72073 66964 70252 59749 39063 37266 48022 36936
40963 36936 12615 20970 59693 69508 29595 -6729 -109 14407 -6519 -41696 -45573 -23024
40951 -23024 -16776 -44286 -88618 -134947 -175878 -188324 -144851 -58011 12014 13397 -39955 -83630
40939 -83630 -79200 -57462 -67546 -100700 -103684 -64805 -33881 -37839 -31086 29315 104202 122721
40927 122721 82049 39305 24731 22223 23131 37151 51345 37055 4559 -791 32792 64377
40915 64377 60470 32657 4335 -19593 -35479 -29026 1790 37023 59209 66806 60234 38887
40903 38887 15424 10236 28100 56120 78864 79386 41085 -27012 -84106 -104459 -110070 -125989
40891a25989n879K9294L3480j0480l6756p24M3754L2220q066j4031P179N352j7918
40878f8564j9235O473K7552L8777N5239N7905J4550m8465o1032n872N2576N2329
40866A02233P216k4069j6161J65j2029m2678m8806j9785K411j1698k8795q441
40854a00437K4583K3607P305K5327N5135K8518m0191n7698j704L9720J2969k2660
40842e526j0201J2810l10k0297j2114p031l1602m1542j885L8041K6309j292J0702
40829d3938M1208M0504J7340O554M439j95R742K7418O205m7357n2203J0904M3615
40816F4236r082n4584j2036M0254O140m9749k0520M0150J1995o5237n2849L8890
40804f2392O2082j7401p0372k5399L4563L4056J0077Q198O982n208P058M3540
$$ plain form
40891 -125989 -131868 -102574 -69094 -79574 -116330 -117054 -73300 -41080 -49146 -63177 -55998 -50646 -68564
40878 -68564 -87799 -81326 -53774 -14997 40242 98147 112697 64232 3200 -2672 49904 102233
40866 102233 109449 85380 69219 69384 57355 14677 -34129 -53914 -51503 -63201 -91996 -100437
40854 -100437 -75854 -52247 -44942 -19615 35520 64038 23847 -33851 -35555 4165 17134 -5526
40842 -5526 -15727 -2917 -3227 -23524 -35638 -42669 -74271 -115813 -117698 -79657 -53348 -54640 -43938
40829 -43938 -2730 37774 55114 61668 66107 65912 75654 103072 109277 61920 9717 20621 64236
40816 64236 55154 570 -11466 28788 34928 -14821 -35341 4809 16804 -48433 -101282 -62392
40804 -62392 -310 -17711 -88083 -113482 -78919 -44863 -34786 -26588 -19606 -24814 -17756 25784
40792B5784N0678J9461K407R362j0102n7515o6645k1836J0421j843j1327O565
40780d4590J2520k202J2807N9714O1747q687o7891m4812J7065L9390J6690j0656
40768D1095k6709l2542k1847l457j221q933K280K2059J1779j6281r433K5455K0753
40755B998l3575o2297k5550K1339K4362L558q493k0669l6133k5968J1772L6178
40743a12478L6383M6370O1847K8472n2323r4120m8581K1608M0053J3631j2273
40732g1411k3322j7143J6013N2675M4611K560l117M1184N9738J2103l8555l3389
40720D1947p072q609j5162O236K3778P60l0087k2191O053J1068l661j1163j2465
40707b0568j5762q515Q693Q228j0357p921K0635K4899j4115m5757l6165j7876
$$ plain form
40792 25784 76462 95923 98330 107692 97590 40075 -26570 -48406 -37985 -39828 -51155 -44590
40780 -44590 -32070 -34272 -21465 38249 99996 91309 23418 -21394 -4329 35061 51751 41095
40768 41095 14386 -18156 -40003 -43460 -44681 -53614 -51334 -29275 -17496 -33777 -43210 -17755 2998
40755 2998 -30577 -92874 -118424 -97085 -72723 -69165 -77658 -98327 -134460 -160428 -148656 -112478
40743 -112478 -76095 -29725 32122 60594 8271 -85849 -134430 -112822 -72769 -59138 -71411
40732 -71411 -94733 -111876 -95863 -43188 1423 3983 866 42050 101788 113891 75336 41947
40720 41947 34875 26266 11104 17340 41118 41878 11791 -10400 -4347 6721 3060 -8103 -20568
40707 -20568 -36330 -44845 -36152 -27924 -38281 -46202 -25567 -668 -14783 -60540 -96705 -114581
40695a14581j2012J6059P1681Q6281K2676n1326o2695l5537k4726j8330J6498
40684a06012N2698M9280K8150L0694M2036K6027p377l0099m5919n7495l5953J9769
40672c4201M8392J0957m3949n6592l9328k6342o261K9715M0477J0076M107O8236
40660E287J30978R8610k154o8055o5110m0264k1072M329K6445J7654r933j4594
40648F2121J2755M2781M9532K3774k7955o9373n9677j7539o316l2174k9326K2115
40636b9282N2103K1454q945Q022K0943j3832l9075k686L5521Q243l2290o991M4328
40623E7513L3120k1930l4306N52J4823p237k3378j9850q236K3462O6743N5564
40611A36840l0158r0415m3633L2983K6641k2385m322N2699L1886n2863o8310J3238
$$ plain form
40695 -114581 -126593 -110534 -38853 47428 70104 18778 -43917 -79454 -104180 -122510 -106012
40684 -106012 -53314 -4034 24116 54810 96846 122873 115496 85397 39478 -18017 -53970 -34201
40672 -34201 14191 25148 -18801 -75393 -114721 -141063 -147324 -117609 -77132 -67056 -62949 5287
40660 5287 136265 234875 232721 164666 99556 59292 38220 42549 68994 86648 76715 62121
40648 62121 74876 117657 167189 190963 163008 93635 33958 16419 10103 -22071 -51397 -29282
40636 -29282 22821 44275 35330 43352 64295 50463 11388 8702 44223 52466 20176 13185 57513
40623 57513 90633 68703 34397 34949 49772 42535 19157 -693 -8929 14533 81276 136840
40611 136840 106682 16267 -27366 5617 32258 9873 5551 58250 90136 37273 -31037 -17799
40599a7799P1697L7161k4116m5861m4278l6268k228L9797L6105l277j1796J5355
40587A4492J7191j3093j7983O840K062l5667l9551N733L8158K7585N575j7582
40575f240n5889p2254k1124M1068K1876l9521k3970N0378M1099o4765j03118L63
40563b32097J02288P2338j5695l4942o30J0309J0287L9640N4213N324m6730k2967
40551e8662L4766L1492k5679n0593j7322K3015L5552K6358l59l6875m9491k2992
40539a10790K542p348k2278j895L3552M4334L9693M5296M3031O813l3863k9015
40527A0072J4429M3129K9104r641m3313n3015l6534j2861k196M104K2837L4747
40515H62J2484j4195P692N3875M2527l0442p1250l4352J0148J944j5602Q555L5911
$$ plain form
40599 -17799 53898 91059 66943 21082 -23196 -59464 -61692 -21895 14210 10933 -863 14492
40587 14492 31683 18590 607 7447 9509 -26158 -65709 -59976 -21818 5767 11342 -6240
40575 -6240 -62129 -134383 -155507 -114439 -92563 -132084 -156054 -105676 -64577 -129342 -232460 -232097
40563 -232097 -129809 -57471 -73166 -108108 -108738 -98429 -88142 -48502 5711 11035 -35695 -58662
40551 -58662 -23896 7596 -18083 -68676 -85998 -62983 -27431 -1073 -1432 -38307 -87798 -110790
40539 -110790 -108248 -115596 -137874 -139769 -106217 -61883 -22190 23106 66137 72950 39087 10072
40527 10072 24501 67630 96734 87093 43780 -9235 -45769 -58630 -60826 -56722 -33885 862
40515 862 13346 -849 6843 60718 103245 72803 1553 -32799 -22651 -20707 -36309 -27754 8157
40502H157J8578j869L0569P1349L5151o2595j16014p0525J6520N6550K3536l2082
40490b2675l7668K3334Q1469O0373j6743n5066k4175J0846Q800Q976L0813J7135
40478H5419n6360j03928m8198N1599Q1063L0876j4826j5103p085k0119l4712k9079
40466h0453j0152O326J1699M443m184J030J2879J0641J479J1964L1961K1020j7402
40453A251l0538k850J9188J0499K950J1196J952k8382k7246K0093N0614K5510
40441E4237p624n385l73k5826m7785l3182j0327m062J0357L2981R697n7875p1684
40428a56851J2315R0154O1709j4687k6357J8410L6188J8230J1295O471k9679n9224
40416c2026k7707K4560K0877j9516k1333J1037J4879n832K697K7047Q231l6412
$$ plain form
40502 8157 26735 24866 55435 126784 161935 99340 -16674 -87199 -70679 -14129 9407 -22675
40490 -22675 -60343 -37009 44460 104833 88090 33024 8849 19695 28495 37471 68284 85419
40478 85419 29059 -74869 -123067 -71468 9595 40471 25645 10542 3457 -16662 -51374 -80453
40466 -80453 -90605 -84279 -72580 -68137 -72321 -71291 -58412 -47771 -46292 -34328 -2367 18653 1251
40453 1251 -29287 -32137 -12949 -2450 500 11696 13648 -14734 -41980 -21887 28727 54237
40441 54237 46613 41228 40855 15029 -32756 -65938 -76265 -80327 -69970 -36989 -27292 -85167 -156851
40428 -156851 -144536 -54382 7327 -7360 -33717 -15307 20881 39111 50406 56877 27198 -32026
40416 -32026 -59733 -35173 -14296 -33812 -55145 -44108 -29229 -35061 -32364 -5317 2914 -33498
40404c3498l3708J2260K5859m785j5322R000J1327k0287k6841Q409K5495k204
40392d4295j8972J2981M7138L2567m811p880K8824O0615N1282P444l0625k7727
40380A06541N812K4084N596k4474m2096m8553l2783K4089P9919N1638m9371r6767
40368C635l1549L6894M151n9375l5956L4832L2408l0113l7007J9681L3300j9666
40356d8765m0150J5495O5532M6246M45j6741j5774k0817k6622l0376l2385m036
40344a07948O5431J06669N1485m3044o2711j0669J1354j5533o756N7528R0218
40333A36024N2771J6178K5562K9404j0251n1563o1591o4539o3602k2709L7905
40322B3589M0201j8506m3817K866M3812K2037j6032k3509k4319l1093p510L5332
$$ plain form
40404 -33498 -67206 -54946 -29087 -33872 -49194 -40194 -28867 -49154 -75995 -67586 -42091 -44295
40392 -44295 -63267 -50286 -3148 29419 24608 16728 45552 106167 157449 164893 134268 106541
40380 106541 112353 136437 142033 117559 75463 26910 -5873 18216 98135 149773 100402 3635
40368 3635 -27914 8980 13131 -46244 -82200 -47368 -14960 -45073 -82080 -62399 -29099 -48765
40356 -48765 -88915 -73420 -7888 38358 38803 22062 6288 -14529 -41151 -71527 -103912 -107948
40344 -107948 -42517 64152 115637 72593 9882 -787 10567 -4966 -11722 45806 136024
40333 136024 188795 204973 230535 259939 249688 198125 136534 71995 8393 -14316 23589
40322 23589 63790 45284 1467 4333 48145 70182 54150 30641 6322 -24771 -32281 3051
40310C051K4730l6087m4080K5861N6092j8011q6503m6004K7647J7731l3579j2104
40298a21256O3825P9979J8011l3002l0518j7480k0862k0780j4157j6964j1980
40287a25184K4030N5637L1440k3447l7022r59K6214J9086J1986K4367L0305J3619
40275E0072m108n022j616r733k5511l5577l0022q444J1974P525j8496l3140j9684
40262a21782j133j213j0306r604r40O897J4444J8210R761j0J0725L1644K4783
40249b8524j4614m2629k7583J2298M4648N6260M0990j475m3163m6233j3329J8497
40237d4857L2654L9019L5910J7760M643N861j8197q4316j15554m4171N0622L9648
40225h0978m3495m5268N0049Q7640P436m8219K3035J11244Q4563n21k1080O100
$$ plain form
40310 3051 27781 -8306 -52386 -26525 29567 11556 -74947 -120951 -93304 -75573 -109152 -121256
40298 -121256 -57431 22548 40559 7557 -22961 -40441 -61303 -82083 -96240 -113204 -125184
40287 -125184 -101154 -45517 -14077 -37524 -74546 -75505 -49291 -30205 -18219 6148 36453 50072
40275 50072 45964 40942 39326 29593 4082 -31495 -61517 -69961 -57987 -50462 -68958 -102098 -121782
40262 -121782 -122915 -124128 -134434 -144038 -144978 -138081 -123637 -105427 -95666 -95676 -84951 -53307 -28524
40249 -28524 -43138 -85767 -113350 -101052 -56404 -144 40846 39371 -3792 -50025 -63354 -44857
40237 -44857 -12203 26816 62726 80486 85129 90990 72793 -11523 -127077 -171248 -120626 -80978
40225 -80978 -124473 -169741 -119692 -32052 -24616 -72835 -49800 61444 146007 145486 124406 130506
40213A30506n396l5279j2082K6970p264q3620q6765l806N9686M3038m969k4029
40201c010r292J9028L6444J3700m1247o4056j7060M4101N0030J9340J0209J7744
40189G5931j57l4717m4733l0187j6882m050R712l731m2530m4425J4133N7126K7449
40176c7061j0572J5659M9926L629p6066p1327J4210O5346L6688l396k965J3270
40164b659J4480O80k6189n1917l4669K7042N5593N527m6230j9229L1669J6194
40152b9708k5498l176M1222K965p6952o0259M7844R8137M5018L896L2028M0382
40140A15899k1716o9528m3316r572k1759k2946K6382N6170J7332j5359K6180P3551
40128A11318L2107o0223r2146l8922L0763O3047N4346J6171k8354m3431k5303
$$ plain form
40213 130506 125110 89831 77749 104719 97455 13835 -72930 -76736 -17050 25988 21019 -3010
40201 -3010 -12302 6726 43170 56870 15623 -48433 -65493 -21392 28638 47978 58187 75931
40189 75931 75774 41057 -3676 -33863 -50745 -54795 -45083 -48814 -91344 -135769 -121636 -64510 -37061
40176 -37061 -47633 -31974 17952 21581 -54485 -125812 -111602 -46256 -9568 -12964 -15929 -2659
40164 -2659 11821 12501 -13688 -65605 -100274 -73232 -17639 -12112 -58342 -77571 -45902 -29708
40152 -29708 -55206 -58382 -17160 -14195 -91147 -151406 -103562 -5425 39593 43489 75517 115899
40140 115899 94183 24655 -18661 -28233 -49992 -72938 -46556 9614 26946 11587 37767 111318
40128 111318 143425 83202 -8944 -47866 -17103 45944 100290 116461 88107 44676 19373
40117A9373j4866l2029m2659k0972Q440K1834L2875M7460M0646Q678j5706k5381
40105B7693n0474q3745o9941j481N2137M7113K1256J0864n313l4672k8714L0054
40093h5223P5384N2310k348l0693l6950m3540l3580P46J7694l478j4333J8615
40081h5396M6771K2920j2763l461K6637K2469o195j6133j0653j2944m939L1292
40069b395N4664K4815k0346k4408p751k0298m0373j4202L5105L7905n12r308K2545
40056C5441K9356j3818m9438l5105k477R366J0113J6970J7516O381P287K5463
40044E7055K4053j6778n6626m9560j2087M741p589q542K3182N2913L8547m827
40032D4482j6579K9441Q0995O8714Q12m1580j3597K9500J0253n8600q9483m2119
$$ plain form
40117 19373 4507 -27522 -70181 -91153 -82713 -60879 -28004 19456 60102 68780 53074 27693
40105 27693 -22781 -106526 -176467 -177948 -125811 -78698 -57442 -46578 -51891 -86563 -115277 -85223
40093 -85223 -9839 42471 40123 9430 -27520 -71060 -104640 -103894 -86200 -89678 -104011 -85396
40081 -85396 -38625 -15705 -28468 -31929 -5292 17177 10982 -5151 -15804 -28748 -33687 -2395
40069 -2395 52269 77084 56738 32330 24579 4281 -36092 -50294 -15189 22716 22204 12896 35441
40056 35441 64797 50979 1541 -33564 -36041 -26675 -16562 408 17924 24305 31592 57055
40044 57055 81108 64330 7704 -41856 -53943 -49202 -56791 -65333 -42151 10762 49309 44482
40032 44482 27903 57344 138339 207053 207865 166285 152688 182188 192441 133841 44358 2239
40020B239K0706J8627m1478p9287m4622K6852O5051M6001N065j4645m647J4894
40008A4756K2779J3293j082o44J5481J8199j5735o0754o6909k9800K139J95q718
39995i6800J299R450p860k9378k5353o542L140R675K5619L9366M5773O4023Q3004
39982A15416M5516n4010j16787o4964L2634N4342J724k5536J693J9937P572J4291
39970C1828M4826L4124l1842p7682n7354j6239J331J5043M0319M4782J6857j114
39958D4879R766R147k2447m3115k8502j5985k9057l2265n110J2054p076k1942
39946a29653N636N0198P0737O1102K3287m0757q4235m4527M8902Q3140J9199n0993
39934A2036n1875k8075l7377m1021J2246P5005O9785R836l4125l8562k5003l284
$$ plain form
40020 2239 22945 41572 94 -79193 -123815 -96963 -31912 14089 19154 4509 -138 14756
40008 14756 37535 50828 49746 49102 64583 82782 67047 6293 -60616 -90416 -88277 -88082 -96800
39995 -96800 -95501 -86051 -93911 -123289 -148642 -155184 -152044 -142369 -116750 -77384 -31611 32412 115416
39982 115416 160932 106922 -9865 -74829 -42195 12147 13871 -11665 -9972 9965 17537 31828
39970 31828 76654 110778 78936 1254 -56100 -72339 -71008 -55965 -15646 29136 45993 44879
39958 44879 54645 63792 41345 -1770 -30272 -46257 -75314 -107579 -112689 -100635 -107711 -129653
39946 -129653 -124017 -73819 -3082 58020 81307 40550 -43685 -88212 -39310 43830 63029 12036
39934 12036 -39839 -67914 -105291 -146312 -134066 -59061 10724 20560 -13565 -52127 -77130 -80414
39922h0414J5808L279l0641k0820M8971R3702M8218k9118n1573l2400k9993l2466
39910i7447J096L7588J5618m0701n2937q296L8659N8242N8464L4576j3569m1751
39898a0458j6556J8601O757k8730l1142j1632j7131l4020j7564J2619M625k0599
39886a45230K907O4376Q2015L1538k1976k9422j4906j5982l4749n8223p0493m3621
39874b53766K9314R7114J00510N1611J2031N106L448j1373l1807n3255o9673n8057
39862a78797j4613J8606J1498j806J9382N0326M6009J8927O379r20k6878m4357
39850i6244j6796K7313L5722J5968O171L26k2103l3244m042K8349K3907K1123
39838a3550O1138Q4378J6607q5088r8389k1020L5748K1327j1542k6381l7653l0169
$$ plain form
39922 -80414 -64606 -61327 -91968 -112788 -63817 29885 78103 48985 -2588 -34988 -64981 -97447
39910 -97447 -96351 -58763 -43145 -83846 -136783 -145079 -106420 -48178 10286 44862 31293 -10458
39898 -10458 -27014 -8413 -1656 -30386 -61528 -73160 -90291 -124311 -141875 -129256 -124631 -145230
39886 -145230 -142323 -77947 4068 35606 13630 -15792 -30698 -46680 -81429 -139652 -210145 -253766
39874 -253766 -224452 -127338 -26828 24783 36814 41920 45368 33995 2188 -51067 -120740 -178797
39862 -178797 -193410 -174804 -163306 -165112 -145730 -95404 -49395 -30468 -24089 -25009 -51887 -96244
39850 -96244 -113040 -85727 -50005 -34037 -27866 -27540 -49643 -82887 -86929 -58580 -34673 -13550
39838 -13550 47588 131966 148573 63485 -34904 -55924 -20176 1151 -10391 -36772 -74425 -104594
39826a04594K8026Q8600O4957k0148n3944j0669K1170M583P844N8108P8402K4778
39814A87113l5525m2953l2283l9273k6662K7023N9169J8802m5779o3109l6254
39803b9731p395J0153J3555r741l6722j2034N8204Q9311M2655j1142q741P892
39791A06264j9913n6591l5892K0648L8476Q527j1657M124K3245J6532q925l5671
39779D9167n1943m6322j8776Q468J3198k350k1017k7965j2837J9067L3428m47
39767e8329n6198o8988j9120M2676O5248M9985K0713j1518l1788j5071L3074O4600
39755A5284M7444Q972m747R647J7022m531l6282m1285r125K4519J6490k4029m3246
39742b3867k0415M161R28j954J7286K0863j8640m9174j5481L9615L5311j8567
$$ plain form
39826 -104594 -76568 12032 76989 56841 2897 -7772 13398 17981 25825 83933 162335 187113
39814 187113 151588 108635 76352 37079 10417 37440 96609 115411 69632 6523 -29731
39803 -29731 -37126 -26973 -13418 -23159 -59881 -71915 -13711 75600 118255 107113 98372 106264
39791 106264 86351 29760 -6132 14516 52992 61519 49862 53986 77231 93763 84838 49167
39779 49167 -2776 -49098 -67874 -59406 -46208 -48558 -69575 -97540 -110377 -91310 -57882 -58329
39767 -58329 -114527 -183515 -202635 -159959 -94711 -44726 -24013 -35531 -67319 -82390 -49316 15284
39755 15284 62728 71700 66953 76600 93622 89091 52809 11524 2399 26918 43408 19379 -23867
39742 -23867 -44282 -40121 -39193 -41147 -23861 -2998 -21638 -70812 -86293 -46678 -11367 -29934
39730b9934m1931j0554K6181L6811L2468J5636j3684j8697K4794O2320L0525l4088
39718G9847m9662k1034j2444k0032Q483N0783L7081j3519j8541J3588l444o6726
39706a5620p9612k5239Q899j54K2853Q4238Q6999J3802k1600K6725M9056k3684
39694A26663r0973n4117K1758L2561K019L540J8033q287m6828m1943j4933j1271
39682f3778q827K6681N6704L1146k0333l9532k9401k1886j2628P020J1992k678
39670f5520O616N2001P5263M1395m982k6505m9831q2225o8304M802N5631L3277
39658b8382l54J4470L6548J8505J3J8884K5479k0543n8230k5004L5505N4857M4312
39645A16060L3635o80n7572o2718N117M2547j7770q0374l8944M7453O0212J0391
$$ plain form
39730 -29934 -71865 -82419 -56238 -19427 13041 28677 14993 -3704 21090 83410 113935 79847
39718 79847 30185 9151 -3293 -23325 -14842 35941 73022 59503 40962 54550 51106 -15620
39706 -15620 -95232 -120471 -111572 -111726 -88873 -4635 82364 96166 74566 101291 150347 126663
39694 126663 35690 -18427 3331 35892 37911 41451 59484 51197 4369 -37574 -52507 -63778
39682 -63778 -72605 -45924 10780 41926 21593 -17939 -47340 -69226 -81854 -74834 -62842 -65520
39670 -65520 -58904 -6903 68360 109755 104773 78268 28437 -53788 -122092 -117290 -61659 -28382
39658 -28382 -28736 -14266 22282 40787 40800 59684 85163 64620 6390 -18614 16891 71748 116060
39645 116060 149695 149015 91443 28725 33842 76389 58619 -21755 -60699 -13246 46966 57357
39633E7357j4933j2350k7815l5183J0899O2031M6758n336k9759m5042q1515p7716
39621a52604J1018Q5155M0452m1501j5181Q0436Q4035j6850p1133j3486N2884
39610D3225M0187j2388l8212k8230M725M3902M6826m409m8602l0118J946k0162
39598a310n3131k0850L3889J7406m1798m0573J2851J8799k8591l4531K3639O4422
39586d9778M3857k093m8328q8064p2463K3963J06905P3344j4462j9319M3843M4515
39574D1920k7598n2921nL7911K9734M0022O2740J5449p5507p8571J6456O5803
39562G5433J1783l2843N022N1458N1813N9907Q9348N9481k7653l9352O1877J21942
39550D88216L6448p9629q8855m1307m7414p9587n4164r64J349k5293j3455J5348
$$ plain form
39633 57357 42424 30074 2259 -32924 -22025 40006 86764 81428 51669 6627 -74888 -152604
39621 -152604 -141586 -56431 -15979 -57480 -72661 7775 91810 74960 3827 -9659 43225
39610 43225 83412 71024 32812 4582 9307 53209 100035 95626 47024 16906 18852 -1310
39598 -1310 -54441 -75291 -41402 -23996 -65794 -106367 -93516 -74717 -103308 -137839 -114200 -49778
39586 -49778 -5921 -8014 -56342 -144406 -216869 -192906 -86001 -12657 -27119 -46438 -2595 41920
39574 41920 14322 -38599 -38604 -693 29041 69063 131803 147252 71745 -6826 9630 75433
39562 75433 87216 54373 59395 110853 162666 222573 311921 371402 343749 304397 366274 488216
39550 488216 524664 445035 356180 314873 267459 187872 133708 132744 134093 108800 95345 110693
39538A10693k64l7927l4880l069N245j758J3141L0486J1543k0996k3078q552j2372
39525B8212j8051M218K9112J7805r431r052J1246J4881K460M64R427Q750p231
39512H2810k7435l6631j9365J6538K5730j5558n0546j4141N0900M5598k2641m4016
39500h757J3422N2988J5591k7773q311K8316J4701k7358m3507l7346l5407k7541
39488i0982j608J9774K1670J8897Q339l1085o9839m2688M2297R6227P5235K5319
39476G1556j3792m6780n0946J2612R1379P5581k4105o8180j955O4012M1983j0904
39464A40461k7447l9818p0830n8703J4194N1377J050m4016p749L7367J0106l4665
39452b8673k1015Q313o775j6342L3375P2536K3891m9033m6774J039J0095m878
$$ plain form
39538 110693 110429 72502 37622 34553 39798 38040 51181 81667 93210 72214 49136 40584 28212
39525 28212 10161 14379 43491 61296 51865 42813 54059 68940 71400 71864 81291 90041 82810
39512 82810 55375 18744 -621 15917 41647 26089 -24457 -38598 12302 57900 35259 -8757
39500 -8757 4665 57653 73244 45471 37160 65476 80177 52819 9312 -28034 -63441 -90982
39488 -90982 -92590 -72816 -51146 -32249 -23910 -54995 -124834 -167522 -125225 -28998 46237 71556
39476 71556 57764 10984 -39962 -27350 64029 139610 115505 47325 45370 109382 151365 140461
39464 140461 113014 73196 2366 -56337 -42143 9234 10284 -33732 -41481 -4114 5992 -28673
39452 -28673 -49688 -41375 -48150 -64492 -31117 41419 65310 16277 -30497 -29458 -19363 -24241
39440b4241J2964L3072K566l4016j4930J2725j8432n6696k0592M3976M0329j0790
39428c4065k4446r685k6187m3878r72N1634K5039l3462o970Q2676J02072K6222
39416A07978l3476k0643K252o535q434J2990J5285j2638k9176k3622k4964k4806
39404d5789J1551N8997N5782J0231j1659j40o621l9376n1191l0641j5294j4137
39392g8287J78K6417L8211L9319M3570K6759k4185n2054r060M5229K7175k9130
39380E4142k7704K3491K8459l0142o6715l7601O350K3189L0920L9442K4416j2783
39368E5464l5360l1196j9308k576K3719L4618J0971j4948j3166j3594l9528m0904
39356h5808J7230O1843J6052o0690n8878M287K7556L672J0056M8371M3982l735
$$ plain form
39440 -24241 -11277 21795 24361 -9655 -24585 -11860 -30292 -86988 -107580 -63604 -23275 -34065
39428 -34065 -58511 -68196 -94383 -138261 -139233 -87599 -62560 -96022 -102992 -20316 81756 107978
39416 107978 74502 53859 56111 49576 41142 54132 69417 56779 27603 3981 -20983 -45789
39404 -45789 -34238 24759 80541 90772 79113 78973 72352 32976 -18215 -48856 -64150 -78287
39392 -78287 -78109 -51692 -13481 25838 69408 96167 71982 19928 10868 56097 83272 54142
39380 54142 26438 49929 78388 48246 -18469 -56070 -49720 -26531 4389 43831 68247 55464
39368 55464 20104 -11092 -30400 -32976 -9257 25361 36332 21384 8218 -5376 -44904 -85808
39356 -85808 -68578 -6735 9317 -51373 -110251 -105964 -78408 -74736 -64680 -16309 27673 23938
39344B3938j7513R192J559m8164n8736n432M0853M2026L8503M4484J8112l5658
39332E3164m6748K248M2807L4337J4213R268o034l6469m2547j7093l193j5404
39320a1451j9802m176P231J1865K5627K8689m035l3887j0476K7883Q855l9240
39308a2917k4059N0131Q1239K9593l8628p0416p2069l8658L8177R1649M1654n7937
39296A7759p1205Q418M6385q832m7795K695N7970L0544k3867j1527M6953O4691
39284A12189K0234l8484p0966o5372k6771J3071J5058j2203j9666Q884M1286N6434
39272C3694O0488M6614L675l9127m2158k0120j1675p298J7946L2568q03l8009
39260C5795j8365J8540m848n9430n4678N44K1001O010K7795P2686N4039j5578
$$ plain form
39344 23938 6425 15617 17176 -30988 -89724 -95156 -54303 -12277 26226 70710 88822 53164
39332 53164 6416 8664 51471 85808 100021 109289 103255 66786 24239 7146 3953 -11451
39320 -11451 -31253 -35429 -28198 -16333 9294 37983 33948 61 -10415 17468 26323 -12917
39308 -12917 -36976 13155 94394 123987 85359 14943 -57126 -95784 -57607 34042 75696 17759
39296 17759 -53446 -45028 1357 -7475 -55270 -52575 5395 35939 12072 545 47498 112189
39284 112189 132423 93939 22973 -42399 -69170 -56099 -41041 -53244 -72910 -64026 -22740 33694
39272 33694 94182 140796 144471 105344 63186 43066 31391 24093 42039 74607 73804 35795
39260 35795 17430 35970 31122 -28308 -82986 -82442 -61441 -55431 -27636 45050 99089 83511
39248H3511k9114K3991L6552k0723m7445J857M0647J1579k2280o832J6329J0508
39236I8580O703J3724j3083o5079o3499L336M4933J6198j7255m246J7572J2998
39224E0882L104m023k4031k0615N4696J35414R8269l2875r8958m9068l326l2302
39212G7167n2290m932L1667l742m3853k2421J8570K9541L3978M1406Q504n2034
39200F1561n5787M971L3610j117j5071K2916L1856j6622l8792m062R145j6396
39188A6212R568R2513J04429Q837n8135k2925O249m2218o7689J08O0712L8245
39176A45906K5588R2137J35150P3568P587K6701L8472m2550j10442n4981K8506
39165C65642M745p2381q1280m4533l8586k9071K4042L5424m9142j06162l1814
$$ plain form
39248 83511 54397 78388 114940 94217 46772 48629 89276 100855 78575 71743 88072 98580
39236 98580 105283 119007 105924 40845 -22654 -19318 25615 41813 24558 20312 37884 50882
39224 50882 53986 49963 25932 5317 60013 195427 293696 260821 161863 112795 109469 77167
39212 77167 24877 19945 51612 47870 4017 -18404 166 29707 63685 105091 113595 61561
39200 61561 5774 10745 44355 43238 28167 51083 82939 66317 27525 23463 32608 16212
39188 16212 25780 118293 222722 231559 173424 150499 156748 114530 46841 46949 107661 145906
39176 145906 171494 263631 398781 472349 479936 506637 545109 502559 392117 337136 365642
39165 365642 370387 298006 216726 172193 133607 104536 128578 164002 114860 8698 -23116
39154b3116N8369K5598m3017O35Q8922O3930l5480n5611l474k25l8007k0748J8806
39141C6582k2201r4223o1721M7941Q3174K5161n473K4491L0394q723k6609j6001
39129A2792k7242m0017K116N7105M1403j4764k2675J908j1665l3470M349M7654
39117A7494K223p6217n8622L3412O5380J6881j0436J5062K8048R115k264q947
39105C1129k8750j6186M8898P0361j3008q0942j5386P4843K5411q7969p2039M3224
39093b0414N8456m2293p3545J8779P7904K1976l7127j3820K6643K1491N217K859
39081D6126j3160l1061r358J8371p642m1550m517N0772K4016l2170M919Q9311
39069I4057P0641l4447o7393o784J5607k7041k4604L4648L7141k6854m0930P187
$$ plain form
39154 -23116 35253 60851 17834 18469 107391 171321 135841 80230 76756 76531 38524 17776 36582
39141 36582 14381 -79842 -141563 -93622 -10448 14713 9240 33731 64125 55402 28793 12792
39129 12792 -14450 -54467 -52351 4754 46157 31393 8718 10626 -1039 -34509 -30160 17494
39117 17494 19717 -56500 -115122 -81710 -16330 551 -9885 5177 33225 42340 40076 31129
39105 31129 2379 -13807 35091 105452 92444 11502 -3884 70959 96370 8401 -63638 -20414
39093 -20414 38042 -4251 -77796 -59017 18887 40863 3736 -10084 16559 38050 43267 46126
39081 46126 32966 1905 -7453 10918 3276 -38274 -42791 7981 31997 -173 4746 94057
39069 94057 164698 130251 62858 56074 71681 44640 20036 54684 91825 64971 24041 31228
39057C1228M893n2415m4706K9075L4735l4031k8426O9059Q8690k2554r3150j8962
39045c6564P2641N9517R104R530J3419k9081n3921j3395K7150J6563J978J3400
39033I0341N945k5958k3428M809j8494p5192n7772K9946O1353Q418j8897J2067
39021f862Q445m0488k5633N7918P1530j4962n3614K0889P9420L5581j7170j04
39009A14950K1541j336o602K4827J0891n4285n9641J2257L7862j4419k2995M1626
38997A04676M6303m2081o8621K8713R5114L5169l0583j3528j3930q6932j00215
38986d5915J0441Q2360J766q7770m0305M4782K7019k6244l47M2899Q095l5565
38974a8784K141M8916J8615j3647L1904O7880Q241n1554r078M9170J3947m2746
$$ plain form
39057 31228 36121 -16294 -61000 -31925 2810 -31221 -59647 9412 98102 75548 -17602 -36564
39045 -36564 36077 95594 104698 114228 127647 98566 44645 31250 58400 74963 76941 90341
39033 90341 96286 70328 46900 51709 33215 -41977 -99749 -69803 -8450 -32 -18929 -6862
39021 -6862 1583 -38905 -64538 -6620 64910 49948 -3666 17223 96643 132224 115054 114950
39009 114950 136491 135155 128553 153380 164271 109986 50345 62602 100464 86045 63050 104676
38997 104676 150979 108898 40277 68990 164104 199273 168690 155162 141232 54300 -45915
38986 -45915 -35474 46886 48652 -39118 -79423 -34641 -7622 -33866 -34213 8686 16781 -18784
38974 -18784 -16643 32273 50888 37241 69145 137025 145266 93712 84634 133804 147751 105005
38962A05005j9692J6465j9451m5134K2315P2198j0608j12093p1849L6943M4165
38951A8264k1839j4914N3512N7868J119j0457K3309J5949k7133l1307l630j274
38939E9467q009J4456K5401j0433k7146K2475N7582J3024k9408N045L3902k2496
38927A33860p1301j0664P3233N5289j2705k0673l408l3783m6749K6057P6535p569
38915A58122j12327o7934N8657P6479j5150o0762k3506L579K256K8189N4500J6007
38903A18110l8864k3532J8121n928n5449l6551J6396J5640n454K7024O0513J4836
38891A04862m2912j2325M5342K1397k9758j174M4226j4381j07527p4268N4335
38880a2183J01299K9577l2904k0605J0563J9168O774m0637r4625n1597R4519J64478
$$ plain form
38962 105005 85313 101778 82327 37193 59508 131706 121098 9005 -62844 -25901 18264
38951 18264 -3575 -18489 35023 92891 94010 83553 106862 122811 95678 64371 60741 59467
38939 59467 51458 65914 91315 80882 53736 76211 133793 146817 117409 122454 156356 133860
38927 133860 62559 51895 125128 180417 167712 147039 143631 109848 63099 89156 165691 158122
38915 158122 45795 -22139 36518 112997 97847 37085 13579 17158 19414 47603 102103 118110
38903 118110 79246 55714 73835 67907 12458 -24093 -7697 7943 2489 29513 90026 104862
38891 104862 61950 49625 94967 116364 86606 85432 129658 115277 7750 -66518 -12183
38880 -12183 89116 118693 85789 65184 75747 94915 101689 61052 -33573 -85170 9349 173827
38868A73827M7777r2708o6594M0470L7683m0410l5934K3930K946n7420j5921P8224
38856I5870O0133m2050n5170K4822M2342k4563m6806j29J3733j5278m003K9779
38844G8680r65n6668k8819M5308M4486r666p495K8147K250m1731n499M7454J937
38831I7419o8597k8125M9354R670p4906k9252Q2468O1245n2261m7329O4267P4855
38819A38808k8989n4890K4627L8039m0558n4033J2432M971p4845n5370O0670P2805
38807D3667m6955r1313J1928Q7509M4442J0482N2392N6815j9642n5582n913J7196
38795A05026k3748k4728L6496N1775K802p691K6619P292m8995l1159L0620J1604
38783A35913m6669n459P4799K1122j02726p9295N3474N1506q1638r1643N1108
$$ plain form
38868 173827 221604 128896 62302 102772 140455 100045 64111 88041 90987 33567 17646 95870
38856 95870 156003 113953 58783 83605 125947 101384 54578 54449 68182 52904 48901 78680
38844 78680 77715 21047 -7772 37536 82022 72356 64861 93008 95258 53527 48028 95482 97419
38831 97419 28822 697 50051 59721 -15185 -44437 38031 99276 47015 -314 63953 138808
38819 138808 109819 54929 79556 117595 77037 23004 35436 40407 -34438 -89808 -29138 43667
38807 43667 -3288 -94601 -82673 4836 49278 59760 112152 168967 149325 93743 87830 105026
38795 105026 81278 56550 93046 144821 147623 139932 166551 173843 124848 93689 124309 135913
38783 135913 89244 83785 158584 179706 76980 -2315 51159 102665 21027 -70616 -19508
38772a9508R1606l3850q3908L1065R2805j777o1583J2420M7312l7074n2810R3132
38760G7830K03655J34839J7789k2066n8715j32209j29528l7111q234n9217j7557
38749c0524J19050J21419n1684j38516k1609P8446J4920m8785J0501N3059r667
38738I6610l2566M4175M6061p8656j12063K9484J10655K439p9162J6927R9321
38727A43225J0416q0442j8022N0319j0594n6291K6640P3891k6003q4172L1977
38716F0944J21567J3289j12930n8833M4523J6054m4599J181M5040k4279p1080
38705i123J4035P3285j4399q0462J0184Q6524K711o8932K8258J18870K2511j04576
38693G8886p0208O510l5907q0061M118O7438k1475q4615L1897J34771L3629q8971
$$ plain form
38772 -19508 72098 38248 -45660 -14595 78210 76433 14850 27270 74582 37508 -15302 77830
38760 77830 281485 416324 434113 412047 353332 221123 91595 54484 46250 -12967 -30524
38749 -30524 88526 209945 158261 19745 -1864 76582 91502 42717 53218 106277 96610
38738 96610 64044 108219 154280 75624 -36439 -6955 103700 106139 26977 43904 143225
38727 143225 153641 73199 55177 105496 94902 38611 65251 139142 113139 28967 60944
38716 60944 182511 195800 82870 24037 68560 84614 40015 41196 86236 61957 -9123
38705 -9123 4912 78197 63798 -16664 -6480 80044 82755 13823 42081 160951 183462 78886
38693 78886 8678 15188 -20719 -100780 -96662 -29224 -50699 -135314 -103417 31354 64983 -23988
38681b3988j1926J16692P1938l4959p096N3112j7229r0501r951O9099k6598j27278
38669c8685l2205R6236L9521n7821J9417J24794L2931j11998o3649O2742K9846
38658A01129o2415K090J10296M2333q2005k5076J09723P9859m0306l7029J6745
38647B15344n6422j40320m2503R8693N5249n5906r651Q0893k756j32737p0671
38636f0787O7654M1061m9149J6983J18345L2246r9426k9886J00849L0506j07481
38625F0915m3245R1936J9901j26836n2309J22488Q8746n8017k7582P9176j4512
38614A40661j69422o6595J55808J26849p1469p4756P2699M1510j17963q6796P7698
38603B8224N8711q1743l1368J28682O7492j27668r6202R8037R2862o3391k5483
$$ plain form
38681 -23988 -35914 80778 152716 117757 110661 163773 146544 56043 46092 115191 88593 -38685
38669 -38685 -70890 25346 64867 7046 26463 151257 184188 72190 8541 71283 101129
38658 101129 38714 40804 151100 193433 111428 86352 196075 275934 235628 198599 215344
38647 215344 158922 18602 -23901 74792 130041 74135 64484 145377 142621 9884 -60787
38636 -60787 6867 47928 -1221 15762 134107 166353 66927 37041 137890 168396 60915
38625 60915 17670 109606 129507 2671 -49638 72850 161596 103579 75997 155173 140661
38614 140661 -28761 -95356 60452 187301 115832 41076 113775 155285 37322 -49474 28224
38603 28224 86935 5192 -26176 102506 169998 42330 -53872 44165 137027 73636 48153
38592D8153J39486P7650j20078n8217J81679J72692k1064M7893L16888K94807
38582A079889N1665K12674Q25029J111264O07543k12050p08418p95412o52340
38573A519844l66106j07611j03931k38697j76376L8626M9713j29082j17627J12963
38563D81716J82240J5133m1157J20232K28245K03130K20240J99061r1630m28567
38553A088643l57372j0089N8488j67880j85128N7553Q4418j57153j85616P0195
38543B96059J29109r9178j43779Q9546J32777j02954j32823J38153J97043q6564
38533D17389j95763L7963J23167j11398j80224Q7264J92002n9317j69048P9363
38523B21398K00787l8066j70789M5061J70909k1040j07089J08226J79708p9381
$$ plain form
38592 48153 187639 265289 145211 86994 268673 441365 420301 468194 785082 1079889
38582 1079889 1131554 1344228 2169257 3280521 3888064 3676014 2967596 2172184 1519844
38573 1519844 1153738 1046127 942196 703499 527123 565749 615462 486380 368753 481716
38563 481716 663956 679089 637932 758164 986409 1189539 1409779 1608840 1517210 1088643
38553 1088643 731271 721182 779670 611790 426662 484215 568633 411480 225864 296059
38543 296059 425168 325990 182211 271757 404534 301580 168757 306910 503953 417389
38533 417389 221626 259589 382756 271358 91134 178398 370400 311083 142035 221398
38523 221398 422185 384119 213330 258391 429300 408260 301171 409397 589105 509724
38513E09724j96491L0502J24968j14367j94767Q9473K20301l6949j68365O8777
38503C32806J61033j26793k52564M1095K00975n0131j56943J57657L03815k9202
38493E81748k24894R4854L38231P6349j70461M31J04628j85622l19579L3922K57680
38482E87287m8009k69443L5357K74341q939k38135L8952K39990q5338l27912r208
38471A88943K58583k0282k32685J17645L85792L8561k74649R810K56929q6240
38461F42407l50089L9052L70275R482l33681J9110L73410K9974l22931K4487L76400
38450H77896J3784l45804L1774L93048k9298m43734k6749M14689Q907m24093K8636
38439D99056N20278P5142m54145l9786M66730J5404m97753L0941O46345J34926
$$ plain form
38513 509724 313233 343735 468703 354336 159569 249042 469343 432394 264029 332806
38503 332806 493839 367046 114482 155577 356552 306421 149478 307135 610950 581748
38493 581748 356854 451708 789939 866288 695827 696258 800886 615264 295685 329607 587287
38482 587287 539278 269835 305192 579533 570594 332459 371411 611401 526063 198151 188943
38471 188943 447526 427244 194559 312204 697996 736557 461908 471718 728647 642407
38461 642407 292318 331370 701645 711127 377446 396556 769966 799940 477009 501496 877896
38450 877896 891680 545876 577650 970698 941400 497666 470917 885606 894513 470420 499056
38439 499056 1019334 1094476 640331 600545 1067275 1082679 584926 615867 1262212 1397138
38429A397138n43870q0627N91198J15684n62857l9865P00236J73705o02898o4002
38419A083842P34401J41687p19664p2816R06442K98453o81861J6912J110530L91881
38409C209807p55158Q8843J447049O56746o92940L70976K163613J361372k62215
38400G588093R67884L099586K065581K86266K719297O697252O304310M666707
38392C4394976R136081J6155120J7310686K0262202M1523341P1325226P0104880
38385B80212512J8215759m8747738p7395888n8687327k9182281j7512470j6922881
38378D9979686j1963206m921390m361067o882847m843269n77148l98436k505862
38370A3526461j573294Q32858j1799k674701k558506m23147k38863j592422j217130
$$ plain form
38429 1397138 853268 772641 1363839 1479523 916666 876801 1577037 1750742 1147844 1083842
38419 1083842 1818243 1959930 1240266 1167450 2073892 2372345 1690484 1707396 2817926 3209807
38409 3209807 2454649 2543492 3990541 4647287 3954347 4325323 6488936 7850308 7588093
38400 7588093 8555977 11655563 13721144 14007410 16726707 23423959 29728269 34394976
38392 34394976 43531057 59686177 76996863 97259065 138782406 210107632 280212512
38385 280212512 298428271 249680533 172284645 113597318 84415037 66902567 49979686
38378 49979686 38016480 33095090 28734023 21851176 17007907 16430759 16032323 13526461
38370 13526461 11953167 12786025 12774226 10099525 7541019 7117872 6879009 5286587 4069457
38361D069457L92771K85529j045558q58077M30023L10852q18707o27503M98183
38352B636970L49764p17110n92017M23981L27964o21741n17551M21063L66468
38343B077791n12278m74892L54013L27340m53233m15132L61718L64125l66680
38334A262772l92222K81950L20840k55113j95639M13646L29676l15379k18900
38325A231631N15878N11122k73830m95644M1532J69464l03130l24886K26157L04501
38315A602795k16096l09612J76054K64726j95511k66422J95517K70320j88605
38306A333166k69558K02810L45113n4511j78496J82386K72139p9697j38627K32559
38296A847284K95796o9476j04879L25676M54963J09816L4603M28941N90529L23018
$$ plain form
38361 4069457 4462228 4747757 3702199 2844122 3274145 3584997 2766290 2138787 2636970
38352 2636970 2986734 2269624 1677607 2101588 2429552 1807811 1290260 1711323 2077791
38343 2077791 1565513 1090621 1444634 1771974 1318741 903609 1265327 1629452 1262772
38334 1262772 870550 1152500 1473340 1218227 1022588 1436234 1765910 1450531 1231631
38325 1231631 1747509 2258631 1984801 1489157 1530689 1700153 1397023 1072137 1298294 1602795
38315 1602795 1386699 1077087 1253141 1517867 1322356 1055934 1251451 1521771 1333166
38306 1333166 1063608 1266418 1611531 1557020 1378524 1560910 1833049 1753352 1614725 1847284
38296 1847284 2143080 2073604 1968725 2294401 2749364 2859180 2893783 3322724 3913253 4236271
38286D236271L00916P09860Q93241O88020P68295J307949J620034J495457J598240
38277A3618283K114152K253547J549084N05436m26562j386546k262153k474388
38269A3490853k019488j647449j635291j444328r07884o24074p97096q19990m31246
38260C164007j92964l80820m69001j80105p312k12948l12364m3348J20248q9733
38250A395660k21889j5623R4388j34052k59354l5592R9225j03216k09899K4727
38240F34375J57465p7404k41647m1127J19994n2000j78564K1217J76802R154j26324
38229D01941L6355J44584n4460j90580O479J68829O201j32673M9874K25320R7756
38218G59626j4808J92577M19629L28860J19414M2036o0713k60826k25028J23970
$$ plain form
38286 4236271 4537187 5247047 6140288 6828308 7596603 8904552 10524586 12020043 13618283
38277 13618283 15732435 17985982 19535066 20040502 19613940 18227394 15965241 13490853
38269 13490853 11471365 9823916 8188625 6744297 5836413 5212339 4415243 3595253 3164007
38260 3164007 2971043 2590223 2121222 1941117 1933805 1720857 1408493 1365145 1485393 1395660
38250 1395660 1173771 1158148 1252536 1118484 859130 823538 922763 819547 609648 634375
38240 634375 791840 714436 472789 431662 551656 499656 321092 342309 519111 528265 401941
38229 401941 438296 582880 528420 337840 344319 513148 519349 386676 436550 661870 759626
38218 759626 744818 937395 1357024 1685884 1805298 1847334 1786621 1525795 1300767 1424737
38208A424737K69639o6555l96670k89196o7323j31576k38851o5277J25022R907
38198E73857j52060l9524J06668j0256j36380J7572J73217K2942j40803K3096
38188D38329K29106J09080o3830R8282L24228K01112L6646L64745Q98592Q38550
38178C474840P7962o67804q70412o64614l66355j17766r910o5760j04251J4453
38168G00383J13339o16j58471j17202N429k3717j13641o4311K2799k9264q1164
38157B53564N5778K03073J09833p0218m8809P5581K8843j17263j05142J2798K700
38146D00738r0187n8316M2200J4442p5514l2918P1993M5486m3939j2055O6831
38135C28761J9707n8269J0386J04178J1540j44904j06856M9505N9438n1873n4393
$$ plain form
38208 1424737 1694376 1627821 1231151 941955 874632 743056 504205 438928 563950 573857
38198 573857 421797 382273 488941 478685 342305 359877 533094 556036 415233 438329
38188 438329 667435 776515 712685 810967 1135195 1336307 1372953 1737698 2636290 3474840
38178 3474840 3552802 2884998 2014586 1349972 983617 865851 855941 790181 685930 700383
38168 700383 813722 813106 654635 537433 542862 519145 405504 341193 363992 334728 253564
38157 253564 309342 512415 622248 552030 503221 578802 607645 490382 385240 398038 400738
38146 400738 310551 252235 294435 308877 233363 200445 272438 317924 273985 261930 328761
38135 328761 348468 290199 300585 404763 416303 271399 164543 214048 273486 221613 167220
38124A67220M2297M0800m6952m7396J8529q38n7748J740J05434O7826n2035m6957
38112A91920O6230R7774K8706n174Q859j1467k5737M6660J23118Q8223J4972K3243
38100F47327N5115J6289j6496N1677J43879J68696J71020J71328J20321J44234
38090A673390M47272P86714N51295l12237r80450q16025k50362n6933k21597k13036
38080F08031J1936N5446r9572r4540P6926O5202j43473j93102j9485O8224j3013
38069C22580k0203Q8230Q7007j4540M5506K40546K29785m5907k46942k02147j12467
38058C71448j00973l4294J01705J03240n1875j22007k9611K2666m4202n9582K9133
38047A85648N3195j9922p643J15184J38568P098p5871k5042J849n8072o4249J2768
$$ plain form
38124 167220 209517 250317 203365 155969 174498 173660 115912 117652 223086 290912 238877 191920
38112 191920 258150 355924 384630 379456 388315 376848 351111 397771 520889 609112 624084 647327
38100 647327 702442 718731 702235 753912 897791 1066487 1237507 1408835 1529156 1673390
38090 1673390 2120662 2907376 3458671 3146434 2165984 1349959 1099597 1042664 821067 608031
38080 608031 619967 675413 575841 481301 558227 623429 479956 286854 267369 335593 322580
38069 322580 302377 390607 477614 463074 508580 749126 978911 933004 686062 483915 371448
38058 371448 270475 236181 337886 441126 389251 267244 237633 260299 216097 156515 185648
38047 185648 238843 218921 211278 326462 465030 472128 396257 371215 373064 314992 250743 263511
38035B63511J9523n4736l1854R3913J04598m1496j14367j7349O1466J0833l1744
38024B62298J5405L1508k9340l0102O2759Q8708j056m5386J7236M1296k2730k2276
38012C68320R1607J51975Q4691L9640R6867J24000M6628j0127L0866O8278N0901
38001A143646Q4149J97111K41868J30664m0966j78942k79330k93026j51782K8873
37991H82265L5606j09864j71182q3182k5465p0745p6447M306K2418o3023q6015
37980B58672J4977P7421J5375l9245l980J6636l2926m9282J798O187n4791m1226
37968A69616P2811J25781N9194J7813O7929Q2716O372l3663J7070L0899m7573
37957E68965q7712k0489L7850R703k2961p219o482l0748l538N1038K1304n8168
$$ plain form
38035 263511 283034 228298 196444 290357 394955 353459 239092 221743 283209 294042 262298
38024 262298 277703 309211 279871 249769 312528 401236 400180 354794 372030 413326 390596 368320
38012 368320 459927 611902 696593 736233 833100 957100 1003728 993601 1024467 1092745 1143646
38001 1143646 1227795 1424906 1666774 1797438 1756472 1577530 1298200 1005174 853392 882265
37991 882265 917871 808007 636825 553643 528178 457433 380986 385292 407710 344687 258672
37980 258672 273649 351070 366445 327200 323220 339856 306930 257648 259446 265633 210842 169616
37968 169616 242427 368208 427402 445215 513144 595860 602232 568569 585639 616538 568965
37957 568965 481253 460764 498614 508317 485356 478137 471655 440907 437369 488407 509711 451543
37945D51543l5776P0945Q9860J4263J2538R2422P5577m8412p5344M0058R6506
37934G84180J4355l7021K5483N8393p516l5960L4274P1001J8276N603Q9284J48422
37922A168774J22196J03385J40620J84715K47235L74714M96929N47624O44323
37913D030515Q77293J087291J177076J399455J949107K637489L479430M988074
37905B1625730O900389P154916L748512k218377o887251p665868n703429l723272
37897A3231350k748214k075275j337974r72568j035932r81580o39555m06937m22204
37888B611111l79977j98914j43615k43765k33463r2773p0694j67216j36181J0784
37878I55297K5710p6746n1030P9798N9490r3982j12811R571K0610r1982q7336
$$ plain form
37945 451543 415767 486712 576572 590835 603373 695795 771372 722960 647616 687674 784180
37934 784180 798535 761514 786997 845390 837874 801914 836188 907189 925465 931068 1020352 1168774
37922 1168774 1290970 1394355 1534975 1719690 1966925 2341639 2838568 3386192 4030515
37913 4030515 4907808 5995099 7172175 8571630 10520737 13158226 16637656 21625730
37905 21625730 28526119 35681035 39429547 37211170 30323919 22658051 16954622 13231350
37897 13231350 10483136 8407861 7069887 6097319 5061387 4079807 3440252 3033315 2611111
37888 2611111 2231134 2032220 1888605 1644840 1411377 1318604 1247910 1080694 944513 955297
37878 955297 981007 904261 853231 933029 992519 898537 785726 795297 815907 723925 636589
37867F36589M3968O0013n5502o3897N6459O7298o0850q4691M9262J06924M052
37856G59625o3411o107K3641l4028l8079M4328N9136k4542m3147N1380J08659
37845H37455O3285J7416N731l9645p4377J5046J47011J26783m008j5267J08740
37834A188170J45072L2061m1556J1077O0136N0106Q9127J84327J90783R3081N1288
37823B053672J03572J04410J9381o68R1665J49963J05292O8386Q9247O6778k5275
37812B826423o0656J2091Q2336Q8844J16939K20621L31767M00496M64510N47470
37802E030841O36384P68832J007428J342225J737891K237189K924300L847198
37794A9532288M951975N820045N465858K988860j140042m888514o391765n696592
$$ plain form
37867 636589 680557 740570 685068 621171 677630 744928 684078 599387 648649 755573 759625
37856 759625 696214 690107 713748 679720 641641 685969 745105 720563 677416 728796 837455
37845 837455 900740 918156 923887 884242 809865 824911 971922 1098705 1094697 1079430 1188170
37834 1188170 1333242 1365303 1323747 1334824 1394960 1445066 1534193 1718520 1909303 2002384 2053672
37823 2053672 2157244 2261654 2281035 2280367 2372032 2521995 2627287 2695673 2784920 2851698 2826423
37812 2826423 2765767 2777858 2860194 2949038 3065977 3286598 3618365 4018861 4483371 5030841
37802 5030841 5667225 6436057 7443485 8785710 10523601 12760790 15685090 19532288
37794 19532288 24484263 30304308 35770166 38759026 37618984 32730470 26338705 20642113
37786B0642113m300264l273662k548521j838896j303049j081463r32480o79529
37778D684249n03886n16278n00603l35580k34689l19444l66942k28437j04273
37769A574117j51351j93469q0243K1243m3235j22960o1681J6417k8304q8255n0218
37758G92061k0778q2728j02782l333N2309l4723r0882Q762R6499K4175o1603m445
37746E72532P1870J7114n6469l304P3745L3943k8805J9006Q9906N7188k124J8642
37734H63244L8942k3751n7233K8615R6585K4270n9293j3643N1340m58n9617J4776
37722I03777J11728P1072j7067R074P7634L4879n3865l1197O1561Q3913N8898
37711A310407Q7107J24536Q5993M3522R0772J40673Q3482O413K9575P1169Q635
$$ plain form
37786 20642113 16341849 13068187 10519666 8680770 7377721 6296258 5363778 4684249
37778 4684249 4180363 3664085 3163482 2827902 2593213 2273769 1906827 1678390 1574117
37769 1574117 1422766 1229297 1149054 1170297 1127062 1004102 942421 958838 930534 842279 792061
37758 792061 771283 688555 585773 582440 634749 600026 509144 517906 614405 638580 576977 572532
37746 572532 644402 661516 605047 601743 675488 709431 680626 699632 789538 846726 844602 863244
37734 863244 902186 878435 821202 849817 946402 970672 911379 897736 949076 948618 889001 903777
37722 903777 1015505 1086577 1069510 1078584 1156218 1191097 1137232 1106035 1167596 1251509 1310407
37711 1310407 1397514 1522050 1608043 1651565 1742337 1883010 1966492 1972905 2002480 2073649 2082284
37700B082284p9546p3280n3430j31423j96075j04102K5246n790j27418j36471
37690A199995n8326o8409j49037j37079m6223l6717j06905j03846j5047K0144
37680D98550k7019n0117k8546l9872p0792l7792K5384J2288n1610n1906L251J5499
37668A97318m010K7217P0481K2931p1194p6589k539K1545k2846l5691L501K1025
37656A51149Q565J8585L0069j0100n1120j3415M6881J9700o2384p9771k6788Q472
37644C9843Q602J2162L063l0370j2935Q1211J18356Q062j07140o5796L8149K3645
37632A16852o0576m4766M4354N0903j0303k350N3693L0844k8389K1895J31188
37621C03345J11736k6975r3142n0120m8809j18548j13845J082Q1185N2933L11
$$ plain form
37700 2082284 2002738 1929458 1876028 1744605 1548530 1444428 1469674 1463884 1336466 1199995
37690 1199995 1141669 1073260 924223 787144 740921 704204 597299 493453 478406 498550
37680 498550 471531 421414 392868 352996 282204 244412 269796 282084 230474 178568 181819 197318
37668 197318 193308 220525 291006 313937 242743 166154 163615 185160 162314 126623 130124 151149
37656 151149 159714 178299 208368 198268 147148 133733 180614 200314 137930 58159 31371 39843
37644 39843 48445 60607 63670 33300 20365 101576 219932 227994 120854 55058 93207 116852
37632 116852 56276 11510 55864 106767 96464 94114 147807 178651 150262 172157 303345
37621 303345 415081 388106 294964 244844 196035 77487 -36358 -35276 45909 98842 99153
37610I9153k6059n9268o7875J3306J05129O8839m2163n3535L1308N9130K1943
37599A49908M4806J07744Q2549K4028R7260K35129K39481K19018M79825Q96779
37589B576527Q76673J70800o81081j003510p63865m10889k20688j42310j00828
37580C00829j03208j10882o5696j0047j2054l4395j5310P630j4552k8651J7539
37569f8797N7846K0663l5894k4306K6275L8832J8942J1519Q047r951j4473L659
37557C2362j366l5389l1518K5055M9026j921m9935l1726M988Q779J0515L2251
37545A1121K8850j0164k0123J2614J1186m0986m9454J7539N1024j3865p8646m8680
37533a29584J6091K7163J6915M4803O8462L0151k3566k2778P272Q733o491n774
$$ plain form
37610 99153 73094 13826 -54049 -40743 64386 133225 91062 37527 68835 127965 149908
37599 149908 194714 302458 385007 409035 506295 741424 980905 1199923 1679748 2576527
37589 2576527 3453200 3624000 2942919 1939409 1175544 764655 543967 401657 300829
37580 300829 197621 86739 21043 10996 -1058 -35453 -50763 -43133 -57685 -86336 -68797
37569 -68797 -10951 9712 -26182 -50488 -24213 14619 33561 45080 53127 43176 28703 32362
37557 32362 30996 -4393 -35911 -10856 38170 36249 -13686 -45412 -40424 -31645 -21130 11121
37545 11121 39971 29807 9684 22298 33484 -7502 -56956 -39417 11607 -2258 -80904 -129584
37533 -129584 -113493 -86330 -69415 -24612 43850 74001 50435 27657 34929 43662 37171 31397
37521C1397q597l0105l1096M086K2055l928k1579o56J0857j1522j5227K1785L7522
37508D992P72k8974j4860m051k0135j2543L0692M3697J0966K935L0364J0357o1688
37495g476o8670K1574P4508J0706n7595k5749K9746Q310l4705r781L7349K6243
37483D460m059J4819M2236J8011j1558R033K2666k9899p7264l4694L7716L4841
37471B6308j7447k2990K0989M9508N0345M1766K213o6376q2945n466P4791O3437
37459A34133K142k5641l1185n1346m5203J7325O0677K2415k8617j5909O885k7249
37447A8427n4723k474N3823J6346m6819j5845O1686N1357l2281n8240m430L0569
37435A7396J3772N022J4198q836m8474l4117K4537M3562M568k7901k2253p784
$$ plain form
37521 31397 22800 -7305 -38401 -34315 -12260 -16188 -37767 -38423 -27566 -39088 -54315 -32530 4992
37508 4992 5764 -23210 -38070 -42121 -62256 -74799 -44107 -410 10556 13491 43855 54212 -7476
37495 -7476 -76146 -54572 19936 30642 -26953 -52702 -22956 -14646 -49351 -59132 -21783 4460
37483 4460 401 15220 57456 75467 63909 72942 95608 65709 -11555 -46249 -8533 26308
37471 26308 8861 -14129 6860 56368 106713 148479 150692 84316 1371 -4095 70696 134133
37459 134133 136275 110634 79449 28103 -17100 225 60902 83317 54700 38791 45676 18427
37447 18427 -36296 -38770 15053 31399 -15420 -31265 30421 81778 49497 -8743 -13173 17396
37435 17396 31168 36190 50388 41552 -6922 -41039 -16502 27060 31628 3727 -18526 -26310
37423b6310R34J2416J2086p405n744L4317N0443J238m6731k9224K47k3204m4737
37410g1674K350M8600L282o4066l0717N6235N1398l8752p1406j2535K6406k49
37398a01128q679M1519P5975M6753N721k112m14o916l308Q19k6146n8265l7288
37385g3469J9044L3499n103l1278j5849P351K2131M0871M3846M295l7775k3702
37373a6139J7304Q641m3946o4119k9451J5216M8135P4042O3342n991p1048n6215
37361f0229M083K2285J870P054K6742J952m0431k2423L4743L7383j4084k8687
37349b9742Q414J6962k3982m3599j6464J401p061Q895N3931O4400K4255p539m506
37336D5365k036p686J0283L5452J3277m1993n7044k1714N144J0743L4522O0020
$$ plain form
37423 -26310 -25376 -12960 -874 -8279 -14023 20294 70737 71975 25244 -3980 -3733 -26937 -71674
37410 -71674 -69324 -20724 -17442 -81508 -112225 -55990 -4592 -43344 -114750 -127285 -100879 -101128
37398 -101128 -109807 -68288 7687 54440 60161 58049 57635 50719 47411 48230 22084 -36181 -73469
37385 -73469 -54425 -20926 -26029 -57307 -73156 -65805 -43674 -2803 41043 45338 7563 -16139
37373 -16139 1165 9806 -34140 -98259 -127710 -112494 -64359 9683 73025 67034 -4014 -60229
37361 -60229 -56146 -33861 -31991 -24937 1805 3757 -36674 -59097 -24354 13029 -1055 -29742
37349 -29742 -21328 -4366 -28348 -71947 -88411 -87010 -94071 -85176 -31245 33155 57410 49871 45365
37336 45365 43329 35643 45926 81378 94655 52662 -4382 -26096 -20952 -10209 24313 84333
37324H4333K4743n2633p7888l0446R834M50j4694j0661k0082m4633l7189M025
37312a64841K3383P434K790K5662M4948N3739O5330N3296l998m6009j2505L0433
37300G9662j8065j08101j00958K864O6113M0729J5130K6655J0188l7569k5930
37289d9282M9694O9773o841o6227l2848J5732K605k5330r349J6578J3521J2433
37277i541K9087J5803l6575n7323j5387K6996L0140L3164M8615K3151m4755p1220
37265b7845k6385J2921K447j410L3199M7177R235k0836n740R917K671R706K3988
37252F9045j4616q2476p5416O028L6037k0246m5977Q897M0243L224Q133R1802
37240B4678J03978l0124j34271n0764R0893Q1250l9991q4436l0398o669l7152
$$ plain form
37324 84333 109076 56443 -21445 -51891 -42057 -41607 -56301 -66962 -87044 -131677 -168866 -164841
37312 -164841 -141458 -134024 -131234 -105572 -60624 -6885 58445 111741 107743 61734 49229 79662
37300 79662 61597 -46504 -147462 -144598 -78485 -37756 -22626 4029 14217 -23352 -49282
37289 -49282 412 70185 63344 -2883 -35731 -19999 -17394 -42724 -52073 -35495 -21974 -9541
37277 -9541 19546 35349 -1226 -58549 -73936 -46940 -16800 16364 64979 88130 43375 -27845
37265 -27845 -54230 -41309 -38862 -40272 -7073 40104 49339 28503 22763 32680 35351 45057 69045
37252 69045 54429 -28047 -103463 -97435 -61398 -81644 -127621 -118724 -78481 -75257 -67124 24678
37240 24678 128656 98532 -35739 -86503 4390 85640 45649 -38787 -69185 -75854 -113006
37229a13006k8386K6396L6895n137j5867J7584K4033m824j261M1668N3123J2676
37217D3894j9378q050J6988K9000K7545M176l9116n8113k5435J0694o82k5138
37205d3615p563K4702J4392j6669q936K3900K3986m369j3399n931j7384l3694
37193f4580j8905M842l962j7911J4866O5115N9090K732k6181j215K5211J5234
37181E4336j1463k9043l3909k1314J1996M4111M9214L2278J1133j2782l6823m3334
37169A4400l1833k7143l3350k6725r489q408q664K8845P1323M0400m0959n3768
37157h5371K1835N8381m611n1020Q580P6477M1841k4831r244L5211p010q9853
37145b9615p9045J2622N2967J6835K657L9024M7794M178k2034k351P145k1508
$$ plain form
37229 -113006 -141392 -114996 -78101 -83238 -99105 -81521 -57488 -62312 -63573 -21905 31218 43894
37217 43894 24516 16466 33454 62454 89999 94175 55059 -3054 -28489 -17795 -18477 -43615
37205 -43615 -51178 -26476 -12084 -28753 -37689 -13789 10197 5828 -7571 -13502 -30886 -64580
37193 -64580 -83485 -78643 -82605 -100516 -85650 -20535 38555 41287 15106 13891 39102 54336
37181 54336 42873 13830 -20079 -41393 -29397 14714 63928 96206 107339 94557 57734 14400
37169 14400 -17433 -44576 -77926 -104651 -114140 -122548 -131212 -102367 -31044 9356 -31603 -85371
37157 -85371 -63536 -5155 -9766 -60786 -52206 24271 66112 41281 32037 67248 60238 -29615
37145 -29615 -108660 -96038 -43071 -26236 -23579 15445 63239 67417 45383 43032 50177 28669
37133B8669m5719l8096j8149N056L4224L8667l495l8435n053N4718N2418o032
37121E8773l8505k1627l194o50R650J9619L426j6016n544L552k8591o0465l5140
37108a14712J0078R544n631K8532O8757K8162n5741o4401R805N9511M1017J6592
37096C1513K0895K0552J0169K1729L5701L186m7037m4019o581j3113n2207m0442
37084e9654J7336K9042j9655m3726j2765J2074Q149K0629M6978L0524j2574L74
37072A6732O3183P2238J443n3965m1837k2609l4536k6987K1026M4161R863j9936
37060B8776k62K7342K3044P727m032l1238n6107k8514L2240M4681k323l2417j5673
37047f756l711j3048J525L4738K2383k8449l4574R903J7245k4506j8658N6871
$$ plain form
37133 28669 -17050 -55146 -73295 -68239 -34015 4652 1157 -37278 -42331 12387 64805 58773
37121 58773 20268 -1359 -4553 -5203 4447 24066 27492 11476 5932 9484 -19107 -79572 -114712
37108 -114712 -104634 -95090 -100721 -72189 -3432 24730 -31011 -95412 -85607 -26096 14921 31513
37096 31513 52408 72960 83129 104858 140559 143745 96708 52689 46108 32995 -19212 -59654
37084 -59654 -42318 -13276 -32931 -76657 -89422 -77348 -69199 -48570 -1592 28932 16358 16732
37072 16732 79915 152153 153596 99631 57794 35185 649 -26338 -5312 38849 48712 28776
37060 28776 28514 55856 78900 86627 82595 51357 -4750 -33264 -1024 43657 41334 8917 -6756
37047 -6756 -10467 -23515 -21990 12748 35131 6682 -27892 -17989 -744 -25250 -43908 12963
37035A2963R0262K3813m8940m7179k0150k2760j5598K4976L3176j7798m3855J75
37023c0915K8891j6295m9539N769O9703M0700k9884l4093J0263J1137l0967l8802
37011f4032N131M9796O6487N8573K1818k9460m6060j9131j0168m4860n5816q64
36999f8586N0248L2122j943J9671N4926K7590k9881l1119J5155K4725k3938p0068
36987a098o8964l0965J6312M3094K5513j2503j1054K9640L2286k7561n9062L647
36975f0715Q2218O7945j3698n2189j4932L4242M2634J2301l2821n8032l1460K3318
36963a189L7449O76j5530J7044K7428k3703o0108k0128L0591J6278j5105J0797
36951D500N1755K9847j9676j4194K3137J2300l0746k7670J1801Q485l9161n3695
$$ plain form
37035 12963 103225 127038 78098 30919 10769 -11991 -27589 -2613 30563 12765 -31090 -30915
37023 -30915 -2024 -18319 -67858 -62089 7614 48314 18430 -15663 -5400 5737 -25230 -64032
37011 -64032 -58901 -9105 57382 115955 137773 108313 62253 43122 32954 -11906 -67722 -68586
36999 -68586 -18338 13784 11841 31512 86438 114028 84147 53028 68183 92908 68970 -1098
36987 -1098 -70062 -101027 -84715 -41621 -16108 -28611 -39665 -10025 22261 -5300 -64362 -60715
36975 -60715 21503 89448 75750 23561 8629 42871 85505 97806 64985 6953 -24507 -1189
36963 -1189 36260 36936 21406 38450 65878 42175 -17933 -38061 -7470 8808 -6297 4500
36951 4500 56255 86102 66426 52232 75369 87669 56923 29253 41054 49539 10378 -43317
36939d3317j3531K3819K4995R226j1266k9900j1724M9515P8489J9591n3890m0781
36927A226K4281L2180j6655k8973O917J2479k1581j7239L4863M4443k0898p5514
36915b4471n5732o815J5086K4516M0531L2316j3385m7294l3769q421j1724k1541
36903a10703M42L9350M9040J5806l0693n2074l2886N429K2427Q331K22K3251M3704
36890a8354K1461k0178k9992r373K058J564J8476M4466L5079j5345n4745l8844
36878f3727K0407P2475P0155P962n9853o6773j9467P774j1959j3692M3954R2572
36866G9828N6249k2215m5826r739R043k0183n1468m4985p316L7780O1534L6111
36854G8813k1833m8434j9966P456n588j4418J7822M0397Q779k2979M07K6734n682
$$ plain form
36939 -43317 -56848 -33029 -8034 1192 -10074 -39974 -51698 -2183 76306 95897 42007 1226
36927 1226 25507 57687 41032 12059 18976 31455 9874 -7365 27498 71941 51043 -24471
36915 -24471 -80203 -87018 -71932 -47416 -6885 25431 12046 -35248 -69017 -77438 -89162 -110703
36903 -110703 -110261 -70911 -21871 -6065 -36758 -88832 -121718 -116289 -93862 -85531 -85309 -62058 -18354
36890 -18354 3107 -17071 -47063 -56436 -54378 -52814 -34338 10128 45207 29862 -24883 -63727
36878 -63727 -43320 29155 99310 107272 47419 -19354 -38821 -31047 -43006 -56698 -12744 79828
36866 79828 136077 113862 68036 58297 67340 47157 -4311 -49296 -56612 -18832 42702 78813
36854 78813 56980 8546 -11420 -3964 -9552 -23970 -6148 34249 43028 20049 20456 47190 41508
36841D1508m2520j0979L5725J3388k6681J2206P6720M0308o3609q0570M079M2162
36829D1737k1740o5943r705O1668N8332J9976J0570P469k5444n8992o2796n8628
36817a03496n5764k0820M1989O8758L7818R074K3038M3939L7480K1819J0346j3433
36805A00748l7966k4771J1707J2469k2362l1952q987j0894m0859l1620K5249M9633
36793i605Q821k8198j3146J1923R742Q016K0833J1088k5161l4135l469J1121q563
36780d0733j3079R461Q293j9562j2021L1863L4977j1047j8392L1928M4096j3573
36768C2211l7105K6095P1153J6377n3407l9568N258q532m4673k6623J3812Q336
36756c6666j3073R413L9227J4223k6377j2397K4369J1775k8353l1010j5117l3578
$$ plain form
36841 41508 -1012 -11991 23734 37122 10441 22647 99367 139675 76066 -4504 -425 41737
36829 41737 19997 -45946 -55651 6017 64349 84325 94895 102364 76920 17928 -44868 -103496
36817 -103496 -159260 -180080 -138091 -69333 -31515 -22441 597 44536 82016 103835 114181 100748
36805 100748 62782 38011 49718 62187 39825 7873 -1114 -12008 -52867 -84487 -59238 -9605
36793 -9605 -784 -28982 -42128 -30205 -20463 -12447 8386 19474 -5687 -39822 -43291 -32170 -40733
36780 -40733 -53812 -44351 -36058 -55620 -67641 -35778 -801 -11848 -30240 1688 45784 32211
36768 32211 -4894 21201 92354 108731 55324 15756 21014 12482 -32191 -58814 -45002 -36666
36756 -36666 -49739 -40326 -1099 13124 -13253 -25650 -1281 10494 -17859 -48869 -63986 -97564
36744i7564m9095O970R0551R2430Q671n6267m3464Q349M9303O0301K6296m0255
36732E6226o9401j5134N7291N2973j1827m3103j7161L301j4639l7883m2238l8675
36720a20270k6994L258L0725K5992O675J0020K9150L3507K7516L1308L2976J7234
36708A01097O241J5241J1692k1545l6726m419J5199l1090q2199n2431K2612M0127
36696a6201p917l9953k5480q125m515J1441L1539K1289j343J0238L8337K6141
36684C5451j5841k6889r412k0690n4131l7896L5746Q2727N2706o099l2549k5716
36672b2593j0080L942O383o548o902K7747N8526L3085k2549l6080k689J6941N897
36659D5080P570L1216L3882P607n386K93j9549o4140p0314k0007J8950j560l6832
$$ plain form
36744 -97564 -146659 -139689 -49138 43292 51963 -4304 -47768 -39419 9884 70185 96481 56226
36732 56226 -13175 -28309 28982 81955 70128 27025 9864 13165 -1474 -39357 -81595 -120270
36720 -120270 -147264 -144006 -113281 -87289 -80614 -70594 -41444 -7937 19579 50887 83863 101097
36708 101097 107338 122579 134271 112726 76000 71581 86780 55690 -26509 -78940 -56328 -16201
36696 -16201 -24118 -64071 -89551 -97676 -102191 -90750 -59211 -37922 -39265 -29027 9310 35451
36684 35451 19610 -7279 -16691 -37381 -91512 -129408 -93662 -10935 41771 35672 3123 -22593
36672 -22593 -32673 -28731 -22348 -28896 -35798 -8051 50475 83560 61011 24931 22242 39183 45080
36659 45080 52650 83866 117748 125355 119969 120262 100713 36573 -33741 -53748 -34798 -36358 -73190
36646g3190k5049K4103N8523N4826K6460k617j1065M70k153m1173p8057o1142
36634a30064j0161J1886J832J2717M7409M5245o395l5043N332N9531N3062p437
36622D7914n8206o0414k4837J1011R703k8827m9793n015O8556Q6902L7469o446
36610B8017L1J8292R221k937R188J5104k1347p2066p8662l1044K7769N6944M7592
36597F102J3386k2629l9800l3536j4348N509J6237J2797P497K1981M8108M4606
36585F5910Jl6533k6564n606k2029n1489m0459m275k343l2723l3264J6520P0198
36572a02656R0328Q0476M5503r677m6441k9708O056J11l5079l6740j978J5185
36560b4620R022K3064M5008J1622o4329q4519j5700N4809N5123K0295J465j6914
$$ plain form
36646 -73190 -98239 -74136 -15613 39213 65673 63056 51991 52461 50308 9135 -68922 -130064
36634 -130064 -140225 -128339 -126507 -113790 -66381 -21136 -27531 -62574 -57242 2289 55351 47914
36622 47914 -10292 -70706 -95543 -84532 -74829 -103656 -153449 -158464 -89908 -3006 34463 28017
36610 28017 28048 46340 55561 52624 61812 76916 55569 -16497 -95159 -126203 -98434 -41490 6102
36597 6102 19488 -3141 -42941 -76477 -90825 -85316 -69079 -56282 -48785 -26804 21304 65910
36585 65910 65911 29378 2814 -2792 -24821 -76310 -116769 -121044 -123387 -156110 -189374 -172854 -102656
36572 -102656 -12328 68148 113651 103974 57533 27825 33881 33992 -1087 -37827 -39805 -24620
36560 -24620 -15598 7466 52474 64096 -233 -84752 -100452 -45643 9480 29775 31240 14326
36548A4326m9551n1094M947O1590O1723L2752K3702J9036j5832n4643m7320j920
36536b284L1243L0252R015j7240l2729j6759K4158M7212K6273j4022l8691m2625
36524C803l1920n123K6022L5407K0870Q961J2390J9402K3557J9948j4589p8393
36512D0335j03519l8326M7318M0704m0071p0859k1386R718j7226j6657M4833O4661
36500f0475j1277o8253n626Q8099Q0344O483j4448J1431o903n6182m0600L3776
36488d3631N7401p23n1341l6438K811K4594L8235L9469K168m3171k5323M6601
36476A0652P5380K0550m2458m6540k6310l6190n4453l3343J2891L5982L2510L5821
36464a5508N1244M9745J7681k3373m4592l6773j2791N469Q367R874K6567M7360
$$ plain form
36548 14326 -35225 -86319 -81372 -19782 41941 74693 98395 117431 101599 46956 -364 -2284
36536 -2284 28959 59211 68226 50986 18257 1498 25656 72868 99141 85119 46428 3803
36524 3803 -28117 -33240 -7218 28189 49059 58020 70410 89812 113369 133317 118728 40335
36512 40335 -63184 -101510 -54192 -13488 -53559 -124418 -145804 -136086 -153312 -169969 -125136 -60475
36500 -60475 -71752 -140005 -145631 -57532 22812 29295 14847 26278 19375 -36807 -77407 -43631
36488 -43631 13770 13047 -38294 -74732 -71921 -47327 -9092 30377 32545 -10626 -35949 10652
36476 10652 86032 106582 64124 17584 -8726 -44916 -99369 -132712 -119821 -83839 -51329 -15508
36464 -15508 35736 85481 103162 79789 35197 -1576 -14367 -8898 -531 9343 35910 83270
36452H3270M3516R513k8384m8054n2433m7653k5818J4230M7872M9130K6376J1394
36440H2959J2394K468l1366n1858j8312M0712N0560l283m6742k6118J1342Q92
36428B3648k7744l929N1216M6896k5558o6333j7356N2337N2857q601o1762o6571
36416e0900l0519J8364M2174K1273p578R087N4577O0483J9170o365N31j5422o0539
36403E4336n9565M477L5348j7978o2608j5672N1490L8522j0330O616O2992N5262
36391A42890r317k8415J4160L0636p949k9211J535K2785q477m5569l6365l64J5194
36378F1533k225l5240n6302l6054K1428N8535L0721k3264l6191j3384p731j8622
36366e6796j733L4963L6712Q18j8393m847M983M647K5349N4851M0099j6543n2615
$$ plain form
36452 83270 126786 136299 107915 59861 7428 -40225 -66043 -51813 -3941 45189 71565 82959
36440 82959 95353 97821 66455 14597 -3715 36997 87557 84274 37532 11414 22756 23648
36428 23648 -4096 -8025 43191 90087 64529 -1804 -19160 33177 86034 77433 15671 -50900
36416 -50900 -81419 -63055 -20881 392 -7186 1901 56478 116961 136131 129766 130297 114875 54336
36403 54336 -5229 -752 34596 16618 -45990 -61662 -10172 28350 18020 24636 87628 142890
36391 142890 133573 105158 119318 149954 142005 112794 114329 137114 128637 83068 46703 46339 61533
36378 61533 59308 24068 -32234 -68288 -46860 11675 42396 19132 -17059 -30443 -38174 -56796
36366 -56796 -58529 -23566 13146 13964 -4429 -9276 -4293 354 25703 80554 120653 104110 51495
36353E1495n0269n3207o3581k5403N6574Q6173J8311n8232m7014K0538M7244J1217
36341f154k8872l2164j1537R333K0889J8328L447j0729j5854j5207o582J7051
36329e8051M2675M3389J7120j2779l8063o6108p7000l3299N0355R9574P1521J2266
36317E1600q814J2726K7381N444l4532n8529n1958k4957K528J9171K6106K3213
36305a0621N563j9252l1243k8358k9307k9576M820O8762R0798K6845n8582o9273
36293g9424o766M5292M3430J7143n943k9602m4987k8589R839L6240M7276N9898
36281F3807N8467J8494k9910l6401j7078k6011n0251k6831L4366M6470j5668o8852
36269d9398m5840J8377N8782O0666L4332j3952n0159k5783L9861O2051J2279l5746
$$ plain form
36353 51495 1226 -51981 -115562 -140965 -84391 1782 20093 -38139 -85153 -64615 -17371 -6154
36341 -6154 -35026 -67190 -78727 -69394 -48505 -30177 -26730 -37459 -53313 -68520 -75102 -58051
36329 -58051 -15376 28013 45133 32354 -5709 -71817 -148817 -182116 -131761 -32187 39334 51600
36317 51600 42786 55512 82893 88337 53805 -4724 -56682 -81639 -79111 -59940 -33834 -10621
36305 -10621 -5058 -24310 -55553 -83911 -113218 -142794 -137974 -69212 21586 48431 -10151 -79424
36293 -79424 -86190 -40898 2532 19675 13732 -15870 -60857 -89446 -79607 -43367 3909 63807
36281 63807 122274 140768 110858 74457 57379 31368 -18883 -45714 -11348 35122 19454 -49398
36269 -49398 -95238 -76861 -18079 42587 76919 62967 12808 -12975 26886 88937 101216 65470
36257F5470k2658R527o53l3582l2879P03K1317J0140j2937k4131j0133K4638M6397
36244D1219K3346k0635k9985k354R678q668j1849J4998J9976k5398p1422o8216
36232a29310l5747j4224l604O737N023o226N551M5986P4362P0458O1674N7753
36220A38433K8984j9506l0254Q587K7628j1884m9554k7062J7517K1501m758j8526
36208H1106j9978k1297k305L7612M5398p20l5734q516K7118J985m8987m6062O131
36195A5751L8753K9078N947j9903n0122n6017j8327K2724K7830K8599O2224Q3349
36183A69886L0794n6245q4720m4477n903j842l215K461l092j3322p041k589k6005
36170d5310m3855r878M0961L4781j8803m0511j0453J3456P073J1276L8417M1931
$$ plain form
36257 65470 42812 52339 51686 18104 -14775 -14072 7245 17385 4448 -19683 -29816 -5178 41219
36244 41219 64565 43930 13945 11591 21269 12601 752 15750 35726 10328 -61094 -129310
36232 -129310 -165057 -179281 -182885 -176148 -171125 -177351 -171800 -125814 -51452 19006 80680 138433
36220 138433 167417 147911 117657 126244 153872 141988 92434 65372 82889 104390 99632 81106
36208 81106 61128 39831 37526 75138 120536 119816 84082 75566 102684 104669 55682 9620 15751
36195 15751 54504 83582 89529 69626 19504 -36513 -54840 -32116 -4286 24313 86537 169886
36183 169886 200680 144435 59715 15238 9335 7493 4278 6739 3647 -9675 -16716 -19305 -45310
36170 -45310 -89165 -99043 -58082 -23301 -42104 -82615 -93068 -79612 -72539 -61263 -22846 19085
36158A9085M262k7738k3122r847j2155j3311n255r580k4233j3085K5412M0848
36146d8719J0498k1879j7187L462O987K180R332J7587Q944n980n974J0893L4471
36133D615N3917M9857P670m7443o3265k6768J4326J5621q460j5998J540J7558
36121C170J4689M158K770R084J0164N021P578J9100J3866k3678n9295m5426M913
36108c3886K9855J2143K065K5892L8216O293k3890m823K6636J2482k4020k0121
36096D6842J6227K4085l107j4065M944J4257J152k233J0319K834l2885n4012l1600
36083a7242J2683M7316O1674M9440Q950l3404m3729k7010j3108n382R396J5700
36071F5284m072r470N5063J53215J72496O9536o9375j41567j38326j07706o9334
$$ plain form
36158 19085 23347 -4391 -27513 -37360 -49515 -62826 -68081 -77661 -101894 -114979 -89567 -48719
36146 -48719 -38221 -60100 -77287 -73825 -66838 -64658 -55326 -37739 -28795 -34775 -40749 -29856 4615
36133 4615 58532 108389 116059 68616 5351 -21417 -7091 8530 70 -15928 -14388 3170
36121 3170 17859 22017 24787 33871 44035 49056 56634 75734 89600 65922 6627 -38799 -33886
36108 -33886 -4031 8112 10177 36069 74285 80578 56688 51865 78501 90983 66963 46842
36096 46842 63069 87154 84047 69982 74926 89183 90335 88102 98421 101255 68370 14358 -17242
36083 -17242 -4559 42757 104431 153871 162821 129417 85688 58678 45570 40188 49584 65284
36071 65284 61212 51742 106805 260020 432516 502052 432677 291110 152784 45078 -24256
36060b4256j9785J7940J1233k6413m2225j1737K9320L2995K757j2916P407K1151
36048a4529j4213o2191m6033L5284R3756P2478J4139j9403k7639l0350j6199J2463
36036b437J0202l2369m5856R485N9828K8190l5283l3542K2167M7871L2868L1172
36024I2296L9282O601m8906n6350j6274M561l730Q995L7579K2793k7567l7306
36012B1974O717L4360J5424p617j9154m7354p1700l5656L3100M1378j0608k1813
36000f0949L1072M9182j0754n6704k1717K8786K3552j832K858R142j1266j7713
35988c6343J0359J5752k6950m5052O103N0563J7050l6568k2969L2091M7692J9171
35976C0899l904j0832j3706L839M2024M8067j512m4285k8792J038q285k4072J558
$$ plain form
36060 -24256 -44041 -26101 -14868 -41281 -83506 -95243 -65923 -32928 -30171 -43087 -35680 -14529
36048 -14529 -28742 -90933 -136966 -101682 -7926 64552 78691 59288 31649 1299 -14900 -2437
36036 -2437 7765 -24604 -70460 -60975 -1147 27043 -8240 -41782 -19615 28256 61124 92296
36024 92296 131578 138179 89273 32923 16649 21210 17480 26475 64054 86847 59280 21974
36012 21974 28691 63051 78475 70858 51704 4350 -67350 -103006 -69906 -28528 -39136 -60949
36000 -60949 -29877 19305 8551 -48153 -69870 -41084 -17532 -19364 -16506 -7364 -18630 -36343
35988 -36343 -25984 -10232 -37182 -82234 -76131 -25568 -8518 -45086 -68055 -35964 11728 30899
35976 30899 26995 16163 2457 6296 48320 96387 94875 50590 21798 22836 14551 -9521 -7963
35963g963L7544L5299J5874J3196K79m4676p1278m1266m843p931p303K9496L4954
35950a8618l5855q9027l1238O0139N6296o158N262Q2703R0789r75p1413m6058
35938d153R727K3297R605j6j3871l1234k6443m008M740L356J4697J7179j9130
35925a6254n3018k4247L5262M6251J7392K1411N3221L9516j5647l0049L264j22
35913G6980n5032o7499K120O5697N0362r26k8167m3561o0209l7320L0849O4804
35901a902J6110m5576l7736J4063L5996K2160J2219O990j3895l0377j2837J4793
35889a9992Q888k0100k6215n20K7404M2884N1710M5702R609m1995p1369o0731
35877e4725k4673J4932M4518N3792L4942q133n4005p0491l9102J7424M7063K6561
$$ plain form
35963 -7963 29581 64880 80754 93950 94229 49553 -21725 -62991 -67834 -75765 -83068 -53572 -18618
35950 -18618 -54473 -143500 -174738 -114599 -58303 -64461 -59199 23504 114293 113318 41905 -4153
35938 -4153 5574 28871 38476 38460 24589 -6645 -33088 -37096 -32356 -29000 -14303 2876 -16254
35925 -16254 -69272 -93519 -58257 -12006 5386 26797 80018 119534 103887 73838 77102 76980
35913 76980 21948 -45551 -43431 22266 72628 71702 43535 -26 -60235 -97555 -66706 -1902
35901 -1902 14208 -31368 -69104 -55041 -19045 3115 15334 22324 8429 -21948 -34785 -19992
35889 -19992 -11104 -31204 -57419 -57939 -30535 12349 64059 109761 119370 77375 6006 -54725
35877 -54725 -79398 -64466 -19948 33844 68786 60653 6648 -63843 -102945 -85521 -38458 -11897
35865a1897p524q040K0593L7758K5704k14k3792l5957k6749k544P881m240p769
35852c6790J1917J7294j4450l6668p267L0350J6394k0309j5948J0602j749l0441
35840g7065l785N5161M9690k1808n1245R95M2982R157l8546k5386K4317N2636
35828A7103N5308M2180n977p7565j01459m1555M1613P5427O0468K9804o525l2342
35816E6480j4262L3315M4228L866k2967q207r530n0170n6295R617N7467R657n9923
35803f724m0869L5870N9179J9020l431J0921N816k6961l3533p750n330l7665m8676
35790h0133j4843J6053O867j9265k9773k2496j099L4548O3701O0305L7418K9179
35778H0462L1762J3488k1589l6060k2762j0393p500K251J0266j1121m9322n7951
$$ plain form
35865 -11897 -19421 -27461 -6868 30890 56594 56380 32588 -3369 -30118 -32662 -24781 -29021 -36790
35852 -36790 -24873 -7579 -22029 -58697 -65964 -35614 -19220 -39529 -55477 -44875 -46624 -77065
35840 -77065 -80850 -25689 24001 2193 -49052 -48057 -5075 4082 -34464 -59850 -35533 17103
35828 17103 72411 114591 108614 31049 -70410 -111965 -70352 5075 65543 95347 88822 56480
35816 56480 42218 75533 119761 123627 100660 92453 82923 32753 -23542 -13925 43542 53199 -6724
35803 -6724 -47593 -11723 47456 66476 63045 73966 79782 52821 19288 11538 6208 -31457 -80133
35790 -80133 -94976 -78923 -72056 -91321 -121094 -143590 -144689 -110141 -46440 13865 51283 80462
35778 80462 112224 125712 104123 68063 45301 34908 27408 29659 39925 28804 -20518 -78469
35766g8469k9576l387P341L1507O8723O8623J2997l9048k9396J8066L7770J3166
35754G8317j5309j5210L206J2480J431j8354k6618j5084L049J0282Q569J1541
35742C8300J5743K241k7982m4347k6743K904Q823q646j4214R641L3067J8462k2355
35729a5106l7809p396K7243K2189n286q657J2084J6019k398k66L6025N5238J5908
35716A07788m6482o7159l6837J614J8647J8781R768q363k6199k8391j5092J639
35704g0286J8636L7715M6665K9136m348j7047J1578N4716O2380J8309l7804n6320
35692I3330l8343k6343l4856k9820N772L1620J4041j1904J242K9545J6950k7267
35680B3967m5505k9090j7778j4278J1339L7183R854m4539l8144K9643N5222r94
$$ plain form
35766 -78469 -108045 -111432 -104091 -72584 -3861 64762 77759 38711 9315 27381 65151 78317
35754 78317 63008 47798 51004 63484 64915 46561 19943 4859 7908 18190 26759 38300
35742 38300 54043 56284 28302 -16045 -42788 -39884 -31061 -39707 -53921 -44280 -11213 7249 -15106
35729 -15106 -52915 -60311 -33068 -10879 -16165 -24822 -12738 3281 883 617 36642 91880 107788
35716 107788 61306 -5853 -42690 -41076 -22429 -3648 6120 -2243 -28442 -56833 -71925 -70286
35704 -70286 -51650 -13935 32730 61866 57518 40471 52049 106765 169145 187454 149650 93330
35692 93330 54987 28644 -6212 -36032 -30260 1360 15401 3497 4739 34284 51234 23967
35680 23967 -21538 -50628 -68406 -82684 -71345 -34162 -24308 -68847 -106991 -77348 -22126 -23120
35668b3120m6689j2337M0715L8067J0432R858Q010k6092l8582J3223N9456K5594
35656E8535l2719k3969J7991J442m8716l1080M8433Q0698L2800j5655j9321j8107
35644E0332k7717o641M1117M7291k834l8980k5599j1332k2929j2871L8669O5329
35632I3835J9073m5249n2872j3487J5633J6845P077r363l1414l9118k1749J431
35620e9358J5653K9815L9875J9359k6516m5824j3222K6457K5685M036O874K7773
35608E0607K1582k1660o0093n5534j6073K0138K6621Q998r774j6501j1938N599
35596e8028L6300N6419L6326o348j7038R981J3791k6954l9533K4773Q5581M2203
35584A57473o2120r8033m3242M412k083l928L2317N4170L1737J5233L4622M0145
$$ plain form
35668 -23120 -69809 -82146 -41431 -3364 7068 16926 24936 -1156 -39738 -26515 32941 58535
35656 58535 25816 1847 19838 21280 -27436 -58516 -10083 70615 103415 87760 68439 50332
35644 50332 22615 15974 57091 104382 101548 62568 36969 25637 2708 -10163 28506 93835
35632 93835 112908 67659 14787 1300 16933 33778 40855 31492 78 -39040 -60789 -59358
35620 -59358 -43705 -13890 25985 45344 18828 -26996 -40218 -13761 11924 15960 22834 50607
35608 50607 72189 50529 -9564 -65098 -81171 -61033 -34412 -25414 -35188 -51689 -63627 -58028
35596 -58028 -21728 34691 71017 64669 47631 57612 71403 44449 4916 29689 115270 157473
35584 157473 95353 -2680 -45922 -41510 -43593 -47521 -15204 38966 70703 85936 120558 160703
35572A60703j204l7073j7757K1871K7246N628j1535k6091m1290l1607M534J8530
35560G1955j2683l9919j9178J8311K2048l051k3694k9701j7963K0257N7711L9743
35548H3836k4341m9189j563L7818L756m2638j6660M5380M4089k6898q1895p1273
35536i9578j8746M5012R8353R7304J7606p7836r4509l0503K5176J8344j4832k2469
35524e6678k598J7936J8969q371n1365o8450l1424K8698N6217M2112K0912R783
35512b4259j902j1926m308J3532J6935M559o429j7059l5957m2712j0694L8446
35500h1774N2550K2418p685o151J1551J9293J2883N73p410J005K0969J9378k2965
35487C4635o7475n8943n707K8739J6600j668J1483L4106K5497j0391l3377k1395
$$ plain form
35572 160703 159499 122426 104669 126540 153786 159414 147879 121788 80498 48891 53425 71955
35560 71955 59272 19353 175 18486 40534 37483 13789 -15912 -33875 -13618 44093 83836
35548 83836 59495 10306 8743 46561 50317 7679 -8981 36399 80488 53590 -28305 -99578
35536 -99578 -118324 -73312 25041 122345 139951 62115 -32394 -62897 -37721 -19377 -34209 -56678
35524 -56678 -59276 -41340 -22371 -30742 -82107 -150557 -181981 -153283 -97066 -54954 -34042 -24259
35512 -24259 -26161 -38087 -42395 -28863 -11928 -7369 -13798 -30857 -66814 -109526 -120220 -81774
35500 -81774 -29224 -6806 -14491 -20642 -9091 10202 23085 23658 16248 17253 38222 57600 34635
35487 34635 -32840 -91783 -97490 -68751 -52151 -53819 -42336 -8230 17267 6876 -26501 -47896
35475d7896R153K9749K8126J2725J381O524K3614L0685O447m0933o8073m0829
35463d9327J2564K6056j0215k5394K3937P1903L9502l0034l1918K5665L1750l3896
35451E0593n6587J5953P0965J3323p0912n2555L4063N9839J0912j5647R909K0733
35439I0589o451j6273R125J7596r127k4700j5057k6421o6237o9560n563O0821
35427f1258N9230N319l7198l7363q995J8322K0299J821M93L1413M8303J3161k5194
35414B8353m72M8710K6994n6397q9881l5357J7641P067r948K4374O4644M8574
35402G4302Q53k2738k2615j8214P124N3608O3376O017n3567m8473j5119k5196
35390f42o3233n9369o570M1214O0119O4126M5967p415n6294m5441O836K9588M449
$$ plain form
35475 -47896 -38743 -8994 19132 31857 33238 39762 63376 94061 100508 59575 -8498 -49327
35463 -49327 -36763 -10707 -20922 -46316 -22379 49524 89026 58992 27074 52739 84489 50593
35451 50593 -5994 9959 80924 94247 23335 -29220 4843 64682 75594 59947 69856 90589
35439 90589 84138 67865 76990 94586 85459 60759 45702 19281 -46956 -116516 -122079 -61258
35427 -61258 -2028 3291 -33907 -71270 -80265 -61943 -41644 -39823 -39330 -7917 40386 53547 28353
35414 28353 27881 76591 103585 47188 -42693 -78050 -60409 -53342 -63290 -38916 25728 74302
35402 74302 75155 52417 29802 11588 18712 72320 135696 141713 88146 39673 24554 -642
35390 -642 -63875 -123244 -129814 -88600 -28481 35645 81612 74197 17903 -27538 -20702 8886 13335
35377A3335j9094j1067M423N670J653l609j9452l4606k5542k657J530r026j99
35364i8641K5542K7030k201j7878K62J5108m52j5616L245L2728K9871n10j8839
35351b0351j3037o368j0574j0092J752L657j8696l9299k1152K4939M2371N666
35339f1184l2367o467O2123Q2986J9931n5867o3255j4719J9312J2752k492k702
35327d1949L940J1500K1972J7819k2320p4885q3046k9100M0805P4516O4209L1808
35315A5269j119j7476r734N692L284j5451k5458j9287j3591j2781l043J1777R264
35302g2654o341k007K4178K7645j1533m6423k8473K1264M5456K5040j8163o2705
35290a04716q7336n9341K1885Q9396P6687J2159j4864J9330M5822J3958l7260
$$ plain form
35377 13335 -5759 -16826 -12403 -6733 -5080 -8689 -28141 -62747 -88289 -90946 -89416 -98442 -98641
35364 -98641 -73099 -46069 -48270 -66148 -65886 -50778 -51230 -66846 -63601 -30873 -1002 -1512 -20351
35351 -20351 -33388 -39756 -50330 -60422 -58670 -55013 -73709 -113008 -134160 -109221 -66850 -61184
35339 -61184 -93551 -100018 -37895 45091 65022 9155 -54100 -68819 -49507 -36755 -39247 -41949
35327 -41949 -38009 -26509 -4537 13282 -9038 -83923 -166969 -196069 -155264 -80748 -16539 15269
35315 15269 14150 -3326 -13060 -7368 -4084 -19535 -44993 -64280 -77871 -90652 -93695 -81918 -72654
35302 -72654 -78995 -81002 -56824 -29179 -40712 -87135 -115608 -94344 -48888 -23848 -42011 -104716
35290 -104716 -192052 -251393 -229508 -140112 -63425 -51266 -66130 -46800 -978 12980 -24280
35279b4280m8425k3113q3J3753L2812M4736K4875j4198l3148k1639n970k684L74
35266e6990J3097K3634J8650J848j4910k4637k6653k5785k7074k2736L001M2394
35254i6161N6971K6031j6722k6717j0498m417r117J815J7504l58l7755l0968K6182
35241a04210N1257l630o3529l4890M8932P0873j099p4221o6144l621L9558M1717
35229i9007L0302K1012O371j1404j4509L024K4060K8378J3293p805k1154k3156
35217e0595j6132M03K5643M7103M8318K9530N821j6927m3109o0923m5399j596
35205g7863K6700J2660j8970l5235l7407l1444N68N4514P2825K1494l6017j8405
35193f6580M3994N0460p662l1870J6114M3448k0616r7673p4186K4682P7592M7212
$$ plain form
35279 -24280 -72705 -95818 -95901 -82148 -49336 -4600 20275 6077 -27071 -48710 -54680 -57364 -56990
35266 -56990 -43893 -20259 -1609 239 -14671 -39308 -65961 -91746 -118820 -141556 -138555 -96161
35254 -96161 -39190 -13159 -29881 -56598 -67096 -71513 -80630 -78815 -61311 -61669 -99424 -130392 -104210
35241 -104210 -52953 -56583 -120112 -155002 -106070 -35197 -36296 -110517 -176661 -180282 -140724 -99007
35229 -99007 -68705 -47693 -41322 -52726 -67235 -64211 -40151 -11773 1520 -6285 -27439 -50595
35217 -50595 -66727 -66324 -40681 6422 54740 84270 90091 73164 30055 -30868 -76267 -77863
35205 -77863 -51163 -38503 -57473 -92708 -130115 -161559 -160991 -106477 -33652 -12158 -48175 -66580
35193 -66580 -22586 27874 20212 -11658 4456 47904 27288 -70385 -144571 -119889 -42297 4915
35181D915J1868K3846L9528J5362j5158r875J455l0916q2489q1376j7432M0365
35169i9907M4224K7001L4880N0145K8045j9507l5331o085J6464n041m2146n1435
35157e8693l4379j6093K47K1743L6523L3661K9702L8301L5854j341m5695n0452
35145a0622j9585J941j702n805R52J738o640m715R583J4710P440J0727K9838L7793
35131F5653J6059k0138m4054l9967o350L5574M6326J4910j3954j02K4554K379
35119H0890n4044p8185n2233k1649r719N629K4500J5722j0724l128L9646N6310
35107f985K7823Q531K2526K0342j8806l5317L292L2944Lm5701m2363k1900l6078
35094i1689m9654q560M4454L2504j9635k4338K1725L9652L729l0623l0889k1350
$$ plain form
35181 4915 16783 40629 80157 95519 80361 70486 71941 41025 -41464 -122840 -140272 -99907
35169 -99907 -55683 -28682 6198 56343 84388 64881 29550 23465 39929 34888 -7258 -58693
35157 -58693 -93072 -109165 -108918 -87175 -50652 -16991 12711 51012 86866 85525 39830 -10622
35145 -10622 -30207 -28266 -29968 -35773 -34821 -33083 -39723 -44438 -34855 -20145 -12705 -1978 27860 65653
35131 65653 81712 61574 17520 -22447 -28797 6777 53103 68013 54059 53957 78511 80890
35119 80890 26846 -51339 -103572 -125221 -134940 -129311 -104811 -89089 -99813 -102941 -63295 -6985
35107 -6985 20838 29369 51895 72237 53431 18114 21406 54350 54353 8652 -33711 -55611 -91689
35094 -91689 -141343 -149903 -105449 -72945 -92580 -116918 -95193 -55541 -51812 -82435 -113324 -134674
35082a34674j0791K0211N2953M1711K298J745M4492N6770P727m0257l5528j0145
35070c488o227l307K6725N2322L0750j7417l9488k8231j7505k0756k1781j6580
35058f4983k1227l6623l8395j1735K3061L2525J1326r789k288K2807L2326K2204
35046d0791K3170M6060N4806J8380l7638o2956m6163j5859L638Q406N084J1894
35034c1969M5881Q2814O4528j6618q1260o3170p217l44l6758l5668K0926O0108
35022A253L8079K810P038K8561J8797j8590m0757l0375j4532k8112o8852q5944
35010a90624l1557O0598Q7953J2653o3274k7658P4853J03192K9385k9169K94M5465
34998G2111K5789k0245k0045N965p659n2120o3171k8442L683O997J984M087L713
$$ plain form
35082 -134674 -145465 -125254 -72301 -30590 -28292 -26547 17945 74715 82442 42185 6657 -3488
35070 -3488 -9715 -13022 13703 66025 96775 79358 39870 11639 -5866 -26622 -48403 -64983
35058 -64983 -86210 -122833 -161228 -172963 -149902 -117377 -106051 -115840 -118128 -95321 -62995 -40791
35046 -40791 -17621 28439 83245 101625 63987 1031 -45132 -60991 -57353 -48947 -43863 -31969
35034 -31969 13912 96726 161254 144636 63376 206 -7011 -7355 -44113 -79781 -58855 1253
35022 1253 39332 42142 49180 77741 96538 77948 37191 6816 -7716 -35828 -104680 -190624
35010 -190624 -222181 -161583 -73630 -60977 -124251 -151909 -77056 26136 55521 26352 26646 72111
34998 72111 97900 77655 57610 63575 55916 3796 -59375 -87817 -84134 -77137 -75153 -71066 -67353
34985f7353k280k031P722J9084K7943K9179J3124j0483r774J8341K3777k7554
34973A9695q3913o3326K5864P8011K3180p6167r7413q610R2175R7164J8308l6706
34961a1738r091L9459K4099l9881o6706k9931Q267K381j1978J1208N0232N3634
$$ plain form
34985 -67353 -69633 -71664 -63942 -44858 -16915 12264 25388 14905 5131 23472 47249 19695
34973 19695 -64218 -127544 -101680 -23669 -489 -76656 -174069 -182679 -90504 6660 24968 -11738
34961 -11738 -20829 18630 42729 2848 -63858 -93789 -85522 -83141 -95119 -83911 -33679 19955
$$ [...]
##END NTUPLES=NMR SPECTRUM
##END=
