##TITLE=31Pdec_IPEDM1
 CDCl3, 24 sc
 22.7.2019
##JCAMPDX= 6.0         $$ Bruker NMR JCAMP-DX V2.0
##DATA TYPE= NMR SPECTRUM
##DATA CLASS= NTUPLES
##ORIGIN= UXNMR, Bruker Analytische Messtechnik GmbH
##OWNER= root
$$ XWIN-NMR		Version 3.5
$$ Mon Jul 22 13:54:37 2019 Russian Standard Time (UT+4h)  she@DPX200
##.OBSERVE FREQUENCY= 81.013821
##.OBSERVE NUCLEUS= ^31P
##.ACQUISITION MODE= SIMULTANEOUS
##.ACQUISITION SCHEME= undefined
##.AVERAGES= 24
##.DIGITISER RES= 17
##SPECTROMETER/DATA SYSTEM= spect
##.PULSE SEQUENCE= zgpg30
##.SOLVENT NAME= Tol
##.SHIFT REFERENCE= (INTERNAL, Tol, 0, 182.463)
##AUDIT TRAIL= $$ (NUMBER, WHEN, WHO, WHERE, WHAT)
$$ ##TITLE= Audit trail, XWIN-NMR		Version 3.5
$$ ##JCAMPDX= 5.01
$$ ##ORIGIN= Bruker BioSpin GmbH
$$ ##OWNER= she
$$ F:/spectra/data/she/nmr/P31/1/pdata/1/auditp.txt
$$ ##AUDIT TRAIL=  $$ (NUMBER, WHEN, WHO, WHERE, WHAT)
(   1,<2019-07-22 13:53:20.35 +0400>,<she>,<DPX200>,
      <created by zg, POWCHK disabled, PULCHK disabled
       configuration hash MD5:
       00 E9 B6 7A A2 85 ED C7 34 08 36 98 17 FE 4E 26
       data hash MD5: 32K
       20 33 64 50 7D 0F 23 F1 35 69 59 23 FA 17 35 D7>)
(   2,<2019-07-22 13:53:22.67 +0400>,<she>,<DPX200>,
      <Start of raw data processing
       efp BC_mod = 2 LB = 1 FT_mod = 6 PKNL = 1 PHC0 = -2939.898 PHC1 = 182.3989 SI = 64K 
       data hash MD5: 64K
       DB 3B 95 EA 99 E4 86 73 94 77 F2 A7 8A 12 D4 C3>)
(   3,<2019-07-22 13:53:52.89 +0400>,<she>,<DPX200>,
      <pk PHC0 = 36.96219 PHC1 = -98.59998 
       data hash MD5: 64K
       BA 56 01 5E 7B 74 E1 1D D9 CA AC AE 8F 22 45 BB>)
(   4,<2019-07-22 13:54:00.46 +0400>,<she>,<DPX200>,
      <abs ABSG = 5 
       data hash MD5: 64K
       4D 9B ED 73 08 BD 23 4C 24 CB 5A 86 1D A0 CA 7D>)
$$ ##END=
$$ 
$$ hash MD5
$$ DB 1E CD 15 E9 2D 35 6C B4 E9 5B 4D B0 11 F3 C2
##$RELAX= 
##$RELAX= 
##$RELAX= 
##$RELAX= 
##$RELAX= 
##$RELAX= 
##$RELAX= 
##$RELAX= 
$$ Bruker specific parameters
$$ --------------------------
##$DU= <F:/spectra>
##$EXPNO= 1
##$NAME= <P31>
##$PROCNO= 1
##$TYPE= <nmr>
##$USER= <she>
##$AMP= (0..31)
100 100 100 100 100 100 100 100 100 100 100 100 100 100 100 100 100 100 
100 100 100 100 100 100 100 100 100 100 100 100 100 100 
##$AQSEQ= 0
##$AQ_mod= 1
##$AUNM= <au_zg>
##$AUTOPOS= <>
##$BF1= 81.014009
##$BF2= 200.13
##$BF3= 200.13
##$BF4= 200.13
##$BF5= 200.13
##$BF6= 200.13
##$BF7= 200.13
##$BF8= 200.13
##$BYTORDA= 1
##$CFDGTYP= 0
##$CFRGTYP= 5
##$CHEMSTR= <none>
##$CNST= (0..31)
1 1 145 1 1 1 1 1 1 1 1 1 1 1 1 1 1 1 1 1 1 1 1 1 1 1 1 1 1 1 1 1 
##$CPDPRG= <waltz16>
##$CPDPRG1= <>
##$CPDPRG2= <waltz16>
##$CPDPRG3= <>
##$CPDPRG4= <mlev>
##$CPDPRG5= <mlev>
##$CPDPRG6= <mlev>
##$CPDPRG7= <mlev>
##$CPDPRG8= <mlev>
##$CPDPRGB= <>
##$CPDPRGT= <>
##$D= (0..31)
0 1 0 0 0 0 0 0 0 0 0 0.03 2e-05 3e-06 0 0 0 0 0 0 0 0 0 0 0 0 0 0 0 0 
0 0 
##$DATE= 1563789199
##$DBL= (0..7)
120 120 120 11 120 120 24 19 
##$DBP= (0..7)
150 150 150 150 150 150 150 150 
##$DBP07= 0
##$DBPNAM0= <>
##$DBPNAM1= <>
##$DBPNAM2= <>
$$ [...]
##$SUBNAM3= <"">
##$SUBNAM4= <"">
##$SUBNAM5= <"">
##$SUBNAM6= <"">
##$SUBNAM7= <"">
##$SUBNAM8= <"">
##$SUBNAM9= <"">
##$SW= 369.568048894756
##$SWIBOX= (0..15)
0 1 3 0 0 0 0 0 0 0 0 0 0 0 0 0 
##$SW_h= 29940.119760479
##$TD= 32768
##$TD0= 1
##$TE= 0
##$TE2= 300
##$TE3= 300
##$TEG= 300
##$TL= (0..7)
0 120 53 12 22 120 120 120 
##$TP= (0..7)
150 150 150 150 150 150 150 150 
##$TP07= 0
##$TPNAME0= <>
##$TPNAME1= <>
##$TPNAME2= <>
##$TPNAME3= <>
##$TPNAME4= <>
##$TPNAME5= <>
##$TPNAME6= <>
##$TPNAME7= <>
##$TPOAL= (0..7)
0.5 0.5 0.5 0.5 0.5 0.5 0.5 0.5 
##$TPOFFS= (0..7)
0 0 0 0 0 0 0 0 
##$TUNHIN= 0
##$TUNHOUT= 0
##$TUNXOUT= 0
##$USERA1= <user>
##$USERA2= <user>
##$USERA3= <user>
##$USERA4= <user>
##$USERA5= <user>
##$V9= 5
##$VALIST= <valist>
##$VCLIST= <CCCCCCCCCCCCCCC>
##$VD= 0
##$VDLIST= <DDDDDDDDDDDDDDD>
##$VPLIST= <PPPPPPPPPPPPPPP>
##$VTLIST= <TTTTTTTTTTTTTTT>
##$WBST= 1024
##$WBSW= 4
##$XGAIN= (0..3)
0 0 0 0 
##$XL= 0
##$YL= 0
##$YMAX_a= 88353
##$YMIN_a= -91677
##$ZGOPTNS= <>
##$ZL1= 120
##$ZL2= 120
##$ZL3= 120
##$ZL4= 120
##$ABSF1= 182.463
##$ABSF2= -187.1042
##$ABSG= 5
##$ABSL= 3
##$ALPHA= 0
##$AQORDER= 0
##$ASSFAC= 0
##$ASSFACI= 0
##$ASSFACX= 0
##$ASSWID= 0
##$AUNMP= <proc_1d>
##$AZFE= 0.1
##$AZFW= 0.5
##$BCFW= 0
##$BC_mod= 2
##$BYTORDP= 0
##$COROFFS= 0
##$CY= -3
##$DATMOD= 1
##$DC= 0
##$DFILT= <>
##$DTYPP= 0
##$F1P= 0
##$F2P= 0
##$FCOR= 1
##$FTSIZE= 65536
##$FT_mod= 6
##$GAMMA= 0
##$GB= 0
##$INTBC= 1
##$INTSCL= 5.30512e-09
##$ISEN= 30
##$LB= 1
##$LEV0= 0
##$LPBIN= 0
##$MAXI= 10000
##$MC2= 0
##$MEAN= 0
##$ME_mod= 0
##$MI= 50
##$NCOEF= 0
##$NC_proc= -3
##$NLEV= 6
##$NOISF1= 182.463
##$NOISF2= 159.3651
##$NSP= 0
##$NTH_PI= 0
##$NZP= 0
##$OFFSET= 182.463
##$PC= 4
##$PHC0= -2902.936
##$PHC1= 83.79891
##$PH_mod= 1
##$PKNL= yes
##$PPARMOD= 0
##$PSCAL= 0
##$PSIGN= 0
##$REVERSE= no
##$SF= 81.0140089999434
##$SI= 65536
##$SIGF1= 159.3651
##$SIGF2= -187.1042
##$SINO= 113.3802
##$SIOLD= 16384
##$SREGLST= <1H.CDCl3>
##$SSB= 0
##$STSI= 65536
##$STSR= 0
##$SW_p= 29940.119760479
##$SYMM= 0
##$S_DEV= 0
##$TDeff= 32768
##$TDoff= 0
##$TI= <>
##$TILT= no
##$TM1= 0
##$TM2= 0
##$TOPLEV= 0
##$USERP1= <user>
##$USERP2= <user>
##$USERP3= <user>
##$USERP4= <user>
##$USERP5= <user>
##$WDW= 1
##$XDIM= 65536
##$YMAX_p= 316873321
##$YMIN_p= -7008246
$$ End of Bruker specific parameters
$$ ---------------------------------
##NTUPLES= NMR SPECTRUM
##VAR_NAME=  FREQUENCY,     SPECTRUM/REAL,   SPECTRUM/IMAG
##SYMBOL=    X,             R,               I
##VAR_TYPE=  INDEPENDENT,   DEPENDENT,       DEPENDENT
##VAR_FORM=  AFFN,          ASDF,            ASDF
##VAR_DIM=   65536,         65536,           65536
##UNITS=     HZ,            ARBITRARY UNITS, ARBITRARY UNITS
##FACTOR=    0.456856943014862, 1,           1
##FIRST=     14782.0589164792, 0,            0
##LAST=      -15158.0608439998, 0,           0
##MIN=       -15158.0608439998, -7008246,    0
##MAX=       14782.0589164792, 316873321,    0
$$ Real data points
##PAGE= N=1
##DATA TABLE= (X++(R..R)), XYDATA
$$ [...]
40986D30990j28597j66303m5532K3756q9617k56973k78563j29497N2973J54154
$$ 430990 302393 136090 90558 114314 24697 -232276 -510839 -640336 -587363 -433209
40976d33209J71274J44802Q6563M927n3186l8555L9146J24045J69527J49061N3844
$$ -433209 -261935 -117133 -30570 -25643 -78829 -117384 -78238 45807 215334 364395 418239
40965D18239o0304p4119M6312J40157L3174j80279k18607k3983J11548m0772k87862
$$ 418239 357935 283816 330128 470285 503459 323180 104573 80590 192138 151366 -136496
40954a36496k72243K6521K83768K79421J15461l3255j44800k30176j91417K5540
$$ -136496 -408739 -382218 -98450 180971 296432 263177 118377 -111799 -303216 -277676
40944b77676K47198K34756R694j48407o6347R9121R4786p1628j60151o2260M6579
$$ -277676 -30478 204278 213972 65565 -782 98339 193125 121497 -38654 -100914 -54335
40933e4335o842j19782q8536N6858J17950Q0234J28168K69651K41204o2082l25212
$$ -54335 -61177 -180959 -269495 -212637 -94687 -14453 113715 383366 624570 562488 237276
40922B37276k25536Q0248J72001l9129k41193k12859p3899k667J2447L4205K4937
$$ 237276 11740 91988 263989 224860 -16333 -229192 -303091 -305758 -293311 -259106 -234169
40911b34169k4557K640J61099K90499K09346k7594k05864k20568j42066o2827
$$ -234169 -258726 -256086 -94987 195512 404858 377264 171400 -49168 -191234 -254061
40901b54061p820J7639J870l2243k7735M1217J32314J72404J25652K8902m9766
$$ -254061 -261881 -244242 -242372 -274615 -302350 -261133 -128819 43585 169237 198139 148373
40890A48373r7270j61493k38766k25709o9635R8843J15286K0151j2231M3694N2751
$$ 148373 51103 -110390 -349156 -574865 -644500 -545657 -430371 -410220 -422451 -378757 -326006
40879c26006k874K7355J62744J87732q828k10274j77861N478J14051J35084J84687
$$ -326006 -328880 -301525 -138781 48951 40123 -170151 -348012 -342534 -228483 -93399 91288
40868I1288K00901L3979k11918k49069l8254J42216J17847L2431M4089O8757k0650
$$ 91288 292189 326168 114250 -134819 -173073 -30857 86990 119421 163510 232267 211617
40857B11617j49895j75862j11223n2647q300N1930Q5019N7901L9331P5428Q6658
$$ 211617 61722 -114140 -225363 -278010 -286310 -234380 -149361 -91460 -52129 23299 109957
40846A09957K7165J0946J04077J34839n1014k58765j67651J56833L01152R6387
$$ 109957 137122 148068 252145 386984 335970 77205 -90446 66387 367539 463926
40836D63926j52440j53268l8024p2130j97499j58248N1948J76259R6862k3588
$$ 463926 311486 158218 120194 48064 -149435 -307683 -255735 -79476 17386 -6202
40826f202l3266J5568L7715O5273J06827M0437j76267l15873j25067K75122M58435
$$ -6202 -39468 -23900 13815 79088 185915 226352 50085 -265788 -390855 -115733 342702
40815C42702K19082j59697k80852j30015j5327r1541j79468r3424P4035J28803
$$ 342702 561784 402087 121235 -8780 -24107 -115648 -295116 -388540 -314505 -185702
40805a85702P6225N5845O9650N02j18305r2102J10885K40750J07704j24311j66636
$$ -185702 -109477 -53632 16018 16520 -101785 -193887 -83002 157748 265452 141141 -25495
40794b5495j5728P8668N608p7494l8538K1959k8933j07703l6529J56345K38481
$$ -25495 -41223 37445 43053 -34441 -72979 -51020 -79953 -187656 -224185 -67840 170641
40783A70641R0057j29000j97434j08501j9193K539K3782M8865l6072k32326l10558
$$ 170641 260698 131698 -65736 -174237 -193430 -190891 -167109 -118244 -154316 -386642 -697200
40772f97200j00277K05255K56722K9662j42011m2604J63045K36308J91062J52701
$$ -697200 -797477 -592222 -335500 -305838 -447849 -490453 -327408 -91100 99962 252663
40762B52663J02739j9410j18235q4143j6495n7822j03042M5951K89789L03093
$$ 252663 355402 335992 217757 133614 117119 59297 -43745 2206 291995 595088
40752E95088J4985k67122k81396j14143K315k2139j30750k09229j18517J61751
$$ 595088 610073 342951 61555 -52588 -50273 -72412 -203162 -412391 -530908 -369157
40742c69157L82575K58917r6662k59464r4437O1591l3024j47816k8671J31754
$$ -369157 13418 272335 175673 -83791 -178228 -116637 -149661 -297477 -326148 -194394
40732a94394M4502j31831m3919K34909L10880J19409o704P3601J13548l6441j70723
$$ -194394 -149892 -281723 -325642 -90733 220147 339556 332852 406453 520001 483560 312837
40721C12837j18555l0455p1877j31297n5696O7570Q5581L4918J6319j693n6173
$$ 312837 194282 163827 91950 -39347 -95043 -27473 58108 93026 109345 107652 51479
40710E1479m8635O3127J12721o646r8927L9760K37497J78424q3699k02027r5255
$$ 51479 2844 65971 178692 172046 73119 112879 350376 528800 445101 243074 147819
40699A47819m6067j79622k27842N768K69597K24272m4021j83047j14331p2087
$$ 147819 101752 -77870 -305712 -299944 -30347 193925 149904 -33143 -147474 -219561
40689b19561j35865q4036J80157L64846J80206j96012l19037p3738J97669J84617
$$ -219561 -355426 -439462 -259305 105541 285747 89735 -229302 -303040 -105371 79246
40679G9246j9988j35748q3420L160K7860J3681j2090n2272p0716j6790Q1305J46761
$$ 79246 59258 -76490 -159910 -156750 -128890 -115209 -127299 -179571 -250287 -267077 -185772 -39011
40667c9011J61562J46923P3302q2232k14069j76252p54J20659R5993K6247N672
$$ -39011 122551 269474 342776 260544 46475 -129777 -130531 -9872 86121 112368 118040
40656A18040j1026p6829j36201j26766p3800r032P3316J08162k5440k66428l27807
$$ 118040 107014 30185 -106016 -232782 -306582 -315614 -242298 -134136 -159576 -426004 -753811
40645g53811o9288K36136K38030R008o2756J46466L17285J68750j31261k08081
$$ -753811 -823099 -586963 -348933 -339925 -402681 -256215 61070 229820 98559 -109522
40635a09522J4271K43557K12283k1871j99394j77086m5592L9119N0440O4924R5938
$$ -109522 -95251 148306 360589 338718 139324 -37762 -83354 -44235 6205 71129 167067
40624A67067O2398o2797j83069k11650j74944j10884K1441K13371K97016J38307
$$ 167067 229465 166668 -16401 -228051 -402995 -513879 -492438 -279067 17949 156256
40614A56256j21989k14161j03923q430m1546o9696J3671R6345O2405R137P0233
$$ 156256 34267 -179894 -283817 -292247 -333793 -403489 -389818 -293473 -231068 -221931 -151698
40603a51698J62137J13152l9139r5840j2886M0560l6324j22668p4764O3645J42664
$$ -151698 10439 123591 84452 -11388 -24274 16286 -20038 -142706 -217470 -153825 -11161
40592a1161J05746K1515k5805q701L9868M6008m1803j71515k16722j24417J8117
$$ -11161 94585 116100 90295 81594 121462 167470 125667 -45848 -262570 -386987 -368870
40581c68870J04142J32866J53728J44471L7850j44244k65609k07175R043K31260
$$ -368870 -264728 -131862 21866 166337 204187 59943 -205666 -412841 -403798 -172538
40571a72538L00528J86587K1064l7018J8141M8059k6482j25193j58501j60910
$$ -172538 127990 314577 335641 298623 316764 364823 338341 213148 54647 -106263
40561a06263j80777j57295m8205L0171k3575p5698N3775K43614K03483m6427j53614
$$ -106263 -287040 -444335 -492540 -462369 -485944 -561642 -507867 -264253 -60770 -107197 -260811
40550b60811K9018K13060J36842n5981j19415r6064j23086j02752Q8683K62136
$$ -260811 -231793 -18733 118109 62128 -57287 -153351 -276437 -379189 -290506 -28370
40540b8370J73810j5090M5617K94554L20030K7577k04535j31509J8170k1827j49467
$$ -28370 145440 130350 175967 470521 790551 818128 613593 482084 500254 478427 328960
40529C28960j45214l2939M2555O5161O5246l869j18439j19586K3197R8440j1668
$$ 328960 183746 150807 193362 258523 323769 319900 201461 81875 105072 203512 191844
40518A91844j13905l7037N8398k7803j48326l5679K27093K92742M1265k90600
$$ 191844 77939 40902 99300 71497 -76829 -112508 114585 407327 448592 157992
40508A57992m27811k86395M1161L21394K99262l556k24245j10243J18654J19376
$$ 157992 -269819 -556214 -515053 -193659 105603 102047 -122198 -232441 -113787 5589
40498E589m4281o5198O1906P2767o3902j13641l8082m9415j55009q9578J84431
$$ 5589 -38692 -103890 -41984 30783 -33119 -146760 -184842 -234257 -389266 -478844 -294413
40487b94413L31846J72230l3397l2946L5525l6314j42668r2082L2075M3460q721
$$ -294413 37433 209663 176266 143320 178845 142531 -137 -92219 -60144 -16684 -25405
40476b5405K9961J00567L4012j28365j87954j04739k8830n1633j15121j38616
$$ -25405 4556 105123 139135 10770 -177184 -281923 -310753 -362386 -477507 -616123
40466f16123q4525N8210K29140L00318K41008J86837K23651K21233L8680k15107
$$ -616123 -700648 -642438 -413298 -112980 128028 314865 538516 759749 798429 583322
40456E83322l08616j95766k2305J03980J71691J54515K8274j24161j80801j36958
$$ 583322 274706 78940 56635 160615 332306 486821 515095 390934 210133 73175
40446G3175p3816j7734M3938O8171J9760k4415K1624R7745R1515L3488M0050J00675
$$ 73175 -641 -18375 25563 93734 113494 89079 110703 208448 299963 333451 373501 474176
40434D74176Q5122n1410k09388k79412k26477p9038O2849P8366k704J6275K01286
$$ 474176 559298 507888 298500 19088 -207389 -286427 -223578 -145212 -147916 -131641 69645
40423F9645L12344J36508j36227j56480M8091J21239m3379j42781K0350K12854
$$ 69645 381989 518497 382270 225790 273881 395120 351741 208960 229310 442164
40413D42164J54309n2067j19823k1560L3069m0577j08874o3647L5429Q0948N0819
$$ 442164 596473 544406 424583 403023 436092 395515 286641 222994 258423 339371 390190
40402C90190l835k8482j5626k3643j16780k54562k99293j82287N14J15020J42293
$$ 390190 386355 357873 342247 318604 201824 -52738 -352031 -534318 -533804 -418784 -276491
40391b76491J38507J16631O3481K1267M2017Q0914L7650r1301j88632j65721o6894
$$ -276491 -137984 -21353 42128 63395 105412 186326 223976 132675 -55957 -221678 -288572
40380b88572R425M1683Q5070J58189J88847J07174l4309r7625l6066L1607j5284
$$ -288572 -279147 -237464 -152394 5795 194642 301816 267507 169882 133816 165423 150139
40369A50139j15403j07262K4898J17160O9583j0543K616L8510m4756j82076j45803
$$ 150139 34736 -72526 -47628 69532 139115 128572 131188 169698 124942 -57134 -202937
40358b02937R7313K63162J12105j97867l04686j25702P4038J07430J04337K03475
$$ -202937 -105624 157538 269643 71776 -232910 -358612 -284574 -177144 -72807 130668
40348A30668K47978L8739k57391k74376M664J87623L1282k33155k71305r2483
$$ 130668 378646 417385 159994 -114382 -109718 77905 109187 -123968 -395273 -487756
40338d87756O2121P9686J3827q2897j46884m8096K27318M31545L17229j9412k63874
$$ -487756 -425635 -345949 -332122 -415019 -561903 -609999 -382681 48864 366093 346681 82807
40327H2807k81702j77553l5424J40236K60650K03098L8030m1784l4954j16836
$$ 82807 -198895 -376448 -411872 -271636 -10986 192112 230142 188358 153404 36568
40317C6568k78856k69732K299K72483K79593J13053K5468N9762N4506o8475j91483
$$ 36568 -242288 -512020 -509721 -237238 42355 155408 180876 240638 295144 226669 35186
40306C5186j60982K5286J91164J49967n3586j37590N4799K74781J69726j87638
$$ 35186 -125796 -100510 90654 240621 187035 49445 104244 379025 548751 361113
40296C61113l67746j99602J8912K8640k1063Q7234K37284K00659L3382n4414o5240
$$ 361113 -6633 -206235 -187323 -158683 -179746 -92512 144772 345431 378813 324399 259159
40285B59159j43200k46380j99933k6288O3440J525o1378k5754L3454M2031L3375
$$ 259159 115959 -130421 -330354 -356642 -293202 -291677 -353055 -378809 -345355 -303324 -269949
40274b69949M1986M8071N7754R9072J20364L0445j36640k22889j43182J8394J27000
$$ -269949 -227963 -179892 -122138 -23066 97298 127743 -8897 -231786 -374968 -356574 -229574
40263b29574J27021N0098k7514l7245J1606L6542K893k2542J950R126m1682n5292
$$ -229574 -102553 -52455 -79969 -117214 -105608 -69066 -66173 -88715 -86765 -77639 -119321 -174613
40251a74613L9245J18871K2890j88823l01571k22095l6165J53614K85834K91027
$$ -174613 -135368 -16497 6393 -182430 -484001 -706096 -742261 -588647 -302813 -11786
40241a1786J56322o12p3812j16587j86141j56587P5304K96660K00265j28188k72447
$$ -11786 144536 143924 70112 -46475 -232616 -389203 -313899 -17239 183026 54838 -217609
40230b17609p1546J77805J91412O0568L567K8169K2774l1611j13436k34018l03741
$$ -217609 -289155 -111350 80062 140630 144197 172366 195140 163529 50093 -183925 -487666
40219d87666j33864K42130M56582K54943j09604j93861L9927K29462J51718l6528
$$ -487666 -621530 -379400 77182 332125 222521 28660 68587 298049 449767 413239
40209D13239j13565q2756o2045q3083j15672j59763j99504j52321K4438K15096
$$ 413239 299674 216918 154873 71790 -43882 -203645 -403149 -555470 -531032 -315936
40199c15936K33768M3156j75121k06236l7479J35519J43359K9668l7065J4855
$$ -315936 -82168 -39012 -214133 -420369 -457848 -322329 -178970 -149302 -186367 -171512
40189a71512J05235J37424R2890O27q6783q7793K6708J37949Q7382r7486k15561
$$ -171512 -66277 71147 164037 164664 77881 -9912 16796 154745 242127 144641 -70920
40178g0920j64149n5122q756O572M0046K7845o5943j11908J3685K08667K62966
$$ -70920 -235069 -290191 -298947 -292375 -252329 -224484 -290427 -402335 -388650 -179983 82983
40167H2983J42025k358o4887p7919q7697q4591o7076n9898n4938k6007m091m5826
$$ 82983 225008 222650 157763 79844 -7853 -92444 -159520 -219418 -274356 -300363 -304454 -350280
40155c50280j20865j20154m34J43355J77480P1844o4754q5809L4950J53997J23741
$$ -350280 -471145 -591299 -591733 -448378 -270898 -199054 -263808 -349617 -314667 -160670 -36929
40144c6929l214m0589N2199J09224L3816m2987k832L4036q6050k49849k16176
$$ -36929 -40143 -80732 -28533 80691 114507 71520 68688 102724 16674 -233175 -449351
40133d49351J2328J90972J82557Q3884O406m7357o2336J7864J38634J40172j6983
$$ -449351 -437023 -246051 -63494 20390 26796 -20561 -82897 -65033 73601 213773 196790
40122A96790j93040k80237k94501k15945L3806L55300M47964J98529r5644j04312
$$ 196790 3750 -276487 -570988 -786933 -753127 -397827 50137 248666 153022 48710
40112D8710P6255Q5144j61899l55395k30770R1321K77714J62252j17929k88021
$$ 48710 124965 210109 48210 -307185 -537955 -446634 -168920 -6668 -124597 -412618
40102d12618j95158M9899J85228R1285o9030p5861M5905Q4367k9505j20984l8332
$$ -412618 -607776 -557877 -372649 -281364 -350394 -426255 -380350 -295983 -325488 -446472 -484804
40091d84804J34699K17753J69182Q1368K4447J892P913K7454J4045m1536n6509
$$ -484804 -350105 -132352 36830 118198 142645 144537 152450 179904 193949 152413 95904
40080I5904L0447J23042O9041j05003j97425j04948M0563P7348K8102n10k2198
$$ 95904 126351 249393 318434 213431 16006 -88942 -48379 28969 57071 56561 34363
40069C4363j14936k20160j84354q203J19899R1951K9544Q0424J96266K26648J35619
$$ 34363 -80573 -300733 -485087 -493290 -373391 -281440 -251896 -171472 24794 251442 387061
40058C87061k113j45136k81794l28073j88658P0445K43907K17315P6559l9240
$$ 387061 384948 239812 -41982 -370055 -558713 -488268 -244361 -27046 49513 10273
40048A0273r0359r7462n1673N0805J37719J14098j2139j10373n8958J07511K04414
$$ 10273 -80086 -177548 -229221 -178416 -40697 73401 61262 -49111 -108069 -558 203856
40037B03856R0270j39996k23591m3272J99276K18540K76k03694k05369n5763J06574
$$ 203856 294126 154130 -69461 -112733 86543 305083 305359 101665 -103704 -159467 -52893
40026e2893K07629J97329M0809j54122j67783L7155J93827O9159j94346k72817
$$ -52893 154736 352065 392874 238752 70969 108124 301951 371110 176764 -96053
40016i6053j11852M6715N2769J2396L5813O3367L1151L24M346m1182j33672q2180
$$ -96053 -207905 -161190 -108421 -96025 -60212 3155 34306 34630 38976 -2206 -135878 -218058
40004b18058J84092L70912J63163k67186m11981j03876K62644K87947O4200o9491
$$ -218058 -33966 336946 500109 232923 -179058 -282934 -20290 267657 331857 262366
39994B62366l8734l3167j19582j48215l5010J05854J54084J18337L4522q9923
$$ 262366 223632 190465 70883 -77332 -112342 -6488 147596 265933 300455 210532
39984B10532j71591p9987J28305J83005m2273k91279k34539P8022K86919K05269
$$ 210532 38941 -41046 87259 270264 227991 -63288 -297827 -219805 67114 272383
39974B72383Q425p7870n9805n2859n4531P318R5882R3966j5484j22355j44586
$$ 272383 280808 202938 143133 90274 35743 43061 138943 232909 217425 95070 -49516
39963d9516j09309o3242N085J08571J92318J82089P4520o5867j77010k23328j77985
$$ -49516 -158825 -222067 -216982 -108411 83907 265996 340516 274649 97639 -125689 -303674
39952c03674n1899O2617O2835j5651m844J67164L20184K12183j25899l67436k49200
$$ -303674 -355573 -292956 -230121 -245772 -250616 -83452 236732 448915 323016 -44420 -293620
39941b93620J23082L82438K75684r9083l97626l60454o8533J47322R3039n6282
$$ -293620 -170538 211900 487584 388501 -9125 -369579 -438112 -290790 -197751 -254033
39931b54033j7226J81863K46276P3953r3590p3854k9005j53322l03352k18404
$$ -254033 -271259 -89396 156880 230833 137243 63389 34384 -118938 -422290 -640694
39921f40694M0360J83187J42291J07978J45937J15860K323j1725J06113J38973
$$ -640694 -600334 -417147 -274856 -166878 -20941 94919 97242 85517 191630 330603
39911C30603J0221m4530J05944K00128j0537l13344l31530j03692Q348q8745j12287
$$ 330603 340824 296294 402238 602366 591829 278485 -53045 -156737 -148389 -237134 -349421
39900c49421Q6295K70623K05417M494q1895j8553N8473Q3894P7196K0072j01914
$$ -349421 -263126 7497 212914 217408 135513 116960 175433 259327 336523 356595 254681
39889B54681j97072j66033o4293k2324l2357L1129J76360K38715J13620q1635
$$ 254681 57609 -108424 -172717 -195041 -227398 -196269 -19909 218806 332426 250791
39879B50791j58192p6011O6679J78271K04876R3360j29131k71869j54260J07535
$$ 250791 92599 16588 83267 261538 466414 559774 430643 158774 4514 112049
39869A12049J69881q7174l45801k51783R5829K80675J40062n9196n2643O9966
$$ 112049 281930 194756 -151045 -402828 -306999 -26324 113738 54542 1899 71865
39859G1865P7931l6338j04003p0609k5352J1200J16478K65440K88841J10441j07767
$$ 71865 149796 113458 9455 -61154 -86506 -75306 41172 306612 595453 705894 598127
39848E98127j62688p1420k3685j11058k20882k15493j14348l2316m866K4114O3641
$$ 598127 435439 364019 340334 229276 8394 -207099 -321447 -353763 -358629 -334515 -270874
39837b70874M6023l6306q3486m4549p237l2962j9422J23024K60106J99944O809
$$ -270874 -224851 -261157 -344643 -389192 -396429 -429391 -448813 -325789 -65683 134261 141070
39826A41070q4912l9825l4544r1619j9730J87292K27508m0712l09513k64833o0342
$$ 141070 56158 16333 -18211 -109830 -129560 57732 285240 244528 -64985 -329818 -390160
39815c90160k6730j20764n3451J63235K25953O7770m0441L2737R0868J1269k7728
$$ -390160 -416890 -537654 -591105 -427870 -201917 -134147 -174588 -141851 -50983 -39714 -67442
39804f7442J01403K09949J07059o7465p3234N0409Q3552k1531j20526j26498p4024
$$ -67442 33961 243910 350969 283504 210270 260679 344231 322700 202174 75676 1652
39793A652L442Q0305Q1594j3233p0656K1207J37968P2638j34090k27450j06064
$$ 1652 5094 85399 166993 153760 83104 104311 242279 314917 180827 -46623 -152687
39782a52687N4457R2886P7043J24479J72394Q1582j15792k29856j59164n40J03502
$$ -152687 -98230 -5344 71699 196178 368572 450154 334362 104506 -54658 -55198 48304
39771D8304J27534J28557J24827Q7143K0733k5372l5337m2606n3725l2543P328
$$ 48304 175838 304395 429222 516365 537098 511726 476389 433783 380058 347515 354843
39760C54843j6667j19457j83402j26307m8076p5178j31501m5346J47376K20824
$$ 354843 338176 218719 35317 -90990 -139066 -214244 -345745 -391091 -243715 -22891
39750b2891J07875J3930R4069K11991J60702k4196j34048p6498N4774J39523J31328
$$ -22891 84984 98914 192983 404974 565676 541480 407432 330934 385708 525231 656559
39739F56559M1448p1501j29878j26325j27774j37459n9306J15131K11833J00094
$$ 656559 698007 626506 496628 370303 242529 105070 45764 160895 372728 472822
39729D72822r6589j73941j37941j41174k00232j83348n2322Q5011J64852K19787
$$ 472822 376233 202292 64351 -76823 -277055 -460403 -512725 -427714 -262862 -43075
39719d3075K28030J08408q6315j59451l8313J04209R4684o442k9982M4885Q9920
$$ -43075 184955 293363 207048 47597 9284 113493 208177 201735 171753 216638 306558
39708C06558L3317n3409p2367k3848J0148k3773q5131j01948q2350r9323j46184
$$ 306558 339875 286466 214099 190251 200399 176626 91495 -10453 -92803 -192126 -338310
39697c38310j08318M6993J62729J04538j7213j8253M5618k4032j86105j69126
$$ -338310 -446628 -399635 -236906 -132368 -149581 -167834 -122216 -146248 -332353 -501479
39687e01479P5976K33486R0466j17710o2161J82834K84914J69545P1807J03093
$$ -501479 -425503 -192017 -101551 -219261 -281422 -98588 186326 355871 427678 530771
39677E30771Q2922j21927l48505l71130k13381p1101k7998l134O1998J07884P1834
$$ 530771 613693 491766 143261 -227869 -441250 -512351 -540349 -543483 -481485 -373601 -301767
39666c01767M825J0207R0506J21114J7061j12734p2386J39473K71718J36890j12677
$$ -301767 -296942 -286735 -196229 -75115 -58054 -170788 -243174 -103701 168017 304907 192230
39655A92230j76470j7893J08963M7261o7388p7907n4503j08746j36223J4678K12091
$$ 192230 15760 -2133 106830 154091 86703 8796 -45707 -154453 -290676 -275998 -63907
39644f3907J58577j53308l68306k38853N5087J94352J43207R6832J35130J49622
$$ -63907 94670 -58638 -426944 -665797 -610710 -416358 -273151 -176319 -41189 108433
39634A08433O9587l7607r5756r5838m1493M1911N6011n5165j49323l7520J92515
$$ 108433 178020 140413 44657 -51181 -92674 -50763 5248 -49917 -199240 -236760 -44245
39623d4245K34225J8518j33491K7882K86234K64972k0137j99208q6922R7952Q7883
$$ -44245 189980 208498 75007 102889 389123 654095 633958 434750 347828 445780 533663
39612E33663r1681k27604k03379p6185L1094L7994l1614o2581J7022J20845J13242
$$ 533663 441982 214378 10999 -65186 -34092 3902 -27712 -90293 -73271 47574 160816
39601A60816J5449k3769L7415P9349K9768l0335k8513j5552l4330j9626O0728
$$ 160816 176265 152496 189911 269260 299028 268693 240180 224628 190298 170672 231400
39590B31400R4817p744j42813j51688n3431J8629M8788J27913K33849K14511L0700
$$ 231400 326217 318473 175660 23972 -29459 -10830 37958 165871 399720 614231 644931
39579F44931j43691j41685o886J10795J73395K60896M02685N11903N01871M05100
$$ 644931 501240 359555 352669 463464 636859 897755 1300440 1812343 2314214 2719314
39569B719314L49577M35208O41174Q63856J080930J461435K178354K997261L173270
$$ 2719314 3068891 3504099 4145273 5009129 6090059 7551494 9729848 12727109 15900379
39560A5900379K049538j28478k201123l101547k791854k053550j517890j205213
$$ 15900379 17949917 17821439 15620316 12518769 9726915 7673365 6155475 4950262
39552D950262r31130p15112o18301n18931l17517j52317j64423k33632j97285
$$ 4950262 4019132 3304020 2685719 2166788 1849271 1696954 1532531 1298899 1101614
39543A101614j45818k12733k47605m6899K23920K31727J5747r5269o1014j50812
$$ 1101614 955796 743063 495458 448559 672479 904206 919953 824684 763670 612858
39533F12858l62244l41507k2791J72856J9291j25980N2481K69293J40283j36912
$$ 612858 250614 -90893 -113684 59172 78463 -47517 4964 274257 414540 277628
39523B77628j24863J01837J14834j08115j61614P3551K43035J28857l4297j0797
$$ 277628 152765 254602 369436 261321 99707 173258 416293 545150 510853 500056
39513E00056O8627m282j67171k38252j90832r8539J3220J12436J11949K044r5038
$$ 500056 568683 564401 397230 158978 -31854 -130393 -117173 -4737 107212 109256 14218
39502A4218r1123l1311K2721O5541O7158j5804j07759o9374P0486J25710M6928
$$ 14218 -76905 -108216 -85495 -19954 47204 31400 -76359 -145733 -75247 50463 97391
39491I7391J712Q8426J75106J23513j0364j02677j19912o2252P1234J69681O0284
$$ 97391 99103 187529 362635 486148 475784 373107 253195 190943 262177 431858 492142
39480D92142k10521l37278j38712J86171L24390K15675K2584j03225q9681N5640
$$ 492142 281621 -55657 -194369 -8198 316192 531867 554451 451226 361545 417185
39470D17185J76491P2375j89630k71418m0738J81497Q5696j43500j25469J12083
$$ 417185 593676 666051 476421 205003 164265 345762 431458 287958 162489 274572
39460B74572K06603M8770j03726r9016q2565j33668q3121J33780K56610P6413
$$ 274572 481175 529945 426219 327203 244638 110970 27849 161629 418239 494652
39450D94652j95763k19932m3645j5471k20277l20350o1087L17977L88748J17896
$$ 494652 298889 78957 35312 19841 -200436 -520786 -581873 -263896 124852 242748
39440B42748j13053n7926R1399O2637p4567p4607M7287N1878q6623j07290R8629
$$ 242748 129695 71769 163168 225805 151238 76631 123918 175796 89173 -18117 80512
39429H0512K73360J71370q9634k45643k51557k14838j36096L2535J81220J47326
$$ 80512 353872 525242 435608 189965 -61592 -276430 -412526 -379991 -198771 -51445
39419e1445k5989j47001j44928r3638k6912O6999J15457L6494q3204q1990K9338
$$ -51445 -77434 -224435 -369363 -463001 -489913 -422914 -307457 -270963 -354167 -436157 -406819
39408d06819J01566R2875Q1958P4719J7879k3753N6735J67230J08961p7614j32426
$$ -406819 -305253 -212378 -130420 -55701 -37822 -61575 -4840 162390 271351 193737 61311
39397F1311J1711J16974L0256q9479o7531J5281J9462l951L8627O4038l8439j65163
$$ 61311 73022 189996 220252 130773 63242 78523 97985 94034 132661 196699 158260 -6903
39385f903j28924L9072J20983K1484j19600j27991O729J43600J36826j8974j61278
$$ -6903 -135827 -96755 24228 45712 -73888 -201879 -195150 -51550 85276 66302 -94976
39374i4976j26387L8851J20847K2103j20671j53438r6412k6034Q6758K70790L94425
$$ -94976 -221363 -182512 -61665 -39562 -160233 -313671 -410083 -436117 -349359 -78569 315856
39363C15856K92430J6686j93613j93713p4128j4260q1078j87623k02340r1646
$$ 315856 608286 624972 431359 237646 163518 149258 68180 -119443 -321783 -413429
39353d13429L9533P7352N0814P0170J22968P2905r3594j78710l8552J89809K60654
$$ -413429 -373896 -296544 -245730 -175560 -52592 20313 -73281 -251991 -290543 -100734 159920
39342A59920J27832n1404j44736j40920p6865p148j0640j02618j66953q8717P1744
$$ 159920 287752 236348 91612 -49308 -126173 -133321 -143961 -246579 -413532 -502249 -430505
39331d30505J47750Q9532J1414K2494J04248J62982J40296P1305N9604J52247
$$ -430505 -282755 -193223 -181809 -159315 -55067 107915 248211 319516 379120 531367
39321E31367K21922P4199k66464m97052l74889k0086K46583K76273J57533K638
$$ 531367 753289 827488 561024 63972 -310917 -331003 -84420 191853 349386 352024
39311C52024j36558j83509p7861P9180R4375o0107j96570j59144p38J25773J43726
$$ 352024 215466 31957 -45904 33276 127651 67544 -129026 -288170 -288908 -163135 -19409
39300a9409P6622j2825o3829n9482m5980o0270n8533R948R0300Q5667J4241p781
$$ -19409 57213 44388 -19441 -78923 -124903 -185173 -243706 -233758 -143458 -57791 -43550 -51331
39288e1331O3371J47308J56233P5933m8446j19089l0746J70419K41074K4567k72050
$$ -51331 12040 159348 315581 391514 343068 223979 193233 363652 604726 629293 357243
39277C57243l01508o0872J00525j259j34210m3379J55264J80013R775j31216j26143
$$ 357243 55735 -5137 95388 94129 -40081 -83460 71804 251817 261592 130376 4233
39266D233p8250r0643j18915p2952N3765J88432K45790J86729N7301m5912q0697
$$ 4233 -74017 -164660 -283575 -356527 -302762 -114330 131460 318189 375490 329578 248881
39255B48881q7800r0301m6742M2111P9191J5735m0979J5067R9570N6288q0904
$$ 248881 161081 70780 24038 66149 145340 161075 120096 135163 234733 291021 210117
39244B10117j16885Q812J23725P3548p0717j42818j08653n3685j4827M6630J22121
$$ 210117 93232 102044 225769 299317 228600 85782 -22871 -76556 -91383 -44753 77368
39233G7368J26991K8704p8825q3269R150R2616Q6307j491r9933j19007r119J53012
$$ 77368 204359 233063 154238 70969 80119 172735 259042 257551 157618 38611 29492 182504
39221A82504J84101O677j92160j65511L2840R4001p9180j90440j621K59557K22052
$$ 182504 366605 373282 181122 15611 48451 142452 63272 -127168 -128789 130768 352820
39210C52820m8127j45202M0123J67526R875j94397j40684Q1191J76842R2823O021
$$ 352820 304693 159491 199614 367140 377015 182618 41934 123125 299967 392790 398811
39199C98811L959L4823Q7361J73129J85483J5423k17442k73249j23094L8315J02723
$$ 398811 402770 437593 524954 698083 883566 898989 681547 408298 285204 323519 426242
39188D26242J42441J79201J11103n4602j32952m7933J9878p3801j82151j03950
$$ 426242 568683 747884 858987 804385 671433 623500 643378 569577 387426 283476
39178B83476O7929P3955j08955k37778j69224k1299P4335J55839K57896K50380
$$ 283476 351405 425360 316405 78627 -90597 -111896 -37561 118278 376174 626554
39168F26554L1968k31501k68802o7295J13918J01357n452n3553o0327r9415j08536
$$ 626554 658522 427021 158219 90924 204842 306199 300747 247194 186867 87452 -21084
39157b1084J1117J72691J71381j9399j82289j39779J9705P8457k7947j51071j19636
$$ -21084 -9967 162724 334105 314706 132417 -7362 12343 90800 62853 -88218 -207854
39146b07854P5076K75970L09523J47682o1309j34686l7835Q3621N9070j21111
$$ -207854 -132778 143192 452715 600397 539088 404402 366567 450188 509258 388147
39136C88147k75834k16053J4129J36895j7657k24530j21132K34072L48143q528
$$ 388147 112313 -103740 -89611 47284 29627 -194903 -316035 -81963 266180 257652
39126B57652l91892k78683J62180L17745L1077k40723j82318k1016k0469n1413
$$ 257652 -134240 -412923 -250743 67002 98079 -142644 -324962 -345978 -366447 -417860
39116d17860O5229J82370J17178K617J8708M9639n0535j14395L9884K06561J07303
$$ -417860 -352631 -170261 -53083 -50466 -31758 17881 -32654 -147049 -107165 99396 206699
39105B06699r8528p6373Q2464L3431j63144j23525J43974K01021n8907k01058
$$ 206699 108171 31798 114262 147693 -15451 -138976 4998 206019 147112 -53946
39095e3946P533K02096N7556j73715j34985L7201K3587q4819K0498K75132L13336
$$ -53946 -46413 155683 213239 39524 -95461 -58260 -34673 -119492 -98994 176138 489474
39084D89474N2849j98505k11947p8167L7395R1016P1234m5871j87660k07721p5501
$$ 489474 542323 343818 131871 53704 91099 182115 253349 207478 19818 -187903 -263404
39073b63404P5620J15342M4118m0918m1574M6286R3318k3062k03849k01756K2031
$$ -263404 -187784 -72442 -28324 -69242 -110816 -64530 28788 5726 -198123 -399879 -377848
39062c77848K05310J66267O0607Q0475J20558k477j84210j88406m0321M4085K7175
$$ -377848 -172538 -6271 54336 134811 255369 252892 68682 -119724 -160045 -115960 -88785
39051h8785L7045O3120o944r2812m387J91265K23518N3001q1350p5327o9058r7665
$$ -88785 -51740 11380 4436 -88376 -92763 98502 322020 375021 293671 218344 149286 51621
39039E1621j4892J35408P1044k31251l73504j17283K12620K06406l2304j11274
$$ 51621 36729 172137 243181 11930 -361574 -478857 -266237 -59831 -92135 -203409
39029b03409L8478J47598Q7525R974L7767J04813J12733L5737j20990k95338l42513
$$ -203409 -164931 -17333 70192 80166 117933 222746 335479 371216 250226 -45112 -387625
39018c87625k02130l0146O099j7796O8610K10883J95533k571j73424j69535m4983
$$ -387625 -589755 -619901 -613802 -631598 -562988 -352105 -156572 -159143 -332567 -502102 -547085
39007e47085R8276K05521K16963J16090K3634N3233J03429J2952j17935m4995
$$ -547085 -448809 -243288 -26325 89765 113399 166632 270061 283013 165078 120083
38997A20083J80674K21837j6500k03863q9402J19594J13985m5072r8077l6792
$$ 120083 300757 522594 506094 302231 212829 332423 446408 401336 303259 266467
38987B66467n4656j54917j39882K6934J44025R6247N008j4996k8136j02457j45918
$$ 266467 211811 56894 -82988 -56054 87971 184218 189226 174230 146094 43637 -102281
38976a02281n8295P7528J04417K2005k8782J5853O7048M2291o886J0879O7510
$$ -102281 -160576 -83048 21369 43374 14592 30445 97493 139784 132898 143777 211287
38965B11287M4667p9940j73404j31877m2346m7708r7291j157K37299L32315Q9861
$$ 211287 255954 176014 2610 -129267 -171613 -219321 -316612 -317769 -80470 251845 341706
38954C41706k68154l46949q7134J76159J73144J9501q819J33208K39681J61394
$$ 341706 73552 -273397 -360531 -184372 -11228 8273 -546 132662 372343 533737
38944E33737j2739j05696q9601r5376j95883k61796j16766J80881L35402J62180
$$ 533737 520998 415302 325701 230325 34442 -227354 -344120 -163239 172163 334343
38934C34343j61117l09708k06779n0601J0404K9766O5428M6882m6407n3402J39379
$$ 334343 173226 -136482 -343261 -393862 -383458 -353692 -288264 -241382 -287789 -341191 -201812
38923b01812L44848K64968q7096l50917k53354P0050K70735J99345J6087n8504
$$ -201812 143036 408004 320908 -30009 -283363 -213313 57422 256767 272854 214350
38913B14350J1518R4900P4180m3586j66295k11582j57233m2336N5791P7520M5960
$$ 214350 225868 320768 394948 351362 185067 -26515 -183748 -226084 -170293 -92773 -46813
38902d6813M7256J10206J48563Q6362m417N225R3908J05888r723j22190j34305
$$ -46813 443 110649 259212 345574 341157 346382 440290 546178 536455 414265 279960
38891B79960j17526j34348q7357Q9395K19516R1761j82657k67262o1591J73446
$$ 279960 162434 28086 -59271 30124 249640 341401 158744 -108518 -170109 3337
38881C337K04537J02849K4862n1343j84775k48914r8236J38378J88780L6599o1480
$$ 3337 207874 310723 335585 284242 99467 -149447 -247683 -109305 79475 116074 54594
38870E4594J5231P7742l5270j74847j19887O1327J18592J3159m1374O3928J72631
$$ 54594 69825 147567 112297 -62550 -182437 -121110 -2518 10641 -30733 33195 205826
38859B05826J38891N4040M9130L8371j26036l36000l20211n9325J39566O7561
$$ 205826 344717 398757 447887 486258 360222 24222 -295989 -355314 -215748 -148187
38849a48187j08345j38263o1732n9495p2321J20360M53058N33485J82490k41127
$$ -148187 -256532 -394795 -456527 -516022 -588343 -467983 -14925 518560 701050 459923
38839D59923k77894K6204K10311L5090k43282k82624r8768M5730M0065R628M8747
$$ 459923 182029 208233 418544 453634 210352 -72272 -171040 -125310 -85245 -75617 -26870
38828b6870P1909q108j00556o3180N6970O3107q9660j75555J1242L30561M20296
$$ -26870 45039 36931 -63625 -126805 -69835 -6728 -96388 -271943 -260701 69860 490156
38817D90156J51848j92006k70129r1655N6819J8757o8256k5959J07069J59633
$$ 490156 642004 449998 179869 88214 145033 163790 95534 69575 176644 336277
38807C36277P4962l8304p3814n2419o3432j32780j77019q4591J49552L69480L75210
$$ 336277 411239 372935 299121 246702 183270 50490 -126529 -211120 -61568 307912 683122
38796F83122J23068k14514m11881l81015j84761O4872K49945K55285O4527j54370
$$ 683122 806190 591676 179795 -201220 -385981 -321109 -71164 184121 248648 94278
38786I4278j85237k3419J05839L8678j24068j82227j04028j2522K6294N9545J11729
$$ 94278 -90959 -114378 -8539 30139 -93929 -276156 -380184 -392706 -366412 -306867 -195138
38775a95138J29955Q6512K8535p995m6785r9557j22712q4606j4840M5022Q4036
$$ -195138 -65183 21329 49864 41869 -4916 -104473 -227185 -311791 -326631 -281609 -197573
38764a97573R4455O5729K8117L2950O4805N0057j5614l5752M0038J24181J18553
$$ -197573 -103118 -37389 -9272 23678 88483 138540 122926 87174 127212 251393 369946
38753C69946N9531M4771O7585L0712q6030j67326j03979N3654J26372L079k03904
$$ 369946 429477 474248 541833 572545 486515 319189 215210 268864 395236 398315 194411
38742A94411k49589m3635K05478K20718l359k06274j91848j5721J58479K28219
$$ 194411 -55178 -98813 106665 327383 324024 117750 -74098 -89819 68660 296879
38732B96879J49282n5310k21456j63460M7741J19305m4597j76496n1820J65390
$$ 296879 446161 390851 169395 5935 53676 172981 128384 -48112 -99932 65458
38722F5458J98484P3703m672j9282p5760j11994n941J20945N8590r4603n7736
$$ 65458 263942 337645 332973 313691 237931 125937 119996 240941 299531 204928 147192
38711A47192J38502J78249o12j08060j9382L1019q3772j38201O193R7570q4569
$$ 147192 285694 463943 463331 355271 335889 366908 283136 144935 151128 248698 164129
38700A64129l21525k89511n3665R4865R6514R6211J14734O2620k5086m6359l0012
$$ 164129 -157396 -446907 -500572 -405707 -309193 -212982 -98248 -35628 -60714 -107073 -137085
38689a37085l5557J8571J72833K17957k8131l49873l72179j01212J03561O2525
$$ -137085 -172642 -154071 18762 236719 208588 -141285 -513464 -614676 -511115 -448590
38679d48590m9752o2422j4235M0223J32600K23421K02534J05530Q5510J27028
$$ -448590 -498342 -560764 -574999 -534776 -402176 -178755 23779 129309 214819 341847
38669C41847N0850j42909k18824q2230O5359O3153J4821L3540K8848o7826j06760
$$ 341847 392697 249788 30964 -51266 14093 77246 92067 125607 154455 86629 -20131
38658b0131K7831J68406J09538n3785q3530K5394Q2035L0012j5081j4992m6354
$$ -20131 7700 176106 285644 231859 148329 173723 255758 285770 270689 255697 209343
38647B09343r9210p5406j830j1822p9155j9587J60365J78681r2661l47388k46722
$$ 209343 110133 34727 32897 21075 -58080 -77667 82698 261379 168718 -178670 -425392
38636d25392O2788J53079l1081q9540J92047M76559L65619j4559k19127j15361
$$ -425392 -362604 -209525 -240606 -330146 -138099 338460 704079 689520 470393 355032
38626C55032K8397J9883l8293l9442n7423j28951j26079J435Q7873K6944k3930
$$ 355032 383429 403312 365019 325577 268154 139203 13124 14559 102432 129376 105446
38615A05446Q7774K26712J92327P0802Q9564K18310K19929Q0789P9758L45145
$$ 105446 193220 419932 612259 683061 772625 990935 1210864 1291653 1371411 1716556
38605A716556O15311O36888O33857J079444J934215K356581J485465m49813k106597
$$ 1716556 2331867 2968755 3602612 4682056 6616271 8972852 10458317 10008504 7901907
38596G901907k367057j511964p29688o17218o91217m07488j0042n458k98192l95405
$$ 7901907 5534850 4022886 3293198 2675980 1984763 1577275 1567233 1561775 1263583 868178
38586H68178k02511o6514j39936j98016q0619R2718J76918J49874J1688j76478
$$ 868178 665667 599153 459217 261201 180582 273300 450218 600092 611780 435302
38576D35302k02481M3483K94918K21460o0716j63059l8544J1535p7379k2632K56825
$$ 435302 232821 276304 571222 792682 731966 568907 530363 541898 464519 441887 698712
38565F98712M43246L21577P7452p1508j72718k87425k92214j42496l5138r9920
$$ 698712 1141958 1463535 1540987 1469479 1296761 1009336 717122 574626 539488 439568
38555D39568j88261j51679p4047m8083K1103J91253K95598J88198j2345j08307
$$ 439568 251307 99628 25581 -22502 -1399 189854 485452 673650 661305 552998
38545E52998q6353m3393j0987J0344j0264n5187n7865l7899p2777j15472m9472
$$ 552998 466645 423252 412265 422609 412345 357158 299293 261394 188617 73145 23673
38534B3673O7059O6161j2353L2216J70599J44140p4804j90650p3769K5206p6990
$$ 23673 90732 156893 144540 176756 347355 491495 416691 226041 152272 177478 100488
38523A00488j77982l9052K30751L64383K89498J05879r3054k22916k05794p5740
$$ 100488 -77494 -116546 114205 478588 768086 873965 780911 557995 352201 276461
38513B76461N4483J47841J94079Q7194j81037l20166r8045K13269J90256n2958
$$ 276461 330944 478785 672864 760058 579021 258855 160810 374079 564335 511377
38503E11377n9632J71807K15095J7626l0667J13200M2233k71229l27191o870J62283
$$ 511377 451745 623552 838647 856273 825606 938806 981039 709810 382619 375749 538032
38492E38032m9903j65873R6673L11674J79329Q3756K96276L85229J4151l77896
$$ 538032 488129 322256 418929 730603 909932 993688 1289964 1675193 1689344 1311448
38482A311448l18860p0758l7188n6337Q6553J03240j83899l35425p3458J23939
$$ 1311448 992588 921830 884642 828305 914858 1018098 834199 498774 425316 549255
38472E49255r4103k27382J23053L67227p0158n98674l73566K80886M72057K08633
$$ 549255 455152 227770 350823 718050 647892 49218 -324348 -43462 428595 637228
38462F37228J25233K20443M7013k25276r9706K09574J35704j54799j09007J18413
$$ 637228 762461 982904 1029917 804641 704935 914509 1050213 895414 786407 904820
38452I04820Q904k36790q0111K48401J68878r3480M5851L28271J37897k21957
$$ 904820 913724 676934 596823 845224 1014102 920622 966473 1294744 1432641 1210684
38442A210684n8617L14198J17860l49498k16493K71535J59921m09224m53698J8433
$$ 1210684 1152067 1466265 1584125 1234627 1018134 1289669 1449590 1040366 586668 605101
38432F05101J30768j12751M6843M32769J97349l69844k03751M80811M75334j77684
$$ 605101 735869 623118 669961 1102730 1300079 930235 726484 1207295 1682629 1504945
38422A504945l02265J32521N5463m36214j95570N79634N45076j58286q6517O59666
$$ 1504945 1202680 1335201 1390664 954450 758880 1338514 1883590 1725304 1638787 2298453
38412B298453O02883o1568K82026J288961J024387j13044K32427J768468J802012
$$ 2298453 2901336 2839768 3121794 4410755 5435142 5322098 5554525 7322993 9125005
38403I125005O13674J411627M012579M592691L241735M678535R085249J1005612
$$ 9125005 9738679 11150306 15162885 19755576 22997311 27675846 36761095 47766707
38395D7766707J1688788K1554558M0987328M8797473K5165609j8094306m6520016
$$ 47766707 59455495 81010053 121997381 170794854 195960463 177866157 131346141
38388A31346141m3033516k4107888j2876496j1721241r843667m702163k506024
$$ 131346141 88312625 64204737 51328241 39607000 29763333 25061170 22555146
38381B2555146m179831m098731r88408M63658j063891j225270J807249L950886
$$ 22555146 18375315 14276584 13288176 13751834 12687943 11462673 13269922 17220808
38373A7220808J979485j787743l700433l469554k654281j794404r39940o06031
$$ 17220808 19200293 17412550 13712117 10242563 7588282 5793878 4853938 4247907
38365D247907p39852n28627O842l6892n78608n30874J35014K73289k72959l89481
$$ 4247907 3508055 2979428 2986270 2949378 2370770 1839896 1974910 2248199 1975240 1585759
38355A585759J70105L48449j76172m33436m4259J64518j38309k12553J70493K35395
$$ 1585759 1755864 2104313 1928141 1494705 1450446 1614964 1476655 1264102 1434595 1669990
38345A669990k23198l63313J00806L35062m6099k95049K9402L05446J06883o4653
$$ 1669990 1446792 1083479 1184285 1519347 1473248 1178199 1207601 1513047 1619930 1555277
38335A555277J14343J60729j52397k43690J69195M72873K78964J68204O76400
$$ 1555277 1669620 1830349 1677952 1434262 1603457 2076330 2355294 2523498 3199898
38326C199898J350895J409349P05983l57629j278028j564559j067492l64056j68622
$$ 3199898 4550793 5960142 6666125 6308496 5030468 3465909 2398417 2034361 1865739
38317A865739l35379j95172K12815K18101j99032l08332O7012K64016J7291j14048
$$ 1865739 1530360 1335188 1548003 1766104 1567072 1258740 1325752 1589768 1607059 1493011
38307A493011J45934L10489J08538n0509N2646O4154j12680m9421L04674L99263
$$ 1493011 1638945 1949434 2057972 2007463 2060109 2124263 2011583 1962162 2266836 2666099
38297B666099J05508K467K89012M00913J09549r783L31140N79482M04626L37140
$$ 2666099 2771607 2774074 3063086 3463999 3573548 3563765 3894905 4474387 4879013 5216153
38287E216153P57465J179397J174990J122689J355505J408533Q49793J00629l16723
$$ 5216153 5973618 7153015 8328005 9450694 10806199 12214732 13064525 13165154 12848431
38278A2848431o46533j249766j732683j544921r50088o23432o65300o97467o01214
$$ 12848431 12201898 10952132 9219449 7674528 6724440 6101008 5435708 4738241 4137027
38269D137027n34501m91682l76156k73247k55141j93888o6721q5675k64834k94023
$$ 4137027 3602526 3110844 2734688 2461441 2206300 2012412 1945691 1860016 1595182 1301159
38259A301159r0930J5808j00727j25760O2020J20548r0971k05617l3387R0293
$$ 1301159 1210229 1226037 1125310 999550 1061570 1182118 1091147 885530 852143 942436
38249I42436k0390n2450J15695Q6346k78716m74851k16131L9613p0428j75856
$$ 942436 922046 869596 985291 1071637 792921 318070 101939 141552 71124 -104732
38239a04732P2509L23699K06394J1778P8118J52431p535o7305J90306K97259n5354
$$ -104732 -32223 291476 497870 509648 587766 740197 732662 665357 855663 1152922 1097568
38228A097568l02354O6975N54646N42427M87511J137251J999880J791407K87858
$$ 1097568 795214 862189 1416835 1959262 2446773 3584024 5583904 7375311 7663169
38219G663169j298231j842041j402008p30039l70635l77238m58176l06582N329
$$ 7663169 6364938 4522897 3120889 2390850 2020215 1642977 1184801 878219 883548
38210H83548J02662p9935j46401P6231K19201O1828n2751R0331J11114k20829
$$ 883548 986210 906275 759874 836105 1055306 1117134 1064383 1154714 1265828 1044999
38200A044999m28388j22246K75461K58973O9473J09981J69181k7661j41730J07817
$$ 1044999 616611 494365 769826 1028799 1098272 1208253 1377434 1349773 1208043 1315860
38190A315860K56788o6875l11160N7590N03500L67690J22466M68541R32194Q12983
$$ 1315860 1572648 1505773 1194613 1252203 1755703 2123393 2245859 2714400 3646594 4459577
38180D459577Q38625K068443L509626K868267j17903k949951l506128k341361
$$ 4459577 5298202 7366645 10876271 13744538 13626635 10676684 7170556 4829195
38172D829195j206070p27237m87090k85038k45766k75572k17031j70638j97457
$$ 4829195 3623125 2895888 2408798 2123760 1877994 1602422 1385391 1214753 1017296
38163A017296j25212M9495O8417n8782o495K06273J65469j34370j62256K14659
$$ 1017296 892084 941579 1009996 951214 944719 1150992 1316461 1182091 1019835 1234494
38153A234494M13581Q9959l04624l10567j43078j56408k26072j24672R50k2104
$$ 1234494 1648075 1738034 1433410 1122843 979765 823357 597285 472613 473563 451459
38143D51459n620K19273M04992K52575j17602l60536l30900j18883R8706J37417
$$ 451459 445839 665112 1070104 1322679 1205077 844541 513641 394758 493464 630881
38133F30881k1188j28952j2086J06212j4552j40426M4878K88090J49550j62967
$$ 630881 609693 480741 468655 574867 560315 419889 464767 752857 902407 739440
38123G39440r6218K58894L13820L4946m0688J91348L31478M10400Q41794J333766
$$ 739440 643222 902116 1215936 1250882 1210194 1401542 1733020 2143420 2985214 4318980
38113D318980R90258j99429j069415q95104k88664l3375m0894M264l7203j70971
$$ 4318980 5309238 5109809 4040394 3145290 2856626 2823251 2782357 2786621 2749418 2578447
38103B578447O6319O73539P95371q61q74091r04634l82890j05481j04466M3618
$$ 2578447 2644766 3318305 4113676 4112815 3238724 2334090 1951200 1845719 1741253 1784871
38093A784871K49049J64542k9601Q1839M17198O31062P03724P34608O31016N34207
$$ 1784871 2033920 2198462 2168861 2250700 2667898 3298960 4002684 4737292 5368308 5902515
38083E902515R08060J562858J356114k46507j994413k291102j294039m66156m35632
$$ 5902515 6810575 8373433 9729547 9483040 7488627 5197525 3903486 3437330 3001698
38074C001698n26781k46977J1085j07587l29415l59691l04071k50309p0738J79859
$$ 3001698 2474917 2227940 2239025 2131438 1802023 1442332 1138261 887952 817214 997073
38064I97073K37387J35818K20413N40444P08605M71776N870m19404o83927p04723
$$ 997073 1234460 1370278 1590691 2131135 2839740 3311516 3317386 2897982 2214055 1509332
38054A509332m62030j61143l9786l5826N3553J74645J20943n9344j17173l313
$$ 1509332 1047302 886159 846373 810547 864100 1038745 1159688 1100344 983171 979858
38044I79858J01268R2038J2422q4442j21180P208K25465K84562J63768J64292
$$ 979858 1081126 1173164 1185586 1101144 979964 987172 1212637 1497199 1660967 1825259
38034A825259L85942M93306K90625J06236K36564M30944L63674K23434L70990
$$ 1825259 2211201 2704507 2995132 3101368 3337932 3768876 4132550 4355984 4726974
38025D726974P76453J231079J690928J933607J379778r9140j607152k150104j816246
$$ 4726974 5503427 6734506 8425434 10359041 11738819 11639679 10032527 7882423 6066177
38016F066177j381691j107329o99843j89070J6918j21731k17522j30653p8162
$$ 6066177 4684486 3577157 2877314 2688244 2705162 2583431 2365909 2235256 2157094
38007B157094j08467n4130L1999o0161k43978k41123p0425J8575j5348n1175j08665
$$ 2157094 2048627 1994497 2026496 1966335 1722357 1481234 1410809 1429384 1414036 1362861 1254196
37996A254196j91638q5738K43541L74063N0915k79429j36468J80621J16498j74071
$$ 1254196 1062558 976820 1220361 1594424 1645339 1365910 1229442 1410063 1526561 1352490
37986A352490j47214J44920K07297L0115M6506K92035L80199K31917J19873P8088
$$ 1352490 1205276 1350196 1557493 1587608 1634114 1926149 2306348 2538265 2658138 2736226
37976B736226o6621j99858j04464K5597r8986k50736o6062K15961J27871j68174
$$ 2736226 2669605 2469747 2365283 2390880 2291894 2041158 1975096 2191057 2318928 2150754
37966B150754j70775N9119R1542k0174P7967K30585J9196l68237l83901p0581
$$ 2150754 1979979 2039098 2130640 2110466 2188433 2419018 2438214 2069977 1686076 1615495
37956A615495P7910K0104R0988K35892J64596L2136J31844K15794k4269j96750
$$ 1615495 1693405 1713509 1804497 2040389 2204985 2237121 2368965 2584759 2560490 2363740
37946B363740J41093N42091L96166P5371K26837M96603K27259j56204J33330P02951
$$ 2363740 2504833 3046924 3443090 3518461 3745298 4241901 4469160 4312956 4446286 5149237
37936E149237O67154L10543M55751P82723N39701K77582R17787J767159J638391
$$ 5149237 5816391 6126934 6582685 7365408 7905109 8182691 9100478 10867637 12506028
37927A2506028J241606K012371L306858L588460L660567N407793P971279R056067
$$ 12506028 13747634 15760005 19066863 22655323 26315890 31723683 39694962 48751029
37919D8751029R585870J2581242J7823256K3241675L1320377M5730259N8786499
$$ 48751029 58336899 70918141 88741397 111983072 143303449 189033708 247820207
37912B47820207N1937945J7115169k7943424n5109096n4536130m0026076k8053237
$$ 247820207 299758152 316873321 288929897 233820801 179284671 139258595 111205358
37905A11205358k1656845j6345353j1451115r322149r066373p696000n184932
$$ 111205358 89548513 73203160 61752045 52429896 43363523 35667523 30482591
37898C0482591l754820l631699l166747k083233j522552j579443j322760p48366
$$ 30482591 26727771 23096072 19929325 17846092 16323540 14744097 13421337 12672971
37890A2672971o38677r22681q87229n71075m98634n25055k36730L7162j94071
$$ 12672971 12034294 11111613 10224384 9653309 9154675 8629620 8392890 8430052 8235981
37881H235981n44133m06456q3807j92384m98344m02635p0407n2765k37892j49828
$$ 8235981 7691848 7285392 7201585 7009201 6510857 6108222 6037815 5985050 5747158 5597330
37871E597330J10526J25678o366O8855K20861J17561r0297p2362L6247n4202j86062
$$ 5597330 5707856 5833534 5827168 5896023 6116884 6234445 6144148 6071786 6108033 6053831 5867769
37860E867769p9448J01245Q7233L8774J84707L18149J93437K9693R0196J69271
$$ 5867769 5788321 5889566 5976799 6015573 6200280 6518429 6711866 6741559 6831755 7001026
37850G001026K7800p6783J55402M73263M84262L06055K85624L92596L91276L27647
$$ 7001026 7028826 6952043 7107445 7580708 8064970 8371025 8656649 9049245 9440521 9768168
37840I768168L89153N32906O30877P32985Q91907J008246J068234J199803J336112
$$ 9768168 10157321 10690227 11321104 12054089 12945996 13954242 15022476 16222279 17558391
37831A7558391J233476R46565Q10161Q60848Q28119P51523R50979J336774J504549
$$ 17558391 18791867 19738432 20548593 21409441 22237560 22989083 23940062 25276836 26781385
37822B6781385J570027K056855K895589L496654L890613M725853O087024P570944
$$ 26781385 28351412 30408267 33303856 36800510 40691123 45416976 51504000 59074944
37814E9074944R587486J3110074J8102609K3959131L1198058L9536997M3494041
$$ 59074944 68662430 81772504 99875113 123834244 155032302 194569299 238063340
37807B38063340L4219051R497300k0175669l9631066m2827690l5883643k7601315
$$ 238063340 272282391 281779691 261604022 221972956 179145266 143261623 115660308
37800A15660308k1262580j6068369j1857090r348948q017774o627097n143377
$$ 115660308 94397728 78329359 66472269 57123321 49105547 42478450 37335073
37793C7335073m326884m071509l613960k881134k376763k104250j660928j110616
$$ 37335073 33008189 28936680 25322720 22441586 20064823 17960573 16299645 15189029
37785A5189029q55138q64498p97145o75017p62782r56713r02547n95682l55816
$$ 15189029 14333891 13469393 12672248 11997231 11234449 10277736 9375189 8779507 8423691
37776H423691l10362l19268l02590k90869k56332j73991j31318j66781j61369
$$ 8423691 8113329 7794061 7491471 7200602 6944270 6770279 6638961 6472180 6310811
37767F310811o5676k6955j14830j51043n129J56837J12246j09905l12890l52152
$$ 6310811 6245135 6218180 6103350 5952307 5947178 6104015 6216261 6106356 5793466 5441314
37757E441314j70988J77109M46921L63626k7082l62667l86334j75527P1852K43641
$$ 5441314 5270326 5447435 5894356 6257982 6230900 5868233 5481899 5306372 5378224 5621865
37747E621865K78561J71434N2264M9274Q9450N7819O9574K79668N11224M54200
$$ 5621865 5900426 6071860 6124124 6173398 6262848 6320667 6390241 6669909 7181133 7635333
37737G635333J89012R7109K50491L22413J54863j1581L0991J86274L19151M36724
$$ 7635333 7824345 7921454 8171945 8494358 8649221 8637640 8668631 8854905 9174056 9610780
37727I610780N07918M39655L16342L42008M90984N44321M93299N36167O50420
$$ 9610780 10118698 10558353 10874695 11216703 11707687 12252008 12745307 13281474 13931894
37718A3931894N75832K78447K5043o7834j49923k49284k13342j16837k58914o27061
$$ 13931894 14507726 14786173 14811216 14743382 14593459 14344175 14130833 14013996 13755082 13128021
37708A3128021q27647p08931n98203p30112q81373q00538n98029m69867l93979
$$ 13128021 12300374 11591443 10993240 10263128 9381755 8581217 7983188 7513321 7119342
37699G119342l24926l52171m60235m60049l37752l29268m82655n22166l33389
$$ 7119342 6794416 6442245 5982010 5521961 5184209 4854941 4372286 3850120 3516731
37690C516731j86685k51478k84041p6511J43313P5995j76491l06689k39743j14730
$$ 3516731 3330046 3078568 2794527 2718016 2861329 2937324 2760833 2454144 2214401 2099671
37680B099671l3182m2917j75766l27633l05488j26192l3966j11366j50571k9414
$$ 2099671 2066489 2023572 1847806 1520173 1214685 1088493 1054527 943161 792590 763176
37670G63176Q7745O2114r027l2617o7334j01187m18J88709K20044O2002j8437
$$ 763176 850921 913035 904008 871391 804057 702870 702452 891161 1111205 1173207 1154770
37659A154770P5738R5999q9484k39231j49765K8359R5396R6724J17960R8836K2979
$$ 1154770 1230508 1326507 1237023 997792 848027 876386 971782 1068506 1186466 1285302 1308281
37648A308281r908k4134j48138k74766j40231J78358L04283J94735K10455M21845
$$ 1308281 1298373 1274239 1126101 851335 711104 889462 1193745 1388480 1598935 2020780
37638B020780M34842J21580q8768N0575J68987m9736l16727k75816r5799r5815
$$ 2020780 2455622 2577202 2488434 2539009 2707996 2658260 2341533 2065717 1969918 1874103
37628A874103k13229k46516k30821k22373j06148R1402J27454R668L7376J98682
$$ 1874103 1660874 1414358 1183537 961164 855016 946418 1073872 1083540 1120916 1319598
37618A319598J46332n7826N9839M45123M95713K35597L99135J006876J273556
$$ 1319598 1465930 1408104 1467943 1913066 2408779 2644376 3043511 4050387 5323943
37609E323943J503068L211573O061870O599113K348261l991985p106369n421828
$$ 5323943 6827011 10038584 16100454 22699567 25047828 21055843 13949474 8527646
37601H527646k346451j162705j430276j233391m39467r2010k55539k43574o2652
$$ 8527646 6181195 5018490 3588214 2354823 1915356 1823346 1567807 1324233 1261581
37592A261581j63811l66028k21895L4029p2253l03903j40829K37796K86712P0923
$$ 1261581 1097770 731742 509847 543876 471623 167720 26891 264687 551399 622322
37582F22322N4833J95871Q3557k16782k61941n5808k6765k25804k43060M5985
$$ 622322 677155 873026 956583 739801 477860 422052 395287 169483 -73577 -27592
37572b7592K74022K11343P0107N6961O7701k7163j46696j90583j95530j87273
$$ -27592 246430 457773 527880 584841 652542 625379 478683 288100 92570 -94703
37562i4703r2556J02227K62212K54523R9794n7519q7039j438M0866o4766j85823
$$ -94703 -187259 -85032 177180 431703 531497 473978 386939 385501 426367 361601 175778
37551A75778j18519P5795J22504m5996j77356q5209J07971K13206K04234J01496
$$ 175778 57259 133054 255558 209562 32206 -53003 54968 268174 472408 573904
37541E73904r8436k58835j61502J24707K31672J2860k30694k31988j39342j75834
$$ 573904 475468 216633 55131 179838 411510 424370 193676 -38312 -177654 -353488
37531c53488k31379r6126J45237K56870K03139R7383j9501j17125q4044P9638
$$ -353488 -584867 -680993 -535756 -278886 -75747 21636 2135 -114990 -199034 -119396
37521a19396J75279J12118O7423J35769J05625j47425l41916k06286M3884L3269
$$ -119396 55883 168001 235424 371193 476818 329393 -12523 -218809 -174925 -141656
37511a41656j68872j87813M0532K05560J25970m4443j12639n5648O6293J71636
$$ -141656 -310528 -498341 -457809 -252249 -126279 -170722 -283361 -339009 -272716 -101080
37501a01080J54916J6712o5039K6929J44760J03251j8883k9702N2689O9805J228
$$ -101080 53836 70548 5509 32438 177198 280449 261566 231864 284553 354358 355586
37490C55586o6619j36893k29494k32058o9537R7584R1952O491J8221O6007O085
$$ 355586 288967 152074 -77420 -309478 -379015 -281431 -189479 -182988 -164767 -98760 -92675
37479i2675o0473M4710J98484J33864r0383j54071O627J10865m590j67002j81207
$$ -92675 -153148 -108438 90046 223910 133527 -20544 -13917 96948 92358 -74644 -255851
37468b55851q1683P407L9454J5662k6716J6612J82764L08747K31229N8560O563
$$ -255851 -337534 -330127 -290673 -275011 -301727 -285115 -102351 206396 437625 496185 502748
37457E02748L3088p1375k69624k92414r4585M1168m8259j59316p0596J09877J33086
$$ 502748 535836 464461 194837 -97577 -192162 -150994 -199253 -358569 -429165 -319288 -186202
37446a86202j8389j28961m7321J44535K42643J46039l3857j06122l8661K7653
$$ -186202 -204591 -333552 -380873 -236338 6305 152344 118487 12365 -26296 1357
37436A357K3633M6508J27309J09491p6564k21195j42505r91l6275j53089q9639
$$ 1357 24990 71498 198807 308298 231734 10539 -131966 -132957 -169232 -322321 -411960
37425d11960J20243K00751Q5590k5929l6574m6936q6308n8835K6011N1306K8561
$$ -411960 -291717 -90966 -5376 -31305 -67879 -114815 -201123 -259958 -233947 -182641 -154080
37414a54080O9422J34674Q4371m4898r4918q1656j35231j90399p2838J36565J80657
$$ -154080 -84658 50016 134387 89489 -5429 -87085 -222316 -412715 -485553 -348988 -168331
37403a68331N6624O418R0052J45891J55811K35018K76697P4809j97223j60044
$$ -168331 -111707 -105289 -15237 130654 286465 521483 798180 872989 675766 515722
37393E15722P9139J1715l72174m40179N8103M93838L06338j48955k30948N816
$$ 515722 594861 606576 234402 -205777 -147674 346164 652502 503547 272599 278415
37383B78415P1166r2254j48001l6997R321j5517O5877J55675Q044k43691k23071
$$ 278415 349581 257327 109326 72329 81650 66133 132010 287685 295729 52038 -171033
37372a71033M1140J35843k7056o1015K01686L75844J31845k68155l59838j28787
$$ -171033 -129893 5950 -21106 -82121 119565 495409 627254 359099 -739 -129526
37362a29526N3828k508j09204m1104J49875K34355J16371n1172p6838J4138L8508
$$ -129526 -75698 -78206 -187410 -228514 -78639 155716 272087 220915 144077 158215 196723
37351A96723n3115j10894n7450k3131r2937j24246K803J42729J19015L2064O8436
$$ 196723 143608 32714 -24736 -47867 -140804 -265050 -262247 -119518 -503 31561 99997
37340I9997J49057P5023q1728p1889R7861J66801N0871o2015p5599j13049k11829
$$ 99997 249054 324077 242349 170460 268321 435122 485993 423978 348379 235330 23501
37329B3501k10431n5589O1402J7695l7187N5066K03741K33817J36302Q086j07439
$$ 23501 -186930 -242519 -181117 -163422 -200609 -145543 58198 292015 428317 436403 328964
37318C28964j85134j61177m0217N7897O5854O5811J22347J45916L4882j49889
$$ 328964 143830 -17347 -57564 333 66187 131998 254345 400261 435143 285254
37308B85254k54641j96770n95K25936L05509J22912j90160l44104k38546p2194
$$ 285254 30613 -166157 -166752 59184 364693 487605 297445 -46659 -285205 -357399
37298c57399l3991o5259l9831J0320J5066M8627J87475K99047J91440p9570k49971
$$ -357399 -391390 -456649 -496480 -486160 -471094 -422467 -234992 64055 255495 175925 -74046
37287g4046j78979J5821J43275J21163j7086j70227k17264j17211L4618J18126
$$ -74046 -253025 -237204 -93929 27234 10148 -160079 -377343 -494554 -459936 -341810
37277c41810J29416J38890J55967J31900O6048J3593K463J5249K9400J9097l4382
$$ -341810 -212394 -73504 82463 214363 280411 294004 296467 311716 341116 360213 325831
37266C25831p9925k3595J09025J43109k516j57545j40630m7797q8214k08755j55321
$$ 325831 245906 222311 331336 474445 471929 314384 173754 125957 37743 -171012 -326333
37255c26333Q6735K06565L0438j80543q6840K36568L85288J46200k54148m32120
$$ -326333 -239598 -33033 -2595 -183138 -269978 -33410 351878 498078 243930 -188190
37245a88190k53249P6704K56686J88180L4366j2624K4686j8410j58148j99415
$$ -188190 -441439 -364735 -108049 80131 114497 101873 126559 108149 -49999 -249414
37235b49414k2956K15292K94141K18260J42050R1951l4899k22333k99333j97160
$$ -249414 -272370 -57078 237063 455323 597373 689324 654425 432092 132759 -64401
37225f4401o0446k0954j6903N1823J22584P4332n2089j02267m1655J7041J8194
$$ -64401 -124847 -145801 -162704 -110881 11703 86035 33946 -68321 -109976 -92935 -74741
37214g4741L8119J15175J47618M7616j02417j50147p1522K6161O1373M7770K9242
$$ -74741 -36622 78553 226171 273787 171370 21223 -50299 -24138 37235 85005 114247
37203A14247L1524O7110J10685Q4870m3218j64922j34513K8157J56730J73657
$$ 114247 145771 212881 323566 408436 365218 200296 65783 93940 250670 424327
37193D24327J63990J71290R2937j09734k58456j89581k0069K4064m2056k7180
$$ 424327 588317 759607 852544 742810 484354 294773 274704 298768 256712 229532
37183B29532O8358M0668j32494j99887m5647R4446J1884j27770o4283J26682J74757
$$ 229532 297890 338558 206064 6177 -39470 54976 66860 -60910 -125193 1489 176246
37172A76246N6235j8064J4289J6425l1877J1616J39460J41449m5954k10742j98397
$$ 176246 232481 214417 228706 245131 213254 224870 364330 505779 459825 249083 50686
37161E0686j16046p3654J3521J82397K30995J5353k48411k47339j5461J43237
$$ 50686 -65360 -139014 -125493 56904 287899 303252 54841 -192498 -207959 -64722
37151f4722R1271l2216q3760n5439L5246J69755K42176J52961k346l0960N8942
$$ -64722 26549 -5667 -89427 -144866 -109620 60135 302311 455272 452926 421966 480908
37140D80908N7955j09285k46487j66615M5132J53831O4168j01708j66098q0274
$$ 480908 538863 429578 183091 16476 61608 215439 279607 177899 11801 -68473
37130f8473L8528N2799j4135j4877P7723R9850l2984j42716m7702J34329J64107
$$ -68473 -29945 22854 8719 -6158 71565 171415 138431 -4285 -51987 82342 246449
37119B46449M6905l7885p5382j73575k42091p2752K44151L52295J56953l2208
$$ 246449 293354 255469 180087 6512 -235579 -308331 -64180 288115 445068 412860
37109D12860j725P4822J0113p9525n4253l5329j40318k01121m2087J80124K16868
$$ 412860 411135 485957 496070 416545 362292 326963 186645 -14476 -56563 123561 340429
37098C40429J22315J03799J39788O2823j03646k01036k22182k44341j87581M0281
$$ 340429 462744 566543 706331 769154 665508 464472 242290 -2051 -189632 -149351
37088a49351K55406K02074j9605q7759K0765K6784j34235j98739m9941Q7550N8614
$$ -149351 106055 308129 288524 200765 221530 248314 114079 -84660 -134601 -47051 11563
37077A1563J9060R2108J20877j3204j18580l458J76755J63324R493l4672O5597
$$ 11563 30623 122731 243608 230404 111824 108366 285121 448445 457938 423266 488863
37066D88863J13594K0107r1336j08695o2610k7016l8084j06384j88300j75062
$$ 488863 602457 622564 531228 422533 359923 332907 294823 188439 139 -174923
37056a74923l0637J03484P3560o1377j14988m4606K7338M1625O9329J33432J45232
$$ -174923 -205560 -102076 -28516 -89893 -204881 -249487 -222149 -180524 -111195 22237 167469
37045A67469P6395L2101O8451Q0805j5695j17358q4636K3853L4657o1153q5815
$$ 167469 243864 275965 344416 425221 409526 292168 207532 231385 266042 204889 119074
37034A19074M5942J79901J29177p4894k25591j77941K1429J95073J79062l3998
$$ 119074 165016 344917 474094 399200 173609 -4332 17097 212170 391232 357234
37024C57234k49253k40706k4029J36159P0474o5026l9315R2449Q8552q4452k06395
$$ 357234 107981 -132725 -156754 -20595 49879 -15147 -54462 37987 126539 42087 -164308
37013a64308j54830n0682k223M9296J33341J35637J8085n5238K5003J12391L7720
$$ -164308 -319138 -369820 -372043 -322747 -189406 -53769 -35684 -90922 -65919 46472 84192
37002H4192j16255j58484p0986L3792J07218J40439Q2457l6956m9795R0722J58248
$$ 84192 -32063 -190547 -261533 -227741 -120523 19916 102373 65417 15622 106344 264592
36991B64592j2210k11885j58157M8154Q5581q6584k30810k45849k21041j41995
$$ 264592 252382 40497 -117660 -69506 16075 -70509 -301319 -547168 -768209 -910204
36981i10204P5917K89169K53788N2953J146J10854Q8552r4264j12327J06811J90260
$$ -910204 -834287 -545118 -291330 -238377 -237231 -126377 -37825 -132089 -244416 -137605 52655
36970E2655m4063k35345p1423J89810J62323n4702j12896J0697R0975R4337J28218
$$ 52655 8592 -226753 -298176 -108366 53957 -745 -113641 -102944 -11969 82368 210586
36959B10586J12846q7420l11508k68471M586J96899J81703R5490K3431n5364n5139
$$ 210586 323432 236012 -75496 -343967 -339381 -142482 39221 134711 158142 102778 47639
36948D7639J25774L08798J94199j38812k46351N5857L93281L19899j28087n33705
$$ 47639 173413 482211 676410 537598 291247 347104 740385 1060284 932197 398492
36938C98492n87025l19345K8450K26669K00705N5168m2742j3318J07238K26351
$$ 398492 -188533 -507878 -479428 -252759 -52054 3114 -39628 -52946 54292 280643
36928B80643K33234O6312j75227k89122k33072j91149k51023k04050J14917M64537
$$ 280643 513877 580189 404962 115840 -117232 -308381 -559404 -763454 -648537 -184000
36918a84000M73952J68651j06307k08396k77151l25536j72027J43257K75951P8612
$$ -184000 289952 458603 352296 143900 -133251 -458787 -630814 -487557 -211606 -132994
36908a32994j48193j04168R8260J89292J52405J21258P0067j01151k90092k79839
$$ -132994 -281187 -385355 -287095 -97803 54602 175860 245927 144776 -145316 -425155
36898d25155o3873J37582J76195J14990O8031N0097J7298l7243o8017l4168K8467
$$ -425155 -489028 -351446 -175251 -60261 7770 57867 75165 37922 -30095 -64263 -35796
36887c5796J6468r5164j49472J2582K66733K89963M526k56838j75141J23244K53252
$$ -35796 -19328 -114492 -263964 -251382 15351 305314 309840 53002 -122139 1105 254357
36876B54357R1022j08941r4593P8848J68830M5052j86938l02615j78189P0882
$$ 254357 345379 236438 141845 220693 389523 434575 247637 -54978 -233167 -162285
36866a62285J90135P0300j13026j20587L5204J19220J6270j04450m7299J07206
$$ -162285 27850 98150 -14876 -135463 -100259 18961 35231 -69219 -116518 -9312
36856i312J14093n9577j62063k7342J59618J32742m4548q2367O2524J10419p5867
$$ -9312 104781 45204 -116859 -144201 15417 148159 103611 21244 83768 194187 118320
36845A18320k43252j39159R5416J59418L1516q4520j06520q7155q33J82296K98749
$$ 118320 -124932 -264091 -168675 -9257 22259 -62261 -168781 -255936 -256769 -74473 224276
36834B24276J81330k0753l4623Q8460P9753m3805q781J76390J84172m2650j51529
$$ 224276 405606 384853 350230 438690 518443 474638 465857 642247 826419 783769 632240
36823F32240q1P0782j58279l65770k14440J02733K21442J58672J03193r201k51235
$$ 632240 632159 702941 544662 178892 -35548 67185 288627 447299 550492 541291 290056
36812B90056l39444m1811K89479J69811k04133k19676J55315L15564N057l14371
$$ 290056 -49388 -91199 198280 368091 163958 -55718 99597 415161 420218 105847
36802A05847k65254r7267j22846j58108O3138L38241L14259P0259n4130q155L209
$$ 105847 -159407 -256674 -379520 -537628 -474490 -136249 178010 248269 194139 185984 189193
36791A89193m6602q935Q4458M9544q9243j10422J7913P8750j6325q2001J4265
$$ 189193 142591 133656 218114 267658 178415 67993 85906 164656 148331 66330 80595
36780H0595J33568J06549n150m1999J81Q755l8452n4729o518K4812l6634j41936
$$ 80595 214163 320712 315562 273563 273744 282499 244047 189318 182800 207612 170978 29042
36768B9042j54050l561K02996K66519J16269r3619j64895q8977j2552p796q645
$$ 29042 -125008 -128569 74427 340946 457215 363596 198701 109724 97172 89376 80731
36757H0731K1818J6824m1578m2856O8830J50670M8782j47086k04842p3322O8457
$$ 80731 102549 119373 77795 34939 103769 254439 303221 156135 -48707 -122029 -53572
36746e3572Q7079M1625J3533k8998j01711r8795M1379J80548J53799K3828j0127
$$ -53572 33507 75132 88665 59667 -42044 -140839 -99460 81088 234887 258715 248588
36735B48588Q2523J30079L4019r3376j11964l2567N1582R8720J09988P1830j8160
$$ 248588 331111 461190 495209 401833 289869 257302 308884 407604 517592 589422 571262
36724E71262j16686j71866j57267o1688Q8578J92912J50161q032j36188j40057
$$ 571262 454576 282710 125443 63755 152333 345245 495406 487374 351186 211129
36714B11129m2409J03141K42677K69830J04666j36904k18390r4226J9683k7607
$$ 211129 168720 271861 514538 784368 889034 752130 533740 439514 459197 431590
36704D31590j05692m4696P7918P5176n1003j48847j67251j65961j36307k3038
$$ 431590 325898 281202 359120 434296 383293 234446 67195 -98766 -235073 -258111
36694b58111R7912P5058o2123r3928P7532K61064K18566k1665j98132j32200O8984
$$ -258111 -160199 -85141 -147264 -241192 -163660 97404 315970 294305 96173 -36027 32957
36683C2957J51273K5672j21730p7698J02430J68326K5335j53200j99201j51377
$$ 32957 184230 209902 88172 10474 112904 281230 306565 153365 -45836 -197213
36673a97213r6900j380J56833K45188J51744j9654j05314j15487j29792r0586
$$ -197213 -294113 -295493 -138660 106528 258272 238618 133304 17817 -111975 -202561
36663b02561P0066K03874J11512j21876k18449j08362J7526M5330O1749J14166
$$ -202561 -132495 71379 182891 61015 -157434 -265796 -248270 -202940 -141191 -27025
36653b7025J07415Q046p0517o1527l0095l091R0678K36438K74999J20961j06122
$$ -27025 80390 88436 17919 -43608 -73703 -76794 13884 250322 525321 646282 540160
36642E40160k41338k40132j48572m6237l7841j46733k08070m6094K34623L41164
$$ 540160 298822 58690 -89882 -136119 -173960 -320693 -528763 -574857 -340234 930
36632I30J95892J9389l0712m8268j19119j32860n814J17395O4593j00104j65606
$$ 930 196822 216211 185499 137231 18112 -114748 -120562 -3167 61426 -38678 -204284
36621b04284l5474J94659L34965K38793m3391k48405j93991n1526r7003k34411
$$ -204284 -239758 -45099 289866 528659 485268 236863 42872 -8654 -105657 -340068
36611c40068j05702K93037N07364K84123n0468j01195N5311J22943O9211K3695
$$ -340068 -445770 -152733 354631 638754 588286 487091 542402 665345 734556 758251
36601G58251m9841k14548k87327p9343K20245K57421K3349j74861j80468j08493
$$ 758251 708410 493862 206535 127192 347437 604858 628207 453346 272878 164385
36591A64385n6322l504K3660k8563o9097L5521K03650K26098Q9083k7204m7977
$$ 164385 108063 104559 128219 99656 30559 66080 269730 495828 584911 557707 509730
36580E09730o4409j12525j21456p5382k5198L5121J17167J27283J0450q3911j0979
$$ 509730 445321 332796 211340 135958 110760 145881 263048 390331 400781 316870 305891
36569C05891R7550L5120j16974j37214o9767j22502k36669j67371L4462O4347
$$ 305891 403441 438561 321587 184373 114606 -7896 -244565 -411936 -377474 -313127
36559c13127p9411m5983K55249M53685L11127Q3341M4738M9934j20032l10746
$$ -313127 -392538 -438521 -183272 270413 581540 664881 709619 759553 639521 328775
36549C28775k56245m5167L8828k3278k8736N5827P0588k1655p9171l5517J2832
$$ 328775 72530 27363 66191 42913 14177 70004 140592 118937 39766 4249 17081
36538A7081j6729r1912j40963j11718J3119J61681J95294Q4290j7298K1914J19181
$$ 17081 352 -91560 -232523 -344241 -331122 -169441 25853 110143 92845 114759 233940
36527B33940J11647l976r5684r2155l1292L2193N9769J9566o5555j08667o2860
$$ 233940 345587 341611 245927 153772 122480 154673 214442 234008 168453 59786 -3074
36516c074K7046J16385K04068K40738J30336r7343k48267j95115l1995Q1038R7836
$$ -3074 23972 140357 344425 585163 715499 618156 369889 174774 142779 223817 321653
36505C21653L4853r7374k04995j23264J37905L08834J79591j14736k75504j94390
$$ 321653 356506 259132 54137 -69127 68778 377612 557203 442467 166963 -27427
36495b7427J1192J95109K66880J86634K0292q4927q0215o2212p7082n2806m262
$$ -27427 -16235 178874 445754 632388 652680 567753 487538 425326 348244 295438 291176
36484B91176o9831k18063j92088O6319K29944P9879j06685M921K48845K47609
$$ 291176 221345 3282 -188806 -122487 107457 187336 80651 85572 334417 582026
36474E82026M2325l4399L1229l8220k34469k41175k0912Q0853p6157k03447j03431
$$ 582026 624351 589952 621181 582961 348492 107317 86405 167258 91101 -112346 -215777
36463b15777K2589j2555n7170M8034J57904J07258J5923M2519Q9355K0824n4388
$$ -215777 -193188 -205743 -262913 -214879 -56975 50283 66206 108725 198080 218904 164516
36452A64516M517Q0178L593j22690r8907J7944L1451l4065L473J28483J41106
$$ 164516 169033 249211 252804 130114 31207 49151 80602 46537 50010 178493 319599
36441C19599J2222o0531J3466P8040m178j51441k21688k11435j88514j41452j7236
$$ 319599 331821 271290 284756 362796 358618 207177 -14511 -225946 -414460 -555912 -573148
36430e73148J42390K10870J35544K5972L9242J84087K86506J81354r7441l58777
$$ -573148 -430758 -219888 -84344 -58372 -19130 164957 451463 632817 535376 176599
36420A76599m42985l17370n5378J84043K28425P4474o4246l5764K0345p3083j63620
$$ 176599 -266386 -583756 -639134 -455091 -226666 -152192 -216438 -252202 -231857 -304940 -468560
36409d68560J9158L35665L36475l6505k86235q7754K36890K57627P1319J7752
$$ -468560 -449402 -113737 222738 186233 -100002 -187756 49134 306761 378080 395832
36399C95832P2783j6596j99127k05610n6713j5105q4983k6330J36094R7988j59733
$$ 395832 468615 452019 252892 47282 -9431 -24536 -109519 -135849 245 98233 -61500
36388f1500k61701m5197J56773N9518j28920q7414J07524J72166Q7665M6869P3863
$$ -61500 -323201 -368398 -211625 -152107 -281027 -368441 -260917 -88751 -1086 45783 119646
36377A19646J8627j33223k23069j76868p8859J0674J20751K36061K59420J50705
$$ 119646 138273 5050 -218019 -394887 -473746 -463072 -342321 -106260 153160 303865
36367C03865l203r2768r3968n8578m4011n7869n3826q82M8297J7733o4084q6112
$$ 303865 300662 207894 113926 55348 11337 -46532 -100358 -101240 -52943 -35210 -99294 -185406
36355a85406j7429N9515R9751J45225J76074P1246j79982l65644k88793k4367
$$ -185406 -202835 -143320 -43569 101656 277730 348976 168994 -196650 -485443 -509810
36345e09810J91580K49203K10617J40999M4776n8493j24715j49307j51250j08724
$$ -509810 -318230 -69027 141590 282589 327365 268872 144157 -5150 -156400 -265124
36335b65124Q619J56609K33109J74957J2220j46920j85129r3775j2429n3664j15794
$$ -265124 -256505 -99896 133213 308170 320390 173470 -11659 -105434 -117863 -171527 -287321
36324b87321l1351J17526P8501j32279j78266O5392K51094Q7912j62992q7066
$$ -287321 -318672 -201146 -122645 -254924 -433190 -367798 -116704 -28792 -191784 -278850
36314b78850K06984K50794m7453k89307k09822J5554J56873K22171K40330J15516
$$ -278850 -71866 178928 131475 -157832 -367654 -352100 -195227 26944 267274 382790
36304C82790j27955k55665j53857L747N9061O8751O7503m9545k23268j47964K44357
$$ 382790 254835 -830 -154687 -150940 -91879 -23128 44375 -5170 -228438 -376402 -132045
36293a32045N30214L52109m0961j84534r5978j36994l36035l51074q5876J39968
$$ -132045 398169 750278 709317 524783 428805 291811 -44224 -395298 -481174 -341206
36283c41206J23128N8591J41171K44647J94654P0546J6435k0112j35707k35185
$$ -341206 -218078 -159487 -18316 226331 420985 491531 507966 487854 352147 116962
36273A16962j76892l2102J6102m4487o8240j016O2680N9542L9069M7000M9555
$$ 116962 -59930 -92032 -75930 -120417 -188657 -189673 -126993 -67451 -28382 18618 68173
36262F8173J2702k8677k7996j465L492q607J6345P9892Q0544o6014k66939l11010
$$ 68173 80875 52198 24202 22737 26229 17622 33967 113859 194403 128389 -138550 -449560
36250d49560j30238Q9260J33097J6360p6065l3739J01725K36493K83627J84255
$$ -449560 -579798 -490538 -357441 -341081 -417146 -450885 -349160 -112667 170960 355215
36240C55215o420j19634q5882n5053j48458k14279n9736J81356K13628N1991k2303
$$ 355215 348795 229161 143279 88226 -60232 -274511 -334247 -152891 60737 112728 90425
36229I0425K7837o6679l42129m23743j00118K89839L32245J10133j7767K4399
$$ 90425 118262 51583 -290546 -714289 -814407 -524568 -192323 -82190 -99957 -75558
36219g5558L9024m0351r9251j01527r5554m1795Q8938J38093k7995k14247j22380
$$ -75558 -36534 -76885 -176136 -277663 -373217 -415012 -326074 -187981 -215976 -430223 -552603
36208e52603J76723L25946K11947P2486O1663N6284l5894j04317q7162j02127
$$ -552603 -375880 -49934 162013 234499 296162 352446 316552 212235 125073 22946
36198B2946j85683j64671M3393K23733J48892q9932k14209j11348Q7165J97967
$$ 22946 -162737 -327408 -284015 -60282 88610 -1322 -215531 -326879 -239714 -41747
36188d1747J45004r271j19551r6444n222M5072O9183J27596J39703j3248k18927
$$ -41747 103257 93986 -25565 -122009 -127231 -82159 -12976 114620 254323 241075 22148
36177B2148k18888P176J92544J69743N0418m1601j34706k11919j44979L4971Q7138
$$ 22148 -196740 -189564 2980 172723 223141 181540 46834 -165085 -310064 -275093 -187955
36166a87955n5486j37858k256J41668R1763k302N1729J19930J4519j15149l8360
$$ -187955 -243441 -381299 -383555 -241887 -150124 -152426 -100697 19233 33752 -81397 -119757
36155a19757J13607N9602j33911j80103p4084l9993o4691O1926K77082K81231
$$ -119757 -6150 53452 -80459 -260562 -334646 -374639 -439330 -377404 -100322 180909
36145A80909O5953n0458K5374L7144q9388p2006J76800K84716n215l77466l98933
$$ 180909 246862 196404 221778 258922 169534 97528 274328 559044 553829 176363 -222570
36134b22570j29270P1295R8108J01050J08851K8008q1220o3395M6610Q0283L3314
$$ -222570 -351840 -280545 -182437 -81387 27464 55472 -25748 -89143 -42533 37750 71064
36123G1064M2329J03947Q3437j2129k9898M8297O9286j1539m7652L7705J19886
$$ 71064 113393 217340 300777 288648 258750 307047 376333 364794 317142 354847 474733
36112D74733Q9196J5006o158m032k1515P667J25145J98250P1761j75499k89160
$$ 474733 563929 578935 572777 568745 547230 554897 680042 878292 950053 774554 485394
36101D85394j70368j0975k9825j70422j79543L3789K48468K05074n9990k68291
$$ 485394 315026 304051 274226 103804 -75739 -41950 206518 411592 351602 83311
36091H3311k50287j04928O111P4593J70180K60079K36629R1433m3946l7147J14881
$$ 83311 -166976 -271904 -265793 -191200 -21020 239059 475688 567121 523175 486028 600909
36080F00909K77708K71743K9665k85283l88798j89617O6003P6329j31251k41250
$$ 600909 878617 1150360 1180025 894742 505944 316327 382330 458659 327408 86158
36070H6158q0754J47956J47115p7925k37215j44639N4868J06269q796p7737Q835
$$ 86158 5404 153360 300475 222550 -14665 -159304 -104436 1833 -6963 -84700 -75865
36059g5865Q8749k0324k23777k61078o4938J59926K19850J31045L161j09379j67897
$$ -75865 12884 -7440 -231217 -492295 -557233 -397307 -177457 -46412 -43251 -152630 -320527
36048c20527j14278J9843Q9514K9386l6808J4481J18575J44926R9691O3983K5375
$$ -320527 -434805 -414962 -325448 -296062 -332870 -318389 -199814 -54888 44803 108786 134161
36037A34161o5930j44622j09337j3287n570r8387j48809o8998Q3914K20795K87997
$$ 134161 68231 -76391 -185728 -199015 -204585 -302972 -451781 -520779 -436865 -216070 71927
36026G1927K31192L6271j80658k49428j30046O8627K27209K66417J20741j71845
$$ 71927 303119 339390 158732 -90696 -220742 -152115 75094 341511 462252 290407
36016B90407l87154l15002m8559J11649N7877j9526L7365J37121J42053Q8542
$$ 290407 -96747 -411749 -460308 -348659 -290782 -310308 -272943 -135822 6231 94773
36006I4773O9875M9488o0436k26739l22596k68437p8998J53289K78931K01947
$$ 94773 164648 214136 153700 -73039 -395635 -664072 -743070 -589781 -310850 -108903
35996a08903J6977p8674m3376j5811m9282k2404J03259J60391N6153l4715N0472
$$ -108903 -91926 -170600 -213976 -229787 -279069 -301473 -198214 -37823 18330 -16385 34087
35985C4087J75948J31354j5746n6375o808l9854j24043o0847J19387J31827j10487
$$ 34087 210035 341389 325643 269268 262460 222606 98563 37716 157103 288930 178443
35974A78443l12863k11710O0789J96687J24083J6234L320N1308P3688K8186p0619
$$ 178443 -134420 -346130 -285341 -88654 35429 51663 54983 106291 179979 208165 137546
35963A37546j47814j15906Q397R2810O0695J791K8489R1278M8414j15074k48320
$$ 137546 -10268 -126174 -117777 -24967 35728 37519 66008 157286 205700 90626 -157694
35952a57694k17865n1871J10788J63422J12836M9511M4874P6379P2759K2578j6725
$$ -157694 -375559 -427430 -316642 -153220 -40384 9127 54001 130380 203139 225717 208992
35941B08992k0751l2316o8236p5625k6042K9954N7002R2262J38066J03520l9302
$$ 208992 188241 155925 87689 12064 -13978 15976 72978 165240 303306 406826 367524
35930C67524j44142q3524L0860N503j12133r3299Q9928J89906O4450j00840q7562
$$ 367524 223382 139858 170718 176221 64088 -29211 60717 250623 315073 214233 126671
35919A26671L5655O8665K354k3237J7193K6309j4875l4279j9641l624N1136J58977
$$ 126671 162326 230991 233345 210108 227301 253610 238735 204456 184815 181191 232327 391304
35907C91304J68801m2091k80813k44402n776N7896j19219j54453J34215L63909
$$ 391304 560105 518014 237201 -7201 -12977 44919 -74300 -228753 -94538 269371
35897B69371J84123j29788j11082J42124J58946j07152k32589n9872P5861l2026
$$ 269371 453494 323706 212624 354748 513694 406542 173953 114081 189942 157916
35887A57916j25791J6199J78657Q8960j46868k74714k68320j95483Q286L20125
$$ 157916 32125 48324 226981 315941 169073 -105641 -373961 -569444 -561158 -241033
35877b41033M42430J89340j46259j76659J0254N5544n2340j5284J92909K57380
$$ -241033 201397 390737 244478 67819 78073 133617 81277 65993 258902 516282
35867E16282O1503j44284j97608k39014l41851l15581p1302J50238J42469M7825
$$ 516282 577785 433501 235893 -3121 -344972 -660553 -731855 -581617 -439148 -391323
35857c91323P5412J48095Q6041n5744j00022n4017m9149p4866o028J66680L22049
$$ -391323 -315911 -167816 -81775 -137519 -237541 -291558 -340707 -415573 -421601 -254921 67128
35846F7128L62672K37982p6144m46826n59466k55175J82475L13357P7114j75511
$$ 67128 429800 667782 591638 144812 -414654 -669829 -487354 -173997 -96883 -272394
35836b72394j64004L3066J79665J62537K7174r8751q0511Q7094K13226J27721
$$ -272394 -436398 -403332 -223667 -61130 -33956 -132707 -213218 -126124 87102 214823
35826B14823n6744q8696K9856M1176j34603k39271q4660J28383J14068n5879p4570
$$ 214823 158079 69383 99239 140415 5812 -233459 -318119 -189736 -75668 -131547 -206117
35815b06117J29023L06493K62710P2694j12124k56128l42181k66331M772K68369
$$ -206117 -77094 229399 492109 564803 452679 196551 -145630 -411961 -407189 -138820
35805a38820K62707Q803j73508m8774K35345L25195R0619k30114l27640j67602
$$ -138820 123887 132690 -40818 -89592 145753 470948 561567 331453 3813 -163789
35795a63789K5526O8875J910l3065J0244O1537N4708p663r3806j72144j87178
$$ -163789 -138263 -69388 -67478 -100543 -90299 -28762 25946 18283 -75523 -247667 -434845
35784d34845p4013J50951L47320L64226K04401K8110k5497K0422M7952J0216l2077
$$ -434845 -508858 -357907 -10587 353639 558040 586150 560653 581075 629027 639243 607166
35773F07166k4918K981J692k4351m8777q6254j56572k04317j34347M8125J96731
$$ 607166 582248 585229 586921 562570 513793 427539 270967 66650 -67697 -19572 177159
35762A77159J77341K8862q9993r6947n2890k8083j568M9282N4262m1757j35126
$$ 177159 354500 383362 293369 196422 143532 115449 113881 163163 217425 175668 40542
35751D0542p4459R8752J82497J09886L3797M8661K4582j38929k70430j52851J15980
$$ 40542 -33917 64835 247332 357218 391015 439676 464258 325329 54899 -97952 18028
35740A8028K25816P1952j47121k24972j29065Q5950L08065L18661q964m13723
$$ 18028 243844 315796 168675 -56297 -185362 -99412 208653 527314 518350 104627
35730A04627m36883j5726L82381L62975P8498q8986o3222k8976m6529k0715M1203
$$ 104627 -332256 -347982 34399 397374 475872 386886 323664 294688 248159 227444 268647
35719B68647K5593o7370j28028j32414j33805j01174K9160J72250J71745M8579
$$ 268647 294240 226870 98842 -33572 -167377 -268551 -239391 -67141 104604 153183
35709A53183j7459M6285J29636J27197M4218p3498j66704j46924n108J05256N3701
$$ 153183 135724 182009 311645 438842 483060 409562 242858 95934 90826 196082 249783
35698B49783n6533m5452M5534L5352o9985r0615p15K3117q8458j86827j56995
$$ 249783 193250 147798 193332 228684 158699 68084 67369 90486 2028 -184799 -341794
35687c41794o1987J2318N6502N2641j0727l4307O3977J39351N576j93533j31133
$$ -341794 -403781 -391463 -334961 -282320 -293047 -327354 -263377 -124026 -118450 -311983 -443116
35676d43116J65194L01917J28162m2455K9900J46914O8860q6214j12939p6518
$$ -443116 -277922 23995 152157 109702 139602 286516 355376 269162 156223 79705
35666G9705j10972j34836n7297o667o0883j9205K35230M13583K32364r2217j63570
$$ 79705 -31267 -166103 -223400 -230067 -290950 -310155 -74925 338658 571022 478805 315235
35655C15235j3383L6382n5605p7496l4151j09908k36578j76614J358J1147j01019
$$ 315235 301852 338234 282629 205133 170982 61074 -175504 -352118 -350760 -339613 -440632
35644d40632k409K93188L68913J01191j03566L2853K37952J82003k2305j11429
$$ -440632 -443041 -149853 219060 320251 216685 249538 487490 669493 647188 535759
35634E35759j08172j49933j74065r5821n7338j83780k91182j42768J62739L38203
$$ 535759 427587 277654 103589 7768 -49570 -233350 -524532 -667300 -504561 -166358
35624a66358L05481J94462Q5347j55J3954J29244J55761l0331k37037k19744o7842
$$ -166358 139123 333585 418932 418777 432731 561975 717736 687405 450368 230624 162782
35613A62782m1913j31286j02482N7702R4145q2703k29608j47724K2969M0189q1511
$$ 162782 120869 -10417 -112899 -55197 38948 -43755 -273363 -421087 -398118 -357929 -439440
35602d39440j20907J9139J84336J85643N4577M098J24956K19387O3605k17340
$$ -439440 -560347 -541208 -356872 -171229 -116652 -112554 12402 231789 295394 78054
35592G8054k54489M0874L03102K06597q5341j84462k2981J27266Q2394p2193j87935
$$ 78054 -176435 -135561 167541 374138 288797 104335 81354 208620 291014 218821 30886
35581C0886k04699j10845M5674J23985N0076l1996M0184J62180J13161o2135j04573
$$ 30886 -173813 -284658 -238984 -114999 -64923 -96919 -56735 105445 218606 156471 51898
35570E1898L1733J04265j4883j53935j55303r9821q5031l3132J09355J98445J14929
$$ 51898 83631 187896 173013 19078 -136225 -236046 -321077 -354209 -244854 -46409 68520
35559F8520j4948k0856L6133k080r9543r4279J3754O3057m782p6000o7117l0634
$$ 68520 53572 32716 68849 66769 -32774 -127053 -113299 -50242 -55024 -131024 -198141 -228775
35547b28775l0958m6206k6961M1742J46966K28924J74765m5972k46847j85142
$$ -228775 -259733 -305939 -332900 -291158 -144192 84732 259497 213525 -33322 -218464
35537b18464R8140K62801R9403j67506j73343Q1237K41745J11160r5738j11839
$$ -218464 -120324 142477 241880 74374 -98969 -17732 224013 335173 239435 127596
35527A27596r997k7111j42565j17002Q0794J87522O1232r0172n1894N9051K3259
$$ 127596 117599 90488 -52077 -169079 -88285 99237 160469 70297 18403 77454 100713
35516A00713q5345j5394K28128L56577K21774K0546j43J42264K39853J55674p0602
$$ 100713 15368 -26 228102 584679 806453 826999 826856 969120 1208973 1364647 1294045
35505A294045k89713l57475k50447r9080m9504r6378j22667p5962n167M8978Q0740
$$ 1294045 1004332 646857 396410 297330 247826 151448 28781 -47181 -52348 -3370 77370
35494G7370O0599k0376o9509J253J08162R3777k2061o9150p056J7832p4103j78608
$$ 77370 137969 117593 48084 49337 157499 251276 229215 160065 153009 170841 96738 -81870
35482h1870j94428j47047p4715L1995J30205J46051J30645J90678K41028Q9071
$$ -81870 -276298 -423345 -498060 -466065 -335860 -189809 -59164 131514 372542 461613
35472D61613j80995k25460L2568K28215J04311r7620p3636L2302o7975k42029
$$ 461613 280618 55158 87726 315941 420252 322632 248996 281298 213323 -28706
35462b8706j38102J77424K68595J0762k28281j70647J1514O7480M7019R3904J35830
$$ -28706 -166808 10616 279211 289973 61692 -108955 -97441 -29961 17058 110962 246792
35451B46792L6720j17075j31276q684P3723M5537J6420P0234J32399Q4500p1539
$$ 246792 283512 166437 35161 26477 100200 145737 162157 232391 364790 449290 377751
35440C77751k10877k19007j01234L7573J06600J00938O1551R381m9679r2773r5734
$$ 377751 166874 -52133 -153367 -115794 -9194 91744 153295 162676 112997 20224 -75510
35429g5510n7226J6784J13731J82374J61503O4828l3992j14757k04651k45582
$$ -75510 -132736 -115952 -2221 180153 341656 406484 372492 257735 53084 -192498
35419a92498j28576Q2510J54310K2678p5061K9080J41160K2124j84342j49567
$$ -192498 -321074 -238564 -84254 -61576 -136637 -107557 33603 55727 -128615 -278182
35409b78182J20879K91667J84566m0887j84634k00304r2156R9956K01388O8852
$$ -278182 -157303 134364 318930 278043 93409 -106895 -199051 -99095 102293 171145
35399A71145j31832j05926J01775J49796m9571j91417q9146N2201L4936k0555
$$ 171145 39313 -66613 35162 184958 135387 -56030 -145176 -92975 -58039 -78594
35389g8594K2665M2174o1559j11989K2495J26966j2973j94565r2603J98977K99998
$$ -78594 -55929 -13755 -75314 -187303 -164808 -37842 -50815 -245380 -337983 -139006 160992
35378A60992J20335o3549p2232k6206o3578j34295j31877l7613R2908J52878L9681
$$ 160992 281327 217778 145546 119340 55762 -78533 -210410 -248023 -155115 -2237 37444
35367C7444j71395k09556M6170L15096K46100q6937k84410j62054P5273J77029
$$ 37444 -133951 -343507 -297337 17759 263859 176922 -107488 -269542 -194269 -17240
35357a7240J06748l9259j40738q5325J01069J93271M9396j25567o0678J34185
$$ -17240 89508 50249 -90489 -175814 -74745 118526 167922 42355 -18323 115862
35347A15862J38866l2943p0881N8003L6486k08652l11951o8737K01346J67032
$$ 115862 254728 221785 150904 208907 245393 36741 -275210 -343947 -142601 24431
35337B4431j1320k1413P2399K0167j25485j12509N8233J56954J19651P9826N9400
$$ 24431 13111 -8302 64097 84264 -41221 -153730 -95497 61457 181108 260934 320334
35326C20334m6128j90332j90355m1126N3662J732o7903n8897m1229o4303m3716
$$ 320334 274206 83874 -106481 -147607 -93945 -92213 -160116 -219013 -260242 -324545 -368261
35315c68261P2349J83662J76075O4362o1639j29848r3164M0580J55677J24279
$$ -368261 -295912 -112250 63825 128187 66548 -63300 -156464 -115884 39793 164072
35305A64072j1740p1153K1131J36723J32040J9923r3975j40893j05241p885P6731
$$ 164072 152332 81179 102310 239033 371073 390996 297021 156128 50887 43002 119733
35294A19733P2361R932l169M4694L3358j00867k44256k46797j05059O4784J65501
$$ 119733 192094 202026 198857 243551 276909 176042 -68214 -315011 -420070 -355286 -189785
35283a89785J64494P2627m5265r3302m9837l459k3064n2492j3531M5288J3691
$$ -189785 -25291 47336 2071 -91231 -141068 -144527 -167591 -220083 -233614 -188326 -174635
35272a74635q9795j11995K4537J98887K34114J07828l7534o9854Q05O5360M8133
$$ -174635 -264430 -376425 -351888 -153001 81113 188941 151407 81553 82358 147718 195851
35261A95851k4264o6450k5395O6017J15276O2264m1913p3943R280Q6805J3949
$$ 195851 171587 105137 79742 145759 261035 323299 281386 207443 216723 303528 317477
35250C17477j57168j98191K597K56601K81782M6714k01478k40700r4647O6899
$$ 317477 160309 -37882 -35285 221316 503098 549812 348334 107634 12987 79886
35240G9886J35255J06569N701j27758k03196j35432K9844J20931L3030j24948
$$ 79886 215141 321710 327411 199653 -3543 -138975 -109131 11800 44830 -80118
35230h0118j56925l9928M6484j8324j24045j10901j4863K3103K0331J14124K69625
$$ -80118 -237043 -276971 -230487 -248811 -372856 -483757 -498620 -475517 -455186 -341062 -71437
35219g1437K70248P2721o7562K9422J81597J35223l3632o6317M4576O2375q6220
$$ -71437 198811 271532 203970 233392 414989 550212 516580 450263 494839 557214 470994
35208D70994j98030j25299K4668R3089P0501J6639m5186p8640l6741K3036j6509
$$ 470994 272964 147665 172333 265422 335923 352562 307376 228736 191995 215031 198522
35197A98522j21126j20772j594K8796j19595k28053r0081J51714K01899K8677
$$ 198522 77396 -43376 -44970 -16174 -135769 -363822 -453903 -302189 -100290 -71613
35187g1613j33631j32076l6358M5284J02350J49708J57116R4111k5785j54030
$$ -71613 -205244 -337320 -373678 -328394 -226044 -76336 80780 174891 149106 -4924
35177d924k18536j64757l8293L2207l17k3754O8430K10323K53337J53993j5885
$$ -4924 -223460 -388217 -426510 -394303 -394620 -418374 -349944 -139621 113716 267709 251824
35166B51824j67492k14369r6156J01269J60524J2322j14123j892K04216J99029
$$ 251824 84332 -130037 -226193 -124924 35600 47922 -66201 -68093 136123 335152
35156C35152n726r8915K8895J13503m4746k43825j82625P4412J72917m6839l40585
$$ 335152 329426 230511 259406 372909 328163 84338 -98287 -23875 149042 102203 -238382
35145b38382l64812p0625K64626L51973J83007n734k8767N6020P6988j1112j02510
$$ -238382 -603194 -673819 -409193 -57220 125787 120053 91286 147306 224294 213182 110672
35134A10672j06944l7583M8439J03718R4096K8248l0385m4852n5006p8591m4546
$$ 110672 3728 -33855 14584 118302 212398 240646 210261 165409 110403 31812 -12734
35123a2734O5628J08531k3022j72365j00862J40249K50035R6135j32759k26017
$$ -12734 52894 161425 138403 -33962 -134824 5425 255460 351595 218836 -7181
35113g181j84125j00152j9281J5898k3548l6985J05196K93723K57810r555j77771
$$ -7181 -191306 -291458 -310739 -294841 -318389 -355374 -250178 43545 301355 291800 114029
35102A14029o0399J10940P8947m9262n1607J2147m4458j61980j39177N797Q3848
$$ 114029 53630 164570 243517 194255 142648 154795 110337 -51643 -190820 -185023 -101175
35091a01175O2041N3310N3175j8683p4482L0945J77737R9056j67586k82205j16851
$$ -101175 -39134 14176 67351 48668 -25814 5131 182868 281924 114338 -167867 -284718
35080b84718N7302J0413j18769r9954L4931J06410O5353k7346j40777k17739j23647
$$ -284718 -227416 -217003 -335772 -435726 -400795 -294385 -229032 -256378 -397155 -614894 -738541
35069g38541J53218L58119K33217j24316l49128k41283L5684J98640J57526M1214
$$ -738541 -585323 -227204 6013 -118303 -467431 -708714 -673030 -474390 -316864 -275650
35059b75650k177L9060O9345K2360o6734j19236r1200K2742J86054K72840J34154
$$ -275650 -277827 -238767 -169422 -147062 -213796 -333032 -424232 -401490 -215436 57404 191558
35048A91558j74105l35254j24444K47867L62091J34342j11363j34202n7491n7952
$$ 191558 17453 -317801 -442245 -194378 167713 302055 190692 56490 -1001 -58953
35038e8953n5677Q2934K40068J96908j9852j74397j52009n1360K6211Q8907J42131
$$ -58953 -114630 -31696 208372 405280 385428 211031 59022 7662 33873 122780 264911
35027B64911J26230K1712q4521r4695j5815N1435K5094o1523q8161l932P5547
$$ 264911 391141 412853 328332 233637 217822 269257 294351 232828 144667 140735 216282
35016B16282J2342j31497j49289J0166J49743R8135o5211j51498j02101J4019
$$ 216282 228624 97127 -52162 -41996 107747 205882 140671 -10827 -112928 -98909
35006i8909J22545J57763P2012o0562p3536M6843R1824n6178k02560j23126P9869
$$ -98909 23636 181399 253411 192849 119313 166156 257980 201802 -758 -123884 -44015
34995d4015J41793M7056Q380R0971J33799M8128n8295r3608j01549j21637j17594
$$ -44015 97778 144834 153214 244185 377984 426112 367817 274209 172660 51023 -66571
34984f6571q5137n8206J0985J87270L50109K77918j0957k23716j84076m5250p171
$$ -66571 -151708 -209914 -198929 -11659 338450 616368 605411 381695 197619 152369 145198
34973A45198l3719L26O6189O6678K9026K9935K8001n2770j46105j24664j7603
$$ 145198 111479 111805 177994 244672 273698 303633 331634 278864 132759 8095 -9508
34962i508J3990q8037k00181j85388m5421J07155J64647J08347J7405j6156M338
$$ -9508 4482 -83555 -283736 -469124 -514545 -407390 -242743 -134396 -116991 -133147 -128809
34951a28809J671l5273k0260P8189J53333J10607J7718K208O1863R0975N7542
$$ -128809 -127138 -162411 -182671 -104482 48851 159458 177176 179384 241247 332222 389764
34940C89764L5675O6690R3491N6561j9698o9892p3229o6760r0355j36250j56069
$$ 389764 425439 492129 585620 642181 622483 552591 479362 412602 322247 185997 29928
34929B9928j17457m1745K5107N7243M6678l020m5994j6021O1410N6932o6040j34933
$$ 29928 -87529 -129274 -104167 -46924 -246 -3266 -49260 -65281 -3871 53061 -12979 -147912
34917a47912k735J83433J65357j9343q1731N3567J31707M950j25678p5233R858
$$ -147912 -150647 32786 198143 178800 97069 150636 282343 287293 161615 86382 96240
34906I6240o0720j68833j11732K2033K0803n9975j9014R1678N8630o5515k1355
$$ 96240 35520 -133313 -245045 -223012 -202209 -262184 -281198 -189520 -130890 -196405 -217760
34895b17760J69280J82096o4125k35386j10689P6521M6510q2394l6052J52693
$$ -217760 -48480 133616 69491 -165895 -276584 -200063 -153553 -235947 -271999 -119306
34885a19306K25632J11115k4048o4028m5744p328N9632J16743J01606L9793Q463
$$ -119306 106326 217441 193393 129365 83621 76293 135925 252668 354274 394067 402530
34874D02530Q039j9502p4282j00897p2144P404J16288J61461K0485k50804l83432
$$ 402530 410569 391067 316785 215888 143744 151148 267436 428897 449382 198578 -184854
34863a84854k26473J1439M7656o6324p0061O5126J28286P4634R7458K34619K42807
$$ -184854 -411327 -399888 -352232 -418556 -488617 -423491 -295205 -220571 -123113 111506 354313
34852C54313J3187j86932j04481J02565J10589r6484k60270k40121j17032J9953
$$ 354313 367500 180568 76087 178652 289241 192757 -67513 -307634 -424666 -404713
34842d04713J42723J80314Q3609k2350K5645J51150J29456m0343j15543q790O9939
$$ -404713 -261990 -81676 1933 -20417 5228 156378 285834 245491 129948 121158 191097
34831A91097j8006r6542J5306J71550J19477r3022j89679p6246O4676P6379J1019
$$ 191097 173091 76549 91855 263405 382882 289860 100181 23935 88611 164990 176009
34820A76009k0341r826j0845m8013j05845j30760n1575J15941K17488J27050o4503
$$ 176009 155668 145842 134997 86984 -18861 -149621 -201196 -85255 132233 259283 194780
34809A94780j57752j14496o7253p5589n4085L2462Q3073L1878m7822p7821p5464
$$ 194780 37028 -77468 -144721 -220310 -274395 -241933 -158860 -126982 -174804 -252625 -328089
$$ [...]
##END NTUPLES=NMR SPECTRUM
##END=
