##TITLE=31Pdec_IPDPC00102
 CDCl3, 24 sc
 5.2.2019
##JCAMPDX= 6.0         $$ Bruker NMR JCAMP-DX V2.0
##DATA TYPE= NMR SPECTRUM
##DATA CLASS= NTUPLES
##ORIGIN= UXNMR, Bruker Analytische Messtechnik GmbH
##OWNER= root
$$ XWIN-NMR		Version 3.5
$$ Tue Feb  5 15:55:27 2019 Russian Standard Time (UT+4h)  she@DPX200
##.OBSERVE FREQUENCY= 81.013821
##.OBSERVE NUCLEUS= ^31P
##.ACQUISITION MODE= SIMULTANEOUS
##.ACQUISITION SCHEME= undefined
##.AVERAGES= 24
##.DIGITISER RES= 17
##SPECTROMETER/DATA SYSTEM= spect
##.PULSE SEQUENCE= zgpg30
##.SOLVENT NAME= DMSO
##.SHIFT REFERENCE= (INTERNAL, DMSO, 0, 182.463)
##AUDIT TRAIL= $$ (NUMBER, WHEN, WHO, WHERE, WHAT)
$$ ##TITLE= Audit trail, XWIN-NMR		Version 3.5
$$ ##JCAMPDX= 5.01
$$ ##ORIGIN= Bruker BioSpin GmbH
$$ ##OWNER= she
$$ F:/spectra/data/she/nmr/P31/1/pdata/1/auditp.txt
$$ ##AUDIT TRAIL=  $$ (NUMBER, WHEN, WHO, WHERE, WHAT)
(   1,<2019-02-05 15:54:31.06 +0400>,<she>,<DPX200>,
      <created by zg, POWCHK disabled, PULCHK disabled
       configuration hash MD5:
       00 E9 B6 7A A2 85 ED C7 34 08 36 98 17 FE 4E 26
       data hash MD5: 32K
       E1 0F 8B FB 5F C1 09 BB 05 EE E4 59 37 46 9D 46>)
(   2,<2019-02-05 15:54:33.43 +0400>,<she>,<DPX200>,
      <Start of raw data processing
       efp BC_mod = 2 LB = 1 FT_mod = 6 PKNL = 1 PHC0 = -1470.779 PHC1 = 113.399 SI = 64K 
       data hash MD5: 64K
       B5 39 C0 F4 2A FA 2D C2 20 95 27 01 E6 DA C8 1F>)
(   3,<2019-02-05 15:54:45.31 +0400>,<she>,<DPX200>,
      <pk PHC0 = 3.082137 PHC1 = 0 
       data hash MD5: 64K
       53 66 7C 42 5A EE 03 55 36 ED D2 43 BB 6B A0 DB>)
(   4,<2019-02-05 15:54:49.92 +0400>,<she>,<DPX200>,
      <abs ABSG = 5 
       data hash MD5: 64K
       E6 79 B2 25 B5 9F 88 05 22 C4 F1 CE 6D FA DA 75>)
$$ ##END=
$$ 
$$ hash MD5
$$ FB A3 D7 12 20 DC 90 B7 8C 0F 7C 4B BB FC E2 32
##$RELAX= 
##$RELAX= 
##$RELAX= 
##$RELAX= 
##$RELAX= 
##$RELAX= 
##$RELAX= 
##$RELAX= 
$$ Bruker specific parameters
$$ --------------------------
##$DU= <F:/spectra>
##$EXPNO= 1
##$NAME= <P31>
##$PROCNO= 1
##$TYPE= <nmr>
##$USER= <she>
##$AMP= (0..31)
100 100 100 100 100 100 100 100 100 100 100 100 100 100 100 100 100 100 
100 100 100 100 100 100 100 100 100 100 100 100 100 100 
##$AQSEQ= 0
##$AQ_mod= 1
##$AUNM= <au_zg>
##$AUTOPOS= <>
##$BF1= 81.014009
##$BF2= 200.13
##$BF3= 200.13
##$BF4= 200.13
##$BF5= 200.13
##$BF6= 200.13
##$BF7= 200.13
##$BF8= 200.13
##$BYTORDA= 1
##$CFDGTYP= 0
##$CFRGTYP= 5
##$CHEMSTR= <none>
##$CNST= (0..31)
1 1 145 1 1 1 1 1 1 1 1 1 1 1 1 1 1 1 1 1 1 1 1 1 1 1 1 1 1 1 1 1 
##$CPDPRG= <waltz16>
##$CPDPRG1= <>
##$CPDPRG2= <waltz16>
##$CPDPRG3= <>
##$CPDPRG4= <mlev>
##$CPDPRG5= <mlev>
##$CPDPRG6= <mlev>
##$CPDPRG7= <mlev>
##$CPDPRG8= <mlev>
##$CPDPRGB= <>
##$CPDPRGT= <>
##$D= (0..31)
0 1 0 0 0 0 0 0 0 0 0 0.03 2e-05 3e-06 0 0 0 0 0 0 0 0 0 0 0 0 0 0 0 0 
0 0 
##$DATE= 1549367670
##$DBL= (0..7)
120 120 120 11 120 120 24 19 
##$DBP= (0..7)
150 150 150 150 150 150 150 150 
##$DBP07= 0
##$DBPNAM0= <>
##$DBPNAM1= <>
##$DBPNAM2= <>
$$ [...]
##$SUBNAM3= <"">
##$SUBNAM4= <"">
##$SUBNAM5= <"">
##$SUBNAM6= <"">
##$SUBNAM7= <"">
##$SUBNAM8= <"">
##$SUBNAM9= <"">
##$SW= 369.568048894756
##$SWIBOX= (0..15)
0 1 3 0 0 0 0 0 0 0 0 0 0 0 0 0 
##$SW_h= 29940.119760479
##$TD= 32768
##$TD0= 1
##$TE= 0
##$TE2= 300
##$TE3= 300
##$TEG= 300
##$TL= (0..7)
0 120 53 12 22 120 120 120 
##$TP= (0..7)
150 150 150 150 150 150 150 150 
##$TP07= 0
##$TPNAME0= <>
##$TPNAME1= <>
##$TPNAME2= <>
##$TPNAME3= <>
##$TPNAME4= <>
##$TPNAME5= <>
##$TPNAME6= <>
##$TPNAME7= <>
##$TPOAL= (0..7)
0.5 0.5 0.5 0.5 0.5 0.5 0.5 0.5 
##$TPOFFS= (0..7)
0 0 0 0 0 0 0 0 
##$TUNHIN= 0
##$TUNHOUT= 0
##$TUNXOUT= 0
##$USERA1= <user>
##$USERA2= <user>
##$USERA3= <user>
##$USERA4= <user>
##$USERA5= <user>
##$V9= 5
##$VALIST= <valist>
##$VCLIST= <CCCCCCCCCCCCCCC>
##$VD= 0
##$VDLIST= <DDDDDDDDDDDDDDD>
##$VPLIST= <PPPPPPPPPPPPPPP>
##$VTLIST= <TTTTTTTTTTTTTTT>
##$WBST= 1024
##$WBSW= 4
##$XGAIN= (0..3)
0 0 0 0 
##$XL= 0
##$YL= 0
##$YMAX_a= 57945
##$YMIN_a= -66600
##$ZGOPTNS= <>
##$ZL1= 120
##$ZL2= 120
##$ZL3= 120
##$ZL4= 120
##$ABSF1= 182.463
##$ABSF2= -187.1042
##$ABSG= 5
##$ABSL= 3
##$ALPHA= 0
##$AQORDER= 0
##$ASSFAC= 0
##$ASSFACI= 0
##$ASSFACX= 0
##$ASSWID= 0
##$AUNMP= <proc_1d>
##$AZFE= 0.1
##$AZFW= 0.5
##$BCFW= 0
##$BC_mod= 2
##$BYTORDP= 0
##$COROFFS= 0
##$CY= -3
##$DATMOD= 1
##$DC= 0
##$DFILT= <>
##$DTYPP= 0
##$F1P= 0
##$F2P= 0
##$FCOR= 1
##$FTSIZE= 65536
##$FT_mod= 6
##$GAMMA= 0
##$GB= 0
##$INTBC= 1
##$INTSCL= 5.30512e-09
##$ISEN= 30
##$LB= 1
##$LEV0= 0
##$LPBIN= 0
##$MAXI= 10000
##$MC2= 0
##$MEAN= 0
##$ME_mod= 0
##$MI= 50
##$NCOEF= 0
##$NC_proc= -5
##$NLEV= 6
##$NOISF1= 182.463
##$NOISF2= 159.3651
##$NSP= 0
##$NTH_PI= 0
##$NZP= 0
##$OFFSET= 182.463
##$PC= 4
##$PHC0= -1467.697
##$PHC1= 113.399
##$PH_mod= 1
##$PKNL= yes
##$PPARMOD= 0
##$PSCAL= 0
##$PSIGN= 0
##$REVERSE= no
##$SF= 81.0140089999434
##$SI= 65536
##$SIGF1= 159.3651
##$SIGF2= -187.1042
##$SINO= 113.3802
##$SIOLD= 16384
##$SREGLST= <1H.CDCl3>
##$SSB= 0
##$STSI= 65536
##$STSR= 0
##$SW_p= 29940.119760479
##$SYMM= 0
##$S_DEV= 0
##$TDeff= 32768
##$TDoff= 0
##$TI= <>
##$TILT= no
##$TM1= 0
##$TM2= 0
##$TOPLEV= 0
##$USERP1= <user>
##$USERP2= <user>
##$USERP3= <user>
##$USERP4= <user>
##$USERP5= <user>
##$WDW= 1
##$XDIM= 65536
##$YMAX_p= 357070012
##$YMIN_p= -9657170
$$ End of Bruker specific parameters
$$ ---------------------------------
##NTUPLES= NMR SPECTRUM
##VAR_NAME=  FREQUENCY,     SPECTRUM/REAL,   SPECTRUM/IMAG
##SYMBOL=    X,             R,               I
##VAR_TYPE=  INDEPENDENT,   DEPENDENT,       DEPENDENT
##VAR_FORM=  AFFN,          ASDF,            ASDF
##VAR_DIM=   65536,         65536,           65536
##UNITS=     HZ,            ARBITRARY UNITS, ARBITRARY UNITS
##FACTOR=    0.456856943014862, 1,           1
##FIRST=     14782.0589164792, 0,            0
##LAST=      -15158.0608439998, 0,           0
##MIN=       -15158.0608439998, -9657170,    0
##MAX=       14782.0589164792, 357070012,    0
$$ Real data points
##PAGE= N=1
##DATA TABLE= (X++(R..R)), XYDATA
$$ [...]
42321C7757k6796P78616P30348k95722j062991o98669M9593O0120m34675m30500
$$ 37757 10961 789577 1519925 1224203 161212 -537457 -487864 -427744 -862419 -1292919
42311a292919Q7677K28209j82504l49109L0446K57503q4178l96040j13485L88489
$$ -1292919 -1205242 -977033 -1159537 -1508646 -1478200 -1220697 -1304875 -1700915 -1814400 -1425911
42301a425911N23626M17381M68465N51813L33313j2452o5410Q6256k6914m45887
$$ -1425911 -902285 -484904 -16439 535374 868687 856235 790825 877081 850167 404280
42291D04280o36982k53472L19952L90002j95275q04130p28424m6114N00365N41444
$$ 404280 -232702 -486174 -166222 223780 28505 -775625 -1504049 -1550163 -1049798 -508354
42281e08354N36954Q68703J007945K99025p63937r90630j94062N29103L95205
$$ -508354 28600 897303 1905248 2204273 1440336 449706 255644 784747 1179952
42272A179952j37003l68944l43935k86503N2649P34220J027427L58955o29979
$$ 1179952 1042949 674005 330070 43567 96216 830436 1857863 2216818 1586839
42263A586839q77043m05036j30300l87554n86303l11423J24270L72389N19035
$$ 1586839 709796 304760 174460 -213094 -799397 -1110820 -986550 -614161 -95126
42254i5126O12205L90973j52613m68556j47768M06206M43062j50282p11779o41182
$$ -95126 517079 908052 755439 286883 139115 545321 988383 838101 126322 -514860
42244e14860p8214L71215L92705K02793N7247j38735m91494o79338l26245K88301
$$ -514860 -593074 -221859 170846 373639 430886 292151 -199343 -878681 -1204926 -916625
42234i16625M64425R8896j30269J82413N25814K67760l97354p60434n01793J22075
$$ -916625 -452200 -353304 -483573 -301160 224654 492414 95060 -665374 -1167167 -1045092
42224a045092O67176P37957K21475l89434l74513J84903L69073j67850n33680
$$ -1045092 -377916 360041 581516 192082 -182431 2472 371545 203695 -329985
42215c29985j5099O76540N46359l8975p5906K72808M4825o51147o98353O4939
$$ -329985 -345084 331456 877815 838840 762934 1035742 1080567 429420 -268933 -203994
42205b03994M70688r4462p96010p53136j18591O21451J220278J199695J43754
$$ -203994 266694 172232 -623778 -1376914 -1495505 -874054 346224 1545919 1689673
42196A689673j102835r98775L38900R46576j059p93502k0154J004600M82068p43068
$$ 1689673 586838 -411937 -73037 873539 872480 78978 58824 1063424 1545492 802424
42186H02424o31831N08907N85365o05630j009105J48523J069535M37374n45092
$$ 802424 170593 679500 1264865 659235 -349870 -201347 868188 1305562 760470
42177G60470m00027K45755N1476p00777q13179k55400N8609k1173J33325N68100
$$ 760470 360443 606198 657674 -43103 -856282 -1111682 -1053073 -1074246 -940921 -372821
42167c72821O88563M16577K62220K88543M0302m45113n04753P9894O48355N54133
$$ -372821 315742 732319 994539 1283082 1323384 878271 373518 453412 1101767 1655900
42157A655900o3573n98278o35451j83406L76125N22066J19659l24827k86396L1839
$$ 1655900 1592327 994049 358598 175192 551317 1073383 1193042 868215 581819 613658
42147F13658L7848k86574l61277K7434L48299J08292m69105p99095o18374j01707
$$ 613658 651506 364932 3655 31089 379388 487680 18575 -780520 -1398894 -1500601
42137a500601M05607N74209K57989l24355p08883n80716L1388Q50366J410727
$$ -1500601 -1094994 -520785 -262796 -587151 -1296034 -1876750 -1845362 -994996 415731
42128D15731J186738J08349j048365j254661l53035P68363J211549Q86029K21512
$$ 415731 1602469 1710818 662453 -592208 -945243 -176880 1034669 1920698 2142210
42119B142210m00971o81539l89325K43748M79616r3851r14141j073049m13005
$$ 2142210 1741239 1059700 670375 914123 1393739 1299888 385747 -687302 -1100307
42110a100307M49774J018171J269958J170654M94108o09287j365212j144375k68792
$$ -1100307 -650533 367638 1637596 2808250 3302358 2693071 1327859 183484 -85308
42101h5308L38766K27776k07833m27654m26963n05887o21984l72851L42881R84726
$$ -85308 253458 481234 273401 -154253 -581216 -1087103 -1709087 -2081938 -1739057 -754331
42091g54331R28404K15401n12431p74619o72993n15581l29084L6912N02861P53270
$$ -754331 174073 389474 -122957 -897576 -1570569 -2086150 -2415234 -2378322 -1875461 -1122191
42081a122191O34643L38379J29884O7854Q2190J67520L19526L63733R3154l75247
$$ -1122191 -487548 -149169 -19285 48569 130759 298279 617805 981538 1074692 699445
42071F99445o13018m05304p5575m4678k15398j58740J34013J65369k44334n32117
$$ 699445 86427 -318877 -394452 -439130 -654528 -813268 -679255 -513886 -758220 -1290337
42061a290337j76495M47379N16822j01479o98497o76501j51726M41477Q39994
$$ -1290337 -1466832 -1019453 -502631 -604110 -1302607 -1979108 -2130834 -1689357 -849363
42052h49363Q91411M87900j45312m41896j04442M78840O80566L40122j64265l89448
$$ -849363 42048 529948 384636 -57260 -161702 317138 997704 1337826 1173561 784113
42042G84113k19110O7988L5556m13679p67935m54045L20465P31979M56900M4815
$$ 784113 565003 632991 668547 254868 -513067 -967112 -646647 85332 542232 587047
42032E87047o7087k07714o31191p34449L6876R97792R92900J47878k68866K11223
$$ 587047 519960 312246 -318945 -1053394 -1016518 -18726 974174 1122052 853186 1064409
42022A064409O03385J17183o16210o34297j25566K8658l45392o49640n60463l25109
$$ 1064409 1667794 1784977 1168767 534470 408904 437562 92170 -557470 -1117933 -1443042
42012a443042j25683J43158M65327O49356O83264O56253M17477j32592n28974
$$ -1443042 -1568725 -1425567 -960240 -310884 372380 1028633 1446110 1313518 784544
42003G84544k35413L49474K20948o73238j090140k40271Q90551P94534m54603
$$ 784544 549131 898605 1119553 446315 -643825 -884096 6455 800989 346386
41994C46386j315198q82222N0717K56840l26358p18716k24691Q02404J415380
$$ 346386 -968812 -1851034 -1800317 -1543477 -1869835 -2588551 -2813242 -2010838 -595458
41985e95458J056894J19296m52844k23433J97802j7596o94623q29018n7349P30891
$$ -595458 461436 580732 127888 -95545 102257 84661 -609962 -1438980 -1496329 -765438
41975g65438O23362p9124m47627k85217j45370k45697k13563Q7821K98320L00829
$$ -765438 -142076 -221200 -668827 -954044 -1099414 -1345111 -1558674 -1470853 -1172533 -871704
41965h71704M56651P85562O49930k22280j015624q21167N5027N27705K35316j92911
$$ -871704 -415053 370509 1020439 798159 -217465 -1038632 -983605 -455900 -220584 -413495
41955d13495k99582l56077n48884m30229K95988J012706Q99312J32133l07695
$$ -413495 -713077 -1069154 -1618038 -2048267 -1752279 -739573 159739 291872 -15823
41946a5823K0235N05616M65523M2072k25192k53376l10514l33559q043M98588
$$ -15823 4412 510028 975551 1017623 792431 539055 228541 -105018 -113061 385527
41936C85527N59604N5033k97715K7514N32965M47029j03863l66027j48644L2326
$$ 385527 945131 1000164 702449 729963 1262928 1709957 1606094 1240067 1091423 1123749
41926A123749q7082k15669k02477k25873j71843K92263P95731M28365p11877j205995
$$ 1123749 1036667 820998 618521 392648 220805 513068 1308799 1737164 1025287 -180708
41916a80708l15154P26732M97304m31056m99482K77448M65087k73736o41870P668
$$ -180708 -495862 230870 728174 297118 -202364 75084 540171 266435 -375435 -367767
41906c67767N83678J78522m28520k15782L63540L35308o9844j665L53645J32444
$$ -367767 215911 394433 -34087 -249869 113671 448979 379135 377470 731115 863559
41896H63559n41197o66728p1880L26082R7255j11200J22688K69584o4577l55909
$$ 863559 322362 -344366 -416246 -90164 7091 -104109 18579 288163 223586 -132323
41886a32323j32635J45861m1023k59802J18888P04882O43786N2352j63326J84837
$$ -132323 -264958 -119097 -160120 -419922 -301034 403848 1047634 1099986 936660 1121497
41876A121497L15740j39372n44468m10040j90037l58175n08358j32214L67613
$$ 1121497 1437237 1297865 753397 343357 153320 -204855 -713213 -845427 -477814
41867d77814L49840J27417M26478R28110N60915o86344j446270q49087L26132
$$ -477814 -127974 -557 425921 1354031 1914946 1228602 -217668 -1066755 -740623
41858g40623R08699P90876M62576J4427n05200n12638K68439R51390N86833l17549
$$ -740623 168076 958952 1421528 1435955 930755 418117 686556 1637946 2224779 1907230
41848A907230n47465r5411r153n14674p30956l31414m5776k15740k43017R6781
$$ 1907230 1359765 1264354 1255201 740527 9571 -321843 -367619 -583359 -826376 -729595
41838g29595J70066j39311J0431P64586R47262P1310m95416L08637J257891O94507
$$ -729595 -559529 -698840 -688409 76177 1023439 1094749 599333 907970 2165861 2860368
41828B860368p02511r59102L6989M98955l28674j197950j017356k31534L64251
$$ 2860368 2157857 1198755 1235744 1734699 1406025 208075 -809281 -1040815 -676564
41819f76564O81842P35276L01884l17458l67610J13439K48181j47744k30353K87421
$$ -676564 5278 740554 1042438 724980 357370 470809 718990 571246 340893 628314
41809F28314N63228J78397j12189J23859J41519m61036p40991m1499O45352K64207
$$ 628314 1191542 1369939 1257750 1381609 1523128 1062092 321101 279602 924954 1189161
41799A189161m67354l01698L84183L34549l52243m97165J7353J43652l64681n73245
$$ 1189161 721807 420109 804292 1138841 786598 289433 306786 450438 85757 -487488
41789d87488j36180J16216k48409m88680l4258N60213O00784K21086j76788n39466
$$ -487488 -623668 -507452 -755861 -1244541 -1278799 -718586 -117802 103284 -73504 -612970
41779f12970p02486k41192O11604Q06075j9321p00249j25638J016284J148686
$$ -612970 -1315456 -1556648 -945044 -138969 -158290 -858539 -984177 32107 1180793
41770A180793O9366q43745o38117Q2746L17504O9105N451K46598K18936l50584
$$ 1180793 1250159 406414 -231703 -148957 168547 237652 243103 489701 708637 358053
41760C58053r00190p59534p9451L62037J95062j34332j07235J39847J50867r6198
$$ 358053 -542137 -1301671 -1381122 -1019085 -824023 -958355 -1065590 -925743 -774876 -871074
41750h71074k20074p3642J08445J74904K55563M41869O04575N99074M05829N9220
$$ -871074 -1091148 -1164790 -1056345 -881441 -625878 -184009 420566 1019640 1425469 1484689
41740A484689l39804n93119o09670n24932m02170o9447M19151N12564j10160q38236
$$ 1484689 1144885 551766 -57904 -582836 -985006 -1054453 -635302 -122738 -232898 -1071134
41730a071134q23741j60527L74756N54229P52672Q70922L29737o71592j030413
$$ -1071134 -1894875 -2055402 -1680646 -1126417 -373745 497177 826914 155322 -875091
41721h75091l25400M99062O00579M01069N59641P33883L24694k95367l76073p2563
$$ -875091 -1200491 -701429 -100850 300219 859860 1593743 1918437 1623070 1246997 1174434
41711A174434m2935j77874J07716N64511L26656n50870r64848m23983K24734J50328
$$ 1174434 1131499 953625 1061341 1625852 1952508 1401638 436790 12807 237541 387869
41701C87869l00948l74968j06876m2388k31391k33274O0732K49233R0321j37299
$$ 387869 86921 -288047 -394923 -437311 -668702 -901976 -841244 -592011 -501690 -638989
41691f38989j14517q79j79877n89897o60924q0473O54626Q12903M00232N8146
$$ -638989 -753506 -754385 -934262 -1524159 -2185083 -2265556 -1610930 -798027 -397795 -339649
41681c39649L4753o9662l66530k95345L36926P04150J44200o03672l59616O51533
$$ -339649 -304896 -374558 -741088 -1036433 -699507 4643 148843 -454829 -814445 -162912
41671a62912J057826L75603l79139l41132K9427o8308m86883n25121p2829L21928
$$ -162912 894914 1270517 891378 550246 579673 511365 24482 -500639 -573468 -251540
41661b51540K78455l5678k45649j85286l3816j21464m49503m88083J83609J107495
$$ -251540 26915 -8763 -254412 -439698 -473514 -594978 -1044481 -1532564 -1348955 -241460
41651b41460J347477P09192j4255j55270N4469N1771k65901o13051p35015n07475
$$ -241460 1106017 1815209 1800954 1645684 1700153 1751924 1486023 872972 137957 -369518
41641c69518j5880L34410K48176J01685M31633Q62417M63467o35448j103489l94145
$$ -369518 -385398 -50988 197188 298873 730506 1592923 2056390 1420942 317453 -76692
41631g6692K71683k43309j185112j103232q5101N40783L00066M824K11516N14883
$$ -76692 194991 -48318 -1233430 -2336662 -2421763 -1880980 -1580914 -1576090 -1364574 -849691
41621h49691N11659L98114L50668J67158k06145m65416m56648l25259j02952K77323
$$ -849691 -338032 60082 410750 577908 371763 -93653 -550301 -875560 -978512 -701189
41611g01189N86416N53543M32457O01577P29407K18984n73764o08378K06242P11125
$$ -701189 -114773 438770 871227 1472804 2202211 2421195 1847431 1239053 1445295 2156420
41601B156420J78412o97531r70908o98230m17991j67153K58963O24717N26202
$$ 2156420 2334832 1637301 666393 -31837 -449828 -616981 -358018 266699 792901
41592G92901L732n94533j010869j010749m02688N03399R52308O39693Q9517j54615
$$ 792901 796633 202100 -808769 -1819518 -2222206 -1718807 -766499 -126806 -37289 -191904
41582a91904j56129j29854m3347j0507l22814p01266l95998M78455P30842p9239
$$ -191904 -348033 -477887 -521234 -531741 -854555 -1555821 -1951819 -1473364 -742522 -821761
41572h21761p01187p8610Q85705P56282j38228l98301R1541K35219j66138j74754
$$ -821761 -1522948 -1601558 -715853 40429 -97799 -496100 -404559 -169340 -335478 -510232
41562e10232L98556N92447N5058l53369j10211K53845L99357O89102R71724L88083
$$ -510232 -111676 480771 535829 182460 72249 326094 725451 1414553 2386277 2774360
41552B774360r15728j420504n09057L66762m6926p77368l35635P34666P88038
$$ 2774360 1858632 438128 -70929 295833 248907 -528461 -864096 -129430 658608
41543F58608k26849q48017m81169O1267K55630M19336N07067l4083r25141j043513
$$ 658608 431759 -416258 -897427 -836160 -580530 -161194 345873 311790 -613351 -1656864
41533a656864j82634M96575K71671j29990Q2477N50125O56861N59472N18725J93701
$$ -1656864 -1839498 -1342923 -1071252 -1201242 -1118765 -568640 88221 647693 1166418 1360119
41523A360119m92396p03200N0719Q04560M67287m04564m83389J57346K55010m07284
$$ 1360119 867723 164523 215242 1019802 1487089 1082525 599136 756482 1011492 604208
41513F04208n85573K87449J019060M52923p54221j095152k51686P61852J084691
$$ 604208 18635 306084 1325144 1778067 1023846 -71306 -322992 438860 1523551
41504A523551P66241K10174l53864p63505q33286n57725j62552J05729J32903
$$ 1523551 2289792 2499966 2146102 1382597 549311 -8414 -170966 -65237 67666
41495F7666j0987o1320J79050M24579R9299p80807j312821p55424M38280J194974
$$ 67666 56679 -4641 174409 598988 698287 -82520 -1395341 -2150765 -1712485 -517511
41485e17511J186767R51039P84774L54264m36652r83166q13932l28976k08241
$$ -517511 669256 1620295 2405069 2759333 2322681 1339515 525583 196607 -11634
41476a1634m56740n24943j51750L44535N08499J89106l50308n87190k09187M19979
$$ -11634 -468374 -993317 -1145067 -800532 -292033 -102927 -453235 -1040425 -1249612 -829633
41466h29633N64072N7183m58535m79891l09608l66763m03880p2455K15267j30177
$$ -829633 -265561 -208378 -666913 -1146804 -1456412 -1823175 -2227055 -2299510 -2084243 -2214420
41456b214420p10717n46556M07008J136887J070642P04893M93618J54881m25465
$$ -2214420 -2925137 -3471693 -3064685 -1927798 -857156 -152263 341355 496236 70771
41447G0771n99751k4655M89945J06980o73862p71886k08045N3243k66383m14740
$$ 70771 -528980 -553635 -63690 43290 -630572 -1402458 -1610503 -1557260 -1823643 -2238383
41437b238383L6275N25700M88809J69306P1926K73359O22499R98866J038796K96674
$$ -2238383 -2202108 -1676408 -1187599 -1018293 -946367 -673008 -50509 948357 1987153 2283827
41427B283827q58300j208023k20336R63172R12760j30854o76620j82440K99401
$$ 2283827 1425527 217504 -2832 960340 1873100 1742246 1065626 883186 1182587
41418A182587j14489q18407p81260j17952K67123J39813Q8522L51400M17489k2222
$$ 1182587 1068098 249691 -531569 -649521 -382398 -242585 -154063 197337 614826 592604
41408E92604m87902m34205K515L66922N13295M47745J1952p10977j046002m73718
$$ 592604 104702 -329503 -326988 39934 553229 1000974 1012926 301949 -744053 -1217771
41398a217771M68076P51382K57197j44740L4555K74775N7930k81760k34764l0666
$$ -1217771 -749695 1687 258884 114144 148699 423474 481404 199644 -35120 -65786
41388f5786k22352p26418r15374m85485K72657R14342J121932P46909L4427l67550
$$ -65786 -288138 -1014556 -1929930 -2415415 -2142758 -1228416 -106484 640425 674852 307302
41378C07302r5459L81992L63187j21322m74330m87955m72288m72658r9338O62161
$$ 307302 211843 593835 957022 835700 361370 -126585 -598873 -1071531 -1170869 -508708
41368e08708J097782N90356n61043j430778j351580l95166P48193J270080R00832
$$ -508708 589074 1179430 618387 -812391 -2163971 -2559137 -1810944 -540864 359968
41359C59968J49478l12780l98511l96473k50729K98334R06674P78094j38737q49047
$$ 359968 509446 196666 -201845 -598318 -849047 -550713 355961 1134055 995318 146271
41349A46271o04903J36309N01792L55370J13337m5474j23414R3961O13923P35371
$$ 146271 -458632 -322323 179469 534839 648176 602702 479288 573249 1187172 1922543
41339A922543j44669j317599j295536K02126J591934J280667l26523j345611p88973
$$ 1922543 1777874 460275 -835261 -633135 958799 2239466 1912943 567332 -221641
41330b21641L04678M16418l52360n31301M25467J153588L66639j021875j058685
$$ -221641 83037 499455 147095 -384206 41261 1194849 1561488 539613 -519072
41321e19072K97708J005387J8057j144757q45261J56160J55836o01022m28944
$$ -519072 -221364 784023 802080 -342677 -1187938 -1031778 -875942 -1476964 -1905908
41312a905908Q60544J598042R75157J83325K36006L92510k52673j045726r19927
$$ -1905908 -1045364 552678 1527835 1711160 1947166 2339676 2087003 1041277 121350
41303A21350k18134K0592j22587K14109R25310R82087J57256o02818o66669l99371
$$ 121350 -96784 -76192 -198779 15330 940640 1922727 2079983 1477165 810496 411125
41293D11125j18781M39825J127173R67245m24891j810682j699070l09076P83418
$$ 411125 292344 732169 1859342 2826587 2401696 591014 -1108056 -1417132 -633714
41284f33714P28676J81810k570R9179J1852j98152j01857L22230O40254N81409
$$ -633714 94962 276772 274202 373381 385233 187081 85224 407454 1047708 1629117
41274A629117L11128J10451P5711J46163K08121J48881m2425k39430l53885m56080
$$ 1629117 1940245 2050696 2126407 2272570 2480691 2629572 2587147 2347717 1993832 1537752
41264A537752n68187m80429l7252M82142N88180J77944l81015p34814p70994m01739
$$ 1537752 969565 489136 451884 934026 1522206 1700150 1319135 584321 -186673 -588412
41254e88412L92951J190329J302917O02716k47600o58158p52985q12409o21228
$$ -588412 -195461 994868 2297785 2900501 2652901 1994743 1241758 429349 -191879
41245a91879L6646O49277M96241k75528q01356o52133j72089K79284O79017Q70857
$$ -191879 -155233 494044 990285 714757 -86599 -738732 -910821 -631537 47480 918337
41235I18337N24828j82534n29777k31459J21048m1227m52121m94248m5309N45703
$$ 918337 1443165 1260631 730854 499395 620443 579216 127095 -367153 -412462 133241
41225A33241R25127Q38832K06978n58773p84876m41318k60794n30138m77985M27819
$$ 133241 1058368 1897200 2104178 1545405 760529 319211 58417 -471721 -949706 -521887
41215e21887J275425Q57305m08648r35249k32156N51184N26503K35828L83297
$$ -521887 753538 1610843 1202195 266946 34790 585974 1112477 1348305 1731602
41206A731602N38934P530q01941r34256l91195l4215j50943j54952J80793K03581
$$ 1731602 2270536 2278066 1476125 541869 150674 116459 -34484 -189436 -8643 194938
41196A94938m49537r83645n09214N09971P86385O5069n11184j43208M46368K47722
$$ 194938 -254599 -1238244 -1747458 -1237487 -451102 -386033 -897217 -1040425 -594057 -346335
41186c46335l52862j92164O90952R80766J62478o07566l29987K87147J11309n04660
$$ -346335 -699197 -891361 -200409 780357 942835 335269 5282 292429 403738 -100922
41176a00922m40700J49354J05709n89642o39793K81595P47502j27569j079207
$$ -100922 -541622 -392268 -286559 -876201 -1515994 -1234399 -486897 -614466 -1693673
41167a693673n80061P75546J223855M64148k16517j38394K7815j87215k22724
$$ -1693673 -2273734 -1498188 -274333 189815 -26702 -165096 -137281 -324496 -547220
41158e47220K93849O75952K58339m64171n54984K1895M98751M44451J67456Q4254
$$ -547220 -253371 422581 680920 216749 -338235 -316340 182411 626862 794318 878572
41148H78572J81196J49933j98783o90716q99416n93000m3282L20571M83886O98045
$$ 878572 1059768 1209701 1010918 320202 -579214 -1172214 -1215496 -894925 -411039 287006
41138B87006Q25319M11182m57156r88350p09754j13244J21418M3922R0180K85416
$$ 287006 1112325 1523507 1066351 78001 -631753 -744997 -623579 -579657 -489477 -204061
41128b04061L78004M07981N13030M49931k7368n24192m44970M2565K09159r5612
$$ -204061 173943 581924 1094954 1544885 1517517 993325 548355 590920 800079 704467
41118G04467k55955M4295K93235k7852o60910r52714o49856n4582L54203L40903
$$ 704467 448512 492807 786042 758190 97280 -855434 -1505290 -1559872 -1205669 -864766
41108h64766J79359M13123J022617J121834J32240j025068r21718K31818O80717
$$ -864766 -685407 -272284 750333 1872167 2004407 979339 57621 289439 970156
41099I70156l05723j298504r00024J77770M02229j85102l46722J41764K81559
$$ 970156 664433 -634071 -1534095 -1356325 -954096 -1139198 -1485920 -1344156 -1062597
41090a062597k51381n44849q1912L76101Q0939n35515o18760j06821L86835M15524
$$ -1062597 -1313978 -1858827 -1940739 -1564638 -1483699 -2019214 -2637974 -2744795 -2357960 -1942436
41080a942436J6736l97058k37128O80028J598369J480647L80224n28391n02542
$$ -1942436 -1925700 -2322758 -2559886 -1879858 -281489 1199158 1579382 1050991 548449
41071E48449m1392J44315Q9886L1525k11288o44078o72635l6183N23159L34347
$$ 548449 507057 651372 741258 772783 561495 -82583 -755218 -791401 -268242 66105
41061F6105j20083r0182J29552j47723n87816l40942L63481M81663o0322k12124
$$ 66105 -53978 -144160 -14608 -162331 -750147 -1091089 -727608 -245945 -306267 -518391
41051e18391L96795Q04693K91482n28940p57988m18330n465L63310P02802P12437
$$ -518391 -121596 683097 974579 445639 -312349 -730679 -736144 -372834 329968 1042405
41041A042405K24617l63301o09132n55769l93826j30989P1449j20413n03446l32247
$$ 1042405 1267022 903721 294589 -261180 -655006 -785995 -714546 -834959 -1338405 -1670652
41031a670652M89531R92550N37791j69145k32071O0484k5908k88936j12218K13006
$$ -1670652 -1181121 -188571 349220 180075 -51996 8488 -17420 -306356 -418574 -205568
41021b05568J4628l19751J04474Q92433P20184m05002r10227j43085N27618o2147
$$ -205568 -190940 -510691 -406217 486216 1206400 801398 -108829 -251914 275704 213557
41011B13557r83160p47382L50777Q22074K65621l09919j67713L58220O78097N68661
$$ 213557 -769603 -1516985 -1166208 -344134 -78513 -388432 -556145 -197925 480172 1048833
41001A048833k578q07972j132488m51227O42002R80893L46700l53066m89225m15804
$$ 1048833 1046255 238283 -894205 -1345432 -703430 277463 624163 271097 -218128 -633932
40991f33932n50766o27006k93110K33989N91977P84185Q28663M61905k84540p14082
$$ -633932 -1184698 -1811704 -2104814 -1870825 -1278848 -494663 334000 795905 511365 -202717
40981b02717k95008M86382P20448K78896j81462k52874j78898k38413l16164k29279
$$ -202717 -497725 -11343 709105 988001 806539 553665 374767 136354 -179810 -409089
40971d09089n2572N9078Q9044P7855M2675L5144O5906l5636m10319p78905n99253
$$ -409089 -461661 -402583 -313539 -235684 -193009 -157865 -91959 -127595 -537914 -1316819 -1916072
40960a916072K12122R91935J037587M46436n7263o8879R5995M7140n3000J01764
$$ -1916072 -1703950 -712015 325572 772008 714745 645866 741861 789001 736001 837765
40950H37765K11058l06900j200702j366915l65204P31091P12129p2301l46375
$$ 837765 1048823 741923 -458779 -1825694 -2190898 -1459807 -747678 -819979 -1166354
40941a166354J12078L34819k4144j02745N52556J091316Q03343K97494K89607
$$ -1166354 -1054276 -719457 -743601 -846346 -293790 797526 1600869 1898363 2187970
40932B187970K60437m73231j208693q19511K84732O78867J16707l12257j18000
$$ 2187970 2448407 1975176 766483 -53028 231704 910571 1027278 715021 597021
40923E97021N2909p8969L8606M03679J53379p67880j095457k30152N78462Q7630
$$ 597021 649930 570961 609567 1013246 1166625 398745 -696712 -926864 -348402 -260772
40913b60772r82297j054321J5385R67030R67358L19171l43100o27089l72464J61480
$$ -260772 -1243069 -2297390 -2282005 -1314975 -347617 -28446 -371546 -998635 -1371099 -1209619
40903a209619L13375j56661n72891k44992N39411J005794R13897M91724j10095
$$ -1209619 -896244 -1052905 -1625796 -1870788 -1331377 -325583 588314 1080038 969943
40894I69943o37452n95465k1479K33719k15360m67603K41619J090995Q94235P9450
$$ 969943 332491 -262974 -284453 -50734 -266094 -733697 -492078 598917 1493152 1572602
40884A572602m7794M55405L36524o15176j201383q19474k46680j04783j4649K68253
$$ 1572602 1524808 1980213 2316737 1701561 500178 -319296 -565976 -670759 -685408 -417155
40874d17155K36543k80648n99450l31015J3619R1956L40453R47809J237732P22786
$$ -417155 -180612 -461260 -1060710 -1391725 -1378106 -1286150 -945697 2112 1239844 1962630
40864A962630q6292m93075m59701k22794R6552J65648l42906r25370p00812P1545
$$ 1962630 1876338 1383263 923562 700768 797320 962968 620062 -305308 -1006120 -934575
40854i34575K20651k97287j83184Q25570J177104R3209q89125l76335N60490L03842
$$ -934575 -713924 -1011211 -1194395 -368825 808279 901488 12363 -363972 196518 500360
40844E00360n09873k29285Q15946Q83265j60300o81156n1200N21781J65112m60452
$$ 500360 -9513 -238798 577148 1460413 1300113 618957 567757 1089538 1254650 794198
40834G94198n39297k18275N2021J29123q6859n07997m91446K84560Q24329M9674
$$ 794198 254901 36626 88647 217770 130911 -377086 -868532 -583972 240357 290031
40824B90031j223618j183884J77585R92288M25741k55504k8623L77969J70271
$$ 290031 -933587 -2117471 -1939886 -947598 -521857 -777361 -805984 -428015 -257744
40815b57744m2070M20268R17336O36603M40k16148k02483m52151o55478l33165
$$ -257744 -299814 120454 1037790 1674393 1674833 1458685 1256202 804051 148573 -184592
40805a84592J56591K46379J43522K93526N16372N02782M69024N21767J72950o52136
$$ -184592 -28001 218378 361900 655426 1171798 1674580 2143604 2665371 2838321 2186185
40795B186185j016796m02570J70968l20039j089751p26785M39869Q11604O6645
$$ 2186185 1169389 766819 937787 617748 -472003 -1198788 -758919 52685 119330
40786A19330m42790R1689Q61500R30808M83892P5973k78239o53887o87455j57353
$$ 119330 -323460 -231771 629729 1560537 2044429 2120402 1842163 1188276 500821 343468
40776C43468M48667N11207R7097k05011m8646L42304M83308J50785l40340m66224
$$ 343468 792135 1303342 1400439 1195428 1146782 1489086 1972394 2123179 1782839 1316615
40766A316615j98679r7209m50666p15712k77039N52826Q83595M18572k89529o38134
$$ 1316615 1117936 1020727 570061 -145651 -422690 130136 1013731 1432303 1142774 504640
40756E04640n11460j21882J98604J38286k52660n04399l45555p6322M0071K60974
$$ 504640 -6820 -128702 69902 208188 -44472 -548871 -894426 -970748 -930677 -669703
40746f69703O81292O57262k33480j126541q18453M64202J313427J048126L03500
$$ -669703 11589 668851 435371 -691170 -1509623 -1045421 268006 1316132 1619632
40737A619632k53327o49984q95516o56036O020M87619N58755N74563N63172R8385
$$ 1619632 1366305 716321 -179195 -835231 -829211 -341592 217163 791726 1354898 1453283
40727A453283o02577n65009L93123J037133M15872o90505r23544k53442K55599
$$ 1453283 850706 285697 678820 1715953 2131825 1441320 517776 264334 519933
40718E19933J11015k02541k73958k68368l28677k24680J85752O08162O32872J83529
$$ 519933 630948 428407 154449 -113919 -442596 -667276 -481524 126638 759510 943039
40708I43039m32069p86739o52850j45757M39988Q52785Q57219K66502o30456r60912
$$ 943039 510970 -275769 -928619 -1074376 -634388 218397 1075616 1342118 711662 -249250
40698b49250k20379Q25155R77404K95620k5591L99542N10393l62184j193330p74556
$$ -249250 -469629 355526 1332930 1628550 1602959 2002501 2512894 2150710 957380 182824
40688A82824L53405P04015P4313l46198J9626L15196k28213r65582p17868N32107
$$ 182824 536229 1240244 1314557 968359 987985 1303181 1074968 109386 -608482 -76375
40678g6375J528279J274472J77928n70197m86095k01666l33450n55060k93002
$$ -76375 1451904 2726376 2904304 2334107 1848012 1646346 1312896 757836 464834
40669D64834J65926J13155l16555l67713p5088k16145o90670l82994Q12466J329862
$$ 464834 630760 743915 427360 59647 -15441 -231586 -922256 -1305250 -492784 837078
40659H37078K84567r02127o16630L79556K60403p78327q03917O70549J821496
$$ 837078 1121645 219518 -397112 -17556 242847 -535480 -1339397 -668848 1152648
40650A152648J228344k31075r05699n16614M2220J63854p690r1748Q8750L41155
$$ 1152648 2380992 2149917 1244218 727604 769824 933678 925988 834240 922990 1264145
40640A264145K50520k16643m66134j62174L3501n38849j206459q07518M06531
$$ 1264145 1514665 1298022 831888 669714 703215 164366 -1042093 -1849611 -1443080
40631a443080J105620R89511R44651J039788K82132j152474j494346j70376R20770
$$ -1443080 -337460 652051 1596702 2636490 2918622 1766148 271802 101426 1022196
40622A022196L14521o37244j12978R99772N86549j032737j496644j46384J100583
$$ 1022196 1336717 699473 586495 1586267 2172816 1140079 -356565 -502949 597634
40613E97634Q51558j4042k94537k05521k85020j96075L06392M95793j31681p84696
$$ 597634 1449192 1435150 1140613 935092 650072 453997 760389 1256182 1124501 339805
40603C39805n66993Q1495J83410k05742k79982J45416N36265N90339M22283P2393
$$ 339805 -227188 -145693 37717 -168025 -448007 -302591 233674 824013 1246296 1318689
40593A318689l93053n66760k28756J04069r3188m15941j84152K88420J30215n29519
$$ 1318689 925636 358876 130120 234189 141001 -274940 -459092 -170672 -40457 -569976
40583e69976o11224J77419Q04554M93005j94246l90751j42143Q7093L30552P32288
$$ -569976 -1181200 -1003781 -199227 293778 99532 -291219 -433362 -346269 -15717 716571
40573G16571Q67522L51405l17409m41451l09879o86599j302468j013187L82052
$$ 716571 1584093 1935498 1618089 1176638 866759 180160 -1122308 -2135495 -1753443
40564a753443J565323J403761L77714k74238j64618J63670K81423K46610J52099
$$ -1753443 -188120 1215641 1593355 1319117 1154499 1318169 1599592 1846202 1998301
40555A998301m0006k46107l18369l32513m51352n66550m29555p4614K27857L74622
$$ 1998301 1958295 1712188 1393819 1061306 609954 43404 -386151 -460765 -232908 141714
40545A41714M50195M12076J30242k54274l60676m2901M02555N63929L00978j71154
$$ 141714 591909 1003985 1134227 879953 519277 476376 878931 1442860 1743838 1572684
40535A572684m50680k88163J17451L18985K32042K48102N28232O01923R1497n53492
$$ 1572684 1122004 833841 951292 1270277 1502319 1750421 2278653 2880576 2972073 2418581
40525B418581o47209l24919l17708q06295j221382j166805q31793m30776O1897
$$ 2418581 1771372 1446453 1128745 322450 -898932 -2065737 -2897530 -3328306 -3266409
40516c266409M92355N20694K11850J7781L9824l4946j64088Q6615O19231P36591
$$ -3266409 -2774054 -2253360 -2041510 -2023729 -1983905 -2018851 -2182939 -2096324 -1477093 -740502
40506g40502L35511K19608P05817Q89754P1416r38848r15694L33O46698N30009
$$ -740502 -404991 -185383 520434 1410188 1481604 542756 -372938 -372605 274093 804102
40496H04102J40331j37935l85479n16699k53252K17370L53257R4799r0529j0178
$$ 804102 944433 806498 421019 -95680 -348932 -131562 221695 316494 225965 215787
40486B15787P2662N4318J11173J86890K0896k72174k86411k2898J14930L1906
$$ 215787 288449 342767 453940 640830 661726 389552 103141 80243 195173 227079
40476B27079o51M570k40357n82360m77378Q5451M32961K00294j93048k86961j51122
$$ 227079 226428 230998 -9359 -591719 -1069097 -983646 -550685 -350391 -543439 -830400 -981522
40465i81522L3093L16672O22553O44668L99200L01924M32754L43498j03404l71037
$$ -981522 -948429 -631757 -9204 635464 1034664 1336588 1769342 2112840 2009436 1638399
40455A638399j21643J87164P2070j84699q4445K13839J86399j93892m57847l28948
$$ 1638399 1516756 1703920 1775990 1591291 1506846 1720685 1907084 1713192 1255345 926397
40445I26397L1469L42694M44501L37789J92201J70185J74067J6411j82050j70600
$$ 926397 957866 1300560 1745061 2082850 2275051 2445236 2619303 2635714 2453664 2283064
40435B283064r6611k83819n04083k27149L14646K33085n56963r82305m24900L09003
$$ 2283064 2186453 1902634 1398551 1171402 1486048 1719133 1162170 179865 -245035 63968
40425F3968L59293J86472N85721J126367P90766l06649j059375r94854o29484
$$ 63968 423261 609733 1195454 2321821 3112587 2805938 1746563 751709 122225
40416A22225l10103J80310P73516Q92295L61558k18498l03249n3790L9846k59597
$$ 122225 -187878 -7568 765948 1658243 2019801 1801303 1498054 1444264 1484110 1224513
40406A224513q19341j212081r52565q2119O05506M16209k97473n68681n8310O85994
$$ 1224513 405172 -806909 -1759474 -1841593 -1236087 -819878 -1117351 -1686032 -1744342 -1058348
40396a058348J058895Q93809K86187m36029o83044j94487M36919M57085J0072
$$ -1058348 547 894356 1180543 744514 61470 -133017 303902 760987 771059
40387G71059j73084N3682J98918J14947J34728K55857R8602k64913l31018r8721
$$ 771059 597975 651657 850575 965522 1100250 1356107 1454709 1189796 858778 760057
40377G60057p5969k44837q049O08064P22533k3921p94856p76479k67750L314l8121
$$ 760057 684088 439251 431202 1039266 1761799 1737878 943022 166543 -101207 -97893 -136014
40366a36014o549J98246L85768M61018M43911L82311L83775M02163R2950n87818
$$ -136014 -142563 55683 441451 902469 1346380 1728691 2112466 2514629 2607579 2019761
40356B019761r05571l20253L39167j14873j164052j073856L37805J162289K92455
$$ 2019761 1114190 793937 1133104 1018231 -145821 -1219677 -881872 280417 572872
40347E72872q69715o68774L97304R06789Q15237Q88439Q74303O4816r58617r52450
$$ 572872 -296843 -965617 -568313 338476 1153713 2042152 2916455 2981271 2022654 1070204
40337A070204p0343L66449o46k50900K3456J59088j50532k79823J06232M26921
$$ 1070204 999861 1366310 1365664 1114764 1138220 1297308 1146776 866953 973185 1400106
40327A400106J92131l08270o30530o67933l55336K64580N98320O8500p86087q10254
$$ 1400106 1592237 1283967 653437 -14496 -369832 -105252 493068 561568 -224519 -1034773
40317a034773K0097M86961N6541l05154J92307Q23940N53566k89701n58531n695
$$ -1034773 -1014676 -527715 -471174 -776328 -584021 239919 793485 503784 -54747 -60442
40307f0442N32930M83645J98607J78192K73664J5328n30795o74049n2089O15759
$$ -60442 472488 956133 1154740 1332932 1606596 1621924 1091129 417080 364991 980750
40297I80750K76559r21100j561411q13571L85755O75156J13477k48445q1506R2983
$$ 980750 1257309 336209 -1225202 -2038773 -1653018 -977862 -864385 -1112830 -1194336 -1101353
40287a101353J43217M23905P43020M87503j76967m23642j55189p8715l21201k76202
$$ -1101353 -958136 -534231 208789 696292 519325 95683 -59506 -138221 -459422 -735624
40277g35624K9245j41715o58101m26607O09797R86121K4127r11476n09044N25031
$$ -735624 -706379 -848094 -1506195 -1932802 -1323005 -336884 -312757 -1224233 -1733277 -1208246
40267a208246Q14410M08589J82912J64625j13063l74459j12196K84593J86336
$$ -1208246 -393836 14753 197665 362290 249227 -125232 -237428 47165 233501
40258B33501q8109M9888K41705q9095m56403j27060M26023L54211P8177M47794
$$ 233501 145392 195280 436985 347890 -108513 -235573 190450 544661 622838 1070632
40248A070632Q33236k667j433250j509523o7339Q52504J61632p41156m02771N62037
$$ 1070632 1903868 1901201 467951 -1041572 -1108911 -256407 -94775 -835931 -1238702 -676665
40238f76665Q75002N71116L26328O1534m83075p63132k91697K92500K06691j24516
$$ -676665 198337 769453 1095781 1157315 674240 -88892 -380589 -88089 118602 -5914
40228e914J10590N72250L45219l84850n62737K2422N10594M40026K70844L05702
$$ -5914 104676 676926 1022145 637295 74558 96980 607574 1047600 1318444 1624146
40218A624146J79237k56773m70749j21428L29457L42055P3179k6598P4727J50572
$$ 1624146 1803383 1546610 1075861 954433 1283890 1625945 1699124 1672526 1747253 1897825
40208A897825K25381M25347N40404K26611m09093q22308o74153j93777J47405
$$ 1897825 2123206 2548553 3088957 3315568 2906475 2084167 1410014 1216237 1363642
40199A363642J16919j57828l49721j56901M27445R59868Q59208P1232p14608p62013
$$ 1363642 1480561 1322733 973012 816111 1243556 2203424 3062632 3133864 2419256 1657243
40189A657243j36717M16164M25820J90041K23089N54558P99941O65658J31439
$$ 1657243 1520526 1936690 2362510 2552551 2775640 3330198 4130139 4795797 4927236
40180D927236o35520j257475j260083n83408J57309L07803j5364j58661P5941
$$ 4927236 4291716 3034241 1774158 1190750 1348059 1655862 1640498 1481837 1557778
40171A557778J72733k32991o97797n22334K69611Q76498O49515j73286p93916
$$ 1557778 1730511 1497520 799723 277389 547000 1423498 2073013 1899727 1105811
40162A105811p86181m58320k43253o6967L28214O76710M23246l12907o95933l52315
$$ 1105811 319630 -138690 -381943 -448910 -120696 556014 979260 666353 -29580 -381895
40152c81895Q3093K4543j40255J68311O08356M50183j54253l80412m2762K21600
$$ -381895 -298802 -274259 -414514 -246203 362153 812336 658083 277671 234909 456509
40142D56509N1549k23545l20409l32618k35384J28105M40187J33202n64804o60033
$$ 456509 508058 284513 -35896 -368514 -603898 -475793 -35606 97596 -467208 -1127241
40132a127241J89976J070478J044470L11903l07621m35178k18157R8511K37214
$$ -1127241 -937265 133213 1177683 1489586 1181965 746787 528630 627141 864355
40123H64355n333l43776j88390M23943O57591M8666p23643p33207R973P65183
$$ 864355 859022 515246 326856 750799 1408390 1457056 733413 206 10179 775362
40113G75362J018666P70315K65279j24745j20132K7229k46704q74514j033330
$$ 775362 1794028 2564343 2829622 2704877 2584745 2611974 2365270 1490756 457426
40104D57426l46332M72038O87512N59284O15554N93204k9394r13213j187848o62657
$$ 457426 111094 583132 1270644 1829928 2445482 3038686 3009292 2096079 908231 245574
40094B45574M5267L94442L03247q5512m28986k84157K52710M19138j05637n18075
$$ 245574 290841 685283 988530 903018 474032 189875 442585 861723 756086 238011
40084B38011p9248O17342N68889L6606P1788O65721P18184j32711r20692q30150
$$ 238011 158763 776105 1344994 1381600 1453388 2119109 2837293 2704582 1783890 953740
40074I53740j76940L88121O79039O42146J30075n79488p95000l36574J67812J87455
$$ 953740 776800 1164921 1843960 2486106 2616181 2036693 1241693 905119 1072931 1260386
40064A260386j10786l46621l58471j4245O89037J199809Q71318L630m13433j60040
$$ 1260386 1149600 802979 444508 430263 1119300 2319109 3190427 3194057 2780624 2620584
40054B620584l4171m14005o72951m42177k92923n22901m17689L99497R53114L71266
$$ 2620584 2586413 2172408 1499457 1057280 764357 241456 -176233 223264 1176378 1547644
40044A547644n33591m49697L23202M05082l74452p52271j34646N15101K83925
$$ 1547644 1014053 564356 887558 1292640 918188 165917 31271 546372 830297
40035H30297l79113n58805j92578J88189M10855O56343Q65244P73645L92676p29
$$ 830297 451184 -107621 -300199 -112010 298845 955188 1820432 2594077 2986753 2986024
40025B986024k61720m22486m37623k37888j9310j25879n21297o57901j39761O13121
$$ 2986024 2724304 2301818 1864195 1626307 1606997 1481118 959821 301920 162159 775280
40015G75280P36929O0628n07628q9292R13578J233324M03953o07020o99602j5465
$$ 775280 1512209 1572837 1065209 975917 1889495 3122819 3526772 2919752 2220150 2204685
40005B204685M80273L76912R1653p8586l89314r09887j020630k23931Q40491Q91466
$$ 2204685 2684958 3061870 3153523 3074937 2685623 1775736 755106 531175 1371666 2263132
39995B263132l38946j504226j160498M00863J472639J095254J70954K7802N43515
$$ 2263132 1924186 419960 -740538 -339675 1132964 2228218 2399172 2426974 2970489
39986B970489N24354l52339j002469n39828M49200P58992J45472n57164o39186
$$ 2970489 3494843 3142504 2140035 1600207 2049407 2808399 2953871 2396707 1757521
39977A757521k62216r637r7813k08617M802L99831M87581J19623k64695l13540
$$ 1757521 1495305 1485668 1387855 1179238 1184040 1583871 2071452 2191075 1926380 1612840
39967A612840l15244n84383o60351N8304J032981J002472j09269q08108j28015
$$ 1612840 1297596 713213 52862 111166 1144147 2146619 2037350 1229242 1101227
39958A101227Q81162O71079n35794j140668n01930L06908J80678n52335p82193
$$ 1101227 1982389 2653468 2117674 977006 475076 781984 962662 410327 -371866
39949c71866j37073O88740R37757O73031M99950O09111N06670j24811p60042p79305
$$ -371866 -508939 179801 1117558 1790589 2290539 2899650 3406320 3281509 2521467 1742162
39939A742162n18108o93959r71066k94893J167480J788724Q03828m37318m99189
$$ 1742162 1224054 530095 -440971 -735864 431616 2220340 3024168 2586850 2087661
39930B087661P1976N775m19330m2676Q82849R24757j46990r64173p20109j59164
$$ 2087661 2159637 2165412 1746082 1703406 2586255 3511012 3364022 2399849 1679740 1520576
39920A520576o8151k08729k28828l42580n25506j92436O77478J112841N12000
$$ 1520576 1452425 1243696 1014868 672288 146782 -45654 631824 1744665 2256665
39911B256665m39683q09334n49414p0975M37470P19207L84145k75432l21937L67361
$$ 2256665 1816982 1007648 458234 387259 824729 1543936 1928081 1652649 1330712 1698073
39901A698073O85389N0348n40829j66273M24405J12040o53418p05100k30494l14813
$$ 1698073 2383462 2433810 1892981 1726708 2151113 2263153 1609735 904635 674141 359328
39891C59328q14470m75388Q05177J550596R47241L9513J4124M74516K80714o93657
$$ 359328 -455142 -930530 -125353 1425243 2372484 2411997 2426121 2900637 3181351 2487694
39881B487694j512111j461434p10893J12173N52763O12854O09818P08031O82174
$$ 2487694 975583 -485851 -1196744 -1084571 -531808 81046 690864 1398895 2081069
39872B081069L43923m2159j53213j24073j60440k3610L85520L81064n25676j349962
$$ 2081069 2424992 2382833 2229620 2105547 1945107 1921497 2307017 2688081 2162405 812443
39862H12443p23691P98927J140172k51881j439683q59082M73863Q17359L37026
$$ 812443 88752 887679 2027851 1775970 336287 -522795 -48932 768427 1105453
39853A105453K90827O62858M93317l7895J72084R97663J036761p4664j025091
$$ 1105453 1396280 2059138 2552455 2514560 2686644 3684307 4721068 4646404 3621313
39844C621313r51659n96904o68409n49370L57900J235668J015635R5371l17709
$$ 3621313 2669654 2072750 1404341 854971 1212871 2448539 3464174 3559545 3241836
39835C241836m034K69725J52226J100j8370j25123k86683k46167j22667k13168
$$ 3241836 3237802 3507527 3659753 3660853 3642483 3517360 3230677 2984510 2861843 2648675
39825B648675l07452j2837L41191L3337p92524j130552n39124K98223O54488N57110
$$ 2648675 2341223 2328386 2669577 2702914 1910390 779838 240714 538937 1193425 1750535
39815A750535K49761k44070o30933l21225N60468R72135M12956k14832O751N33796
$$ 1750535 2000296 1756226 1125293 804068 1364536 2336671 2749627 2534795 2541546 3075342
39805C075342L00127m71575o50918r3928J90349j78933l22516L34125R98237P20293
$$ 3075342 3375469 2903894 2252976 2159048 2349397 2170464 1847948 2182073 3180310 3900603
39795C900603j53470n72063l11326n8802j89420k63706J62812Q17579J062350
$$ 3900603 3747133 3175070 2863744 2804942 2615522 2351816 2514628 3332207 4394557
39786D394557O72276K1670m01336m74007l91311k62782K4687M52118O25584K17844
$$ 4394557 5066833 5088503 4687167 4213160 3821849 3559067 3583754 4035872 4661456 4879300
39776D879300m28942n44167J25221R33261J074685M70591k65412n55677l42366
$$ 4879300 4450358 3906191 4031412 4964673 6039358 6509949 6244537 5688860 5346494
39767E346494N9062L76539N70823O42643M07891k68400j000388j081579m26365
$$ 5346494 5405556 5782095 6352918 6995561 7403452 7135052 6134664 5053085 4626720
39758D626720J49915O4331j21334L08445P70798J11846j313040j722972m82582
$$ 4626720 4776635 4840966 4719632 5028077 5798875 5910721 4597681 2874709 2392127
39749B392127Q19187O92899j23158p8513O83662Q26002K06700j3364M68377N91392
$$ 2392127 3211314 3904213 3781055 3702542 4386204 5212206 5418906 5405542 5873919 6465311
39739F465311j04842o23878k50252K48548K901n53778o42244m93000o29114o39814
$$ 6465311 6360469 5736591 5486339 5734887 5737788 5184010 4541766 4048766 3419652 2779838
39729B779838M7430P86321N17280l71517m45573N40008J223447O96847l27836
$$ 2779838 2827268 3613589 4130869 3759352 3313779 3853787 5077234 5774081 5446245
39720E446245q51449q72574p28725k86761L84128N18531j62095n88053J85170
$$ 5446245 4594796 3722222 2993497 2706736 3090864 3609395 3447300 2859247 3044417
39711C044417J291330J177011N630n70198N815M21967k74602j138099q50945L17709
$$ 3044417 4335747 5512758 5518388 4948190 4954005 5375972 5101370 3963271 3112326 3430035
39701C430035J109780J064062O39897J04133n77937j020854o93842J08759N26570
$$ 3430035 4539815 5603877 6243774 6347907 5769970 4749116 4055274 4164033 4690603
39692D690603M13460M52573Q76017J023689M94476j59685l82995m63104p85736
$$ 4690603 5104063 5556636 6432653 7456342 7950818 7791133 7408138 6945034 6159298
39683F159298r34574l84151L69461L48884l79503o76555M0243R79291J130775
$$ 6159298 5224724 4840573 5210034 5558918 5179415 4502860 4543103 5522394 6653169
39674F653169N50852j3548k54986l93867m23320m0209O05654P77852J19745o93565
$$ 6653169 7204021 7190473 6935487 6541620 6118300 6078091 6683745 7461597 7581342 6887777
39664F887777p34223k6564M99910K02268n64102r75843o15463K70318J032726
$$ 6887777 6153554 6126990 6626900 6829168 6265066 5289223 4673760 4944078 5976804
39655E976804J029098J51408q65334j039852k87095M36141M23186J54158M19247
$$ 5976804 7005902 7157310 6291976 5252124 4965029 5401170 5824356 5978514 6397761
39646F397761R79620R30723K09750k07929K19861P80901N73349k42783p85751
$$ 6397761 7377381 8308104 8517854 8309925 8529786 9310687 9884036 9641253 8855502
39637H855502o28680j05930L14001M67811L85891J25248k23901n10344n16332
$$ 8855502 8226822 8120892 8434893 8902704 9288595 9413843 9189942 8679598 8163266
39628H163266m3641P75461J302639R36191o4683p28402n38083k708K03205J52039
$$ 8163266 8119625 8895086 10197725 11133916 11069233 10340831 9802748 9800040 10003245 10155284
39618A0155284K48561L63951P6842m29835m57041J62511P34104O46664J70097
$$ 10155284 10403845 10767796 10844638 10414803 9957762 10120273 10854377 11501041 11671138
39609A1671138j4742K46236N09381M64440L22268L70470M58366K34095k14046
$$ 11671138 11656396 11902632 12412013 12876453 13198721 13569191 14027557 14261652 14047606
39600A4047606l63844l8508K27393l9267m34267j94523O12796J100012Q39981
$$ 14047606 13683762 13645254 13872647 13833380 13399113 13204590 13817386 14917398 15757379
39591A5757379M47526N75256R23809P43660m7187p47005p10580L1317Q68567J139784
$$ 15757379 16204905 16780161 17703970 18447630 18400443 17653438 16942858 16974175 17842742 18982526
39581A8982526P54869L85218P19258J467757J604380P55121k65297o20818n01967
$$ 18982526 19737395 20122613 20841871 22309628 23914008 24669129 24403832 23783014 23281047
39572B3281047n06174n87615l26158J72620L78015J18361l07510n79759m58796
$$ 23281047 22774873 22187258 21861100 22033720 22411735 22530096 22222586 21642827 21184031
39563B1184031K02078J033601J184233M00456l79329k20871M91384P72959N92817
$$ 21184031 21386109 22419710 23603943 24004399 23625070 23404199 23895583 24668542 25261359
39554B5261359O61303J003651R40889M00297P2516J95872K84513J99241M06798
$$ 25261359 25922662 26926313 27867202 28267499 28340015 28535887 28820400 29019641 29426439
39545B9426439R60649J266195J119749R81152R85930P66556N08932R44869J863964
$$ 29426439 30387088 31653283 32773032 33754184 34740114 35506670 36015602 36960471 38824435
39536C8824435J979299R75484L43742J171866K350567K313276J543201J695879
$$ 38824435 40803734 41779218 42122960 43294826 45645393 47958669 49501870 51197749
39528E1197749K810231L199581K111919Q64533Q87265J903675K720050K913812
$$ 51197749 54007980 57207561 59319480 60184013 61071278 62974953 65695003 68608815
39520F8608815K963927L229335L548632L712401L807089M023664M378776M730655
$$ 68608815 71572742 74802077 78350709 82063110 85870199 89893863 94272639 99003294
39512I9003294N018969N411264O109494O994389P621914P694165P444471P467652
$$ 99003294 104022263 109433527 115543021 122537410 130159324 137853489 145297960 152765612
39504A52765612Q218788R637880J1111385J1881804J1761575J1387818J1474730
$$ 152765612 160984400 170622280 181733665 193615469 205377044 216764862 228239592
39497B28239592J1945871J2240456J2296334J2528129J2852372J2590544J1553404
$$ 228239592 240185463 252425919 264722253 277250382 290102754 302693298 314246702
39490C14246702J0368353R381060Q105862O257014M417281K982780J310960j158703
$$ 314246702 324615055 333996115 342101977 348358991 352776272 355759052 357070012 355911309
39482C55911309l668501n128681n812837o859964q375119r288773r117843q703117
$$ 355911309 352242808 347114127 341301290 334441326 326066207 316777434 307659591 298956474
39474B98956474q935704r681635j0309063j0548361j0482530j0247659j0044788
$$ 298956474 290020770 280339135 270030072 259481711 248999181 238751522 228706734
39467B28706734j0046063j0132781j0078603r978976j0048699j0053278r505941
$$ 228706734 218660671 208527890 198449287 188470311 178421612 168368334 158862393
39460A58862393q453370p520180p119543p105752p192104p180047o807811n967807
$$ 158862393 150409023 142888843 135769300 128663548 121471444 114291397 107483586 101515779
39452A01515779n085570m693586m630856m283718l594678l116576l037993k952289
$$ 101515779 96430209 91736623 87105767 82822049 79227371 76110795 73072802 70120513
39444G0120513k731697k803036l281299l604564l386003k929736k542326k046995
$$ 70120513 67388816 64585780 61304481 57699917 54313914 51384178 48841852 46794857
39436D6794857j410522j131837j443988j757446j536559j195921j409805j938613
$$ 46794857 45384335 44252498 42808510 41051064 39514505 38318584 36908779 34970166
39428C4970166j936724j250175o68310q38467j470151j755305j270551l70721
$$ 34970166 33033442 31783267 31114957 30276490 28806339 27051034 25780483 25409762
39420B5409762J69330q1289p50037j092430q69327n01902l46270k83328j89109
$$ 25409762 25579092 25497803 24747766 23655336 22786009 22284107 21937837 21654509 21465400
39411B1465400k79706o40725q67601o10136j21719J63871K61951L69152K94571
$$ 21465400 21185694 20544969 19677368 19067232 18945513 19109384 19371335 19740487 20035058
39402B0035058k48426r59040j157306o58207L8930M25428M12052R8629m00980
$$ 20035058 19786632 18827592 17670286 17012079 17051009 17476437 17888489 17987118 17586138
39393A7586138p97043p19263k06632J70400p2449p13731j018512n35940M04198
$$ 17586138 16789095 16069832 15863200 16033600 15961151 15247420 14228908 13692968 14097166
39384A4097166J031144R27491L91838k7018j95190l89487p37857r95773r23639
$$ 14097166 15128310 16055801 16447639 16420621 16225431 15835944 15098087 14102314 13178675
39375A3178675n89609k07056P0017J25612n4857k34956j53403N8374N5709j20774
$$ 13178675 12589066 12382010 12452027 12577639 12522782 12287826 12134423 12192797 12248506 12127732
39365A2127732j50141j69242o55833j335065j128206J87906J161366N10926q76196
$$ 12127732 11977591 11808349 11152516 9817451 8689245 8877151 10038517 10549443 9673247
39356I673247j092578p111O23514n4567p39355k25803N62188J09751j082035j102689
$$ 9673247 8580669 8573558 9197072 9142505 8403150 8177347 8739535 8849286 7767251 6664562
39346F664562M24068J673141J237751j1377m69153q7768J4044m36907n96279j24426
$$ 6664562 7088630 8761771 9999522 9988145 9518992 9431224 9445268 9008361 8412082 8287656
39336H287656J97597j88812o72663m46853K94433P67821O77850K51602l48820
$$ 8287656 8485253 8296441 7623778 7176925 7471358 8239179 8917029 9168631 8819811
39327H819811r61294j129971o19075Q829M1204l57074m89630k69472j42013m3173
$$ 8819811 7858517 6728546 6109471 6118300 6159504 5802430 5312800 5043328 4901315 4858142
39317D858142M87027J103946P68821n70428j530580j129528r3083L94933L30521
$$ 4858142 5345169 6449115 7217936 6647508 5116928 3987400 3894317 4289250 4619771
39308D619771L71974M88234K51147n7663J59879N81080K97456o59644j232704
$$ 4619771 4991745 5479979 5731126 5673463 5833342 6414422 6711878 6052234 4819530
39299D819530q96062k91589p8881r4704j2362K2717j05419p5829K39497L67563
$$ 4819530 3923468 3631879 3552998 3458294 3445932 3468649 3363230 3287401 3526898 3894461
39289C894461L3049k16922J20945N03413O0314r48216j330681o35879K68176N33094
$$ 3894461 3927510 3710588 3831533 4334946 4395260 3447044 2116363 1480484 1748660 2281754
39279B281754M20588N60615Q09417O01710M5849j92023n067j4390m84090q38380
$$ 2281754 2702342 3262957 4072374 4674084 4719933 4527910 4522843 4508453 4024363 3185983
39269C185983n95194j16142M5193j8446M6984J06754j40855m26841k42729K74476
$$ 3185983 2590789 2474647 2519840 2501394 2548378 2655132 2514277 2087436 1844707 2119183
39259B119183N18915L76581K93658M40494N36808N04327N48921N58393J89412
$$ 2119183 2638098 3014679 3308337 3748831 4285639 4789966 5338887 5897280 6086692
39250F086692l71345n37597l22546l46649o92467p06430k13065R2092j17685k03841
$$ 6086692 5715347 5177750 4855204 4508555 3816088 3109658 2896593 2988685 2871000 2667159
39240B667159K19367M91994Q2795l78169j25885M75051O16583L00939j6984l66925
$$ 2667159 2886526 3378520 3461315 3083146 2957261 3432312 4048895 4349834 4332850 3965925
39230C965925q57959r61337k53658O42670Q86832O69910O11108N07322j11652
$$ 3965925 3107966 2146629 1892971 2535641 3422473 4092383 4703491 5210813 5099161
39221E099161p27813n04892J73695K52952j95935k02497K79114L55107m4917m3720
$$ 5099161 4371348 3866456 4040151 4293103 4097168 3894671 4173785 4528892 4483975 4440255
39211D440255M10271L41468l53878n38787O7023J60975q66498j536988m39013
$$ 4440255 4850526 5191994 4838116 4299329 4366352 4527327 3660829 2123841 1684828
39202A684828J444056J986895P35999q29978j357527p98944J31483O86596M45891
$$ 1684828 3128884 5115779 5851778 5021800 3664273 2865329 2996812 3683408 4129299
39193D129299k91656o28069j24155N53537N51817P895k86356o5480J94990P2229
$$ 4129299 3837643 3209574 3085419 3638956 4190773 4198668 3912312 3846832 4041822 4114051
39183D114051l04789m85282j66893M21544N59469j71226j120939j181410k41581
$$ 4114051 3809262 3323980 3157087 3578631 4138100 3966874 2845935 1664525 1422944
39174A422944O61640P87754M80112K89085K19250K03259L88609N23862M5555p41871
$$ 1422944 2084584 2872338 3352450 3641535 3860785 4064044 4452653 4976515 5022070 4280199
39164D280199p00839K74189O76047l73168j521807j115535L11731R98148O23542
$$ 4280199 3579360 3853549 4529596 4156428 2634621 1519086 1830817 2828965 3452507
39155C452507L22856M87691L32975l77499p99392m69078L9384K67182N32965J028451
$$ 3452507 3775363 4263054 4596029 4218530 3419138 2950060 2989444 3256626 3789591 4818042
39145D818042J227057O94633j92399p34994o51167j57166K66973J89022k81449
$$ 4818042 6045099 6739732 6547333 5812339 5161172 5004006 5270979 5460001 5178552
39136E178552m76912j02013K04451j16000m73345k3168Q05775Q65461J26884l31882
$$ 5178552 4701640 4599627 4804078 4688078 4214733 4191565 4997340 5862801 5989685 5657803
39126E657803j08535J18563Q0608L86865J133260J401798P44627j1623j14104
$$ 5657803 5549268 5667831 5748439 6135304 7268564 8670362 9414989 9403366 9289262
39117I289262L1156j53883l54900j38751P0999k66947p50065o29051J3917N06215
$$ 9289262 9320418 9166535 8811635 8672884 8743883 8476936 7726871 7097820 7111737 7617952
39107G617952N97315M81608J97054k48475m62348j03930M79948O77238M53484
$$ 7617952 8215267 8696875 8893929 8645454 8183106 8079176 8559124 9236362 9689846
39098I689846K18081J13117J5671j0072J20197J10890l05114p19035m69652L55540
$$ 9689846 9907927 10021044 10036715 10026643 10146840 10257730 9952616 9233581 8763929 9119469
39088I119469R80126R93257P22585N04581K48355m5605N3436P66011J495336J414543
$$ 9119469 10099595 11092852 11815437 12320018 12568373 12522768 12576204 13342215 14837551 16252094
39078A6252094N84822J51L71604J238051J606398J247268Q69342J017670J388247
$$ 16252094 16836916 16837067 17208671 18446722 20053120 21300388 22169730 23187400 24575647
39069B4575647J511264J543065J820219K055650J748151J184744J169079J741134
$$ 24575647 26086911 27629976 29450195 31505845 33253996 34438740 35607819 37348953
39061C7348953K056462J730154J384571J445739J295922L43278p72067r89698
$$ 37348953 39405415 41135569 42520140 43965879 45261801 45605079 44833012 43843314
39053D3843314m60465l40237r98485j439696q63497o571k24759j583813k664940
$$ 43843314 43382849 43042612 42044127 40604431 39740934 39734363 39509604 37925791 35260851
39044C5260851k400729j433900j140683j726365k109557j667561j128297j279124
$$ 35260851 32860122 31426222 30285539 28559174 26449617 24782056 23653759 22374635
39036B2374635j666127j430312q24270p98365j364459j556824j042946o21389
$$ 22374635 20708508 19278196 18453926 17655561 16291102 14734278 13691332 13069943
39028A3069943q48946j213347j102078o97693m11887k11818k4049r3955m19753
$$ 13069943 12220997 11007650 9905572 9207879 8795992 8584174 8560125 8466170 8046417
39019H046417m98122j54595L3354l20768p16823o00721k26967m4398J13292M70024
$$ 8046417 7548295 7393700 7427054 7106286 6389463 5788742 5561775 5517377 5630669 6100693
39009F100693N57997q2253q94568r19119j66122M37089L22820j90636n36142m69653
$$ 6100693 6658690 6576437 5681869 4762750 4596628 5033717 5356537 5165901 4629759 4160106
38999D160106r5328K40167K24427K7493J32720M93185M53101j39496n07061j67653
$$ 4160106 4064778 4304945 4529372 4556865 4689585 5182770 5635871 5496375 4989314 4821661
38989D821661K51209J38686m6563K27614M13466r8742o12442j77194O19232M69985
$$ 4821661 5072870 5211556 5164993 5392607 5806073 5707331 5094889 4917695 5536927 6006912
38979F006912m70271q77427m78760k35103l58769n278Q14274Q80007j05032p56177
$$ 6006912 5536641 4659214 4180454 3945351 3586582 3581304 4395578 5275585 5170553 4414376
38969D414376j88500N88369M18723k41035m17589k70694m18616n89029k33711
$$ 4414376 4225876 4814245 5232968 4991933 4574344 4303650 3885034 3296005 3062294
38960C062294K37844J01331l35305k18065M00861P07469M59338J55944O1253l419
$$ 3062294 3300138 3401469 3066164 2848099 3248960 3956429 4415767 4571711 4632964 4629545
38950D629545j4750K30033N14648M29953J64444L15802Q97910J237687R51663
$$ 4629545 4614795 4844828 5359476 5789429 5953873 6269675 7167585 8405272 9356935
38941I356935M27957K07570L50821N24357L77633j78869p86777q34026j49915
$$ 9356935 9784892 9992462 10343283 10867640 11245273 11066404 10279627 9445601 9295686
38932I295686O49205Q55372N21793K30781K15416J87975p7786m66918p84335r03408
$$ 9295686 9944891 10800263 11322056 11552837 11768253 11956228 11878442 11411524 10627189 9723781
38922I723781p04330k23104J82942J32262l54395r27426j258882j137078n02873
$$ 9723781 9019451 8796347 8979289 9111551 8757156 7829730 6570848 5433770 4930897
38913D930897L14394P00090M43951K9851j07483k12667o17995r48980o06010K20329
$$ 4930897 5245291 5945381 6389332 6419183 6311700 6099033 5481038 4532058 3926048 4146377
38903D146377P42211O61913L74984J49747j83387o59354r49133q74612o51248
$$ 4146377 4888588 5550501 5925485 6075232 5891845 5232491 4283358 3408746 2757498
38894B757498m75433k92134o1335J34425K83896L77329K07450k98593o38056k23502
$$ 2757498 2282065 1989931 1928596 2063021 2346917 2724246 2931696 2633103 1995047 1771545
38884A771545O60914J030288M77537l08007n25425k22506L4818J982j05103l2983
$$ 1771545 2432459 3462747 3940284 3632277 3106852 2884346 2919164 2921146 2816043 2783060
38874B783060K44168N23496N02961R3557l67795m67190k52492r4998o2065J31276
$$ 2783060 3027228 3550724 4053685 4147242 3779447 3312257 3059765 2964767 2902702 3033978
38864C033978N31251P98394P45714N55188L54643O5045k12701j82313J17903L08223
$$ 3033978 3565229 4363623 5109337 5664525 6019168 6084213 5871512 5689199 5807102 6115325
38854F115325L57823O60754J174593J199977M76036j72840Q2197Q87893J337714
$$ 6115325 6473148 7133902 8308495 9508472 9984508 9811668 9893865 10781758 12119472
38845A2119472J354586J567654K032824K058078J427064R33797J308171K218180
$$ 12119472 13474058 15041712 17074536 19132614 20559678 21493475 22801646 25019826
38837B5019826K817124K856860K694432K409517J568418J0243j632716k586994
$$ 25019826 27836950 30693810 33388242 35797759 37366177 37376420 35743704 33156710
38829C3156710k858808l039873l284582l078308k216063j398998j345703j754474
$$ 33156710 30297902 27258029 23973447 20895139 18679076 17280078 15934375 14179901
38821A4179901j832216j556757j558310j833681j579795n67496K54660P4248n94804
$$ 14179901 12347685 10790928 9232618 7398937 5819142 5251646 5506306 5580554 4985750
38812D985750p08788j55916K97272J86191k15457m68856m05606r4207J90767J11428
$$ 4985750 4276962 4121046 4418318 4604509 4389052 3920196 3514590 3420383 3611150 3722578
38802C722578k68093m22342j43155J6306l98040q57315n55945K95499P30933M50113
$$ 3722578 3454485 3032143 2888988 2905294 2507254 1649939 1093994 1389493 2120426 2570539
38792B570539R1245O2199J6890k72863l78353J8041M82239M76550J79682J38562
$$ 2570539 2661784 2723983 2740873 2468010 2089657 2107698 2589937 3066487 3246169 3384731
38782C384731M00356M74255M6892n89079q06271k54715O94960J174890P51180
$$ 3384731 3785087 4259342 4306234 3717155 2910884 2656169 3351129 4526019 5277199
38773E277199N6693Q5416Q86021J489063J213012M46312q7958k54458l46507n20471
$$ 5277199 5333892 5419308 6305329 7794392 9007404 9453716 9365758 9111300 8764793 8244322
38763H244322p92489j159798j335610q35098K05035P73508J73815q98297j174715
$$ 8244322 7451833 6292035 4956425 4121327 4326362 5099870 5273685 4375388 3200673
38754C200673m85203J48441J7654m53662n43775k01130J59940L46541M52595M90989
$$ 3200673 2715470 2863911 2881565 2427903 1884128 1682998 1842938 2189479 2642074 3133063
38744C133063L44466L4933k01781j64808O6753J97303N7627j72968k35329k36858
$$ 3133063 3477529 3512462 3310681 3145873 3212626 3409929 3467556 3294588 3059259 2822401
38734B822401n10361r33337q20695J54136J267041J466614O29038l78625p76218
$$ 2822401 2312040 1378703 558008 712144 1979185 3445799 4074837 3696212 2919994
38725B919994n30556k6080L68845L72384m4140m51748l93774r4088j97624o85955
$$ 2919994 2389438 2363358 2732203 3104587 3060447 2608699 2214925 2120837 1923213 1237258
38715A237258p13067J41886J077626J059499J55472p07302r79426q21651m34396
$$ 1237258 524191 666077 1743703 2803202 2958674 2251372 1271946 450295 15899
38706A5899J55918O12907L70126m84077r74048l53851Q66705J460736Q82229k60291
$$ 15899 171817 784724 1154850 670773 -303275 -657126 209579 1670315 2552544 2292253
38696B292253j011745r46045k63390N40813R55433P57377K73750R1017K86819
$$ 2292253 1280508 334463 71073 611886 1567319 2324696 2598446 2689463 2976282
38687B976282K56904l58453r19886n73271L63231O12385k62773j097306p21717
$$ 2976282 3233186 2874733 1954847 1381576 1744807 2357192 2094419 997113 275396
38678B75396L38534O10718k25596r67957o41778K91046P85519N52972P8545j93995
$$ 275396 613930 1224648 999052 31095 -610683 -319637 465882 1018854 1097399 903404
38668I03404j76480O2856L41980L64586L6685l23696l51208p2645K33428M26729
$$ 903404 726924 789780 1131760 1496346 1533031 1209335 858127 785482 1018910 1445639
38658A445639M95747L34812j48919p55094j052221p36432J21559J064848J462869
$$ 1445639 1941386 2276198 2127279 1372185 319964 -416468 -294909 769939 2232808
38649B232808R94321L7303o56691p57499n36810k53232J16842L89906J16431n57684
$$ 2232808 3227129 3264432 2607741 1850242 1313432 1060200 1177042 1566948 1683379 1125695
38639A125695o64885K46848J130224P23348n59361j112891m01588M33986M01553
$$ 1125695 460810 707658 1837882 2561230 2001869 888978 487390 921376 1322929
38630A322929p5226k03299j01004k51886m31904j09527M99404O52237J68394m28123
$$ 1322929 1247703 1044404 943400 691514 259610 150083 649487 1301724 1470118 1041995
38620A041995p13761o34705j16496Q09548J480624J050001k68822j143886p55956
$$ 1041995 328234 -306471 -422967 386581 1867205 2917206 2648384 1504498 748542
38611G48542J22558K71072k42270k80918N71900J341169J029465l7268p30852
$$ 748542 871100 1142172 899902 618984 1190884 2532053 3561518 3524250 2793398
38602B793398n63783l6930K43524J83110p7671m78298q48781q27590k93003L62702
$$ 2793398 2229615 2192685 2436209 2619319 2541648 2063350 1214569 386979 93976 456678
38592D56678O58573N43061K74200j293k87049n32381o57009o48520m43201N7017
$$ 456678 1115251 1658312 1932512 1931219 1644170 1111789 454780 -193740 -636941 -579924
38582e79924O12887O39453r949n66919k41567O11845R19522M04017j20252p7106
$$ -579924 32963 672416 662467 95548 -146019 465826 1385348 1789365 1669113 1592007
38572A592007J06470o1259k41300M3636M27160K39011l01866l20609L33723P87464
$$ 1592007 1698477 1637218 1395918 1439554 1866714 2105725 1803859 1483250 1816973 2604437
38562B604437M38386j66340j88375K81988M70984J42028j18578P6006K49752j40741
$$ 2604437 3042823 2876483 2688108 2970096 3441080 3583108 3464530 3540536 3790288 3649547
38552C649547o77099m54843M70783R07345J45795r00731q42220K96661J147083
$$ 3649547 2972448 2517605 2988388 3895733 4041528 3140797 2298577 2595238 3742321
38543C742321Q60328O9119j87159K30882O96949P25694L34457j35352k17184L52475
$$ 3742321 4602649 4671768 4484609 4715491 5412440 6138134 6472591 6337239 6120055 6472530
38533F472530J235336J738483J669192J528126J606846J433556N68310n24138
$$ 6472530 7707866 9446349 11115541 12643667 14250513 15684069 16252379 15728241
38525A5728241r98468p37176l59212l24803n79472r29933j220615j222486q63789
$$ 15728241 14729773 13992597 13633385 13308582 12729110 11799177 10578562 9356076 8492287
38516H492287n29171o60724j101415j282617j013453o15683l07802L1081M18507
$$ 8492287 7963116 7302392 6200977 4918360 3904907 3289224 2981422 3012503 3431010
38507C431010N65153K76709k61431p08579q44203o35975l05274k52052n84713
$$ 3431010 3996163 4272872 4011441 3302862 2458659 1822684 1517410 1265358 680645
38498F80645q17881m33647L38137P63793O02169L50453M32688O42527N62823J43639
$$ 680645 -137236 -570883 -232746 531047 1133216 1483669 1916357 2558884 3121707 3265346
38488C265346l21529n17011l15689P5605K04110q3007k82216J44311Q92993J118179
$$ 3265346 2943817 2426806 2111117 2186722 2390832 2307825 2025609 2169920 3062913 4181092
38478D181092N68783j89194o75693q91192p44481Q469R34141R59031j52942j138758
$$ 4181092 4749875 4560681 3884988 2993796 2249315 2257784 3191925 4150956 3998014 2859256
38468B859256q27964K23175N93303M3078l52225K4312M92946K48338m54911p33698
$$ 2859256 2031292 2254467 2847770 2890848 2538623 2562935 3055881 3304219 2849308 2115610
38458B115610k31928N43834Q34096L76365l19222m34148K40979R83846J039930
$$ 2115610 1883682 2427516 3261612 3637977 3318755 2884607 3125586 4109432 5149362
38449E149362O32548N45218Q39112P59385O1547m01443R7989J012479J272713
$$ 5149362 5781910 6327128 7166240 7925625 7987172 7585729 7683718 8696197 9968910
38440I968910P53316K43571K35475N52772J063456J855819K582430K541293J810215
$$ 9968910 10722226 10965797 11201272 11754044 12817500 14673319 17255749 19797042 21607257
38431B1607257J516296K399700L756686M508611M771612N495298O914605Q358529
$$ 21607257 23123553 25523253 29279939 33788550 38560162 44055460 50970065 59328594
38423E9328594R454583J0462892J1278860J1088088R366450O465348K933518r18429
$$ 59328594 68783177 79246069 90524929 101613017 110979467 117444815 120378333 119459904
38415A19459904m451633o654378p299300p411209p947311q675232q940737q745871
$$ 119459904 115008271 108353893 101054593 93643384 85696073 77020841 68080104 59334233
38407E9334233q308324p371267n912312m791248m577941m415878l335732k081023
$$ 59334233 51025909 43654642 37742330 32951082 28373141 23957263 20621531 18540508
38399A8540508k058983k853925k595035q57107O03963M51164n26786r98430r37164
$$ 18540508 16481525 13627600 11032565 10175458 10779421 11230585 10703799 9705369 8768205
38390H768205r74847j076787q95426o31461o11452n98275k63246J74773L54245
$$ 8768205 7793358 6716571 5821145 5189684 4578232 3979957 3716711 3891484 4245729
38381D245729K82841K7203m60409q46765n46695K39420M89914j66831q59663q37535
$$ 4245729 4528570 4555773 4095364 3248599 2701904 2941324 3431238 3264407 2404744 1567209
38371A567209m14782k7635M83745R58979N66042o79467j289701l64335Q75447
$$ 1567209 1152427 1124792 1608537 2567516 3133558 2454091 1164390 800055 1675502
38362A675502R10287J75138K328L18832J12630n49323p54587n04907n36088p49388
$$ 1675502 2585789 2760927 2763255 3082087 3194717 2645394 1890807 1385900 849812 100424
38352A00424m52211J70169M09604M74717R24235J107078M3225j465706j653621
$$ 100424 -351787 -181618 227986 702703 1626938 2734016 2777241 1311535 -342086
38343c42086n76188N4441j87658J9326R94083J275085K78696n76949l63982j04151
$$ -342086 -918274 -863833 -1051491 -1032165 -38082 1237003 1515699 938750 574768 470617
38333D70617n95472q36614l088Q62946O80835K04781M51605P57680J50494o49358
$$ 470617 -124855 -961469 -964557 -101611 579224 784005 1235610 1993290 2143784 1494426
38323A494426m48174K60445K15230l85868m19362P1963J29486k55906k43223K22157
$$ 1494426 1046252 1306697 1521927 1136059 716697 788660 918146 662240 419017 641174
38313F41174M38109L26402L31029K61129l09527q10713l55295N89298P34207K7087
$$ 641174 1079283 1405685 1736714 1997843 1688316 877603 522308 1111606 1845813 1872900
38303A872900l39878P2693M44903K54849p0760j93136k42551o4137O22484J211439
$$ 1872900 1533022 1605715 2050618 2305467 2234707 2041571 1799020 1734883 2357367 3568806
38293C568806O84998p19451j580709j220031l48984L00503O73892O22081q2740
$$ 3568806 4253804 3534353 1953644 733613 384629 685132 1359024 1981105 1898365
38284A898365p05102r0934J293791J472305j90576j780828j445437J28629R87059
$$ 1898365 1193263 1102329 2396120 3868425 3677849 1897021 451584 580213 1567272
38275A567272N70747j40475l69145j94627R5155K92392J54473k88140n55569l20611
$$ 1567272 2138019 1997544 1628399 1433772 1528927 1821319 1975792 1687652 1132083 811472
38265H11472J63180N36528P11862N55373o2911o40602l97948L66686L67042o76102
$$ 811472 974652 1511180 2223042 2778415 2715504 2074902 1676954 2043640 2410682 1734580
38255A734580j342240o32583M36108M73087j57073k21643K56756L34224Q482J01527
$$ 1734580 392340 -240243 195865 668952 511879 290236 546992 881216 889698 991225
38245I91225N60313M80539j78927l91582K23148P90393O08004N1439l18112n37733
$$ 991225 1551538 2032077 1853150 1461568 1684716 2475109 3083113 3134552 2816440 2278707
38235B278707p17152o23611k58072j03913l55009n29106k58442J07913J00476
$$ 2278707 1561555 937944 679872 575959 220950 -308156 -566598 -458685 -358209
38226c58209j56857k25846K2334L85882O41469O38334L29900j36632n44937q03329
$$ -358209 -515066 -740912 -718578 -332696 308773 947107 1277007 1140375 595438 -207891
38216b07891p94214k52277P52007J420961R81909k07574r64784p26757m6948L88154
$$ -207891 -1002105 -1254382 -502375 918586 1900495 1692921 728137 1380 -45568 342586
38206C42586N09564M75806K60851o2513k03020r4093K2755R9200K99185M23323
$$ 342586 852150 1327956 1588807 1526294 1323274 1229181 1251936 1351136 1650321 2073644
38196B073644M5381n76553n59291K47821P93287K91338n70395o23783J33608O89918
$$ 2073644 2119025 1542472 983181 1231002 2024289 2315627 1745232 1121449 1255057 1944975
38186A944975M74262j06209m21266k66924J77338N57503N56254K07151j31655
$$ 1944975 2419237 2313028 1891762 1624838 1802176 2359679 2915933 3123084 2991429
38177B991429k92656m54097n97036l64877J67964K41911m63679j058060n99682
$$ 2991429 2698773 2244676 1647640 1282763 1450727 1692638 1228959 170899 -428783
38168d28783M40618Q05417K27807m00942m69930k32984K5308L69624N98563K30057
$$ -428783 11835 817252 1045059 644117 174187 -58797 -33489 336135 934698 1164755
38158A164755n76175r26486m02847L62076O68657N85150M22370J31915k64943
$$ 1164755 588580 -337906 -740753 -378677 289980 875130 1297500 1429415 1164472
38149A164472l42418K7148K20490k37677q20807p32138q7892L37485K51344M1046
$$ 1164472 822054 849202 1069692 832015 11208 -720930 -808822 -471337 -219993 -178947
38139a78947M7030K76894O66083J024273R11541J81205n42353n72252j53214l4637
$$ -178947 -131917 144977 811060 1835333 2746874 2928079 2385726 1813474 1660260 1625623
38129A625623k40447j40456K98027L24685l13273q39731o10984j8970K51081J65466
$$ 1625623 1385176 1244720 1542747 1867432 1554159 714428 103444 84474 335555 501021
38119E01021P962k35625n15738l38784M70388J081588O19760m52790q36960k01780
$$ 501021 508983 273358 -242380 -581164 -110776 970812 1590572 1137782 300822 99042
38109I9042M43350L08332j55827j81931J33166J93992l5697n7734K47298L89963
$$ 99042 542392 850724 694897 512966 646132 840124 804427 746693 993991 1383954
38099A383954M4869m42794n58979k94800l043K06252M90975P16541M05229m53776
$$ 1383954 1428823 986029 427050 132250 129207 335459 826434 1542975 1948204 1494428
38089A494428r99984m92346N40401Q87984L58259j8690K70579L23711o27753j688548
$$ 1494428 494444 2098 542499 1430483 1788742 1770052 2040631 2364342 1736589 48041
38079D8041j459478j77560O22937L80294L5789J97826K53415j83605l37768L15072
$$ 48041 -1411437 -1588997 -966060 -585766 -549977 -352151 -98736 -282341 -620109 -305037
38069c05037Q58259L28317n70531m99673L21973M43011m75397j121935n71628
$$ -305037 553222 881539 311008 -188665 133308 576319 100922 -1021013 -1592641
38060a592641M42698Q10435N49292L47348L57483K02683k36027o45601o77167
$$ -1592641 -1149943 -339508 209784 557132 914615 1117298 881271 235670 -441497
38051d41497j89791O05620J058302O12787l30588o84809j45550L00084j44017
$$ -441497 -631288 -25668 1032634 1645421 1314833 630024 484474 784558 640541
38042F40541q29150o97355M0063L14649n0944j79596L03678P03856N00138J39228
$$ 640541 -188609 -885964 -845901 -531252 -582196 -761792 -458114 245742 745880 885108
38032H85108J41738K71850J48460k7829K3202J7703l64746p62704o25785r1762
$$ 885108 1026846 1298696 1447156 1419327 1442529 1460232 1095486 332782 -293003 -384765
38022c84765K83261L83055M48976L94299l9361n60345n45041j1860L45465K06811
$$ -384765 -101504 281551 730527 1124826 1085465 525120 -19921 -31781 313684 520495
38012E20495Q221Q5230J25522j87919n70541n82523k39818J87698N79330Q12032
$$ 520495 528716 613946 739468 551549 -18992 -601515 -841333 -653635 -74305 737727
38002G37727O36579J24756j61106O9587K64073k10138j000613j134872l67553
$$ 737727 1374306 1499062 1337956 1407543 1671616 1461478 460865 -674007 -1041560
37993a041560M80949O25674K22979l2846J66614N02031N39772K59930K1356J6806
$$ -1041560 -560611 65063 288042 255196 421810 923841 1463613 1723543 1744899 1761705
37983A761705q6402o69737j364532j269518k19942P44414P03198J33976J24145
$$ 1761705 1675303 1005566 -358966 -1628484 -1848426 -1104012 -400814 -266838 -142693
37974a42693O97685Q99249M13557J4414K00913M10740O3062m69806n69388l92884
$$ -142693 554992 1454241 1867798 1882212 2083125 2493865 2556927 2087121 1517733 1124849
37964A124849m66482p09583o05940j00837L42004M67541M48088M26312L37918
$$ 1124849 658367 -51216 -657156 -757993 -415989 51552 499640 925952 1263870
37955A263870K10522K30773M29125N56844L41866k39264q78681j073646n69313
$$ 1263870 1474392 1705165 2134290 2691134 3033000 2793736 1915055 841409 272096
37946B72096K18382N16334J08296l98146m36588k04576j85490l60185l55347n6311
$$ 272096 490478 1006812 1115108 716962 280374 75798 -109692 -469877 -825224 -881535
37936h81535L86791Q42661J026403M70270o95768j352901o41027O66491J021782
$$ -881535 -494744 347917 1374320 1844590 1148822 -204079 -845106 -178615 843167
37927H43167K32494l86468j15838J70895l39407r18993m69513O17124R85595L62877
$$ 843167 1075661 689193 573355 744250 404843 -514150 -983663 -366539 619056 981933
37917I81933j50586J18421M68573J03514n65124o30593j37357P0900k41638l48808
$$ 981933 831347 949768 1418341 1521855 956731 326138 188781 259681 18043 -330765
37907c30765K10809Q41666P96234K82508O922Q108k27783o54377o18095m6829
$$ -330765 -119956 721710 1517944 1800452 1807374 1815482 1587699 933322 315227 268398
37897B68398K79846L0311n4230N19032R27417K42819r46424j279846o18130o8693
$$ 268398 548244 578555 524325 1043357 1970774 2213593 1267169 -12677 -630807 -699500
37887f99500j61281k67674M9966L61126L78287M93135Q02292O61130j52253p94898
$$ -699500 -860781 -1128455 -1078489 -717363 -339076 154059 956351 1617481 1465228 670330
37877F70330o22378k05476k44786l31671J58820O69002K40247p21597q27386K04742
$$ 670330 47952 -157524 -402310 -733981 -575161 93841 334088 -387509 -1214895 -1010153
37867a010153J098432Q65789L5411l30304M457M91370N75883R2934o26673q75466
$$ -1010153 88279 954068 989479 659175 663632 1155002 1730885 1823819 1197146 321680
37857C21680l14088L72084K59911l49854k30185P79679J253588L00061r33907
$$ 321680 7592 379676 639587 289733 59548 839227 2092815 2392876 1458969
37848A458969r57793k29837l10444j224931j361924q7041J186674J153723M57635
$$ 1458969 501176 271339 -39105 -1264036 -2625960 -2713001 -1526327 -372604 85031
37839H5031L87739P88391N60712l44770q41418m93594q4971j71901k30671K25531
$$ 85031 472770 1261161 1821873 1477103 635685 142091 57120 -114781 -345452 -119921
37829a19921O36343K78206m86622p17605l03255L231j52470k50712J57108O83738
$$ -119921 516422 794628 308006 -409599 -712854 -709623 -862093 -1112805 -955697 -271959
37819b71959O37079l8098o75343o26385P8262P82187R06526N85873M21165N74084
$$ -271959 365120 327022 -348321 -974706 -896444 -114257 792269 1378142 1799307 2373391
37809B373391N25000j2733m60015k22078K61371J28403m95510o79654k47536n3173
$$ 2373391 2898391 2885658 2425643 2203565 2464936 2593339 2097829 1418175 1170639 1117466
37799A117466m41281n63944J59869R01405O37584k14398m21758K24218P48170
$$ 1117466 676185 112241 272110 1173515 1811099 1596701 1174943 1399161 2147331
37790B147331N16215o1081m15593n66434p45948r05326q66688n82509j11037L56967
$$ 2147331 2663546 2602465 2186872 1620438 874490 -30836 -897524 -1480033 -1591070 -1234103
37780a234103M74151J22704k52942j63453J63543J11768k67971k35205M42830
$$ -1234103 -759952 -637248 -890190 -1053643 -890100 -778332 -1046303 -1281508 -838678
37771h38678R72242N98671l36981q86443o96520k47183o1224j03993R081M35605
$$ -838678 133564 732235 395254 -491189 -1187709 -1434892 -1496116 -1600109 -1591028 -1155423
37761a155423Q21261O37926j05614o60395l88608K81925L00270n15011j073186
$$ -1155423 -334162 303764 198150 -462245 -850853 -568928 -268658 -783669 -1856855
37752a856855m89022O05197Q86911J76117l52655J58504J085930J204685K91059
$$ -1856855 -2345877 -1740680 -853769 -677652 -1030307 -871803 214127 1418812 1709871
37743A709871o68676p56193j46573K84870Q9284l14275k83259K26969O45919N01121
$$ 1709871 1041195 285002 138429 423299 512583 198308 -84951 142018 787937 1289058
37733A289058l4476l66877j68455K58920L42466q1522n49064n04430J8894M15662
$$ 1289058 1254582 887705 719250 978170 1320636 1239114 690050 185620 204514 620176
37723F20176K36206k61069m10616O3240O84552P35548J05694n11788m35095J07976
$$ 620176 856382 595313 184697 247937 932489 1668037 1773731 1261943 826848 934824
37713I34824K75329j58521m45669q2987K61593k21958j044078j069031l55246
$$ 934824 1210153 1051632 605963 522976 784569 562611 -481467 -1550498 -1905744
37704a905744n1183m04999l43905N32621J079532N72610N6731M76602Q38537n7895
$$ -1905744 -1956927 -2361926 -2705831 -2173210 -1093678 -521068 -464337 12265 850802 792907
37694G92907j172902o63950Q75735J064311m22198j187738Q2933J555431J208969
$$ 792907 -379995 -1043945 -168210 896101 473903 -713835 -630902 924529 2133498
37685B133498j52748n45596M1926J01033o81620j131190o90716r3475J04360K22494
$$ 2133498 1980750 1435154 1477080 1578113 896493 -234697 -925413 -1018888 -914528 -692034
37675f92034M60134M01690r1698m07907m6904O55983J025504Q31631L38479q8456
$$ -692034 -231900 169790 78092 -329815 -376719 279264 1304768 2136399 2474878 2386422
37665B386422k50279k25063k76407m99458o56155n35515k59858m750K77333N47538
$$ 2386422 2136143 1911080 1634673 1135215 479060 -56455 -316313 -321063 -43730 503808
37655E03808M76524j3121l72332j39804K83354J84700l80407p07247m61560O2801
$$ 503808 980332 967211 594879 455075 738429 923129 542722 -164525 -626085 -563284
37645e63284N55312Q92062Q48508L18452k32169k44376K1716j82521q09160r20570
$$ -563284 -7972 884090 1732598 2051050 1818881 1574505 1596221 1413700 604540 -316030
37635c16030j29549O94868O27286o3263m39790k14330R2617P4103q8944q0851
$$ -316030 -445579 249289 876575 813312 373522 159192 251809 325912 236968 156117
37625A56117Q5952K35931L87491O58136Q37583L89216q04645j861431j630509
$$ 156117 242069 478000 865491 1523627 2361210 2750426 1945781 84350 -1546159
37616a546159j81580J010274P93708k37962o60931j39992M07753L91588L01138
$$ -1546159 -1727739 -717465 76243 -161719 -822650 -962642 -554889 -163301 137837
37607A37837O56259J049074P74360o2426o43576n06861q9424j14283o25608q72655
$$ 137837 794096 1843170 2617530 2555104 1911528 1404667 1315243 1200960 575352 -297303
37597b97303l04155N23960N28316l69422r66725l96111O70586J048223O41802
$$ -297303 -601458 -77498 450818 81396 -885329 -1281440 -610854 437369 1079171
37588A079171K05695L4419j05946j24196K10180M74492J39875k86651N0039O55213
$$ 1079171 1284866 1319285 1213339 1089143 1299323 1773815 1913690 1627039 1677078 2332291
37578B332291J95876j178376j715386p30266L04992J47545l74459m5767O84915
$$ 2332291 2528167 1349791 -365595 -1095861 -790869 -643324 -1017783 -1063550 -378635
37569c78635P83083N50592Q24609J169438O33271l07756l75514K93233L83799
$$ -378635 404448 955040 1779649 2949087 3582358 3274602 2899088 3192321 3576120
37560C576120k58531l99253K83697N27523l11031j065217o78903P5800o5357q34406
$$ 3576120 3317589 2918336 3202033 3729556 3418525 2353308 1674405 1750205 1684848 850442
37550H50442r75623j91495N98555O43786R4575m81898o20795j61049N12114O53594
$$ 850442 -125181 -316676 281879 925665 1020240 538342 -82453 -243502 268612 922206
37540I22206Q8974l78922p5398M32916J26329q30597j208419n02522L53957L88423
$$ 922206 1011180 632258 556860 989776 1116105 285508 -922911 -1425433 -1071476 -683053
37530f83053j16519k73586N7200K62597L2918k63372k45519j4054J46697J60556
$$ -683053 -799572 -1073158 -1015958 -753361 -720443 -983815 -1229334 -1243388 -1096691 -936135
37520i36135P9113q7726k51165j78301K11877O26928P11169M89329K67429J60953
$$ -936135 -857022 -944748 -1195913 -1374214 -1162337 -535409 175760 665089 932518 1093471
37510A093471J2828k04297k37804K3356K45669O5010l26663l59139J15392N32718
$$ 1093471 1106299 902002 664198 687554 933223 998233 671570 312431 427823 960541
37500I60541L37888k31645m28730r086M46653L78639J8709o7896Q1800m3833m36859
$$ 960541 1298429 1066784 638054 628968 1075621 1454260 1472969 1405073 1486873 1443040 1006181
37489A006181m46695J04676M16210j30322q79098p49358J57406O74902K17076
$$ 1006181 559486 664162 1080372 950050 70952 -678406 -521000 153902 370978
37480C70978n46650p73733m39799j9892J63327J8775l04120k93992L96893J138097
$$ 370978 -175672 -949405 -1389204 -1409096 -1245769 -1226994 -1531114 -1825106 -1428213 -290116
37470b90116Q46302l58255r65965j44515R44183P96566k49879o61148k8220N95457
$$ -290116 556186 197931 -768034 -912549 31634 828200 578321 -82827 -111047 484410
37460D84410N31304K92507L45404K86834k14364o38904m79077j58018l16833o78236
$$ 484410 1015714 1308221 1653625 1940459 1726095 1087191 608114 450096 133263 -544973
37450e44973m50974L59527Q58350N37597l5294r2881K57373L09463j01708l18914
$$ -544973 -995947 -636420 221930 759527 724233 631352 888725 1198188 1096480 777566
37440G77566J19797O74359N02865k57672n71867K2451O70326L45207p17700j311813
$$ 777566 897363 1571722 2074587 1816915 1245048 1267499 1937825 2283032 1565332 253519
37430B53519p93134K14450O41407J07142q08105j168124n51203N24810J115647
$$ 253519 -539615 -325165 316242 423384 -384721 -1552845 -2104048 -1579238 -463591
37421d63591Q61904K66786r8240k27226k92587j69405J86580L63242R5516j46742
$$ -463591 398313 665099 566859 339633 47046 -122359 64221 427463 522979 376237
37411C76237J54430O33093N54712n299l31784k28548j03239j276M35039R69650
$$ 376237 530667 1163760 1718472 1713173 1381389 1152841 1049602 1048326 1483365 2453015
37401B453015P74245k75796j215009j274180p50938k30341K24062O13634N48813
$$ 2453015 3227260 2951464 1736455 462275 -288663 -519004 -294942 318692 867505
37392H67505r6901p01550p11621m15403k88262j24272M39263J005844R15639M03615
$$ 867505 770604 69054 -642567 -1057970 -1346232 -1470504 -1031241 -25397 890242 1293857
37382A293857L39308Q15461Q78724m8536j174371j291078l68985M01635J73300
$$ 1293857 1633165 2448626 3327350 3278814 2104443 813365 444380 846015 1019315
37373A019315m88402m71319K63141O12039k2693p95654o58665J06693M51219K19246
$$ 1019315 530913 59594 322735 934774 912081 116427 -542238 -435545 15674 234920
37363B34920J59909M35848L56023k18309m32817J05129N46435J80823l79640k81958
$$ 234920 394829 830677 1186700 968391 535574 640703 1187138 1367961 988321 706363
37353G06363J14053q0267o90647p00131J49375R73579R82962L44086k69949m18436
$$ 706363 820416 740149 49502 -650629 -501254 472325 1455287 1799373 1529424 1110988
37343A110988j16689K63428K94200n2380l58657l20816m4823L62986R56900J403790
$$ 1110988 994299 1257727 1551927 1499547 1140890 820074 775251 1138237 2095137 3498927
37333C498927R70430l67236j436453j233835k70377K40172N6149j50889j50301
$$ 3498927 4469357 4102121 2665668 1431833 1161456 1401628 1457777 1306888 1156587
37324A156587l68756q41684r52349l70709M71008R65647Q75177L46093j24230
$$ 1156587 787831 -53853 -1006202 -1376911 -905903 59744 934921 1281014 1156784
37315A156784M4149P17306Q73247n4866j083483q89825K24634P60908K63515j84853
$$ 1156784 1200933 1918239 2791486 2736620 1653137 763312 987946 1748854 2012369 1827516
37305A827516J58127O48766N25498O2941j51400j52918j68533m0050K72333K84431
$$ 1827516 1985643 2634409 3159907 3222848 3071448 2918530 2749997 2709947 2982280 3266711
37295C266711k64582q17449p64170l21472p2043o5801K5420K01633J77332n6696
$$ 3266711 3002129 2184680 1420510 1099038 1026995 961194 986614 1188247 1365579 1308883
37285A308883j95321o1334K21779M30949M64618M46319N79699P35819M22319m33123
$$ 1308883 1113562 1052228 1274007 1704956 2169574 2615893 3195592 3931411 4353730 3920607
37275C920607r99415n57745K53898J98368o28643q23991J44768J079717R29403
$$ 3920607 2921192 2363447 2617345 2815713 2187070 1363079 1507847 2587564 3516967
37266C516967K82968J29701K32733j18719n86821l53177K84818K45633n63668
$$ 3516967 3799935 3929636 4162369 4043650 3456829 3103652 3388470 3634103 3070435
37257C070435j053253o20194P9857L09207K71763M90971Q29418P34054J79877
$$ 3070435 2017182 1396988 1476845 1786052 2057815 2548786 3378204 4112258 4292135
37248D292135j70714J71765Q02144Q56794J72375m09170k35190J05875l14399
$$ 4292135 4121421 4293186 5095330 5952124 6124499 5715329 5480139 5586014 5271615
37239E271615j092379q69920M91621J423257R08709k1206R868O41932O51422L8160
$$ 5271615 4179236 3309316 3800937 5224194 6132903 6111697 6121565 6763497 7414919 7453079
37229G453079k36497m8429r3053l40230p7666N22304M33920l91106o94320J29883
$$ 7453079 7216582 7168153 7075100 6734870 6657204 7179508 7613428 7222322 6528002 6657885
37219F657885J062620J049461M02802n3261j82994j40346K51236Q66205Q84542
$$ 6657885 7720505 8769966 9172768 9119507 8936513 8796167 9047403 9913608 10798150
37210A0798150j9556q17762m70618M63551O58103J6266l50461N9038N42907M88327
$$ 10798150 10778594 9960832 9490214 9953765 10611868 10628134 10277673 10336711 10879618 11367945
37200A1367945J55431p8442k71400l36877J72359J144368J561058P96311l35158
$$ 11367945 11523376 11444934 11173534 10836657 11009016 12153384 13714442 14510753 14175595
37191A4175595o42116k18736r2789m74853m94093K04478P51717M60408n5134Q379
$$ 14175595 13533479 13314743 13221954 12747101 12253008 12457486 13209203 13669611 13614477 13622856
37181A3622856K05162l57767j255084j137497J15244R92827N16849m09553n41196
$$ 13622856 13828018 13470251 12215167 11077670 11192914 12185741 12702590 12293037 11751841
37172A1751841j38888k32098p68678p89067j77334O1345n34694j024974m11998
$$ 11751841 11612953 11380855 10612177 9823110 9645776 9707121 9172427 8147453 7735455
37163G735455Q47916J340776M40663r72407j567903j022957k15419j2128k00332
$$ 7735455 8583371 9924147 10364810 9392403 7824500 6801543 6586124 6573996 6373664
37154F373664J5578O59168Q40636J50331n94675n48605j20810k61069r13970j130240
$$ 6373664 6389242 7048410 7889046 8039377 7444702 6896097 6775287 6514218 5600248 4470008
37144D470008n34791K34572N49143M26764Q9260l31531n12853j06966O00326Q40370
$$ 4470008 3935217 4169789 4718932 5145696 5234956 4903425 4390572 4283606 4883932 5724302
37134E724302L88833j32746j77061N7834P8136k74942q04101j134463q79511j12020
$$ 5724302 6113135 5980389 5803328 5861162 5939298 5664356 4860255 3725792 2846281 2734261
37124B734261M03850P2676n51116m45865K85651N32886k555k93018K76122Q22024
$$ 2734261 3138111 3210787 2659671 2213806 2499457 3032343 3029788 2736770 3012892 3834916
37114C834916L70781o17439j054606q25414n85942m75880o9876O07086R32130
$$ 3834916 4205697 3588258 2533652 1708238 1122296 646416 576540 1183626 2115756
37105B115756N63187j65269p26835q34628m68208J39819O11093P54204O46214
$$ 2115756 2678943 2513674 1786839 952211 484003 623822 1234915 1989119 2635333
37096B635333L11365k86772q19186p34683q9466L67646K46221p415j3790m6154
$$ 2635333 2946698 2659926 1840740 1106057 1016591 1384237 1630458 1623043 1609253 1563099
37086A563099k48998j59605L38666M91663p2379m70125L6579O35845K13656p28887
$$ 1563099 1314101 1154496 1493162 1984825 1912446 1442321 1478900 2114745 2328401 1599514
37076A599514q57417j68829K09418O5725K56706Q53649Q60766O9072m09172K3701
$$ 1599514 742097 573268 782686 848411 1105117 1958766 2819532 2888604 2479432 2503133
37066B503133M87045J24302o56896j100567j145064r05660k03081O92980R01817
$$ 2503133 2990178 3114480 2457584 1357017 211953 -693707 -896788 -203808 698009
37057F98009K70873j44243K52779N21849k13760j106972q08135M00981J083797
$$ 698009 968882 824639 1077418 1599267 1385507 278535 -529600 -128619 955178
37048I55178P95693L70952K94675J48832k71706m97548k76585L3418J99361L97046
$$ 955178 1750871 2121823 2416498 2565330 2293624 1796076 1519491 1552909 1752270 2149316
37038B149316N40670J55365p54609j416339j239388n05902J82939O00847P23132
$$ 2149316 2689986 2845351 2090742 674403 -564985 -1070887 -887948 -287101 436031
37029D36031M11197k78678q36937p84249k20181L83132P23585P80570O17435L27934
$$ 436031 847228 568550 -268387 -1052636 -1272817 -889685 -166100 614470 1231905 1559839
37019A559839L5352k25702m92817o68046n50126j64046J98572L71941M64029N02474
$$ 1559839 1595191 1369489 876672 208626 -341500 -505546 -306974 64967 528996 1031470
37009A031470K94370j52460m36164l00472m8363m0038o7493K82515Q29943R40256
$$ 1031470 1325840 1173380 737216 436744 388381 348343 280850 563365 1393308 2333564
36999B333564M41080j58503m55293o00797p48663o17179k9572N36095M96378K6291
$$ 2333564 2774644 2616141 2160848 1560051 811388 194209 164637 700732 1197110 1223401
36989A223401k00749j7807J03413o1643j26757J64477M15771J74044l79684p43146
$$ 1223401 1022652 1004845 1108258 1046615 919858 1084335 1500106 1674150 1294466 551320
36979E51320p59367n74251k61399O7918J15997j12105r234P62218J382914P63304
$$ 551320 -208047 -782298 -1043697 -975779 -859782 -971887 -981121 -218903 1164011 1927315
36969A927315p44388j543759r26186K7372J67191j23149R3869N61345K95931n68216
$$ 1927315 1182927 -360832 -1287018 -1259646 -1092455 -1215604 -1121735 -560390 -264459 -832675
36959h32675p56858J78828J063980P79274j75613n35963q0526K97097R1699j23129
$$ -832675 -1589533 -1410705 -346725 432549 256936 -279027 -359553 -62456 29243 -93886
36949i3886L13879J106670J356136O74440m23760j150815j172518p05293j63469
$$ -93886 219993 1326663 2682799 3357239 2933479 1782664 610146 -95147 -258616
36940b58616J40923J00212j64684l62479k50640J34282N09017O23697M69312K26734
$$ -258616 -117693 -17481 -182165 -544644 -795284 -661002 -151985 471712 941024 1167758
36930A167758R1153J38827K65419K42616n9894m80384o86016n13648j09273K62299
$$ 1167758 1258911 1397738 1663157 1905773 1845879 1365495 679479 165831 56558 318857
36920C18857M30922L63594J55307j3672o8846j64954m06490n03828p3871O65345
$$ 318857 749779 1113373 1268680 1255008 1186162 1021208 614718 110890 37019 702364
36910G02364R53511M66430j86894k82701R4744L93985M86333N88966N41923n3769
$$ 702364 1655875 2122305 1935411 1652710 1747454 2141439 2627772 3216738 3758661 3704892
36900C704892r59384j331320q55450j84483N9122P0089K31472L38914P7333k31300
$$ 3704892 2745508 1414188 558738 374255 433377 503466 734938 1073852 1151185 919885
36890I19885j16020J43091p0940n94380o76758k49594l7150k63124k71556J95681
$$ 919885 803865 946956 876016 281636 -395122 -644716 -681866 -944990 -1216546 -1020865
36880a020865L95999q3727l81101K97557J196103J078815K04733j69868O4155
$$ -1020865 -624866 -708593 -1089694 -792137 403966 1482781 1687514 1517646 1581801
36871A581801j63552r48278r80515J70898J010868L82819o17407l69623O84113
$$ 1581801 1418249 469971 -510544 -339646 671222 1054041 436634 67011 751124
36862G51124Q14187k44710j025165o60757Q1333K68752k7913l37672m36503r9737
$$ 751124 1565311 1320601 295436 -365321 -283988 -15236 -43149 -380821 -817324 -917061
36852i17061P46364J361116P78429n95125j127607k15818P64145M67504n50931
$$ -917061 -170697 1190419 1968848 1373723 246116 30298 794443 1261947 711016
36843G11016r06424l96789J50959L67615N13999N76851K99274p4534l7724K89482
$$ 711016 -195408 -592197 -441238 -73623 440376 1017227 1316501 1241967 1204243 1493725
36833A493725L15683n6173l35913k45524J0857J68923O9636l63628p94702n29083
$$ 1493725 1809408 1753235 1417322 1171798 1182655 1351578 1421214 1057586 262884 -266199
36823b66199M38406R39331J03784j147671j233122k19636L45791j47076o16100
$$ -266199 172207 1111538 1215322 67651 -1165471 -1385107 -1039316 -1186392 -1802492
36814a802492k46060K72102J42659j62306J14097O11776N01926r7070l84348j50645
$$ -1802492 -2048552 -1776450 -1633791 -1796097 -1682000 -1070224 -568298 -665368 -1049716 -1200361
36804a200361J59437L80966P05954R51125O25474j91227p50706n98169j05577
$$ -1200361 -1040924 -659958 45996 997121 1622595 1431368 680662 82493 -23084
36795b3084J23337n8406m21071p38957q46044n73782Q1119P99070J143606R56167
$$ -23084 100253 41847 -379224 -1118181 -1964225 -2538007 -2456888 -1657818 -514212 441955
36785D41955M67277m650l65136o37597o46977j52447N81230P70930Q3615p12335
$$ 441955 909232 904582 539446 -98151 -745128 -897575 -316345 454585 538200 -174135
36775a74135o64294K05J95089l57999o99127j50010O37739P40062L21535J48586
$$ -174135 -838429 -838224 -643135 -1001134 -1700261 -1850271 -1212532 -472470 -150935 -2349
36765b349K79882J77723j41437m7955N75576J018598P94269K98420N8049r0848
$$ -2349 277533 455256 313819 265864 841440 1860038 2654307 2952727 3010776 2919928
36755B919928n57322j101992j020084j84998O17559O17728O607l81497k00664
$$ 2919928 2362606 1260614 240530 55532 673091 1290819 1297426 915929 715265
36746G15265K1266k56954p67463q43698l76144J55855M78363P34052Q67350N01380
$$ 715265 736531 479577 -287886 -1131584 -1507728 -1351873 -873510 -139458 727892 1229272
36736A229272k87712p20933l30518K67775J94891m54793q23480n13574L6678L08522
$$ 1229272 941560 220627 -109891 157884 352775 -102018 -925498 -1439072 -1402394 -1093872
36726a093872K39050R716j69359m6989L90173O11559P5375q49044j108420l50999
$$ -1093872 -854822 -845106 -1014465 -1061454 -671281 -59722 15653 -833391 -1941811 -2292810
36716b292810N15293N51066L6571j01354K66788M05257L6752j32958M19393J040165
$$ -2292810 -1777517 -1226451 -1189880 -1291234 -1024446 -619189 -582437 -715395 -296002 744163
36706G44163P67487j82247o64384l05840r387m27380q63602m52320L01282K71057
$$ 744163 1511650 1329403 665019 359179 349792 -77588 -941190 -1393510 -1092228 -821171
36696h21171l78640l47322O83993J423365R08715j17150m97366k88633j57274
$$ -821171 -1199811 -1547133 -863140 560225 1468940 1351790 854424 565791 408517
36687D08517l3515M44033P49456P7211j115525j468380o49865K21221K49037j98580
$$ 408517 375002 819035 1568491 1645702 530177 -938203 -1588068 -1366847 -1117810 -1316390
36677a316390l92262k19264J04913M60264N81892J75642l68200j91968O80876
$$ -1316390 -1708652 -1927916 -1823003 -1362739 -780847 -605205 -973405 -1165373 -484497
36668d84497J079622L38869o30230o72980l7484K45276L3679L2785M04501N61820
$$ -484497 595125 933994 303764 -369216 -406700 -161424 -127745 -94960 309541 871361
$$ [...]
##END NTUPLES=NMR SPECTRUM
##END=
