##TITLE=31Pdec_IPDP1502
 CDcl3, 24 sc
 15.2.2019
##JCAMPDX= 6.0         $$ Bruker NMR JCAMP-DX V2.0
##DATA TYPE= NMR SPECTRUM
##DATA CLASS= NTUPLES
##ORIGIN= UXNMR, Bruker Analytische Messtechnik GmbH
##OWNER= root
$$ XWIN-NMR		Version 3.5
$$ Fri Feb 15 16:30:12 2019 Russian Standard Time (UT+4h)  she@DPX200
##.OBSERVE FREQUENCY= 81.013821
##.OBSERVE NUCLEUS= ^31P
##.ACQUISITION MODE= SIMULTANEOUS
##.ACQUISITION SCHEME= undefined
##.AVERAGES= 24
##.DIGITISER RES= 17
##SPECTROMETER/DATA SYSTEM= spect
##.PULSE SEQUENCE= zgpg30
##.SOLVENT NAME= CDCl3
##.SHIFT REFERENCE= (INTERNAL, CDCl3, 0, 182.463)
##AUDIT TRAIL= $$ (NUMBER, WHEN, WHO, WHERE, WHAT)
$$ ##TITLE= Audit trail, XWIN-NMR		Version 3.5
$$ ##JCAMPDX= 5.01
$$ ##ORIGIN= Bruker BioSpin GmbH
$$ ##OWNER= she
$$ F:/spectra/data/she/nmr/P31/1/pdata/1/auditp.txt
$$ ##AUDIT TRAIL=  $$ (NUMBER, WHEN, WHO, WHERE, WHAT)
(   1,<2019-02-15 16:29:29.04 +0400>,<she>,<DPX200>,
      <created by zg, POWCHK disabled, PULCHK disabled
       configuration hash MD5:
       00 E9 B6 7A A2 85 ED C7 34 08 36 98 17 FE 4E 26
       data hash MD5: 32K
       2B BE 03 EB 6E DC 2B 00 C9 80 4B 34 02 3E E7 6E>)
(   2,<2019-02-15 16:29:31.42 +0400>,<she>,<DPX200>,
      <Start of raw data processing
       efp BC_mod = 2 LB = 1 FT_mod = 6 PKNL = 1 PHC0 = -1462.314 PHC1 = 74.79891 SI = 64K 
       data hash MD5: 64K
       2D 52 7A 3E A0 47 6F C2 57 78 61 6D 71 0E E7 DD>)
(   3,<2019-02-15 16:29:45.50 +0400>,<she>,<DPX200>,
      <pk PHC0 = -0.5334104 PHC1 = 0 
       data hash MD5: 64K
       A1 BB B2 88 96 C3 FA 57 84 37 14 28 D7 A1 3E 84>)
(   4,<2019-02-15 16:29:48.12 +0400>,<she>,<DPX200>,
      <abs ABSG = 5 
       data hash MD5: 64K
       AE 6F B1 FD EB 7A 6B F7 4B 3D 16 A9 8A 81 80 CC>)
$$ ##END=
$$ 
$$ hash MD5
$$ 5F 07 1F 06 AB 4F 36 44 89 E2 ED 48 21 B9 20 F3
##$RELAX= 
##$RELAX= 
##$RELAX= 
##$RELAX= 
##$RELAX= 
##$RELAX= 
##$RELAX= 
##$RELAX= 
$$ Bruker specific parameters
$$ --------------------------
##$DU= <F:/spectra>
##$EXPNO= 1
##$NAME= <P31>
##$PROCNO= 1
##$TYPE= <nmr>
##$USER= <she>
##$AMP= (0..31)
100 100 100 100 100 100 100 100 100 100 100 100 100 100 100 100 100 100 
100 100 100 100 100 100 100 100 100 100 100 100 100 100 
##$AQSEQ= 0
##$AQ_mod= 1
##$AUNM= <au_zg>
##$AUTOPOS= <>
##$BF1= 81.014009
##$BF2= 200.13
##$BF3= 200.13
##$BF4= 200.13
##$BF5= 200.13
##$BF6= 200.13
##$BF7= 200.13
##$BF8= 200.13
##$BYTORDA= 1
##$CFDGTYP= 0
##$CFRGTYP= 5
##$CHEMSTR= <none>
##$CNST= (0..31)
1 1 145 1 1 1 1 1 1 1 1 1 1 1 1 1 1 1 1 1 1 1 1 1 1 1 1 1 1 1 1 1 
##$CPDPRG= <waltz16>
##$CPDPRG1= <>
##$CPDPRG2= <waltz16>
##$CPDPRG3= <>
##$CPDPRG4= <mlev>
##$CPDPRG5= <mlev>
##$CPDPRG6= <mlev>
##$CPDPRG7= <mlev>
##$CPDPRG8= <mlev>
##$CPDPRGB= <>
##$CPDPRGT= <>
##$D= (0..31)
0 1 0 0 0 0 0 0 0 0 0 0.03 2e-05 3e-06 0 0 0 0 0 0 0 0 0 0 0 0 0 0 0 0 
0 0 
##$DATE= 1550233768
##$DBL= (0..7)
120 120 120 11 120 120 24 19 
##$DBP= (0..7)
150 150 150 150 150 150 150 150 
##$DBP07= 0
##$DBPNAM0= <>
##$DBPNAM1= <>
##$DBPNAM2= <>
$$ [...]
##$SUBNAM3= <"">
##$SUBNAM4= <"">
##$SUBNAM5= <"">
##$SUBNAM6= <"">
##$SUBNAM7= <"">
##$SUBNAM8= <"">
##$SUBNAM9= <"">
##$SW= 369.568048894756
##$SWIBOX= (0..15)
0 1 3 0 0 0 0 0 0 0 0 0 0 0 0 0 
##$SW_h= 29940.119760479
##$TD= 32768
##$TD0= 1
##$TE= 0
##$TE2= 300
##$TE3= 300
##$TEG= 300
##$TL= (0..7)
0 120 53 12 22 120 120 120 
##$TP= (0..7)
150 150 150 150 150 150 150 150 
##$TP07= 0
##$TPNAME0= <>
##$TPNAME1= <>
##$TPNAME2= <>
##$TPNAME3= <>
##$TPNAME4= <>
##$TPNAME5= <>
##$TPNAME6= <>
##$TPNAME7= <>
##$TPOAL= (0..7)
0.5 0.5 0.5 0.5 0.5 0.5 0.5 0.5 
##$TPOFFS= (0..7)
0 0 0 0 0 0 0 0 
##$TUNHIN= 0
##$TUNHOUT= 0
##$TUNXOUT= 0
##$USERA1= <user>
##$USERA2= <user>
##$USERA3= <user>
##$USERA4= <user>
##$USERA5= <user>
##$V9= 5
##$VALIST= <valist>
##$VCLIST= <CCCCCCCCCCCCCCC>
##$VD= 0
##$VDLIST= <DDDDDDDDDDDDDDD>
##$VPLIST= <PPPPPPPPPPPPPPP>
##$VTLIST= <TTTTTTTTTTTTTTT>
##$WBST= 1024
##$WBSW= 4
##$XGAIN= (0..3)
0 0 0 0 
##$XL= 0
##$YL= 0
##$YMAX_a= 23759
##$YMIN_a= -23774
##$ZGOPTNS= <>
##$ZL1= 120
##$ZL2= 120
##$ZL3= 120
##$ZL4= 120
##$ABSF1= 182.463
##$ABSF2= -187.1042
##$ABSG= 5
##$ABSL= 3
##$ALPHA= 0
##$AQORDER= 0
##$ASSFAC= 0
##$ASSFACI= 0
##$ASSFACX= 0
##$ASSWID= 0
##$AUNMP= <proc_1d>
##$AZFE= 0.1
##$AZFW= 0.5
##$BCFW= 0
##$BC_mod= 2
##$BYTORDP= 0
##$COROFFS= 0
##$CY= -3
##$DATMOD= 1
##$DC= 0
##$DFILT= <>
##$DTYPP= 0
##$F1P= 0
##$F2P= 0
##$FCOR= 1
##$FTSIZE= 65536
##$FT_mod= 6
##$GAMMA= 0
##$GB= 0
##$INTBC= 1
##$INTSCL= 5.30512e-09
##$ISEN= 30
##$LB= 1
##$LEV0= 0
##$LPBIN= 0
##$MAXI= 10000
##$MC2= 0
##$MEAN= 0
##$ME_mod= 0
##$MI= 50
##$NCOEF= 0
##$NC_proc= -5
##$NLEV= 6
##$NOISF1= 182.463
##$NOISF2= 159.3651
##$NSP= 0
##$NTH_PI= 0
##$NZP= 0
##$OFFSET= 182.463
##$PC= 4
##$PHC0= -1462.847
##$PHC1= 74.79891
##$PH_mod= 1
##$PKNL= yes
##$PPARMOD= 0
##$PSCAL= 0
##$PSIGN= 0
##$REVERSE= no
##$SF= 81.0140089999434
##$SI= 65536
##$SIGF1= 159.3651
##$SIGF2= -187.1042
##$SINO= 113.3802
##$SIOLD= 16384
##$SREGLST= <1H.CDCl3>
##$SSB= 0
##$STSI= 65536
##$STSR= 0
##$SW_p= 29940.119760479
##$SYMM= 0
##$S_DEV= 0
##$TDeff= 32768
##$TDoff= 0
##$TI= <>
##$TILT= no
##$TM1= 0
##$TM2= 0
##$TOPLEV= 0
##$USERP1= <user>
##$USERP2= <user>
##$USERP3= <user>
##$USERP4= <user>
##$USERP5= <user>
##$WDW= 1
##$XDIM= 65536
##$YMAX_p= 389094027
##$YMIN_p= -4418579
$$ End of Bruker specific parameters
$$ ---------------------------------
##NTUPLES= NMR SPECTRUM
##VAR_NAME=  FREQUENCY,     SPECTRUM/REAL,   SPECTRUM/IMAG
##SYMBOL=    X,             R,               I
##VAR_TYPE=  INDEPENDENT,   DEPENDENT,       DEPENDENT
##VAR_FORM=  AFFN,          ASDF,            ASDF
##VAR_DIM=   65536,         65536,           65536
##UNITS=     HZ,            ARBITRARY UNITS, ARBITRARY UNITS
##FACTOR=    0.456856943014862, 1,           1
##FIRST=     14782.0589164792, 0,            0
##LAST=      -15158.0608439998, 0,           0
##MIN=       -15158.0608439998, -4418579,    0
##MAX=       14782.0589164792, 389094027,    0
$$ Real data points
##PAGE= N=1
##DATA TABLE= (X++(R..R)), XYDATA
$$ [...]
42729c77484J317324J84458m73697k73865j04502n83841j095290q20253k8354
$$ -377484 939840 1124298 650601 376736 272234 -311607 -1406897 -2227150 -2255504
42720b255504L78278J97123n071K6598m1134k55377j09059N13214Q97577N38698
$$ -2255504 -1877226 -1680103 -1685174 -1658576 -1699710 -1955087 -2064146 -1550932 -653355 -114657
42710a14657k1452l7493K83842K39334j47755k39270O9464K14813j8611j99519
$$ -114657 -136109 -173602 110240 349574 201819 -37451 32013 246826 228215 28696
42700B8696r3113M594j4329J81375N63876M87763k59202q34056m37842M57502
$$ 28696 -64417 -59823 -74152 107223 671099 1158862 899660 65604 -372238 85264
42690H5264P16302Q4843n83972n43742L9430N28642N71526K98164O4832P5525
$$ 85264 801566 886409 302437 -241305 -201875 326767 898293 1196457 1261289 1336814
42680A336814J31335j29403o18795p35959k05889L79288L46715k5354O6789O15552
$$ 1336814 1468149 1338746 719951 -16008 -221897 157391 504106 478752 545541 1161093
42670A161093O90309j45463j024867q61199J96700R41484N86165l89719q99092
$$ 1161093 1851402 1705939 681072 -180127 16573 958057 1544222 1154503 255411
42661B55411m47186M40442Q47187M06866l80303p18858l23323L81678P54652N08929
$$ 255411 -191775 248667 1095854 1502720 1122417 403559 80236 461914 1216566 1725495
42651A725495j16855n80072m70264R0180N06333L49262j23545l20472j21943K0325
$$ 1725495 1608640 1028568 558304 648484 1154817 1504079 1380534 1060062 938119 958444
42641I58444j69841l70796k16953Q3964P2301k19804k84943J10336N84800O71657
$$ 958444 788603 417807 200854 284818 357119 137315 -147628 -37292 547508 1219165
42631A219165L81463L2103k55805n90647r12300q98218l96130K57131N51323L60226
$$ 1219165 1600628 1632731 1376926 786279 -126021 -1024239 -1420369 -1163238 -611915 -251689
42621b51689J2810j45449p4047P7501J97317K44182K12439J68375K11588L21502
$$ -251689 -238879 -384328 -458375 -380874 -183557 60625 273064 441439 653027 974529
42611I74529L50520K27778L7783j50904l53448m96135m11375j37707K8197k9573
$$ 974529 1325049 1552827 1590610 1439706 1086258 590123 178748 41041 69238 39665
42601C9665k4641K46384M69077K42906k52144m70536k78118m7130p339J7509J78089
$$ 39665 15024 261408 730485 973391 721247 250711 -27407 -74537 -81876 -64367 113722
42590A13722L69415N37265P68546R27545O52186n1376o08841n73004k14927j18760
$$ 113722 483137 1020402 1788948 2716493 3368679 3317303 2708462 2135458 1920531 1801771
42580A801771m17482p12725n95678m3872N54611O65086J15623n77415o92297j93751
$$ 1801771 1384289 671564 75886 32014 586625 1251711 1367334 789919 97622 -96129
42570i6129K40206J91735R577J25910M15471N81839O39598N81301J36204n85221
$$ -96129 144077 335812 345389 471299 886770 1468609 2108207 2689508 2825712 2240491
42560B240491q05533j85014L41716j98675j155546j004623L75113J442371J185614
$$ 2240491 1434958 1249944 1591660 1392985 237439 -767184 -392071 1050300 2235914
42551B235914L38014n8399j64702o45149j293776j296871m63408N46059J000557
$$ 2235914 2573928 2515529 2350827 1705678 411902 -884969 -1348377 -802318 198239
42542A98239O46229k10138p81720l89784O29521J106024N54411j16677n073L92339
$$ 198239 844468 634330 -147390 -537174 92347 1198371 1752782 1636105 1631032 2023371
42532B023371R1779o53000p14013O4530O00978K41395l93519m99396j14129K98869
$$ 2023371 2115150 1462150 748137 812667 1413645 1655040 1261521 762125 647996 946865
42522I46865N31124N33638K93926J14626L86222Q36669P28305Q9030r9875N86098
$$ 946865 1477989 2011627 2305553 2420179 2806401 3643070 4371375 4460405 4360530 4946628
42512D946628J202868Q64978K00914L99880J338288J789210J306846P85744J009618
$$ 4946628 6149496 7014474 7215388 7615268 8953556 10742766 12049612 12835356 13844974
42503A3844974J595552J750881J388017J019009R51911J017042R12991N55890
$$ 13844974 15440526 17191407 18579424 19598433 20550344 21567386 22480377 23036267
42495B3036267J51478P338K09579N45121Q64138J331353K042819K591356K454366
$$ 23036267 23187745 23195083 23404662 23949783 24813921 26145274 28188093 30779449 33233815
42486C3233815J759426J212988J204248J338855R35412k82719j957043l249499
$$ 33233815 34993241 36206229 37410477 38749332 39684744 39402025 37444982 34195483
42478C4195483l335759k163413o63862K04790N03892R04865J456622J561784J127313
$$ 34195483 30859724 28696311 28032449 28237239 28741131 29645996 31102618 32664402 33791715
42469C3791715P27287L73460p94073k975516m808225m874019l460928j944215
$$ 33791715 34519002 34892462 34098389 31122873 26314648 21440629 17979701 16035486
42461A6035486r93774l89609j09404l57322o95780m08634J93171J7820j029604
$$ 16035486 15041712 14652103 14542699 14185377 13489597 13080963 13274134 13291954 12262350
42452A2262350j710791j338021q21110j109478j644922j400857o82086o22850
$$ 12262350 10551559 9213538 8392428 7282950 5638028 4237171 3555085 2932235
42444B932235j253260j365886l85194P45857R24347L03457j69295q3531J35961
$$ 2932235 1678975 313089 -72105 673752 1598099 1901556 1732261 1648730 1784691
42435A784691K3750l07947l63925J16008P65333Q56372J01260q79372j170262
$$ 1784691 1808441 1500494 1136569 1252577 2017910 2874282 2975542 2096170 925908
42426I25908o44296p2906n5749k63666n6136M85502O57264K02933k50053o9003
$$ 925908 281612 208706 152957 -110709 -166845 318657 975921 1178854 928801 859798
42416H59798M40636M31684k35896o91872k53607N33229O09578o0209m13497J36411
$$ 859798 1300434 1732118 1496222 804350 550743 1083972 1693550 1633341 1219844 1356255
42406A356255Q26057O82216j15423o83142p61042p49648p02441k64696L74022
$$ 1356255 2182312 2864528 2749105 2065963 1304921 555273 -147168 -411864 -37842
42397c7842M47188j89862o74065l68977K34012L51921K8260j61582k1933K44730
$$ -37842 409346 219484 -454581 -823558 -589546 -237625 -209365 -370947 -392880 -148150
42387a48150N26257P26550N69106N5069k43520L3628L24607o7989p97497r10277
$$ -148150 378107 1104657 1673763 1728832 1485312 1518940 1843547 1775558 978061 67784
42377F7784k71517L32336M61314M75376O14262N20110k0503n86129p15792m33677
$$ 67784 -203733 128603 589917 1065293 1679555 2199665 2179162 1593033 877241 443564
42367D43564M1717N20774O05388o1285j038261j307257n99008K18672M48932M46284
$$ 443564 485281 1006055 1611443 1550158 511897 -795360 -1394368 -1175696 -726764 -280480
42357b80480O72029P47619K39853l53673l63598j25617l50303p35027l70215O38445
$$ -280480 391549 1139168 1379021 1025348 661750 536133 185830 -549197 -919412 -280967
42347b80967J129122N63093k82416n23983j84033K71792N82741N44969l2815q20527
$$ -280967 848155 1411248 1128832 604849 420816 692608 1275349 1820318 1787503 966976
42337I66976j044146m72431K18875M05517K53067J31186o3004m58722o44551k21927
$$ 966976 -77170 -549601 -330726 74791 327858 459044 396040 -62682 -707233 -929160
42327i29160M19195N31229K8406m78295n29495k07117K12645N26057N82162M08344
$$ -929160 -509965 21264 49670 -428625 -958120 -1165237 -952592 -426535 155627 563971
42317E63971L02055M32215M57446k0191o91213p59193k6687P23532O79071k7342
$$ 563971 866026 1298241 1755687 1735496 1044283 285090 258403 981935 1661006 1633664
42307A633664n98001n72208j87682J26599K01542K7707l80149p68705o27476J79960
$$ 1633664 1035663 463455 275773 402372 603914 631621 251472 -517233 -1144709 -964749
42297i64749R39283Q00815k3523m28732K5513M78297J63606l42815j33023M03854
$$ -964749 -25466 775349 751826 323094 348607 826904 990510 647695 514672 918526
42287I18526J74685o78394q37139N9074P51461L48945l20445j73776M12876M27007
$$ 918526 1093211 414817 -422322 -363248 388213 737158 416713 242937 655813 1082820
42277A082820p5641k94039j63637k82150o40332o07218j11759K11162Q9736j02051
$$ 1082820 1007179 713140 549503 267353 -372979 -980197 -1091956 -880794 -791058 -893109
42267h93109j84075l82839n84170k69952N40868J062927P77665Q1884l59108l52626
$$ -893109 -1077184 -1460023 -2044193 -2314145 -1773277 -710350 67315 149199 -209909 -562535
42257e62535o0291L16667N12601L33949j3465j57950j49015k93054m37385r4351
$$ -562535 -622826 -306159 206442 540391 526926 368976 219961 -73093 -510478 -604829
42247f04829O67352J173428J092854P12020J88028o02177j300652j155112k41938
$$ -604829 62523 1235951 2328805 3040825 3228853 2626676 1326024 170912 -71026
42238g1026L74258J99246L1749M73935P50948r651j148812j309155m04924L99372
$$ -71026 303232 502478 534227 1008162 1759110 1749459 600647 -708508 -1113432 -714060
42228g14060M09898J0873l32485o26608q18516o14583n8448L71369M33026L77401
$$ -714060 -304162 -293289 -625774 -1252382 -2070898 -2685481 -2743929 -2372560 -1939534 -1562133
42218a562133M33323N07182M60896K83733p403k74984j94722K96580O81927N01705
$$ -1562133 -1128810 -621628 -160732 123001 115598 -159386 -354108 -57528 624399 1126104
42208A126104Q9158N4358K48259Q479o48686r28476m53553K19109M78566L61604
$$ 1126104 1215262 1269620 1517879 1526358 877672 -50804 -504357 -285248 193318 554922
42198E54922J49686o1408j12238K48565P89146P82459m905q01816p69334q1990
$$ 554922 704608 643200 530962 779527 1568673 2351132 2346227 1544411 775077 693087
42188F93087L62741O3329o18226r44027n32094K48604N58296J7140p02935o66755
$$ 693087 1055828 1119157 500931 -443096 -975190 -726586 -168290 -151150 -854085 -1520840
42178a520840J8686L86003J52564J47367Q00910J197767M46517p69754j071309
$$ -1520840 -1502154 -1116151 -963587 -816220 -15310 1182457 1628974 859220 -212089
42169b12089l55362K44613J68840k295J18061L5384n14433p96639j75666P49745
$$ -212089 -567451 -322838 -153998 -156293 -38232 -2848 -517281 -1313920 -1489586 -739841
42159g39841R80613N95984M33495N57965J62924q62958j370098n52171O88476
$$ -739841 240772 836756 1270251 1828216 1991140 1128182 -241916 -794087 -105611
42150a05611Q61619n7032o75947j98657O20843P89147M20475J81017P9397l44120
$$ -105611 756008 698976 23029 -175628 445215 1234362 1654837 1835854 1915251 1571131
42140A571131r55422j053662m82302M8269k1008l49017l11935O6866K55710O2944
$$ 1571131 615709 -437953 -920255 -871986 -892994 -1242011 -1553946 -1487080 -1231370 -1168426
42130a168426j26108J5524K59746J89036j24866j52476L17329P70105O25596O6054
$$ -1168426 -1294534 -1279010 -1019264 -830228 -955094 -1107570 -790241 -20136 605460 671514
42120F71514k34477q1661R0686L2776j2041N6222m3767l08630k91255J7408k7869
$$ 671514 437037 355376 446062 478838 466797 523019 479252 170622 -120633 -103225 -131094
42109a31094n34806n90383K50345R37673M69136m02488l56966L17590L61701j48754
$$ -131094 -665900 -1256283 -1005938 -68265 400871 -1617 -358583 -40993 320708 171954
42099A71954j8583P15864O99866k45685o15195J79256O94575p2270r24308m75055
$$ 171954 153371 869235 1569101 1323416 708221 887477 1582052 1509782 585474 110419
42089A10419O11910Q60750K38804l06266n51798p87086p63630k59328J07970m8306
$$ 110419 722329 1583079 1821883 1515617 963819 176733 -586897 -846225 -738255 -786561
42079g86561R4781J057141J591370M77441j128906j186730L8479N03819k57082
$$ -786561 -691780 365361 1956731 2434172 1305266 118536 157015 660834 403752
42070D03752p10640k61156j14611p19137p49166M03583J257388O30139l93253
$$ 403752 -306888 -568044 -682655 -1401792 -2150958 -1747375 -489987 140152 -253101
42061b53101l42960K74047J27329n40094m17083N97385J247053Q45351L4713l81633
$$ -253101 -596061 -322014 -194685 -734779 -1151862 -554477 692576 1537927 1572640 1191007
42051A191007l46749j84272o9330j7828J9959J05222J74122J16827N9326J98268
$$ 1191007 844258 659986 590656 572828 592787 698009 872131 988958 1048284 1246552
42041A246552L14211O343n13872n86106k11441j35422n40469o32012p056N59296
$$ 1246552 1560763 1567106 1053234 467128 255687 120265 -420204 -1052216 -1059272 -499976
42031d99976L66225r7672q7993J88059J85685Q2996K54259L41063j14505o39937
$$ -499976 -133751 -231423 -319416 -131357 54328 137324 391583 732646 618141 -21796
42021b1796m80716J42220M33690L13621K98182M05186J93377l16848o93019q50886
$$ -21796 -502512 -360292 73398 387019 685201 1090387 1283764 966916 273897 -576989
42011e76989r01490n55004L50792J039385O28993l94984o85981L9469P20927O28015
$$ -576989 -1478479 -2033483 -1682691 -643306 -14313 -409297 -1095278 -1055809 -334882 293133
42001B93133J60054j77336m38185n63053j26082P54938J153000N31129m72552
$$ 293133 453187 275851 -162334 -725387 -851469 -96531 1056469 1587598 1115046
41992A115046r31630p15175k74899R5711L52415M60914M28760L15666P4256l24878
$$ 1115046 183416 -531759 -806658 -710947 -358532 102382 531142 846808 921064 596186
41982E96186o37077o16215m27019k84265Q4091Q90546J444071Q49781m81897j127835
$$ 596186 -40891 -657106 -1084125 -1368390 -1284299 -393753 1050318 1900099 1418202 290367
41972B90367o18437J4799k9097k30937L9293L65016J90793k8471L85544J005003
$$ 290367 -328070 -313271 -342368 -573305 -534012 -168996 21797 -6674 378870 1383873
41962A383873Q08051k54797j105758r05478N5259Q31096P86783J10845m31824
$$ 1383873 2191924 1937127 831369 -74109 -18850 812246 1599029 1709874 1278050
41953A278050l49472J7617J08225J03096N52314J135185Q55602k91740j010893
$$ 1278050 928578 946195 1054420 1157516 1709830 2845015 3700617 3408877 2397984
41944B397984n79029J16339J36969p8936J56781L50019j64872o99400k51930N68390
$$ 2397984 1818955 1935294 2072263 1993327 2150108 2500127 2335255 1635855 1383925 1952315
41934A952315L67959o24222p86649K46398R85389N33018o7175K99585J032634
$$ 1952315 2320274 1696052 909403 1155801 2141190 2674208 2607033 2906618 3939252
41925C939252R49681J60362l51588l59512m72510q74639r69105l29713O18625
$$ 3939252 4888933 5049295 4697707 4338195 3865685 2991046 2021941 1692228 2310853
41916B310853J027596N03861m45384q42774l30927K83202N8751o37521n71406
$$ 2310853 3338449 3842310 3396926 2554152 2223225 2506427 2565178 1927657 1356251
41907A356251L72919P77984j55846j168262p32763N39545P39449m51069j298121
$$ 1356251 1729170 2507154 2351308 1183046 450283 989828 1729277 1278208 -19913
41898a9913o27325N92062R14561M27512R0456l3414n88433j360355j259884k9885
$$ -19913 -647238 -55176 859385 1286897 1377353 1343939 755506 -604849 -1864733 -1894618
41888a894618J140330J156660L45743k96949m66488m55261k80560J77148M62590
$$ -1894618 -754288 402372 748115 451166 -15322 -470583 -751143 -573995 -111405
41879a11405j3349q12072p47208L82850J252285P41237n18276j040764m18739
$$ -111405 -124754 -936826 -1684034 -1301184 -48899 692338 174062 -866702 -1285441
41870a285441M32805O61407L05885j61401l92013k17219K49694M89495Q0080o13742
$$ -1285441 -852636 -191229 114656 -46745 -438758 -655977 -406283 83212 163292 -450450
41860d50450p71008k11383L70934L92067N7853j33083m8116J76976M29111N19517
$$ -450450 -1221458 -1432841 -1061907 -669840 -611987 -745070 -793186 -616210 -187099 332418
41850C32418K20769k85035m10712K0766L64000L940p05714q82882k97228M27710
$$ 332418 553187 268152 -142560 -121794 242206 246146 -459568 -1342450 -1639678 -1211968
41840a211968P14146O13874M52250L52113K73989J97726O9323k14020n87690p43966
$$ -1211968 -497822 116052 568302 920415 1194404 1392130 1461453 1247433 659743 -84223
41830h4223m56461Q8022M37580L58231O1306r5603n0872o4172l14212o43495p92635
$$ -84223 -540684 -452662 -15082 343149 404455 308852 257980 193808 -120404 -763899 -1556534
41819a556534p10432m57360O303O29363J010715P74594K02648K564L22626N12486
$$ -1556534 -2266966 -2724326 -2718023 -2088660 -1077945 -303351 -100703 -98139 224487 736973
41809G36973J27295l56483k82105J66902L05263M1807o9956J79072L23352K5424
$$ 736973 864268 507785 225680 392582 697845 739652 669696 848768 1172120 1197544
41799A197544m16323o30625o98672p50208n23936J44473P29182N40247k64627
$$ 1197544 781221 150596 -548076 -1298284 -1822220 -1677747 -948565 -408318 -672945
41790f72945q05228o66143l66526m25134n20384n3157Q09902J261367R44280L60778
$$ -672945 -1478173 -2144316 -2510842 -2935976 -3456360 -3509517 -2699615 -1438248 -493968 -133190
41780a33190R4213J15781R4582k5223j12025k02094l40915k73511K17269P44617
$$ -133190 -38977 76804 171386 146163 34138 -167956 -508871 -782382 -565113 179504
41770A79504O31984j09153o19232k66973M97859P08873N7995q27435j132022n84847
$$ 179504 811488 702335 83103 -183870 313989 1022862 1080857 253422 -878600 -1463447
41760a463447M24172J155210J026554J18380q29111j124296p67940k06490L39169
$$ -1463447 -1039275 115935 1142489 1260869 431758 -692538 -1460478 -1666968 -1327799
41751a327799Q85145J164710P31903k38001q33906n04987J49951K08366k57457
$$ -1327799 -442654 722056 1453959 1215958 382052 -122935 27016 235382 -22075
41742b2075l37997L25546J022377J018952M94759O0342j54131m05414o67418o65618
$$ -22075 -360072 -34526 987851 2006803 2501562 2561904 2407773 2002359 1334941 669323
41732F69323m47182l25943k72359N4818N75072O90483J85823l13919j81906L36696
$$ 669323 222141 -103802 -376161 -321343 253729 944212 1130035 816116 634210 970906
41722I70906N48460K82787o1108j95466j46605M4336K70200J48368n09027j085552
$$ 970906 1519366 1802153 1741045 1545579 1398974 1443310 1713510 1861878 1352851 267299
41712B67299p59994K02316N79282q3322p25713l46071M54549M34606k90079m23025
$$ 267299 -492695 -290379 288903 205581 -520132 -866203 -411654 22952 -267127 -690152
41702f90152L99110R54298L46446n49598m40795L58739M38360m78546j105237
$$ -690152 -291042 663256 1009702 460104 19309 378048 816408 337862 -767375
41693g67375n95320K08421J68894m22209m71607J26854M56197J67036l4268L03329
$$ -767375 -1362695 -1154274 -985380 -1407589 -1879196 -1752342 -1296145 -1129109 -1163377 -860048
41683h60048N97395K69510k46115k14364K44936M59111K98403K07955L21744K80518
$$ -860048 -262653 6857 -239258 -453622 -208686 250425 548828 756783 1078527 1359045
41673A359045n3528l11197j64881K58649N82608M87134j19332q87562j133237
$$ 1359045 1305517 994320 829439 1088088 1670696 2157830 2038498 1150936 17699
41664A7699n96069O2032M3795m49611n21235O0365N66361M58241M5588k40565
$$ 17699 -578370 -516338 -472543 -922154 -1443389 -1383024 -816663 -358422 -312834 -553399
41654e53399m61943o75817n26321J37789P80952Q73781O43078N93861O64776M42880
$$ -553399 -1015342 -1691159 -2217480 -2079691 -1298739 -424958 218120 811981 1476757 1919637
41644A919637n2810l82654l35112q8342J43686K08994p2949o49312j009155o96245
$$ 1919637 1866827 1484173 1149061 1060719 1204405 1413399 1340450 691138 -318017 -1014262
41634a014262j0033K49247k10349p77950o67520J98908J145980J439973R31417
$$ -1014262 -1024295 -775048 -985397 -1763347 -2430867 -2231959 -1085979 353994 1285411
41625A285411O1815o44948r54736q14137k27347M93016P16297K42114k24756q246
$$ 1285411 1347226 702278 -252458 -1066595 -1293942 -800926 -84629 157485 -67271 -75517
41615g5517L89133j7520r68837j109368p3189Q34893N83609j56099l09409j1316
$$ -75517 313616 296096 -672741 -1782109 -1855298 -1020405 -436796 -592895 -902304 -913620
41605i13620Q1970J11660M53439O30313Q4196n70454l75938L72420O66672M65015
$$ -913620 -831650 -719990 -266551 363762 447958 -122496 -498434 -126014 540658 1005673
41595A005673M40504M62208j25884r48469r39171j79347J91905r2321k23172p3748
$$ 1005673 1446177 1908385 1782501 834032 -105139 -284486 -92581 -184902 -408074 -481822
41585d81822l44638p66708j70666J167202J373197J2418q65100M4735J100191
$$ -481822 -826460 -1593168 -1763834 -596632 776565 788983 -76117 -31382 1068809
41576A068809M47502q89953q09738L74702O65829k25407o90868j13229M04695
$$ 1068809 1516311 626358 -183380 191322 857151 631744 -59124 -172353 232342
41567B32342K91693L35788Q33215Q15928j63987j040673q60229j73370L0156k05279
$$ 232342 524035 859823 1693038 2508966 2344979 1304306 444077 270707 300863 95584
41557I5584k23035Q2016K82964J34374k70091o75471o93739j04291O55240Q14282
$$ 95584 -127451 -45435 237529 371903 101812 -573659 -1267398 -1371689 -716449 97833
41547I7833K75171k61131l35427k54058l41418l41706N8000O35437R36645P90163
$$ 97833 373004 111873 -223554 -477612 -819030 -1160736 -1102736 -467299 469346 1259509
41537A259509K86363l65687p97660p07001k56239J07678K16992J60132j11699
$$ 1259509 1545872 1180185 382525 -324476 -580715 -473037 -256045 -95913 -207612
41528b07612n44590o02550J9107N21587m4154j044141q67157N41257J318847M63345
$$ -207612 -752202 -1354752 -1335645 -814058 -858212 -1902353 -2769510 -2228253 -909406 -446061
41518d46061o13176l41812O26001P38744J17206N0598N80318M74691m94259r99102
$$ -446061 -1059237 -1401049 -775048 -36304 80902 131500 711818 1186509 692250 -306852
41508c06852k21503R25053J172156M62458l79935p21233l85104M49441J152873
$$ -306852 -528355 396698 1568854 2031312 1651377 930144 545040 994481 2147354
41499B147354J021448J55511n38732n54220m40816q55744j480833j444681n30435
$$ 2147354 3168802 3324313 2785581 2231361 1790545 934801 -546032 -1990713 -2521148
41490b521148N53655R99650O38939o5751m98000l96571m6649Q2603p1512j03169
$$ -2521148 -1967493 -967843 -328904 -394655 -892655 -1289226 -1335875 -1253272 -1324784 -1427953
41480a427953K75050Q11835J027169P62505K60127j71753m00508m40530l39530
$$ -1427953 -1152903 -341068 686101 1448606 1708733 1536980 1136472 695942 356412
41471C56412j34888J08258K57125J77190j37358n53685q99372r64168n09090M09456
$$ 356412 221524 329782 586907 764097 626739 73054 -826318 -1790486 -2299576 -1890120
41461a890120J143197R64540O2790m82484p2982N78093N12273o3165j94758K77647
$$ -1890120 -746923 217617 280407 -202077 -275059 303034 815307 752142 557384 835031
41451H35031N10907R742o39530o32757N0470P62015Q80408K64572n90627q38028
$$ 835031 1345938 1355680 716150 83393 133863 895878 1776286 2040858 1450231 612203
41441F12203j70666O33480O25181K8341j06693M28135O65444M4671p02894p80172
$$ 612203 441537 1075017 1700198 1728539 1621846 2049981 2715425 2760096 2057202 1277030
41431A277030m99397m83498m78996P6717P99457O92324l99119j484144j606876
$$ 1277030 777633 294135 -184861 -108144 691313 1383637 984518 -499626 -2106502
41422b106502p71208K88763Q15752N70786K7215q3110L49965O70188M24696M473
$$ -2106502 -2877710 -2588947 -1773195 -1202409 -1175194 -1258304 -908339 -238151 186545 191018
41412A91018p1213L7417m0114j32505N8700K45501K6141l20899l20859j82012
$$ 191018 119805 157222 117108 -15397 43303 288804 314945 -5954 -326813 -508825
41402e08825k96647k80058M01840J159665R05363j57030p01945l11378N7830j30861
$$ -508825 -805472 -1085530 -683690 475975 1381338 1224308 522363 210985 268815 137954
41392A37954k23421Q6852k9583r04996j315853k66364J220890J459667N07749
$$ 137954 -85467 1385 -28198 -933194 -2249047 -2515411 -1294521 165146 672895
41383F72895j79678j7021K31872O0216q1436J57795M09043L27559J01649n7623
$$ 672895 493217 476196 708068 768284 686848 844643 1253686 1581245 1682894 1625271
41373A625271k35819m07920l38461o8320P0981M9708J56559L17606N4205o68010
$$ 1625271 1389452 981532 643071 574751 645732 695440 851999 1169605 1223810 555800
41363E55800j161677q88209j21132N20935P64810O79542M21322K27898K86349
$$ 555800 -605877 -1494086 -1615218 -1094283 -329473 350069 771391 999289 1285638
41354A285638M07462K06104k60742m92932l33007k09901l57667l80166J8783M18088
$$ 1285638 1693100 1899204 1638462 1145530 812523 602622 244955 -135211 -116428 301660
41344C01660L06803j01132k41793o0543Q5137J28078K81232M70784L87351O0663
$$ 301660 608463 507331 265538 204995 290132 418210 699442 1170226 1557577 1618240
41334A618240j67762k29380l42136m42396k14781K17168K93487m3717r1596M84159
$$ 1618240 1450478 1221098 878962 436566 221785 438953 732440 688723 597127 1081286
41324A081286Q85078K46295r49738j388917p13230J11015L07482K30064L88073
$$ 1081286 1966364 2212659 1262921 -125996 -839226 -728211 -420729 -190665 197408
41315A97408M22682j65799q69794p31252J86792Q32464O61357K06339R608j21148
$$ 197408 620090 454291 -415503 -1146755 -959963 -127499 533858 740197 749805 628657
41305F28657m30462n84212k63476J97504L17652J48413n0216l36391p42554q60552
$$ 628657 198195 -386017 -649493 -451989 -134337 14076 -36140 -372531 -1115085 -1975637
41295a975637l96605K17239L78004J59668L3741J05328K26523M53632P20449N30035
$$ -1975637 -2372242 -2155003 -1776999 -1617331 -1583590 -1478262 -1251739 -798107 -77658 452377
41285D52377k35331p14924k47835L81045Q5941o04391l19743O97589P49731m90183
$$ 452377 217046 -497878 -745713 -364668 -278727 -883118 -1202861 -505272 244459 -245724
41275b45724j220026k79704J071470J203850M34283K564j7268l17460q02297r16525
$$ -245724 -1465750 -1745454 -673984 529866 964149 966713 949445 631985 -170312 -1086837
41265a086837q43719r80227q24998J83990J271280J278355N95319N29651J027523
$$ -1086837 -1930556 -2910783 -3735781 -3551791 -2280511 -1002156 -406837 122814 1150337
41256A150337P93239l14967q58430j77872N54204L43260j18412P7062L94784r1139
$$ 1150337 1943576 1628609 770179 592307 1146511 1489771 1371359 1448421 1843205 1752066
41246A752066r21976q87490M2509O73266L50337k77458l86654o3405N9236k39366
$$ 1752066 830090 -57400 -14891 658375 1008712 731254 344600 281195 340431 101065
41236A01065n52231m42180K2974M14766M94024L93771K56800N1357r7289J26799
$$ 101065 -451166 -893346 -870372 -455606 38418 432189 688989 740346 643057 769856
41226G69856N63921M29495n34641j280399p25485N75031J111126N38839j19461
$$ 769856 1333777 1763272 1228631 -51768 -777253 -202222 908904 1447743 1328282
41217A328282l11268n40462r07974o32274L67524Q80437K79741l37638L6515O06912
$$ 1328282 1017014 476552 -431422 -1063696 -696172 184265 464006 126368 162883 769795
41207G69795K01250o59370p13783k08387m04478j225605j243270o7291R52649
$$ 769795 971045 311675 -402108 -610495 -1014973 -2240578 -3483848 -3551139 -2598490
41198b598490Q07999J65048L4507L13391L75201J94256J33723K46624L98908N82132
$$ -2598490 -1790491 -1625443 -1590936 -1277545 -902344 -708088 -574365 -327741 71167 653299
41188F53299O38172J96611o63217j196245r03765k11687K01140K91489L67726
$$ 653299 1291471 1488082 824865 -371380 -1275145 -1486832 -1285692 -994203 -626477
41179f26477L42321q9461p09445q14277n9057J068684J691016J327676K90602
$$ -626477 -284156 -373617 -1083062 -1897339 -1956396 -887712 803304 2130980 2421582
41170B421582o11608q17228m71412q8809O3129Q519k46962n94100n87083J6892
$$ 2421582 1809974 992746 521334 432525 495654 504173 257211 -336889 -923972 -907080
41160i07080N88872L06587m76605n27433L48336Q00595l6441j084954q69558L29170
$$ -907080 -318208 -11621 -488226 -1015659 -667323 133272 96831 -988123 -1857681 -1528511
41150a528511J067183Q80759M92386K29942k74812q27645o18272K45791N39259
$$ -1528511 -461328 419431 911817 1141759 866947 39302 -578970 -333179 206080
41141B06080j79431p37184j95344O27631N07027k61845m96886o625M51037O23964
$$ 206080 26649 -710535 -905879 -278248 228779 -33066 -529952 -536577 -85540 538424
41131E38424Q32855Q39417O6801j036305j260187n15839r0015n61368q23645L6729
$$ 538424 1371279 2210696 2277497 1241192 -18995 -534834 -624849 -1186217 -2009862 -1973133
41121a973133J129874J138229L61085P6962M49575M58328k70305q63294n97779
$$ -1973133 -843259 294970 656055 733017 1182592 1640920 1370615 507321 -90458
41112i0458J27207N35100M51017K13911J13357J61384J40201j46336m69052l14037
$$ -90458 36749 571849 1022866 1236777 1350134 1511518 1651719 1505383 1036331 722294
41102G22294K34169K90527n01591j063571l29175R15849J001324q6613p33356
$$ 722294 956463 1246990 745399 -318172 -647347 268502 1269826 1183213 449857
41093D49857l23572o8667p06648j146322l89949P06256Q63405L68009K47726M30181
$$ 449857 126285 57618 -649030 -1795352 -2185301 -1479045 -615640 -247631 95 430276
41083D30276J90945k99382l58196j62768k88841l65471K89275J071178P70015
$$ 430276 621221 321839 -36357 -199125 -487966 -853437 -564162 507016 1277031
41074A277031l27960p04965j3260M90986J55714j50986J48659K82783k90637p13510
$$ 1277031 949071 244106 230846 721832 877546 726560 875219 1158002 867365 153855
41064A53855j92000N65076N26075j515q4277K20753K04052q5099k6365K73797
$$ 153855 -38145 526931 1053006 1051491 967214 1187967 1392019 1306920 1280555 1554352
41054A554352R9259n10848o43478L6421O45626L05344o22694j010303l80788N64063
$$ 1554352 1653611 1142763 499285 535706 1181332 1486676 863982 -146321 -527109 36954
41044C6954Q27715K84778k46844j15345L11476K56955k60538m83505j44220J45122
$$ 36954 864669 1149447 902603 787258 1098734 1355689 1095151 611646 467426 612548
41034F12548m3657k80207r9272J93900J08322k16780l92580m74800o30394n72320
$$ 612548 568891 288684 189412 383312 491634 274854 -117726 -592526 -1222920 -1795240
41024a795240n0205M64295L51805j45482k43541K13627O25296N90055L20802J32016
$$ -1795240 -1845445 -1381150 -1029345 -1174827 -1418368 -1204741 -579445 10610 331412 463428
41014D63428J00395K14007L51027J92158l56684q09212o88394k53634m1290M1727
$$ 463428 563823 777830 1128857 1321015 964331 155119 -533275 -786909 -828199 -786472
41004g86472L92805P17763L41524n05150p68591j77801K49648k24724q77190n87791
$$ -786472 -393667 324096 665620 160470 -608121 -785922 -536274 -760998 -1638188 -2225979
40994b225979N35842J337224J071016Q0250p61306q01772n556R65878J200102
$$ -2225979 -1690137 -352913 718103 798353 37047 -764725 -770281 195597 1395699
40985A395699M17557o75834j134889p08271J27076P53971P86178J96634n45209
$$ 1395699 1813256 1137422 2533 -705738 -578662 175309 961487 1158121 612912
40976F12912p26034j92359L08369M2513o23592o16976L50845J269198J067800
$$ 612912 -113122 -305481 2888 45401 -578191 -1195167 -844322 424876 1492676
40967A492676n0424r27436q98320m40783l09518m65193k59926M66889J002999
$$ 1492676 1442252 514816 -383504 -824287 -1133805 -1598998 -1858924 -1392035 -389036
40958c89036O90861j29090n16743j25485M51420N45098J82981j82608l53632m61436
$$ -389036 301825 172735 -344008 -469493 -18073 527025 710006 527398 173766 -287670
40948b87670n35093l61990J53577O99603P83782K50322n05305q93038o71441p4794
$$ -287670 -822763 -1184753 -1031176 -331573 452209 702531 197226 -695812 -1367253 -1442047
40938a442047N17091Q39988P21139J46650n10468o86536l10440L7928l3186j19147
$$ -1442047 -924956 -84968 636171 782821 272353 -414183 -724623 -686695 -719881 -839028
40928h39028K64985P38537N43870k21347p00449o00778n14837p08772n32780M28268
$$ -839028 -574043 164494 708364 487017 -213432 -814210 -1329047 -2037819 -2570599 -2142331
40918b142331J390204J310572L26576m92954n59937k42234p5724j49025k73822
$$ -2142331 -752127 558445 885021 392067 -167870 -410104 -485828 -634853 -908675
40909i08675k61324J0379M37002O32572L71526k0919j01682O206j58075n61881
$$ -908675 -1169999 -1159620 -722618 -90046 281480 260561 158879 165085 7010 -554871
40899e54871o36996j40058M58993O16973L23840j07407m56067n71319k96306K76903
$$ -554871 -1191867 -1331925 -872932 -255959 67881 -39526 -495593 -1066912 -1363218 -1086315
40889a086315P08751O56836K86196K8491N6956J84970J87696N6361m1661K240
$$ -1086315 -377564 279272 565468 593959 650915 835885 1023581 1079942 1038281 1040521
40879A040521K5168k71803q06680r39184k44351O41063O06051l58064r32323k69772
$$ 1040521 1065689 793886 -12794 -951978 -1196329 -555266 50785 -307279 -1239602 -1509374
40869a509374P27645P18562p7071k92553M09433Q51570K45601o25623p15814k15714
$$ -1509374 -781729 -63167 -140238 -432791 -23358 828212 1073813 448190 -267624 -483338
40859d83338N3464k5554o6765j33267m61002o26019q7595O47844N54381k54535
$$ -483338 -429874 -455428 -522193 -655460 -1116462 -1742481 -1830076 -1182232 -627851 -882386
40849h82386n82384j7607M80645K45529p6244J73124M59422P1604n61821o12481
$$ -882386 -1464770 -1482377 -1001732 -756203 -832447 -659323 -199901 -128297 -690118 -1302599
40839a302599k14963k3731N034K61709M25253O901m39591m2838O75338L73047
$$ -1302599 -1517562 -1541293 -1536259 -1274550 -849297 -842396 -1281987 -1324825 -649487 -276440
40829b76440p74470r93872L62851J631819J246398m6878n41299o9056K05059j97795
$$ -276440 -1050910 -2044782 -1681931 -50112 1196286 1149408 608109 539053 744112 546317
40819E46317o48155p01897n75477l95210j8056L65053L39825M2613L1689L42743
$$ 546317 -101838 -803735 -1379212 -1774422 -1792478 -1427425 -1087600 -1044987 -1013298 -670555
40809f70555M51427K30360J16796J84377p8087p29257r35072j15775J063517J466067
$$ -670555 -219128 11232 128028 312405 234318 -494939 -1430011 -1545786 -482269 983798
40799I83798Q70148K1250m23178m34350k46638j4788J17379K3713k00451k93953
$$ 983798 1853946 1875196 1452018 1017668 771030 756242 873621 897334 696883 402930
40789D02930j71141o986O6478J29113K47575K92297J39339j03628k71836m11551
$$ 402930 231789 224803 291281 420394 667969 960266 1099605 995977 724141 312590
40779C12590n98277n80064l2394P42920Q94605J66747m97985j41024P22869O86635
$$ 312590 -285687 -865751 -898145 -155225 739380 906127 408142 267118 989987 1676622
40769A676622m67043j292668p34122K98853K67792p28379j160062l40569O78882
$$ 1676622 1209579 -83089 -817211 -518358 -250566 -978945 -2139007 -2479576 -1800694
40760a800694P36110R2958k28166L5919K77165J17269j13456l0497K32410L38852
$$ -1800694 -1064584 -971626 -1199792 -1163873 -886708 -769439 -882895 -913392 -680982 -342130
40750c42130K85808K94555L34622J54484j83360k32174J13671K38091l17877q95454
$$ -342130 -56322 238233 572855 727339 543979 311805 425476 663567 345690 -549764
40740e49764m74314O15536P98054m64578j538472p41214J163692J919864Q81892
$$ -549764 -1024078 -408542 389512 -75066 -1613538 -2354752 -1191060 728804 1610696
40731A610696l37392m48904j61891n72525j187760p65670O07367J583044J453774
$$ 1610696 1273304 824400 662509 89984 -1097776 -1863446 -1256079 326965 1780739
40722A780739Q24687L43631j59305q94305j343743r26676K7318O09726M56850
$$ 1780739 2605426 2949057 2789752 1895447 551704 -374972 -347654 262072 718922
40713G18922J4135k43104l13291k94079k9750N04327Q03865L53625n19615q48382
$$ 718922 733057 489953 176662 -117417 -147167 357160 1161025 1514650 995035 146653
40703A46653k44703N37005N80940n715l60819j26108J29672j82450q16683j016096
$$ 146653 -98050 438955 1019895 1014180 653361 527253 656925 474475 -342208 -1358304
40693a358304m64742L45015O74806L47484q5101m0834L23657L38703j40775l97363
$$ -1358304 -1823046 -1478031 -803225 -455741 -540842 -581676 -258019 80684 -60091 -457454
40683d57454J16464Q54798Q66026J19303n44532o41916m60779k55095J25596N87894
$$ -457454 -340990 513808 1379834 1499137 954605 312689 -148090 -403185 -277589 310305
40673C10305N90259K489m95775l53589Q0131K18925J27739J64753K12208m3334
$$ 310305 900564 903053 407278 53689 133820 352745 480484 645237 857445 814111
40663H14111l88704l57767n1429j0692l35420n35407k77311K26442O07744O91068
$$ 814111 425407 67640 16211 5519 -329901 -865308 -1142619 -916177 -308433 382635
40653C82635M36553o7009n24410o72742n80211m45301k50246M4863J81345l9658
$$ 382635 819188 752179 227769 -444973 -1025184 -1470485 -1720731 -1675868 -1494523 -1534181
40643a534181k41580J09044Q25280J131346P02955J6480m02102n03378l73452
$$ -1534181 -1775761 -1666717 -841437 289909 992864 1009344 607242 103864 -269588
40634b69588M0175O20269R79329R15395N87481J11908n42111j131148j202012
$$ -269588 -229413 390856 1370185 2285580 2873061 2984969 2442858 1311710 109698
40625A09698q10071n56329n99093l25746N04100J024237M60046n01836n60303
$$ 109698 -700373 -1256702 -1855795 -2181541 -1677441 -653204 -193158 -694994 -1255297
40616a255297K53857O08804o7714o83706j43611R71546J205729K48098p32937
$$ -1255297 -1001440 -392636 -460350 -1144056 -1287667 -316121 889608 1137706 404769
40607D04769p15730j8658L73384J25865k36131j79513K29200N59991N24226J53540
$$ 404769 -310961 -329619 43765 169630 -66501 -246014 -16814 543177 1067403 1220943
40597A220943k78338m03820o3297L94136L49007l30583r85284r01808j70039N18877
$$ 1220943 942605 538785 475488 869624 1218631 888048 -97236 -999044 -1169083 -650206
40587f50206P33180N38817P1865n28774q16340l72768M01798N41241j44449o65411
$$ -650206 82974 621791 693656 164882 -651458 -1024226 -622428 -81187 -225636 -891047
40577h91047k31657O24360R13304N88192K93287J59992k00284o88614o75099m1382
$$ -891047 -1122704 -498344 414960 1003152 1296439 1456431 1256147 567533 -107566 -148948
40567a48948N64402P00487O29777O00792L20782m56458j315593j571189j001505
$$ -148948 415454 1115941 1745718 2346510 2667292 2210834 895241 -675948 -1677453
40558a677453L6395R48419J237732Q38371K39170k7168k4148j69107m63651n44388
$$ -1677453 -1641058 -692639 545093 1383464 1622634 1595466 1571318 1402211 938560 394172
40548C94172m24332m34824m18945J06627Q34842P81950r3733n29819J15115P12851
$$ 394172 -30160 -464984 -883929 -777302 57540 839490 745757 215938 331053 1043904
40538A043904J18940r46767j031390j61421N12236O95494R71251J161802M38040
$$ 1043904 1162844 216077 -815313 -976734 -464498 230996 1202247 2364049 2802089
40529B802089q53641j208398k56646N12752l343r40603r86047k68496K91269N30366
$$ 2802089 1948448 740050 483404 996156 992813 52210 -933837 -1202333 -911064 -380698
40519c80698Q05881R24290M53826l35559q23524r59818r75334o19895L44823J250842
$$ -380698 425183 1349473 1803299 1467740 644216 -315602 -1290936 -1910831 -1566008 -315166
40509c15166J179020L48420j38686J25704M79422L89340P1535k09622n37924p78890
$$ -315166 863854 1212274 1073588 1199292 1678714 2068054 2139589 1929967 1392043 613153
40499F13153m64971L47246Q01482L11232n99231r83109o15447k4316L08669L30598
$$ 613153 148182 495428 1296910 1608142 1008911 25802 -589645 -613961 -305292 25306
40489B5306J71711n6189j97181o7862L20766O25043M15647k82535p82384m05898
$$ 25306 197017 140828 -56353 -124215 196551 821594 1237241 954706 172322 -233576
40479b33576N58240J005034L76421n96439r34378o99209n96034p06087m96683
$$ -233576 324664 1329698 1706119 1109680 175302 -523907 -1119941 -1826028 -2322711
40470b322711Q7947M96020N53334O46336P68283L55273n63347r89864l40374N55302
$$ -2322711 -2234764 -1738744 -1185410 -539074 229209 584482 21135 -968729 -1309103 -753801
40460g53801N76747j16193m36728M7353O89201Q04060M33332J5367j73672j16771
$$ -753801 -177054 -293247 -729975 -682622 6579 810639 1243971 1259338 1085666 968895
40450I68895O0325J85036J93258J79113J63445l3032m60884p51078m79771K20341
$$ 968895 1029220 1214256 1407514 1586627 1750072 1717040 1256156 505078 25307 245648
40440B45648P08421N43089m3367m28717k61267J88874L25910q5406n83537n24311
$$ 245648 954069 1497158 1453791 1025074 763807 952681 1278591 1193185 609648 85337
40430H5337R1978N61664L20001l97495q57833n99255K10500R91892J216160Q16562
$$ 85337 177315 738979 1058980 661485 -196348 -795603 -585103 406789 1622949 2439511
40420B439511K31688p8742j31905k33263l90390l02278N0990K49900J6062m12120
$$ 2439511 2671199 2592457 2460552 2227289 1836899 1534621 1585611 1835511 1851573 1439453
40410A439453o33864m90814l4687N08708O63117J09505o47781o08929L81471J175513
$$ 1439453 805589 314775 280088 788796 1451913 1561418 913637 304708 686179 1861692
40400A861692P00200o30986j446125j068550q6078N60578N20755Q7324k78006
$$ 1861692 2561892 1930906 484781 -583769 -669847 -109269 411486 498810 220804
40391B20804l78841l84098m64993l88940J77868R33855J076038M30210j57978
$$ 220804 -158037 -542135 -1007128 -1396068 -1218200 -284345 791693 1221903 1063925
40382A063925j6206L50819J01204n73268p48935k11625K73938J60804j83584j92464
$$ 1063925 1047719 1398538 1499742 926474 177539 -34086 239852 400656 217072 24608
40372B4608P5907J54514j27892m52414m13227J7886M39675M83156K65390J33361
$$ 24608 100515 255029 127137 -325277 -738504 -720618 -280943 202213 467603 600964
40362F00964J7255m39804r97576p94077L49764J306384J043523Q9147k87640O7582
$$ 600964 618219 178415 -819161 -1613238 -1263474 42910 1086433 1175580 887940 955522
40352I55522K12460k23807n52333l11365N4721J46323K69535O28669O89943N0118
$$ 955522 1167982 944175 391842 80477 135198 281521 551056 1179725 1869668 1919786
40342A919786o67496n95069L7219J74272m94752j024563n52767M33068P24593
$$ 1919786 1252290 657221 694440 868712 373960 -650603 -1203370 -770302 -45709
40333d5709N0220n79616l39333K64303K71732j79395r3066P01799J159449O07959
$$ -45709 4511 -575105 -914438 -650135 -378403 -557798 -650864 50935 1210384 1818343
40323A818343k47684m78269k18810o1715N2951L95775N30996n0782p94714p32177
$$ 1818343 1570659 1092390 873580 811865 864816 1260591 1791587 1740805 946091 213914
40313B13914m1281K00437k60635n44826j42486L86188M61529K51942P8004r0851
$$ 213914 172633 373070 112435 -432391 -574877 -188689 272840 524782 602786 511935
40303E11935k26911j03999J44420M7795l83180n83403l71197j73029j06169K77875
$$ 511935 285024 181025 325445 373240 -9940 -593343 -964540 -1137569 -1243738 -965863
40293i65863R91769J233343N15400n35083j014953q03160l62102l5307P2120K042
$$ -965863 25906 1259249 1774649 1239566 224613 -578547 -940649 -975956 -903836 -901794
40283i01794P855K36911K78368k93818r07415m82775Q52109J608987R37827k55040
$$ -901794 -893939 -657028 -378660 -672478 -1579893 -2062668 -1210559 398428 1336255 1081215
40273A081215p46576n42488k91668j19871J06489J54368p1808p5011L96132P34976
$$ 1081215 334639 -207849 -499517 -619388 -512899 -358531 -430339 -505350 -109218 625758
40263F25758M66344R5265J31386Q5780n35490j005085l73255Q55065J313829O95503
$$ 625758 1092102 1187367 1318753 1404533 869043 -136042 -509297 345768 1659597 2355100
40253B355100j18740n43037o77309m46270L40212J087898Q43587k24043q91878
$$ 2355100 2236360 1693323 1016014 569744 909956 1997854 2841441 2617398 1725520
40244A725520o25081j69735j43531j39315K86290O96222N12797m852k00605j4319
$$ 1725520 1100439 930704 787173 647858 934148 1630370 2143167 2138315 1937710 1923391
40234A923391N4683k54037o52290p05722k95703K65453N04800K69195j09306k77947
$$ 1923391 1978074 1724037 1071747 366025 70322 335775 840575 1109770 1000464 722517
40224G22517l30623n24098p09843m95601O8748M22434K13915k28409k75250L03797
$$ 722517 391894 -132204 -842047 -1337648 -1268900 -846466 -632551 -860960 -1136210 -832413
40214h32413J048472J168614L37412q13496j251399o97517J19727M82417M57214
$$ -832413 216059 1384673 1722085 908589 -342810 -1040327 -920600 -438183 19031
40205A9031M14717L70549K38699J97373K77351Q3165n11132q87721n38690Q3533
$$ 19031 433748 804297 1042996 1240369 1517720 1600885 1089753 202032 -336658 -253125
40195b53125K43450l0329k94438n51232q90560p86143J86718J274849J318070
$$ -253125 -9675 -40004 -334442 -885674 -1776234 -2562377 -2375659 -1100810 217260
40186B17260M16980k73924k98616k73836m98088m18651K35202Q73028J013445
$$ 217260 634240 360316 61700 -212136 -710224 -1128875 -893673 -20645 992800
40177I92800R41450R71831Q34411K50983m94017r70197j105893r89604o22321
$$ 992800 1934250 2906081 3740492 3991475 3497458 2527261 1421368 431764 -190557
40168a90557j06327K89199L78540R7610n65190j262980j236698k44815P54985
$$ -190557 -296884 -7685 370855 468465 -96725 -1359705 -2596403 -2841218 -2086233
40159b086233P16641M9192P038O89425R13923K12427l92386q5035M75066L24604
$$ -2086233 -1369592 -1320400 -1313362 -623937 289986 502413 110027 24992 500058 824662
40149H24662l09535n48498k50663j8819j77347m41051m60780k43198p2359j75574
$$ 824662 515127 -33371 -284034 -302853 -480200 -921251 -1382031 -1625229 -1697588 -1873162
40139a873162l67668j31461O38405J196710Q11433j20291n45141k39773J6982
$$ -1873162 -2240830 -2372291 -1733886 -537176 274257 153966 -391175 -630948 -613966
40130f13966k22181m67104k15118L14345O26922N03710j4027n70600m72183N15718
$$ -613966 -836147 -1303251 -1518369 -1204024 -577102 -73392 -87419 -658019 -1130202 -614484
40120f14484J434410J121507j08265q09299m43416Q8863P9161q4395L3919J69333
$$ -614484 819926 1941433 1833168 1023869 580453 669316 748477 664082 698001 867334
40110H67334J06414J04991J59336j34806o15503n35101J54574O20690N47160M69110
$$ 867334 973748 1078739 1238075 1103269 487766 -47335 107239 727929 1275089 1744199
40100A744199M31094k14942j220720j259336l6145R81021P64508J06874q7216
$$ 1744199 2175293 1960351 739631 -519705 -555850 425171 1189679 1296553 1209337
40091A209337k18864o04959l95216P10722J274153K89331q94320o16343M23569
$$ 1209337 990473 385514 -9702 701020 1975173 2264504 1370184 753841 1177410
40082A177410M95700k72580m64615L446J8837m79921m87481J12518M79293M74774
$$ 1177410 1673110 1400530 935915 939361 958198 478277 -9204 103314 582607 1057381
40072A057381O03469N68873k62264j169593p85826N46789J031041J24215q43335
$$ 1057381 1660850 2229723 1967459 797866 12040 558829 1589870 1714085 870750
40063H70750r24731n97076k76349L51496J051411Q73190r8333m65546K84803Q59363
$$ 870750 -53981 -651057 -927406 -575910 475501 1348691 1250358 784812 1069615 1928978
40053A928978K78534n52790m52129J20452L94p03943q57765q8140P57891Q40534
$$ 1928978 2207512 1654722 1202593 1323045 1323439 619496 -238269 -326409 431482 1272016
40043A272016K64974k62495l02056p7431n5304k11782n5296M59985O23427N3877
$$ 1272016 1536990 1274495 972439 895008 839704 627922 572626 1032611 1656038 1709915
40033A709915n40403m22976o66K3150nN80682J151107N64573q06571j368921o78422
$$ 1709915 1169512 746536 745870 769020 769015 1349697 2500804 3065377 2258806 889885 211463
40022B11463N6282J7228k16807m6212K27461L23484N07561P11391L61395m43261
$$ 211463 267745 284973 68166 21954 249415 572899 1080460 1791851 2153246 1709985
40012A709985p83517m01794j10869k67370j39295O12798J113567O81627p7709
$$ 1709985 926468 524674 413805 146435 7140 619938 1733505 2415132 2337423
40003B337423l52606k58115j61237Q9910M85336L96566l59378q91509n06443K14279
$$ 2337423 1984817 1726702 1565465 1655375 2140711 2537277 2177899 1286390 779947 994226
39993I94226M25968K99003L98731N18179J20311n48184p22653k40673L36167N63997
$$ 994226 1420194 1719197 2117928 2636107 2756418 2208234 1485581 1244908 1581075 2145072
39983B145072N45189O05732Q53332J000603O34536j50911o56111n18477l01085
$$ 2145072 2690261 3295993 4149325 5149928 5784464 5633553 4977442 4458965 4157880
39974D157880m59203l43669O44093J490246P57927r22387j400672j84043Q25061
$$ 4157880 3698677 3355008 3999101 5489347 6247274 5324887 3924215 3740172 4565233
39965D565233K42669r69992j343116q81951k71420M05811J078298J066895J62622
$$ 4565233 4807902 3837910 2494794 1612843 1341423 1747234 2825532 3892427 4055049
39956D055049o47550m69091L02996P42478M87365l66199j422260j696558m47620
$$ 4055049 3407499 2938408 3241404 3983882 4471247 4105048 2682788 986230 538610
39947E38610J322313J638573K73797q73254o11920R4342J74326L1842J63197O5829
$$ 538610 1860923 3499496 3773293 2900039 2288119 2382461 2556787 2588629 2751826 2817655
39937B817655l95412l19331M49137O83157j800k58601M82491P79557j39124p50312
$$ 2817655 2422243 2102912 2552049 3235206 3233406 2974805 3457296 4236853 4097729 3347417
39927C347417m108O21012j18610p30583L05796J484862P50292q10490q18756L13748
$$ 3347417 3343309 3964321 3845711 3115128 3420924 4905786 5656078 4845588 4026832 4340580
39917D340580L71468o52816p83468L03047R53462O02275L82216P31424Q41985
$$ 4340580 4712048 4059232 3275764 3578811 4532273 5134548 5516764 6248188 7090173
39908G090173M97386L41561L91218J11469k85797k32066L3856J41552N42663J387157
$$ 7090173 7587559 7929120 8320338 8431807 8146010 7913944 7947800 8089352 8632015 10019172
39898A0019172J745282J417267J757506L031506L245101J728591J173151L326442
$$ 10019172 11764454 13181721 14939227 17970733 21215834 22944425 24117576 27444018
39890B7444018N582536N313094M600367O493475R490689J0639556J1412226J4959880
$$ 27444018 33026554 38339648 42940015 49433490 58924179 69563735 80975961 95935841
39882I5935841J9871998K2512731K3219089K4009157K3172068J9675927J9445218
$$ 95935841 115807839 138320570 161539659 185548816 208720884 228396811 247842029
39875B47842029K7215851L4843082L0387493J7973622J3038435J5020552K772963
$$ 247842029 275057880 309900962 340288455 358262077 371300512 386321064 389094027
39868C89094027l3188390o9675799p7120458n6465222l3543164k3645378j9632844
$$ 389094027 355905637 286229838 209109380 152644158 119100994 95455616 75822772
39861G5822772j2784535o664479o178007p539976o107164m278117n216685o280486
$$ 75822772 63038237 56373758 50195751 42655775 36548611 32270494 27053809 20773323
39853B0773323m413793j932344j779638k217306q99982L97072m67156j649150
$$ 20773323 16359530 14427186 12647548 10430242 9530260 9927332 9460176 7811026
39845G811026r27558N1257q21420j868304q24326P35463K27637j224364r06838
$$ 7811026 6883468 6934725 6113305 4245001 3420675 4156138 4383775 3159411 2252573
39836B252573O99701J085865Q4151m74911k57753l60708p14134m26424Q5135j79356
$$ 2252573 2952274 4038139 4122290 3647379 3389626 3028918 2314784 1888360 1973495 1794139
39826A794139p36683n01616J46935K29876Q9553M36159N78740k93914j139452
$$ 1794139 1057456 555840 702775 932651 1022204 1458363 2037103 1743189 603737
39817F03737n52714P13533R05160J14509k11337J00480P564n75905p76293n69232
$$ 603737 51023 764556 1669716 1784225 1572888 1673368 1680932 1105027 328734 -240498
39807b40498o25519o62589J30625J233393J235510J06496o92017m26286J26909
$$ -240498 -866017 -1528606 -1397981 -164588 1070922 1177418 485401 59115 186024
39798A86024K29869R1345J6922j18998k85778j45773K99565O33040O43812M65028
$$ 186024 415893 507238 524160 405162 119384 -26389 273176 906216 1550028 2015056
39788B015056K26290N5441J30683L04754J47716k54147k44982K27654L18476k63433
$$ 2015056 2241346 2296787 2427470 2732224 2879940 2625793 2380811 2608465 2926941 2663508
39778B663508o10685k03254P3773m60709q73361j44248R60231J059486L59028
$$ 2663508 2052823 1849569 1923342 1462633 589272 445024 1405255 2464741 2823769
39769B823769J01001M62662N79542K09661j14794k71127n37241o97143l76343
$$ 2823769 2924770 3387432 3966974 4176635 4061841 3790714 3253473 2556330 2179987
39760B179987M1741n8915m63661n86712m64062l26831P9227P05254O61786l03390
$$ 2179987 2221728 2162813 1699152 1112440 648378 321547 400774 1106028 1767814 1464424
39750A464424q51999n3854P97568J70302r99497p67096N12081Q01057j81736p31918
$$ 1464424 612425 558571 1356139 1526441 526944 -240152 271929 1072986 891250 159332
39740A59332k55592k2097n77902q44703l09893R8702n3828M8540O39367P41871
$$ 159332 -96260 -118357 -696259 -1540962 -1850855 -1752153 -1805981 -1757441 -1118074 -376203
39730c76203R2184k01548L01838N28005o2870l96315K31760P93476L08578n09357
$$ -376203 -284019 -485567 -183729 344276 281406 -114909 116851 910327 1218905 709548
39720G09548n79141j33537O7429O1844J64405J47188j27166k22325k0675m1187
$$ 709548 130407 -3130 64299 126143 290548 437736 310570 88245 67570 26383
39710B6383k63659P6950Q85618R19422o9449n79064J42393N87203n06530j751564
$$ 26383 -237276 -160326 725292 1644714 1575265 996201 1138594 1725797 1219267 -532297
39700e32297j141060P28616J577117Q30598J538L6791K63813J6939l77222n28656
$$ -532297 -1673357 -944741 632376 1462974 1464512 1501303 1765116 1782055 1404833 876177
39690H76177n99092o62469m29136J16391N17783M55398P5643k49589j49841M76934
$$ 876177 277085 -385384 -814520 -698129 -180346 275052 350695 101106 -48735 428199
39680D28199J096858R21558K6839n52706k79244J43181L3721j93881J5622K85489
$$ 428199 1525057 2446615 2473454 1920748 1641504 1784685 1818406 1624525 1640147 1925636
39670A925636J15941j26745l9789j14295p19513j035471k74202P96645Q89178
$$ 1925636 2041577 1914832 1875043 1760748 1041235 5764 -268438 528207 1417385
39661A417385R8221n42334p30882p55705l90627N31253J063892L23607p84834
$$ 1417385 1515606 973272 242390 -513315 -903942 -372689 691203 1014810 229976
39652B29976p31842J74454L08555n95756j213621r56995n80918m05697J13322
$$ 229976 -501866 -327412 -18857 -614613 -1828234 -2785229 -3366147 -3771844 -3658522
39643c658522Q13620P44223L2502k0618Q20929J221610N70123m4214J46383L90947
$$ -3658522 -2844902 -2100679 -2068177 -2088795 -1267866 -46256 523867 479653 626036 1016983
39633A016983R8887l8160L81241M55506k85109p27095j12218L68640m64356j488777
$$ 1016983 1115870 1077710 1458951 1914457 1629348 902253 790035 1158675 694319 -794458
39623g94458q41662J010351J703454K72974j619348j918169m55343J271834J829941
$$ -794458 -1636120 -625769 1077685 1350659 -268689 -2186858 -2642201 -1370367 459574
39614D59574J089989Q9090k38501j03992k71742o50531m10948M50782Q85351M89537
$$ 459574 1549563 1638653 1400152 1296160 1024418 373887 -37061 413721 1299072 1788609
39604A788609J40629L45864L20350m35067r82855m93771K64319K42997j71790
$$ 1788609 1929238 2275102 2595452 2160385 1177530 683759 948078 1191075 1019285
39595A019285j21674O3800l30372q29955o04006j25742l33630p69838l18233O89398
$$ 1019285 897611 961411 631039 -198916 -802922 -928664 -1262294 -2032132 -2350365 -1660967
39585a660967R47316M40404L45067P94446O69936k54497q19255m57845M4056J79091
$$ -1660967 -713651 -273247 71820 866266 1536202 1281705 462450 4605 48661 227752
39575B27752M57599R91712R34176K9993o93933n50765k24255m07022o27169k94796
$$ 227752 685351 1677063 2611239 2641232 1947299 1396534 1172279 765257 138088 -156708
39565a56708J61308J13165k08959l24362l61747n19559m17217K35446R58171J159458
$$ -156708 4600 117765 -91194 -415556 -777303 -1296862 -1714079 -1478633 -520462 638996
39555F38996Q83382L99153k28282o84481l98967M29134P18870Q1282m59469q3799
$$ 638996 1522378 1921531 1693249 1008768 609801 1038935 1757805 1839087 1379618 1295819
39545A295819N07944L61216j41142j39384R2134k45806q66044q27416k22614l1167
$$ 1295819 1803763 2164979 2023837 1884453 1976587 1730781 864737 37321 -185293 -216460
39535b16460m36931o14968k04368K19376K54564J70160J52733M8677k8908J80488
$$ -216460 -653391 -1268359 -1472727 -1253351 -998787 -828627 -675894 -627217 -656125 -475637
39525d75637K76210m04370j407982j390675j10426J020655R97268O37065J008281
$$ -475637 -199427 -603797 -2011779 -3402454 -3512880 -2492225 -1494957 -857892 150389
39516A50389J531629R98304k10558n23655L40962Q79316J40431q58426q32738
$$ 150389 1682018 2680322 2469764 1946109 2287071 3166387 3306818 2448392 1615654
39507A615654j75979m9596l43827j8234Q34689Q79949k50851j146498p13208K08596
$$ 1615654 1439675 1390079 1046252 1028018 1862707 2742656 2491805 1345307 632099 840695
39497H40695L32428p5882k681L71606J39873m18820j56998Q14022J091097K90897
$$ 840695 1173123 1097241 1094560 1466166 1606039 1187219 1030221 1844243 2935340 3226237
39487C226237l33073l3286L88395L57881O05791J461168J745698P39141k20524
$$ 3226237 2893164 2859878 3248273 3606154 4211945 5673113 7418811 8157952 7937428
39478G937428K64915J293339J172599L42680O94833K484069M037199M439211M523936
$$ 7937428 8202343 9495682 10668281 11010961 11705794 14189863 18227062 22666273 27190209
39469B7190209M971476N173701M393729K606200j04929l537894o457074p198175
$$ 27190209 32161685 37335386 41729115 44335315 44230386 40692492 34235418 27037243
39461B7037243n721349l786482k671079k037327j426341j265725j645407j605625
$$ 27037243 21315894 17529412 14858333 12821006 11394665 10128940 8483533 6877908
39453F877908o69234J58510l2591n99460n51119j79989l11622q00226r64973p88622
$$ 6877908 6208674 6367184 6334593 5735133 5184014 5004025 4692403 3892177 2927204 2138582
39443B138582n55253m2142P62358R22484j18960j178128q17867L34568M49897
$$ 2138582 1583329 1541187 2303545 3226029 3107069 1928941 1111074 1445642 1895539
39434A895539o13157j135601l58774M05437P2230m93182p7165Q27752Q60107m8395
$$ 1895539 1282382 146781 -211993 193444 265674 -227508 -304673 523079 1383186 1334791
39424A334791o39934k23650M93984N90518J23646k11703j40451l8546k11952l96238
$$ 1334791 694857 471207 965191 1555709 1679355 1467652 1327201 1288655 1076703 680465
39414F80465k17527J18028O2184l82218n79187k59453K3183j46447k60118K40055
$$ 680465 462938 580966 643150 260932 -318255 -577708 -554525 -700972 -961090 -721035
39404g21035Q12720M87284n51458j073942n50221J80845K40614j45115k46213
$$ -721035 91685 578969 27511 -1046431 -1596652 -1415807 -1175193 -1320308 -1566521
39395a566521J02837N11505O32101L50921k14789n97417k97002M55708P24662
$$ -1566521 -1463684 -952179 -320078 30843 -183946 -781363 -1078365 -622657 102005
39386A02005O5618p42721o78521J46072O86210M00407j12768k2840O16181R52740
$$ 102005 167623 -575098 -1253619 -1107547 -421337 -20930 -133698 -156538 459643 1412383
39376A412383M41242m10996o24477l0276M46834P2743n85476m97366J77086K66427
$$ 1412383 1853625 1442629 818152 787876 1234710 1307453 721977 224611 401697 668124
39366F68124n07003r38824j87015Q35900Q28041O8943j58081L31387M46242k56223
$$ 668124 161121 -777703 -964718 -128818 699223 768166 610085 941472 1387714 1131491
39356A131491p84277k95200N69606O40261j41961p70365n23583L19453R43094
$$ 1131491 347214 52014 621620 1261881 1119920 349555 -174028 145425 1088519
39347A088519P65323r1181q16375o53896J23095L71560m12436j230273q69324
$$ 1088519 1853842 1762661 946286 292390 415485 787045 374609 -855664 -1724988
39338a724988L24532Q64433K35825m10862N798R59874J166501L85903m24932n27491
$$ -1724988 -1400456 -536023 -300198 -711060 -705262 254612 1421113 1807016 1382084 854593
39328H54593j90364j1986r0916j18385J12419N62670J047560J230883P39312l90812
$$ 854593 664229 652243 561327 442942 555361 1118031 2165591 3396474 4135786 3744974
39318C744974j447080j563972o58033L61850N48658j5488m23451k27704l0651
$$ 3744974 2297894 733922 75889 437739 986397 970909 547458 319754 289103
39309B89103m41258r18939m45053P77206J292728M12371o72743n36477M45134
$$ 289103 -152155 -1071094 -1516147 -738941 553787 966158 293415 -243062 202072
39300B02072P48797M880n88381k04552M47078L67050k52161n01697j43648K17981
$$ 202072 950869 955749 367368 162816 609894 976944 724783 223086 79438 297419
39290B97419R9821l35358o53944o39259l94855j73131q1016O9971M46588P78625
$$ 297419 397240 61882 -592062 -1231321 -1626176 -1799307 -1880323 -1810352 -1363764 -585139
39280e85139O40516J69428j0815K63472L94324l4337n73796o09002k51420p739
$$ -585139 55377 224805 213990 477462 871786 837449 263653 -345349 -596769 -604508
39270f04508M5024J69885L42173K98343L8694k23037m45320o35404n60417r7937
$$ -604508 -559484 -389599 -47426 250917 289611 66574 -378746 -1014150 -1574567 -1672504
39260a672504L29402K50113o4565P2189O81016R89681M95682l70309q30417o30224
$$ -1672504 -1343102 -1092989 -1157554 -1085365 -404349 585332 1081014 710705 -119712 -749936
39250g49936j42982J47205J31088J38224M75551Q65569O51806k28337r08803o83834
$$ -749936 -892918 -745713 -614625 -476401 -850 864719 1516525 1288188 379385 -304449
39240c04449m1485L3961m72167o24469J2119P33981P20665P3101m81050m96476
$$ -304449 -345934 -311973 -784140 -1408609 -1396490 -662509 58156 131257 -349793 -846269
39230h46269j25581K20325L06296K75993M48058Q26861R84768O27938L1271l78731
$$ -846269 -971850 -751525 -445229 -169236 278822 1105683 2090451 2718389 2749660 2370929
39220B370929n70704o61308m92193Q681L79396J92184j96857j76388Q2271p4816
$$ 2370929 1800225 1138917 646724 655405 1034801 1226985 1030128 853740 936011 861195
39210H61195o11712q24514m96441j28786L1009K85832O74136P37883L27833j36868
$$ 861195 249483 -575031 -1071472 -1200258 -1169249 -883417 -209281 528602 856435 719567
39200G19567l85910n06579l58679L02546R89862Q11662j01816n80310j79091J88202
$$ 719567 333657 -172922 -531601 -229055 760807 1572469 1470653 890343 711252 899454
39190H99454j17727m23443q5947L11639J11103j10388M09195J063753P20558l99108
$$ 899454 781727 358284 272337 583976 695079 584691 993886 2057639 2778197 2379089
39180B379089j025694p68847m57050n90003o48063j66225M65539O49409L87930
$$ 2379089 1353395 584548 127498 -462505 -1110568 -1276793 -811254 -161845 226085
39171B26085J08656P3163J87785K01645K7621q5312J02747K73522j61262j009347
$$ 226085 334741 407904 595689 797334 824955 739643 842390 1115912 954650 -54697
39161e4697j188894j61440J120989J360318N37418l08877n33606l58016j55994
$$ -54697 -1243591 -1405031 -284042 1076276 1613694 1304817 771211 413195 257201
39152B57201j1866J11969L11747P12514J131403J096100N58750R8428M5k08485
$$ 257201 245335 357304 669051 1381565 2512968 3609068 4167818 4266246 4266291 4057806
39142D057806p60647j000894n00118P172k19964o34500m27001o7134m01550q59891
$$ 4057806 3297159 2296265 1796147 1803319 1583355 948855 521854 454720 53170 -806721
39132h06721k39376J080071J485320O31103j42024l335M56432P41087J127845
$$ -806721 -1046097 33974 1519294 2150397 2008373 2005038 2461470 3202557 4330402
39123D330402J397382O43661r48246j766947j084934k07871l59202q75376o54133
$$ 4330402 5727784 6371445 5423199 3656252 2571318 2363447 2004245 1128869 474736
39114D74736l6436J30519J53798O83028J129816N29547n94248q31147l8152O11744
$$ 474736 438300 568819 722617 1405645 2535461 3065008 2470760 1639613 1601461 2213205
39104B213205N90662N49245P98179O62576k26970j113440j179386o88359m81270
$$ 2213205 2803867 3353112 4151291 4813867 4586897 3473457 2294071 1605712 1124442
39095A124442p80397r90774n31534M13031R95877O08231l20089p24866k43769
$$ 1124442 344045 -646729 -1178263 -765232 230645 838876 518787 -206079 -449848
39086d49848L28937K45302j22109q885M56443N41670J87323N5685L58524N36729
$$ -449848 -120911 124391 2282 -6603 449840 991510 1178833 1234518 1593042 2129771
39076B129771K40467j73488l62291m95303o94977o17243o1524M71040L82050j15839
$$ 2129771 2370238 2196750 1834459 1339156 644179 26936 -34588 436452 818502 702663
39066G02663k42720K42975O76496L96062l34806o71028l14913J64071K50271J98471
$$ 702663 459943 702918 1379414 1775476 1440670 769642 454729 618800 869071 1067542
39056A067542M00216M97988q1909r00669q05127L58397J305947J054650J97335
$$ 1067542 1467758 1965746 1883837 983168 178041 536438 1842385 2897035 3094370
39047C094370k26724k73562n50685q14391l47306N56264P60571K1415n84914k76189
$$ 3094370 2867646 2594084 2043399 1229008 881702 1437966 2198537 2219952 1635038 1358849
39037A358849L53471L49136k47062o31173l59355K85514P68594P57737L11156
$$ 1358849 1712320 2061456 1814394 1183221 823866 1109380 1877974 2635711 2946867
39028B946867j13741l5461M62147P32371L49741l25166n75531j57665M96943Q05051
$$ 2946867 2833126 2797665 3259812 3992183 4341924 4016758 3441227 3283562 3780505 4585556
39018D585556N97342J98371K5467J29923J98299J9143k50032m08144n42092p61312
$$ 4585556 5182898 5381269 5406736 5536659 5734958 5754101 5504069 5095925 4553833 3792521
39008C792521q40131n13868L0848M01004O18630R92712J404542J295455N03411
$$ 3792521 2952390 2438522 2469370 2870374 3489004 4481716 5886258 7181713 7685124
38999G685124l99712q40828q94557r31609r98970r12732p15788o39026o80857
$$ 7685124 7285412 6444584 5550027 4618418 3619448 2706716 1990928 1351902 671045
38990F71045n58631j30704L48309N10597L23665J15485J23893J77535R800k23880
$$ 671045 112414 -18290 330019 840616 1164281 1279766 1403659 1581194 1590994 1367114
38980A367114j03642L35584M92364N3383m63178m15690O5938L90657M08177L83320
$$ 1367114 1263472 1599056 2091420 2144803 1681625 1265935 1331873 1722530 2130707 2514027
38970B514027K77233j97876q11585q69278k45547K88400R7629m76896o77538l05574
$$ 2514027 2791260 2593384 1781799 912521 666974 955374 1053003 576107 -101431 -407005
38960d07005K53506O43625P56006N52318Q9649l37748l94311q1900K14869R1017
$$ -407005 -153499 490126 1246132 1798450 1888099 1550351 1156040 1074140 1289009 1380026
38950A380026m54607q95110o01353L81372J116035P33041m21065j085812o34881
$$ 1380026 925419 30309 -571044 -189672 926363 1659404 1238339 152527 -482354
38941d82354K22016N29900L03050J64504K35819J01849k77197l69399N9226M82963
$$ -482354 -260338 269562 572612 737116 972935 1074784 797587 428188 487414 970377
38931I70377L73143j541M17L87365N00201J2045n67689o50372l94388l23941m25451
$$ 970377 1343520 1341979 1342396 1729761 2229962 2242007 1674318 1023946 629558 305617 -119834
38920a19834k51230J65750K27551k25955n23144j52089M37309N21047J13987k48815
$$ -119834 -371064 -205314 22237 -203718 -726862 -878951 -441642 79405 193392 -55423
38910e5423l16382j21697L89513J031542J083982J70440q62397q82252r6949K75391
$$ -55423 -371805 -493502 -103989 927553 2011535 2181975 1319578 437326 340377 615768
38900F15768j43145n24489l84547k25138l00071m1492O57811Q07421j38101j123291
$$ 615768 472623 -51866 -436413 -661551 -961622 -1003114 -345303 462118 324017 -799274
38890g99274r41870j7474M25997K88524L64217O48826L60706m28845o40611O3648
$$ -799274 -1741144 -1758618 -1332621 -1044097 -679880 -31054 329652 -99193 -739804 -676156
38880f76156O53557L56303j81086n6028M42685M42165k4649j15665M10717P72967
$$ -676156 -22599 333704 152618 96590 539275 981440 956791 841126 1251843 2024810
38870B024810L21773n21908q48367m36253P0308Q7440k01394k53077j4295M0598
$$ 2024810 2346583 1824675 976308 540055 610363 697803 496409 243332 229037 269635
38860B69635k90596n61397l44392J01339K41917R8133J42202M51180N33591J20725
$$ 269635 -20961 -582358 -926750 -825411 -583494 -485361 -343159 108021 641612 762337
38850G62337l66814m08043p4521J85841K12444K23948L49976M05103J76513k75432
$$ 762337 395523 -12520 -87041 98800 311244 535192 885168 1290271 1466784 1191352
38840A191352o91034q65894p47193l67670J54078N20529L68278k83727p82205
$$ 1191352 500318 -365576 -1112769 -1480439 -1326361 -805832 -437554 -721281 -1503486
38831a503486m27305N47922J006475L04313o78007n41330O90860J439001O53141
$$ -1503486 -1930791 -1382869 -376394 -72081 -750088 -1291418 -600558 838443 1491584
38822A491584p31890j086200k99810K50563j74893o72439k10386P55782J000910
$$ 1491584 759694 -326506 -626316 -375753 -550646 -1223085 -1433471 -677689 323221
38813C23221L52997j86524m7104J62417k05377p42079n94021K87496J082587J090397
$$ 323221 676218 489694 442590 605007 399630 -342449 -936470 -648974 433613 1524010
38803A524010L53747n52017j002917p38485r6804K79526J61221q1407j58483k59226
$$ 1524010 1877757 1325740 322823 -415662 -512466 -232940 -71719 -153126 -311609 -570835
38793e70835m42372k16741O48142J398560J206531M38712Q1677J75156o8565o76924
$$ -570835 -1013207 -1229948 -581806 816754 2023285 2461997 2543674 2718830 2650265 1973341
38783A973341p30581Q433N46016K29536k86148l12538k72456o94246j030724n72785
$$ 1973341 1242760 1251193 1797209 2026745 1740597 1428059 1155603 461357 -569367 -1142152
38773a142152J87762K81918j66858k87335q529j6850l32106j98427N04937R07399
$$ -1142152 -954390 -672472 -839330 -1126665 -1135194 -1152044 -1484150 -1682577 -1177640 -270241
38763b70241M92097j82085m50101l64360j69186K20910P21422P65521Q3406p17444
$$ -270241 221856 39771 -410330 -774690 -943876 -722966 -1544 763977 847383 129939
38753A29939q99419n13682q2261K27057N39089O95173L85558k23975n38721k55575
$$ 129939 -769480 -1283162 -1365423 -1138366 -599277 95896 481454 257479 -281242 -536817
38743e36817L37577P96818R07228O17620r433o33295p73640l88460o4869k76190
$$ -536817 -199240 597578 1504806 2122426 2112993 1479698 706058 317598 252729 -23461
38733b3461o22467l24506N15124Q06295j2705r70719p85512L14950R42795N81370
$$ -23461 -645928 -970434 -455310 350985 338280 -632439 -1417951 -1103001 -160206 421164
38723D21164J34022K43649L02143k10637n36704J25047J004664P18904n55092
$$ 421164 555186 798835 1100978 890341 353637 478684 1483348 2202252 1647160
38714A647160j237996o31189K59547M07318Q6107L1137K46477L02755J67251R9571
$$ 1647160 409164 -222025 37522 444840 530947 562084 808561 1111316 1278567 1378138
38704A378138J21097P8328m7003k10025l97657m51159j56303L11476M49093J32723
$$ 1378138 1499235 1577563 1530560 1320535 922878 471719 315416 626892 1075985 1208708
38694A208708j64287o9086K08064L00785J53517j46532n26555o91678k64915N28161
$$ 1208708 1044421 975335 1183399 1484184 1637701 1491169 964614 272936 8021 536182
38684E36182Q50471L29592l39906l26628K28328N38363K73316j92475m15974k90773
$$ 536182 1386653 1716245 1376339 1049711 1278039 1816402 2089718 1897243 1481269 1190496
38674A190496M5093L05526J66486l76391q25400o26419K07187J021133J039874
$$ 1190496 1235589 1541115 1707601 1331210 505810 -120609 86578 1107711 2147585
38665B147585O3221j141019j350242k51523R13615P62681l26250p09162J03512
$$ 2147585 2210806 1069787 -280455 -531978 381637 1144318 818068 108906 212418
38656B12418P97478M31089j55877p565K14705m44834j217983o81142P19381J114464
$$ 212418 1009896 1440985 1285108 1277543 1492248 1047414 -170569 -851711 -132330 982134
38646I82134R8024p02365k45465N00534M18355o9999j68108k28131q47255j407363
$$ 982134 1080158 377793 132328 632862 1051217 981218 813110 584979 -262276 -1669639
38636a669639r22164K07783O49017J07395m07049k66654P301j02211k33606Q7300
$$ -1669639 -2591803 -2384020 -1735003 -1627608 -2034657 -2301311 -2294010 -2396221 -2629827 -2542527
38626b542527N74237O64458L93309K23737K79504K43505q5505n02387o55006m04523
$$ -2542527 -1968290 -1303832 -910523 -686786 -407282 -163777 -249282 -751669 -1406675 -1811198
38616a811198L0523K14905o1434m13854k10446N51766J058341O81146j38824m74855
$$ -1811198 -1780675 -1565770 -1627204 -2041058 -2251504 -1699738 -641397 39749 -99075 -573930
38606e73930j59826J51747R6260N1843K84592L70085l9228m27514r9628O45271
$$ -573930 -733756 -582009 -485749 -433906 -149314 220771 181543 -245971 -345599 299672
38596B99672Q02636J00367n85515m52495K02138N34074K84802r2633j97196j02668
$$ 299672 1102308 1202675 617160 164665 366803 900877 1185679 1093046 895850 793182
38586G93182m2975l6000M8207K08149K47797j32m50957q34299r61111q06596l46220
$$ 793182 750207 714207 762414 970563 1218360 1218228 767271 -67028 -1028139 -1834735 -2180955
38575b180955M33208J248398J558927J157687M67122m1277m04931p62337q00371
$$ -2180955 -1747747 -499349 1059578 2217265 2684387 2643110 2238179 1475842 675471
38566F75471k58630L26697K24768k91861l09811J63922J19793p00211j145361
$$ 675471 416841 743538 968306 676445 366634 530556 650349 -49862 -1195223
38557a195223l88918P11173Q63437J52879l82604l63825j98026l0785L25473O31327
$$ -1195223 -1584141 -872968 -9531 143348 -239256 -603081 -801107 -831892 -506419 124908
38547A24908M24787q9123k72419j08987j18037k78466l6591N49211P04935K23884
$$ 124908 549695 460572 188153 79166 -38871 -317337 -353928 195283 900218 1124102
38537A124102j20350J74581N61702M17457J4639q7590o337k03096n94861o63926
$$ 1124102 1003752 1178333 1740035 2157492 2172131 2084541 2078204 1875108 1280247 616321
38527F16321k80016J03683L8039m37026q61403p93065k72693J83296K50561K70167
$$ 616321 336305 439988 478027 41001 -820402 -1613467 -1886160 -1702864 -1452303 -1182136
38517a182136O44832J014554P39577O6824j16742K49044K67732k80934l96638
$$ -1182136 -537304 477250 1216827 1283651 1166909 1415953 1683685 1402751 1006113
38508A006113M02337R95251L47385p16679p34372J33103N48975K59439K61516
$$ 1006113 1408450 2403701 2751086 2034407 1300035 1433138 1982113 2241552 2503068
38499B503068P97264Q68023Q8188n23248k53985J39893j45424n13693k4202R47600
$$ 2503068 3300332 4168355 4256543 3733295 3479310 3619203 3473779 2960086 2935884 3883484
38489C883484J296004R05533O15456P50271Q10591N64691M10241N17754N00695
$$ 3883484 5179488 6085021 6700477 7450748 8261339 8826030 9236271 9754025 10254720
38480A0254720J86246j1807K12428N61740O16295L65135P3574M0845N64321J603869
$$ 10254720 10440966 10429159 10641587 11203327 11819622 12184757 12258331 12299176 12863497 14467366
38470A4467366K383723K007211P35515m0340M54503J310369J259112N77692P91560
$$ 14467366 16851089 18858300 19593815 19553475 20007978 21318347 22577459 23155151 23946711
38461B3946711K506120M231030L695790K07255m380966p121568o633335m329659
$$ 23946711 26452831 30683861 34379651 34586906 30205940 23084372 16451037 12121378
38453A2121378k718499k635634k803503k030384p13447K57955Q61802J269513
$$ 12121378 9402879 6767245 3963742 1933358 1219911 1477866 2339668 3609181
38445C609181Q84568n87800j845320j369010K22723Q26491j75218j217495j032211
$$ 3609181 4493749 3905949 2060629 691619 914342 1740833 1565615 348120 -684091
38436f84091j95664K91618M20690M18046k4499p99673q56263K89117J466300J361519
$$ -684091 -879755 -588137 -167447 250599 226100 -573573 -1429836 -1140719 325581 1687100
38426A687100K96714n45923q61870j023096q72423o4609Q31916Q89115K64807
$$ 1687100 1983814 1437891 576021 -447075 -1319498 -1384107 -552191 336924 601731
38417F01731n7074J85718L31473M7759k50651k53391j23736K5668K65042M50897
$$ 601731 544657 730375 1061848 1109607 858956 605565 481829 507497 772539 1223436
38407A223436L35118j7254m36967r59866j366756r71559L20056J330548J011315
$$ 1223436 1558554 1541300 1104333 144467 -1222289 -2193848 -1873792 -543244 468071
38398D68071n197l90924j18481j19521m15065k11432L31038J69767o51450q03439
$$ 468071 462874 71950 -46531 -166052 -581117 -792549 -461511 -291744 -943194 -1746633
38388a746633J67496J031271P87435L0572k17489J20340N36800O51598J65950
$$ -1746633 -1579137 -547866 239569 270141 52652 172992 709792 1361390 1527340
38379A527340q53574j415011n58422R10764J106427j79263j046196l78699N90815
$$ 1527340 673766 -741245 -1299667 -388903 717524 538261 -507935 -886634 -295819
38370b95819M83246j87802l46130j63596j89189l0695O46096R75336K15103q04570
$$ -295819 187427 -375 -346505 -510101 -699290 -729985 -83889 891447 1106550 301980
38360C01980r52381n12507k64321M7605P85501J058358O2671j129331r81226P8239
$$ 301980 -650401 -1162908 -1427229 -1379624 -594123 464235 526906 -602425 -1583651 -1505412
38350a505412N34126L50329N62633R11782K36783j002235j019325L14675J092918
$$ -1505412 -971286 -620957 -58324 853458 1090241 88006 -931319 -616644 476274
38341D76274M14583l74732j57450K98490J03605j56395K41167O98043M02546k52863
$$ 476274 890857 516125 358675 657165 760770 604375 845542 1543585 1946131 1693268
38331A693268m99029m81450o67811p84161l69679K32132L49351j3977l52521m02582
$$ 1693268 1194239 712789 44978 -739183 -1108862 -876730 -527379 -541356 -893877 -1296459
38321a296459j80792K30965N14863K93201j70164j18589M87259P03052K5049p32153
$$ -1296459 -1477251 -1246286 -731423 -438222 -608386 -726975 -239716 463336 488385 -243768
38311b43768o11712J35552N77028M28450J75376K28950M95536N45594l1906j077711
$$ -243768 -855480 -719928 -142900 285550 460926 689876 1185412 1731006 1699100 621389
38301F21389j621695q40609O66785J392098Q61631R9084r1513j22694l96757l44684
$$ 621389 -1000306 -1840915 -1174130 217968 1079599 1178683 1087170 964476 567719 223035
38291B23035M12733R89106M28110p36313j185756n97859K04290M82678J68404
$$ 223035 635768 1624874 2052984 1316671 130915 -466944 -262654 220024 388428
38282C88428m10519p27801m06453J26069l9429q15980q81483L33955J466888J130041
$$ 388428 -22091 -749892 -1156345 -1030276 -1069705 -1885685 -2767168 -2433213 -966325 163716
38272A63716L8095j88840M07556M16291m79001j057038n69643L61604J010681
$$ 163716 201811 12971 420527 836818 357817 -699221 -1268864 -907260 103421
38263A03421J272844R14487m13296j951255k043537l36611J371547J348972R8823
$$ 103421 1376265 2290752 1877456 -73799 -2117336 -2453947 -1082400 266572 365395
38254C65395n93753p0639P32602Q15219J66716n97978r45205p23888k07456J39804
$$ 365395 -228358 -298997 433605 1248824 1415540 817562 -127643 -851531 -1058987 -919183
38244i19183J75932K30572N28036P24722L78240l21889p28310n86037l01182l00588
$$ -919183 -743251 -512679 15357 740079 1118319 796430 68120 -517917 -819099 -1119687
38234a119687m82235m86687k56105l9144M1346R0369R8525j10393l94994j77131
$$ -1119687 -1601922 -2088609 -2344714 -2383858 -2342512 -2252143 -2153618 -2264011 -2659005 -2836136
38224b836136P35305J504605J122182j38002q69329l13892P17785J037690N10182
$$ -2836136 -2100831 -596226 525956 387954 -481375 -795267 -77482 960208 1470390
38215A470390j81093n63341n47116r1311N68433P21863k4424r89116j170921n76426
$$ 1470390 1289297 725956 178840 87529 655962 1377825 1353401 364285 -806636 -1383062
38205a383062o5644k6667k7241K08200L20130N0501k28752q7633L21638N39726
$$ -1383062 -1448706 -1475373 -1502614 -1294414 -974284 -923783 -1152535 -1240168 -918530 -378804
38195c78804M22483K13573J59199K25826J54307k03917n82726n33922q5094J55664
$$ -378804 43679 257252 416451 642277 796584 592667 9941 -523981 -609075 -453411
38185d53411j80246o44468o06955j50638J49902Q7148n7311n0276J29723M72520
$$ -453411 -633657 -1278125 -1885080 -2035718 -1885816 -1798668 -1855979 -1906255 -1776532 -1304012
38175a304012Q06332P32635J91392k10917o269L57453K28711j42561q4105K22807
$$ -1304012 -497680 234955 426347 215430 209161 566614 795325 652764 568659 791466
38165G91466K767o86329r09177l50124K22113K51439J47310L54079N87029M83739
$$ 791466 794233 107904 -801273 -1151397 -929284 -677845 -530535 -176456 410573 894312
38155H94312K32867O0309k01907n54879n48884r2224J42167k59295o47307k66511
$$ 894312 1127179 1187488 985581 430702 -118182 -210406 -68239 -327534 -974841 -1241352
38145a241352M84304N93851l0921m32737m085P11897Q48195L39061j39156j23655
$$ -1241352 -757048 -163197 -194118 -626855 -630940 80957 929152 1268213 1129057 1005402
38135A005402J27561J43371o3462j32168m0526j34345l85315k55135L48307O34179
$$ 1005402 1132963 1276334 1212872 1080704 1040178 905833 520518 265383 613690 1247869
38125A247869N7386o94179o43336J2523L19182Q9146m3374J43103K89333L92765
$$ 1247869 1305255 611076 -32260 -19737 299445 388591 345217 488320 777653 1170418
38115A170418P34608R18979K52283q45418j133552m41311J03984l482q977L79596
$$ 1170418 1905026 2824005 3076288 2230870 1097318 656007 759991 756509 747532 1127128
38105A127128K69570o33385j096434k91360P26669O97592Q7254j887K46732K6609
$$ 1127128 1396698 763313 -333121 -624481 102188 799780 887034 885147 1131879 1158488
38095A158488l88928j87244L62594L60312j03094k21934j1333j49032n55490n24911
$$ 1158488 769560 582316 944910 1305222 1202128 980194 968861 819829 264339 -260572
38085b60572j02545J0364j80366r463M69661M52896j71943n44564j74534M60359
$$ -260572 -363117 -352753 -533119 -542582 -72921 379975 208032 -336532 -511066 -50707
38075e0707P93104P32236L32230j92235k20408N12030J070566L98945q92906j154467
$$ -50707 742397 1474633 1806863 1614628 1394220 1906250 2976816 3375761 2482855 1328388
38065A328388j31076O76102L30084l50506m32403k79872n22584p92013m70201
$$ 1328388 1197312 1873414 2203498 1852992 1420589 1140717 618133 -173880 -644081
38056f44081J42141L69038K89200M46142P99920P35140j8126r77919j398609r82189
$$ -644081 -501940 -132902 156298 602440 1402360 2137500 2119374 1141455 -257154 -1239343
38046a239343k02762J26486j71652l57655J09294O16614L39492k74215r1250Q04259
$$ -1239343 -1442105 -1315619 -1487271 -1844926 -1735632 -1119018 -779526 -1053741 -1144991 -340732
38036c40732J103353K96814n95062o62580k46660M0152K65741N41241M78336l8482
$$ -340732 762621 1059435 464373 -198207 -444867 -404715 -138974 402267 880603 842121
38026H42121m25521l47197k31967l20944j52992M29257P59587M81795J92095K55465
$$ 842121 416600 69403 -162564 -483508 -636500 -207243 552344 1034139 1226234 1481699
38016A481699O7319o61971r98296k25315P86258Q40464K13918n5784N3741j55086
$$ 1481699 1549018 887047 -111249 -336564 449694 1290158 1504076 1448292 1502033 1346947
38006A346947n70077m49548J41470L75904M4110k34478j29314N4566J03616R9145
$$ 1346947 776870 327322 468792 844696 888806 654328 525014 579580 683196 782341
37996G82341l8977m26531p28177m94467J56102P64277J125295J112018M59288
$$ 782341 743364 316833 -411344 -905811 -749709 14568 1139863 2251881 2711169
37987B711169n58085q98199j34909N94784J32272q60250r23461j20236K31802
$$ 2711169 2153084 1254885 1119976 1714760 1847032 986782 63321 -56915 174887
37978A74887j48716j85967N17858R65564M75748k69586m14429p1415K06605J99620
$$ 174887 26171 -159796 358062 1323626 1799374 1529788 1115359 1043944 1250549 1450169
37968A450169r2517n44991p05897k93738J01316k44398q36854n35098N23070R33772
$$ 1450169 1357652 812661 106764 -186974 -85658 -330056 -1166910 -1702008 -1178938 -245166
37958b45166J81374o25153n75150j42879P392R6639M08929N53823K97973J27992
$$ -245166 -63792 -688945 -1264095 -1406974 -1399582 -1302943 -894014 -340191 -42218 85774
37948H5774L19780M20647K24699J90051L28739q1764r96271j168208j24196P94483
$$ 85774 405554 826201 1050900 1240951 1569690 1487926 491655 -676553 -800749 -6266
37938f266M91255j25184J72698P26908J91147r95877j231296l27687L80181L02097
$$ -6266 484989 359805 532503 1259411 1450558 454681 -776615 -1104302 -724121 -422024
37928d22024K17970N80224P72756L53482k38424n15834m51868j6218P71008J244646
$$ -422024 -204054 376170 1148926 1502408 1263984 748150 296282 280064 1051072 2295718
37918B295718O48161n73110j117363o45204j39000k03021k24500K72520O06178
$$ 2295718 2943879 2370769 1253406 608202 469202 266181 41681 314201 920379
37909I20379P9762p30920p87117j71189O7210n19167j128575p70507M63153J438461
$$ 920379 1000141 269221 -517896 -689085 -621875 -1141042 -2269617 -3040124 -2576971 -1138510
37899a138510J220900J12405p24265o34999r5537J68772J40044J60400J78305
$$ -1138510 82390 194795 -529470 -1164469 -1260006 -1091234 -951190 -790790 -612485
37890f12485L6993Q2844O11067R92258L75799q10838j157538k42019P30679O38991
$$ -612485 -575492 -492648 118419 1110677 1486476 675638 -481900 -723919 6760 645751
37880F45751j23784m74594j55101K42381K82846Q1882p9223n7008J33440L21071
$$ 645751 521967 47373 -107728 134653 417499 499381 420158 363150 496590 817661
37870H17661K82188l0423m43984p26599o67525j81003M26638N69904J26982k73564
$$ 817661 1099849 1069426 625442 -101157 -768682 -949685 -523047 46857 173839 -99725
37860i9725j79069p0414n08947j019112p83012n8087K65821K51673O73531J280337
$$ -99725 -278794 -349208 -858155 -1877267 -2660279 -2718366 -2452545 -2200872 -1527341 -247004
37850b47004R21899l22684q37186N3225R01451M13281n54898n53089J16320J44957
$$ -247004 674895 352211 -484975 -431750 469701 882982 328084 -225005 -108685 36272
37840C6272n07545o99724q0049M89778L90017p0901m22926n14734k44593L53218
$$ 36272 -471273 -1170997 -1251046 -761268 -371251 -442152 -865078 -1379812 -1624405 -1271187
37830a271187Q00066O66061K35320L5358L053j54843j73589K84206P11467L84978
$$ -1271187 -471121 194940 430260 465618 468671 313828 140239 424445 1135912 1520890
37820A520890l17570l67118K41818M63084o9831n00570k45930J11514l6615k65585
$$ 1520890 1203320 836202 1078020 1541104 1471273 970703 724773 836287 799672 534087
37810E34087P2583O62809O48604q5506p31891o27475p5802N0276n58254j103146
$$ 534087 606670 1269479 1918083 1832577 1100686 473211 397409 447685 -110569 -1213715
37800a213715n85336P39615J413266O34692n96319q53624j66236M07878N42527
$$ -1213715 -1799051 -1059436 353830 988522 392203 -461421 -627657 -219779 322748
37791C22748P43049R72922N90648k77405o63515l35553j60772m99982n44488J34793
$$ 322748 1065797 2038719 2629367 2351962 1688447 1352894 1192122 692140 147652 282445
37781B82445O27601J26882p21113q80005m79673k97475l95866l42894k46907m75197
$$ 282445 910046 1036928 315815 -564190 -1043863 -1341338 -1737204 -2080098 -2327005 -2802202
37771b802202o86733k08046P66600J276720Q81845J08644l67601l61407m1791
$$ -2802202 -3488935 -3696981 -2930381 -1653661 -771816 -663172 -1030773 -1392180 -1433971
37762a433971K78847K67122n7355j96568J52136N36287L64570j79368m24855j97495
$$ -1433971 -1155124 -888002 -945357 -1141925 -989789 -453502 -88932 -268300 -693155 -890650
37752h90650J11361K89686M58926N66807L75955k8633k78112k79877k43623j84182
$$ -890650 -779289 -489603 -30677 536130 912085 883452 605340 325463 81840 -102342
37742a02342P0796L80269L42474o8052l79820k51579J41355M21006M13812K18271
$$ -102342 -31546 348723 691197 623145 243325 -8254 133101 554107 967919 1186190
37732A186190Q3001J53029J95496j63277p36470p74032n4160N53984K35212n55843
$$ 1186190 1269191 1422220 1617716 1454439 717969 -56063 -110223 443761 678973 123130
37722A23130q08363m48241j55977l2393L82062Q63205N73579m05266q40866j25232
$$ 123130 -685233 -1133474 -1289451 -1321844 -939782 -76577 497002 91736 -749130 -874362
37712h74362P75114P44837l943n39766n19509j89704K56662O09822M84707q1018
$$ -874362 -99248 645589 641646 101880 -417629 -607333 -350671 259151 743858 662840
37702F62840l67082M4839N40770M00061r9780k88390k72991n37682p86810l30876
$$ 662840 295758 340597 881367 1281428 1181648 893258 620267 82585 -704225 -1035101
37692a035101N23774O64985j05652o69549k96999K53826j2044p72061r42484l27745
$$ -1035101 -511327 153658 48006 -621543 -918542 -664716 -676760 -1448821 -2391305 -2719050
37682b719050K23269K11964J53339N81453J083651Q87049O1913n19904m00843
$$ -2719050 -2495781 -2283817 -2130478 -1549025 -465374 421675 483588 -36316 -437159
37673d37159o8064m9237j05678J65628M50982K40409p3825L51818J243241J249969
$$ -437159 -505223 -554460 -660138 -494510 -43528 196881 123056 474874 1718115 2968084
37663B968084j5633j091717o40820N83230Q42136j08822r19859p81310l43415
$$ 2968084 2952451 1860734 1219914 1803144 2645280 2536458 1616599 835289 491874
37654D91874l55301n60315m12573k9726J36699L8342k6554J45047N42278R33334
$$ 491874 136573 -423742 -836315 -866041 -729342 -691000 -717554 -572507 -30229 903105
37644I03105Q76380J65190o94567r73227o80164m00045k18142K81575Q47794N51323
$$ 903105 1779485 1944675 1250108 276881 -403283 -803328 -1021470 -739895 107899 659222
37634F59222n87155j124493j76650J120511J175275J54416n74761n86399n79595
$$ 659222 72067 -1052426 -1229076 -108565 1066710 1221126 646365 59966 -519629
37625e19629p45353m42888M11013R52574O83197R5957l13939o40042q20929l63916
$$ -519629 -1264982 -1707870 -1296857 -344283 338914 434871 120932 -519110 -1340039 -1703955
37615a703955O45408J194924O80435j70986l96290j34039j10522l56034k91838
$$ -1703955 -1058547 136377 816812 645826 249536 115497 4975 -351059 -642897
37606f42897K16490O73083O95222L62093p2952l72187l52934r4686O5509p065
$$ -642897 -426407 246676 941898 1303991 1231039 858852 505918 411232 476741 469676
37596D69676p7479k4038k4482k8964L09204Q05950O32286l73578j098909p00086
$$ 469676 392197 368159 343677 314713 623917 1429867 2062153 1688575 589666 -110420
37586a10420K9812q6808o90789n63790K58742O05451K17614M0904L51654K54284
$$ -110420 -80608 -167416 -858205 -1421995 -1163253 -557802 -340188 -299284 52370 306654
37576C06654n12989q67148k12888M48273K01409k47461J18150Q15689O99764j11615
$$ 306654 -206335 -1073483 -1286371 -838098 -636689 -884150 -766000 49689 749453 637838
37566F37838n19780k33732L0337n9636p6259J52844K32231M2089q101K31110L61240
$$ 637838 118058 -115674 -85337 -144973 -221232 -68388 163843 205932 197831 428941 790181
37555G90181J50238j07585j57090j55188k72117l88405l73930k69345m9637L96994
$$ 790181 940419 832834 675744 520556 248439 -139966 -513896 -783241 -832878 -435884
37545d35884Q88671R17173K57150n89897q16532j90037N97676O14359j93730q05527
$$ -435884 452787 1369960 1627110 1037213 220681 30644 628320 1242679 1048949 243422
37535B43422l76291N71799Q41148K91052n8483K30142L22626l16709q42571m32379
$$ 243422 -132869 438930 1280078 1571130 1512647 1742789 2065415 1748706 906135 473756
37525D73756K37531R3936n54999o66025k55943j01250j21840L25784Q07819K34998
$$ 473756 711287 805223 250224 -415801 -671744 -772994 -894834 -569050 238769 473767
37515D73767j016697j216165P1242J140743O69122m38619o65018n5551L45151
$$ 473767 -542930 -1759095 -1687853 -547110 122012 -316607 -981625 -1037176 -692025
37506f92025K59897J91348K75596J91908j01220l33744m02201l61130k23262j01106
$$ -692025 -432128 -240780 34816 226724 125504 -208240 -610441 -971571 -1194833 -1295939
37496a295939j46866j52049K21271O78071N50640p849q4353M47177O00920j9596
$$ -1295939 -1442805 -1594854 -1373583 -695512 -144872 -152721 -237074 210103 811023 791427
37486G91427m69303j28937J86257k33905o08780n9849P20655O04487j01699m06823
$$ 791427 322124 193187 379444 145539 -463241 -523090 197565 802052 700353 293530
37476B93530m16265p43969q80930J9767J202937J087038j87395q69188k96737
$$ 293530 -122735 -866704 -1747634 -1727867 -524930 562108 374713 -494475 -791212
37467g91212L55593K50280k4305O229j74240o98426o30341M45927J439340J279352
$$ -791212 -435619 -185339 -209644 -203415 -377655 -1076081 -1706422 -1260495 178845 1458197
37457A458197L68379l20955n81761n77127j16224P26341J124240N96764j33189
$$ 1458197 1826576 1505621 923860 346733 230509 956850 2081090 2677854 2544665
37448B544665k84059k75937q35361j513271j291105k79701L77953J95618j16675
$$ 2544665 2260606 1984669 1149308 -363963 -1655068 -1934769 -1556816 -1361198 -1477873
37439a477873J08181N93172P15356L99382R4701J42927L67141K63739l35252q55827
$$ -1477873 -1369692 -776520 -61164 338218 432919 575846 942987 1206726 871474 15647
37429A5647o00072J92244M65297k27727j032314r40924n9837P85414J146771J021039
$$ 15647 -584425 -392181 73116 -154611 -1186925 -2127849 -2187686 -1402272 -255501 765538
37419G65538L63993o33489j156776n84496M53322P22573O8442m26826p7241N11365
$$ 765538 1129531 496042 -660734 -1245230 -791908 -69335 -893 -427719 -504960 6405
37409F405N17687Q2310j54653j20710k18357m58604m05908K2645L26011J73146
$$ 6405 524092 606402 451749 331039 112682 -345922 -751830 -729185 -403174 -230028
37399b30028j05609q7656R2427J11141J49586N68990J015944O54152n31045j449667
$$ -230028 -335637 -423293 -330866 -219725 -70139 498851 1514795 2168947 1637902 188235
37389A88235j328487o71373k49344Q1210P18497J187340Q10842M9531r8761K24916
$$ 188235 -1140252 -1811625 -2060969 -1979759 -1261262 -73922 736920 786451 687690 912606
37379I12606L4085o24986o09160L03719Q77100L91940k84561k78963P124P861
$$ 912606 946691 321705 -287455 16264 893364 1285304 1000743 721780 728904 736765
37369G36765O1550L88501K54748o87419j355550q11576J39995K99059M8603M33428
$$ 736765 798315 1186816 1441564 754145 -601405 -1412981 -1272986 -973927 -925324 -491896
37359d91896J093109Q68472q6344n93707n07963o82432j070193p12229L23498
$$ -491896 601213 1469685 1383341 789634 281671 -400761 -1470954 -2183183 -1859685
37350a859685P99463L56497M15K00091J96771k95435l88684K69452O63877J67081
$$ -1859685 -1060222 -703725 -703310 -503219 -306448 -601883 -990567 -721115 -57238 109843
37340A09843l10095P3347O23165L77302k65031l69184k3972R1626k8581J8327
$$ 109843 -200252 -126905 496260 873562 608531 239347 215375 307001 278420 296747
37330B96747J37483P5388O0382K18259N2887n81344q18795j59971L85754j40679
$$ 296747 434230 509618 570000 788259 841146 259802 -558993 -718964 -333210 -473889
37320d73889p99490j28793J240964J315494p8351q98727m4880J025302O74190
$$ -473889 -1273379 -1402172 -161208 1154286 1075935 177208 132328 1157630 1831820
37311A831820n22814r39669l17289K70836K05950j13328k00996l5584K06710L11058
$$ 1831820 1309006 369337 52048 322884 528834 415506 214510 178926 385636 696694
37301F96694M4949m83431p13934l58792N3763r3132n17373m36308K06809O28035
$$ 696694 741643 258212 -455722 -814514 -760751 -853883 -1371256 -1807564 -1600755 -972720
37291i72720L51984j59607k08623K90316Q59596R87354M64780m21265q84429k81953
$$ -972720 -620736 -780343 -988966 -698650 160946 1148300 1613080 1191815 307386 25433
37281B5433R45749J407152L10353j377226j886320p04152Q89122J437658Q76431
$$ 25433 971182 2378334 2688687 1311461 -574859 -1279011 -389889 1047769 1924200
37272A924200J44200k47594n86120j044750j152578m95996M91879R07151M23928
$$ 1924200 2068400 1820806 1234686 189936 -962642 -1458638 -966759 -59608 364320
37263C64320l84532p67485n53007j08308K18152M18308O51991R26856J033629
$$ 364320 -20212 -787697 -1340704 -1449012 -1230860 -812552 -160561 766295 1799924
37254A799924P77091K17062l54551o67246o70075m87199k47931j6873J43761J45659
$$ 1799924 2577015 2794077 2439526 1772280 1102205 615006 367075 350202 493963 639622
37244F39622k1673j94043j52086J04345K93320J87455m3332j7294L16594N58349
$$ 639622 617949 423906 271820 376165 669485 856940 813608 796314 1112908 1671257
37234A671257M04269R3954P2412L32448L86264r2171q21524j193793q92117j85716
$$ 1671257 2075526 2169480 2241892 2574340 2960604 2868433 2046909 853116 -39001 -224717
37224b24717L33142L11534l4953k15214p6799O5571k7267j59357j11617r0037
$$ -224717 108425 419959 385006 169792 92993 158564 131297 -28060 -139677 -229714
37214b29714l38136n19393o7331Q38905J240060N86306m70803q33158k65231M02142
$$ -229714 -567850 -1087243 -1154574 -315669 924391 1510697 1039894 206736 -58495 343647
37204C43647L03167n05113j176205j033866k76587L35300M16372L34344N51429
$$ 343647 646814 141701 -1034504 -2068370 -2344957 -2009657 -1593285 -1258941 -707512
37195g07512Q92249P96418J34527o09221r20989o95570j37215M39562P18979N96418
$$ -707512 184737 981155 1115682 506461 -414528 -1110098 -1247313 -807751 -88772 507646
37185E07646K86019J8228k21952m23827l44325P5J7795o13811j116862n31076
$$ 507646 793665 811893 589941 166114 -178211 -178136 -160341 -774152 -1891014 -2422090
37175b422090O94483J106037L26018m26564k31841L03110L46059K36356N90163
$$ -2422090 -1727607 -621570 -295552 -722116 -953957 -650847 -304788 -68432 521731
37166E21731Q84950J90553j120270j634403q28641K88717O28320L01279J36614
$$ 521731 1406681 1597234 476964 -1157439 -1986080 -1697363 -1069043 -767764 -631150
37157f31150M54879P22817L04539o44015j189084p04908K42050O01803L24704
$$ -631150 -176271 546546 851085 207070 -982014 -1686922 -1444872 -843069 -518365
37148e18365L11412P85138Q32858O8626m57123M6524O11867L5384r77394q34702
$$ -518365 -206953 578185 1411043 1479669 1022546 1069070 1680937 1716321 738927 -95775
37138i5775K96763P06769r6284p03843k03401N01772M33535M3676N5267J14627
$$ -95775 200988 907757 811473 107630 -95771 406001 839536 883212 938479 1053106
37128A053106k85224n75650l9387P73238P92513R3295l94084m96578q58591j460241
$$ 1053106 767882 192232 152845 926083 1718596 1811891 1417807 921229 62638 -1397603
37118a397603j351053j96155R48148J004367L19156L5998M26659O31478M4294
$$ -1397603 -2748656 -2944811 -1996663 -992296 -673140 -637142 -210483 420995 465289
37109D65289p47889p65296L5640P52996P38809K64950r4121j86510r9336K24085
$$ 465289 -282600 -1047896 -1012256 -259260 479549 744499 650378 463868 364532 588617
37099E88617O84006P53191J48509m96803l57167L25524M93294j93901q78069p58318
$$ 588617 1272623 2025814 2174323 1677520 1320353 1645877 2139171 1945270 1067201 308883
37089C08883r3682L81814M25574K53019K6325j67182j47097J35476L76544K20251
$$ 308883 215201 597015 1022589 1275608 1301933 1134751 987654 1123130 1499674 1719925
37079A719925k91387p11238o08324n0074L10737o9833p16467n01324O61621J273988
$$ 1719925 1428538 717300 108976 58902 369639 299806 -416661 -917985 -256364 1017624
37069A017624K86336j085455r44675L99712R05570N4655m27357M10805J126594
$$ 1017624 1303960 218505 -726170 -326458 579112 633767 206410 617215 1743809
37060A743809M08751o45786m13754N18944M32884o23394j030410k95884L70827
$$ 1743809 2152560 1506774 1093020 1611964 2044848 1421454 391044 95160 465987
37051D65987K07932p8975J99388N84589L72696k97467p64708o65524j56990K59256
$$ 465987 673919 594944 794332 1378921 1751617 1454150 689442 23918 -133072 126184
37041A26184J17440m13721n35831R0261O75562M14962k14469k04983L33597M05723
$$ 126184 243624 -170097 -705928 -615667 59895 474857 260388 55405 389002 794725
37031G94725j99351o49616m59863k5695K83956N09147N03240J1028n51675m41614
$$ 794725 595374 -54242 -514105 -539800 -255844 253303 756543 767571 215896 -225718
37021b25718J69894L48932j03876m32230l26355l03515m52506j42142N97134P73565
$$ -225718 -55824 293108 189232 -242998 -569353 -872868 -1325374 -1467516 -870382 -96817
37011i6817J34349j81723M82139J049322L99191p69688j010833k82089K56966
$$ -96817 37532 -144191 337948 1387270 1786461 1016773 5940 -276149 -19183
37002a9183J08876j23015M8364L68244M30070J83588j56924l14591k02518j44676
$$ -19183 89693 -33322 15042 383286 813356 996944 840020 525429 322911 178235
$$ [...]
##END NTUPLES=NMR SPECTRUM
##END=
