##TITLE=31Pdec_IPDP0702
 CDCl3, 24 sc
 8.2.2019
##JCAMPDX= 6.0         $$ Bruker NMR JCAMP-DX V2.0
##DATA TYPE= NMR SPECTRUM
##DATA CLASS= NTUPLES
##ORIGIN= UXNMR, Bruker Analytische Messtechnik GmbH
##OWNER= root
$$ XWIN-NMR		Version 3.5
$$ Fri Feb  8 14:51:48 2019 Russian Standard Time (UT+4h)  she@DPX200
##.OBSERVE FREQUENCY= 81.013821
##.OBSERVE NUCLEUS= ^31P
##.ACQUISITION MODE= SIMULTANEOUS
##.ACQUISITION SCHEME= undefined
##.AVERAGES= 24
##.DIGITISER RES= 17
##SPECTROMETER/DATA SYSTEM= spect
##.PULSE SEQUENCE= zgpg30
##.SOLVENT NAME= CDCl3
##.SHIFT REFERENCE= (INTERNAL, CDCl3, 0, 182.463)
##AUDIT TRAIL= $$ (NUMBER, WHEN, WHO, WHERE, WHAT)
$$ ##TITLE= Audit trail, XWIN-NMR		Version 3.5
$$ ##JCAMPDX= 5.01
$$ ##ORIGIN= Bruker BioSpin GmbH
$$ ##OWNER= she
$$ F:/spectra/data/she/nmr/P31/1/pdata/1/auditp.txt
$$ ##AUDIT TRAIL=  $$ (NUMBER, WHEN, WHO, WHERE, WHAT)
(   1,<2019-02-08 14:49:52.54 +0400>,<she>,<DPX200>,
      <created by zg, POWCHK disabled, PULCHK disabled
       configuration hash MD5:
       00 E9 B6 7A A2 85 ED C7 34 08 36 98 17 FE 4E 26
       data hash MD5: 32K
       07 C5 8D 23 8D 64 B7 CD D6 10 C1 60 33 CA F7 1D>)
(   2,<2019-02-08 14:49:55.20 +0400>,<she>,<DPX200>,
      <Start of raw data processing
       efp BC_mod = 2 LB = 1 FT_mod = 6 PKNL = 1 PHC0 = -1461.967 PHC1 = 81.19894 SI = 64K 
       data hash MD5: 64K
       F9 0F 19 38 22 BF 87 20 F2 47 67 A2 92 7F DA 7B>)
(   3,<2019-02-08 14:50:11.37 +0400>,<she>,<DPX200>,
      <pk PHC0 = 7.426956 PHC1 = 0 
       data hash MD5: 64K
       F0 E9 C2 56 90 11 95 CA 42 96 AA 32 96 50 07 B0>)
(   4,<2019-02-08 14:50:14.79 +0400>,<she>,<DPX200>,
      <abs ABSG = 5 
       data hash MD5: 64K
       29 10 0A B0 65 A1 C9 DE F5 2A 6E CD 93 4D 25 7F>)
$$ ##END=
$$ 
$$ hash MD5
$$ 33 C6 8E CE 11 72 EB 4E 82 25 4F 45 72 28 07 D3
##$RELAX= 
##$RELAX= 
##$RELAX= 
##$RELAX= 
##$RELAX= 
##$RELAX= 
##$RELAX= 
##$RELAX= 
$$ Bruker specific parameters
$$ --------------------------
##$DU= <F:/spectra>
##$EXPNO= 1
##$NAME= <P31>
##$PROCNO= 1
##$TYPE= <nmr>
##$USER= <she>
##$AMP= (0..31)
100 100 100 100 100 100 100 100 100 100 100 100 100 100 100 100 100 100 
100 100 100 100 100 100 100 100 100 100 100 100 100 100 
##$AQSEQ= 0
##$AQ_mod= 1
##$AUNM= <au_zg>
##$AUTOPOS= <>
##$BF1= 81.014009
##$BF2= 200.13
##$BF3= 200.13
##$BF4= 200.13
##$BF5= 200.13
##$BF6= 200.13
##$BF7= 200.13
##$BF8= 200.13
##$BYTORDA= 1
##$CFDGTYP= 0
##$CFRGTYP= 5
##$CHEMSTR= <none>
##$CNST= (0..31)
1 1 145 1 1 1 1 1 1 1 1 1 1 1 1 1 1 1 1 1 1 1 1 1 1 1 1 1 1 1 1 1 
##$CPDPRG= <waltz16>
##$CPDPRG1= <>
##$CPDPRG2= <waltz16>
##$CPDPRG3= <>
##$CPDPRG4= <mlev>
##$CPDPRG5= <mlev>
##$CPDPRG6= <mlev>
##$CPDPRG7= <mlev>
##$CPDPRG8= <mlev>
##$CPDPRGB= <>
##$CPDPRGT= <>
##$D= (0..31)
0 1 0 0 0 0 0 0 0 0 0 0.03 2e-05 3e-06 0 0 0 0 0 0 0 0 0 0 0 0 0 0 0 0 
0 0 
##$DATE= 1549622991
##$DBL= (0..7)
120 120 120 11 120 120 24 19 
##$DBP= (0..7)
150 150 150 150 150 150 150 150 
##$DBP07= 0
##$DBPNAM0= <>
##$DBPNAM1= <>
##$DBPNAM2= <>
$$ [...]
##$SUBNAM3= <"">
##$SUBNAM4= <"">
##$SUBNAM5= <"">
##$SUBNAM6= <"">
##$SUBNAM7= <"">
##$SUBNAM8= <"">
##$SUBNAM9= <"">
##$SW= 369.568048894756
##$SWIBOX= (0..15)
0 1 3 0 0 0 0 0 0 0 0 0 0 0 0 0 
##$SW_h= 29940.119760479
##$TD= 32768
##$TD0= 1
##$TE= 0
##$TE2= 300
##$TE3= 300
##$TEG= 300
##$TL= (0..7)
0 120 53 12 22 120 120 120 
##$TP= (0..7)
150 150 150 150 150 150 150 150 
##$TP07= 0
##$TPNAME0= <>
##$TPNAME1= <>
##$TPNAME2= <>
##$TPNAME3= <>
##$TPNAME4= <>
##$TPNAME5= <>
##$TPNAME6= <>
##$TPNAME7= <>
##$TPOAL= (0..7)
0.5 0.5 0.5 0.5 0.5 0.5 0.5 0.5 
##$TPOFFS= (0..7)
0 0 0 0 0 0 0 0 
##$TUNHIN= 0
##$TUNHOUT= 0
##$TUNXOUT= 0
##$USERA1= <user>
##$USERA2= <user>
##$USERA3= <user>
##$USERA4= <user>
##$USERA5= <user>
##$V9= 5
##$VALIST= <valist>
##$VCLIST= <CCCCCCCCCCCCCCC>
##$VD= 0
##$VDLIST= <DDDDDDDDDDDDDDD>
##$VPLIST= <PPPPPPPPPPPPPPP>
##$VTLIST= <TTTTTTTTTTTTTTT>
##$WBST= 1024
##$WBSW= 4
##$XGAIN= (0..3)
0 0 0 0 
##$XL= 0
##$YL= 0
##$YMAX_a= 28104
##$YMIN_a= -29058
##$ZGOPTNS= <>
##$ZL1= 120
##$ZL2= 120
##$ZL3= 120
##$ZL4= 120
##$ABSF1= 182.463
##$ABSF2= -187.1042
##$ABSG= 5
##$ABSL= 3
##$ALPHA= 0
##$AQORDER= 0
##$ASSFAC= 0
##$ASSFACI= 0
##$ASSFACX= 0
##$ASSWID= 0
##$AUNMP= <proc_1d>
##$AZFE= 0.1
##$AZFW= 0.5
##$BCFW= 0
##$BC_mod= 2
##$BYTORDP= 0
##$COROFFS= 0
##$CY= -3
##$DATMOD= 1
##$DC= 0
##$DFILT= <>
##$DTYPP= 0
##$F1P= 0
##$F2P= 0
##$FCOR= 1
##$FTSIZE= 65536
##$FT_mod= 6
##$GAMMA= 0
##$GB= 0
##$INTBC= 1
##$INTSCL= 5.30512e-09
##$ISEN= 30
##$LB= 1
##$LEV0= 0
##$LPBIN= 0
##$MAXI= 10000
##$MC2= 0
##$MEAN= 0
##$ME_mod= 0
##$MI= 50
##$NCOEF= 0
##$NC_proc= -3
##$NLEV= 6
##$NOISF1= 182.463
##$NOISF2= 159.3651
##$NSP= 0
##$NTH_PI= 0
##$NZP= 0
##$OFFSET= 182.463
##$PC= 4
##$PHC0= -1454.54
##$PHC1= 81.19894
##$PH_mod= 1
##$PKNL= yes
##$PPARMOD= 0
##$PSCAL= 0
##$PSIGN= 0
##$REVERSE= no
##$SF= 81.0140089999434
##$SI= 65536
##$SIGF1= 159.3651
##$SIGF2= -187.1042
##$SINO= 113.3802
##$SIOLD= 16384
##$SREGLST= <1H.CDCl3>
##$SSB= 0
##$STSI= 65536
##$STSR= 0
##$SW_p= 29940.119760479
##$SYMM= 0
##$S_DEV= 0
##$TDeff= 32768
##$TDoff= 0
##$TI= <>
##$TILT= no
##$TM1= 0
##$TM2= 0
##$TOPLEV= 0
##$USERP1= <user>
##$USERP2= <user>
##$USERP3= <user>
##$USERP4= <user>
##$USERP5= <user>
##$WDW= 1
##$XDIM= 65536
##$YMAX_p= 272877282
##$YMIN_p= -4162792
$$ End of Bruker specific parameters
$$ ---------------------------------
##NTUPLES= NMR SPECTRUM
##VAR_NAME=  FREQUENCY,     SPECTRUM/REAL,   SPECTRUM/IMAG
##SYMBOL=    X,             R,               I
##VAR_TYPE=  INDEPENDENT,   DEPENDENT,       DEPENDENT
##VAR_FORM=  AFFN,          ASDF,            ASDF
##VAR_DIM=   65536,         65536,           65536
##UNITS=     HZ,            ARBITRARY UNITS, ARBITRARY UNITS
##FACTOR=    0.456856943014862, 1,           1
##FIRST=     14782.0589164792, 0,            0
##LAST=      -15158.0608439998, 0,           0
##MIN=       -15158.0608439998, -4162792,    0
##MAX=       14782.0589164792, 272877282,    0
$$ Real data points
##PAGE= N=1
##DATA TABLE= (X++(R..R)), XYDATA
$$ [...]
42508a64313J12329N2790j39737j64749Q2603L12621K30481n6326j97720p0781
42498b802J00881Q8212n8170j41445j09899o6284m0099N5340J99340J99321j7391
42487B07004k15103j50332O1887J21424k78n8779L8363J20324J03344J23196K09528
42476E60578J54081j11262l01692j94017j712l4642j88319j34571J00340J53264
42466B048q0650k57412j03509J88055K67207J07315m2748m7474M879K7577N4483
42455A19771J06590J13301M7340J0259O8167R7127m5157k39846k14332L3265J57850
42444B54335m1032k77561j80662J29969K09253l6807k24844r8711J11812R5747
42434e8501q8350j84963j25871j1470J07887K12598K25449J33760N4559K0919
$$ y = [-164313, -51984, 806, -138931, -303680, -221077, 91544, 322025, 265699, 67979, -2802, 98079, 186291, 128121, -13324, -123223, -189507, -229606, -174266, 25074, 224395, 207004, -8099, -158431, -96544, 24880, 24602, -34177, 4186, 124510, 227854, 351050, 560578, 714659, 603397, 301705, 107688, 105976, 71334, -116985, -251556, -151216, 2048, -78602, -336014, -439523, -251468, 15739, 123054, 80306, 32832, 37711, 65288, 119771, 226361, 339662, 387002, 397261, 465428, 562555, 517398, 277552, 63220, 96485, 254335, 213303, -64258, -244920, -114951, 94302, 57495, -167349, -266060, -154248, -58501, -146851, -331814, -457685, -469155, -361268, -148670, 76779, 210539, 265098, 286017]
42424B86017j02832l18267l52538o9114K28340K17333N1963O1336J64726N5469
42414B22433j71865j22927J86950K85156L944k42200j38843N5563L023j62670
42404h1436j27251P4701J81792J31954M0492n8366j46756q4637J57192L00785
42394C88470J24194j38487j18145J01947J26887r2849j94904l3098P0839j34380
42384A00474m02061l44018K2138L31397L42212J38121o6664j47397j10440k8506
42374a64744M2883R8969J23357M5444j44407k85423k04962K7746J79924J90163
42364i1050K17049L11695K81950Q564l06774l81313j97534M8235K11981K50397
42354C53200J29697j11256k84031k34586o2305J7066j9329j4163P8854J22631
$$ y = [286017, 183185, -135082, -487620, -556734, -328394, -111061, -59098, 2238, 166964, 222433, 50568, -72359, 114591, 399747, 403691, 161491, 22648, 78211, 81234, -81436, -208687, -133986, 47806, 179760, 220252, 161886, 15130, -69507, 87685, 388470, 512664, 374177, 256032, 357979, 484866, 392017, 197113, 164015, 234854, 100474, -301587, -645605, -623467, -292070, 50142, 188263, 121599, -25798, -136238, -164744, -121861, -22892, 100465, 145909, 1502, -283921, -488883, -461137, -281213, -91050, 125999, 437694, 719644, 728208, 421434, 40121, -157413, -109178, 102803, 353200, 482897, 371641, 87610, -146976, -209281, -192215, -211544, -225707, -146853, -24222]
42344b4222L8494o3476n9558J5776M3225j9980j01815r5075K6271J38909P9552
42333b1899j16407j95083k4713J71830J20310q2909j20444M1597J24868J9632
42323h3218o2267j688K1523r6406j45452J8406J62582N3388j16051l4501J88695
42312i4989K00618l7p8832N3566J08040p2578k60384k30855p9033R976L4572N8155
42300c51781N1114J0147K9065J08985J05308l879l3119O8879O0270j82862l57053
42289d94926j50811K23231K96739M4752r1287J11197L41865K55124l9166j89913
42279C06805r8422L1763L2308n0811r6131p3668m1608n1624r0369r6572l2702
42268b61031O0695J01626O0444p061k6034J7060O5654N7311j741l6841k961L9897
$$ y = [-24222, 14272, -49204, -108762, -92986, -49761, -69741, -171556, -266631, -240360, -101451, -21899, -138306, -333389, -358102, -186272, -65962, -148871, -269315, -227718, -102850, -83218, -145485, -147173, -125650, -222056, -367508, -349102, -186520, -133132, -249183, -283684, -94989, 105629, 105592, 26760, 80326, 188366, 115788, -144596, -375451, -454484, -444508, -409936, -351781, -300667, -290520, -261455, -152470, -47162, -51041, -84160, -15281, 44989, -137873, -494926, -645737, -422506, -125767, -81015, -172302, -61105, 280760, 535884, 496718, 306805, 208383, 240146, 272454, 221643, 125512, 51844, 10236, -41388, -131757, -228329, -261031, -200336, -98710, -38266, -45327, -71361, -54301, 11353, 68664, 66923, 30082, 27121, 67018]
42256F7018O565p6646j06174o8566n1028o4345j1454J03433J12727m2008j47683
42245b78161j6285J96179J99020k56j33150r3002l9856p2152p8323P614O1693
42234b46679O873k4415Q0408J98061J52909j5080j31865j38058r9980n5564m221
42223b77611J1160m0828q7839n0771J0058j6337r0899o3793Q9607K19130K12758
42212h5365J29287P0370L4440k5404q0178n9335K5514Q0703O2360L8019P8350
42201B68761J35542J00337k6503j06871n5659J9300l6110j78985k04078l5568
42191a19834J46036J34185m5014j93264j92734r8664j2924L4456O8194J02316
42181a77247J21293J01048L6725m3331r6715j02948o8224o420N2577N4260k0431
$$ y = [67018, 73583, -3063, -109237, -177803, -228831, -293176, -304630, -201197, -88470, -130478, -278161, -294446, -98267, 100753, 100497, -32653, -125655, -165511, -237663, -315986, -308372, -246679, -239806, -264221, -183813, 14248, 167157, 152077, 20212, -117846, -217826, -273390, -277611, -266451, -307279, -395118, -445889, -435831, -452168, -543067, -606860, -517253, -298123, -85365, 43922, 114292, 148732, 123328, 43150, -16185, 9329, 90032, 152392, 190411, 268761, 404303, 504640, 478137, 371266, 315607, 334907, 298797, 119812, -84266, -119834, 26202, 160387, 115373, -77891, -270625, -369289, -382213, -347757, -279563, -177247, -55954, 45094, 81819, 38488, -58227, -161175, -229399, -235819, -183242, -128982, -149413]
42170a49413r4450p4663J770L363q2794r7035N5536K30515K33769R8853J2613
42159A38064J0996n2136k07952k50829l5426K49587K83446L2288k11445k13024
42149b56431m9429P8087J22990J54122J53601M4833j07437j20008M2431J84788
42139B47547J40120k4375j46777j85775j86502j52106q3322m2181l3807O4636
42129d02542K84460L91178J65529k15644l56173j81298o767l1840q0791K8514
42119d05374J59901J15231j3255l274J29420J81950J06692N6080R5880Q8713p8317
42108D33647k88287l06675o8588J96341J77962j37306l82265k34704J36273K72490
42098b01112O3858j17945j0335J53955O9721j33595j35187L5361P7533o4826j43636
$$ y = [-149413, -243863, -318526, -316756, -313393, -396187, -493222, -437686, -207171, 26598, 125451, 138064, 149060, 96924, -111028, -361857, -397283, -147696, 135750, 168038, -43407, -256431, -305860, -227773, -104783, 49339, 202940, 247773, 140336, 20328, 62759, 247547, 387667, 363292, 216515, 30740, -155762, -307868, -391190, -433371, -467178, -402542, -118082, 273096, 438625, 222981, -133192, -314490, -321257, -353097, -433888, -405374, -245473, -130242, -143497, -146771, -17351, 164599, 271291, 327371, 423251, 511964, 433647, 145360, -161315, -229903, -33562, 144400, 7094, -375171, -609875, -473602, -201112, -137254, -255199, -265534, -111579, -41858, -175453, -310640, -275279, -197746, -262572, -406208]
42087d06208l9042Q9893J12696Q3657M5220m6121j37660q8718O2311R1316n5568
42076b88224j40355Q788K32568K78944J31760m3682j37195j35296m8395O5660
42066g5427R3977l23j05986j00649J0799J44817K34027K28791J12334l2372p3884
42055D36104N151R7281J37042J42511Q0417j21375l72342m32668k30507J4085
42045b44301R4640O8389P1271P2378o958q5776m5987M2510K3657q7549j37159
42034b34885p0800L0170J07651J62572J70875J15891O7149Q0495O5613q4568k71108
42023A39055k79247q4510J12525J73259J61358J52219Q9545o2727j72309r4791
42013A34377R2697J65401M9125q9887r3526l1457o6833j75758j67430L995J34073
$$ y = [-406208, -445250, -355357, -242661, -159004, -113784, -159905, -297565, -386283, -323972, -232656, -288224, -428579, -419791, -187223, 91721, 223481, 179799, 42604, -92692, -141087, -75427, 18550, 18227, -87759, -188408, -177609, -32792, 201235, 430026, 542360, 509988, 436104, 441255, 538536, 675578, 818089, 898506, 777131, 404789, -27879, -258386, -244301, -149661, -81272, -10001, 62377, 55419, -30357, -76344, -33834, -10177, -97726, -234885, -305685, -275515, -167864, -5292, 165583, 281474, 348623, 429118, 494731, 410163, 139055, -140192, -224702, -112177, 61082, 222440, 374659, 464204, 401477, 229168, 134377, 227074, 392475, 441600, 351713, 258187, 226730, 159897, -15861, -183291, -179296, -45223]
42002d5223P4480k9204J7858J26327Q7062l3214J1868J80703J54099j08906k31192
41991B04658k8148J36341p3688l66447k37490K23255M32957J61166k04327k85525
41981c7248j70935j00262o5918M1852J51860J23501k791o5447n257J07489J87637
41970A64481J73480L9457j34360j91255q3784M9424O8431O880j6225K9138R0248
41959A95915J37896J65514J32236O856j51019k34189k11163j49507j10379o5285
41949b83125N2349K25678L29792K65707Q8601o4632j49796k08817k07614o0943
41939a2800J38000J37082r6694k44400q4323J42042R6426j08442r6496J47862
41929A8257K67672J25939l1956p1022j69915l73510l77609k5460L37228L20110
$$ y = [-45223, 29257, 53, 17911, 144238, 231300, 198086, 209954, 390657, 544756, 435850, 204658, 176510, 312851, 239163, -127284, -364774, -141519, 291438, 452604, 248277, -37248, -208183, -308445, -374363, -332511, -180651, -57150, -59941, -125388, -130645, -23156, 164481, 337961, 377418, 243058, 51803, -31981, 17443, 85874, 92754, 76529, 105667, 195915, 333811, 499325, 631561, 638417, 487398, 253209, 42046, -107461, -217840, -283125, -230776, -5098, 324694, 590401, 679002, 614370, 464574, 255757, 48143, -12800, 125200, 262282, 165588, -78812, -163135, -21093, 75333, -33109, -129605, 18257, 285929, 411868, 379912, 308890, 138975, -234535, -612144, -637604, -300376, 19734]
41919A9734K8708j67950j74674j41611r5409L7314J61279J15879k5453o9293m3020
41908c54496j07499j93516p1876K22487L79814K72514J08229N7509L0911o7674
41898B76403j45191j18271p2259p3144k8865J08503J93593J09592k4698m2500
41888A83163J9400L3902J8463O1403J13931O2023n5424r7470n3228l4984o1458
41877A89721m0367K8416K5473p2757j28135n5463N2871R2599Q9331Q4112K8914
41866B94715p7338q8875Q0532K56580K08462j1091j44038j11215p6254j11960
41856B19518p3161J01378K15738J14912n2404p7111k4569q1843k01443j81729
41846d0714l6547J1880r1540j47087l4763J16652J67069J41801R0009q757j00948
$$ y = [19734, 48442, -119508, -294182, -435793, -531202, -493888, -332609, -216730, -242183, -311476, -354496, -461995, -655511, -727387, -504900, -125086, 147428, 255657, 313166, 344077, 276403, 131212, 12941, -59318, -132462, -161327, -52824, 140769, 250361, 225663, 183163, 202563, 236465, 254928, 316331, 430262, 492285, 436861, 339391, 286163, 251179, 189721, 149354, 177770, 203243, 130486, 2351, -53112, -241, 92358, 181689, 265801, 294715, 217377, 128502, 209034, 465614, 674076, 662985, 518947, 407732, 331478, 219518, 146357, 247735, 463473, 578385, 525981, 448870, 424301, 342458, 141015, -40714, -77261, -65381, -156921, -304008, -338771, -222119, -55050, 86751, 176760, 168003, 67055]
41835F7055m9934J07905J25005q3911k50654j36434R0866J12113n4499j06052
41825a78540O4585K18258J26706j31115k96894k27915q731J60602J60642O0160
41815e2242N285J0491l3829j27922j08043Q6138K65235K50991J25288N6784L5738
41804E13914k5235p6386m6444m2249j72657k77834j26670J74700K75845P5655
41794B72639j63635k13734j17498P127J27607J90858J05830p3449j53326o7897
41784h5478M9069J10928J80335K59565K12902O940j75503j79483o3729N0231J31370
41773D97147J48527K5777j89023k90400j78792j575P6874P6409O5959J8409o5149
41762A84163p1331L3925J03654N2684J7199R6039J27436m8087k67464k56189m8213
$$ y = [67055, 17121, 125026, 250031, 166120, -84534, -220968, -130102, -17989, -72488, -178540, -113955, 104303, 231009, 99894, -197000, -424915, -433646, -273044, -112402, -52242, -46957, -36466, -70295, -198217, -306260, -220122, 45113, 296104, 421392, 478176, 513914, 488679, 412293, 365849, 323600, 150943, -126891, -253561, -78861, 196984, 272639, 109004, -104730, -222228, -215101, -87494, 103364, 209194, 135745, -17581, -85478, -36409, 74519, 254854, 514419, 727321, 734261, 558758, 379275, 315546, 365777, 497147, 645674, 671451, 482428, 192028, 13236, 11661, 88535, 164944, 230903, 249312, 184163, 112832, 146757, 250411, 303095, 320294, 416333, 543769, 495682, 228218, -27971, -76184]
41751g6184Q4503N8143M5686J23943J33714k8349j98972j63444M0535J62803M7664
41740B30042j81821k64593j07086R4176Q7676j03838k00869l3941K37838L43428
41730A01012K18748J4861j19758j59920j61525j77921j87570r3215J31280L14720
41720a19288K60526M6510m8905M2789Q6801m8981j69723j02486k050o6413j72317
41709b93537q8903J10151J64952N5342o296M5080N3452n8536j75194j87406j00142
41698d81037M8923J88984J78792k2271j98997j23967R5817J63649L6799n2601
41688a65909K500O4769N4640P2307J54517J82108J09247L7447p868j18980k50749
41677A34029k02490L2242J73580O4661q7062o3302J5896o3614k14017j81981K4512
$$ y = [-76184, 8319, 66462, 112148, 236091, 369805, 341456, 142484, -20960, 19575, 182378, 230042, 48221, -216372, -323458, -229282, -141606, -245444, -446313, -480254, -242416, 101012, 319760, 334621, 214863, 54943, -106582, -284503, -472073, -565288, -434008, -119288, 141238, 187748, 138843, 181632, 268433, 219452, 49729, -52757, -54807, -121220, -293537, -382440, -272289, -107337, -51995, -58291, -13211, 40241, -18295, -193489, -380895, -481037, -432114, -243130, -64338, -86609, -285606, -409573, -313756, -150107, -113308, -165909, -163409, -98640, -44000, 28307, 182824, 364932, 474179, 511626, 503758, 384778, 134029, -68461, -36219, 137361, 202022, 114960, 51658, 67554, 3940, -210077, -392058, -367546]
41666c67546J33326K0504j16788n9777J29257K10046R4429m0570M432J69173K01021
41655C77507O410k09426k35017j33435q1375p4637j4663L0328o3672j71335n0191
41644f19506K27879L22216J49801J0231P7521J29561l1385k21608j89909j9785
41634a64984N5494K7368K9311N2738J0700n5653p6908j21761k28684k28333p36
41623g01448K37906K08853J5103j8346J28349J62739q681j26341q945J81877K34588
41612C05654J75636J07978q673k16446l58872k47640L3016J84107O3569j41017
41602a02688j60308K8022K00106J84203N7778J988M2149M4718n6298j67597j92396
41591a20323j44282n8465P4514K12467K31170R2578o4620j03263n3676n945M3350
$$ y = [-367546, -234220, -213716, -330504, -390281, -261024, -50978, 43451, 2881, 7313, 176486, 377507, 383917, 174491, -60526, -193961, -275336, -349973, -364636, -334308, -397980, -569315, -619506, -391627, -69411, 80390, 90621, 168142, 297703, 266318, 44710, -145199, -164984, -109490, -82122, -52811, -73, 10627, -45026, -121934, -243695, -472379, -700712, -701448, -463542, -254689, -239586, -257932, -129583, 33156, 24475, -101866, -110811, 71066, 305654, 481290, 589268, 580595, 364149, 5277, -242363, -209347, -25240, 38329, -102688, -262996, -234974, -34868, 149335, 207113, 209101, 251250, 295968, 239670, 72073, -120323, -264605, -323070, -248556, -36089, 195081, 287659, 223039, 119776, 66100, 60155, 103505]
41580A03505J16486J42643O3923l7644n6490k1371o466J6430Q8607J23936K6983
41569E60542j21378j63559r2065k3019n619j0012l8680r5410j11103n1176j4267
41558a65746o6899q6909L7399J65152R5494q8112j32420j5702N0378L87j73J17764
41546h9387J94312J12658k9042r9752r4291m7196K6309N5209l2674j41001q8145
41535b33000J00062J94228J09997K7828Q5725J71110J25686k9726j77636k44112
41525A30162j76791L8493K57262K56082K4572j90869k08291r6748J1437P6427
41515A21736N2209j12414k69760j46071K27771M34640K24492j12182j73393o580
41505B40448O5157j7119m1541M4811O2036n5239j46411j02720r706L9673O8016
$$ y = [103505, 219991, 362634, 426557, 388913, 332423, 311052, 304586, 321016, 409623, 533559, 560542, 439164, 275605, 183540, 160521, 154902, 144890, 106210, 10800, -100303, -151479, -165746, -232645, -319554, -282155, -117003, -21509, -109621, -242041, -257743, -207365, -206978, -207151, -89387, 104925, 217583, 188541, 88789, -5502, -52698, -26389, 28820, -3854, -144855, -233000, -132938, 61290, 171287, 199115, 284840, 455950, 581636, 551910, 374274, 130162, -46629, -8136, 249126, 505208, 529780, 338911, 130620, 33872, 45309, 121736, 173945, 61531, -208229, -354300, -126529, 308111, 532603, 420421, 247028, 240448, 305605, 288486, 246945, 291756, 353792, 298553, 152142, 49422, 39716, 79389, 147405]
41494A47405R1783N0354p3135j82577j77235n6464R3780J58992P4877p9675j25879
41483g7774l348J35725J45494Q6826P5956O3118m6406j62659j41857p1656j51178
41472a47759l11336k56513O2898L07977K07333p7378k03971r1958O5610J12416
41462c32681O9112J5779j6455l6417n6679o6467k0038J01866K09669J74904J8446
41451F1039p6996j0023Q4907K3817j64434k80521k18196o8197L4881O7342R3253
41440d53128J53696K14807K05673J02227j9183m1268N4147J46199J23491K9601
41430E16262j5981r259n9662j85231k40164j22443N1346R9883L8927L4142J10195
41419B18015R1422j05308k88186k35629j0936J32155R5666J2229n799k373k5429
$$ y = [147405, 239188, 289542, 216407, 33830, -143405, -199869, -106089, 52903, 127780, 48105, -77774, -81122, 54603, 200097, 286923, 362879, 425997, 379591, 216932, 75075, 3419, -147759, -459095, -715608, -652710, -344733, -137400, -214778, -418749, -510707, -445097, -332681, -263569, -247790, -264245, -300662, -357341, -423808, -443846, -341980, -132311, 42593, 61039, -15957, -25980, 58927, 82744, -81690, -362211, -580407, -648604, -613723, -546381, -453128, -299432, -84625, 121048, 223275, 204092, 162824, 216971, 363170, 486661, 516262, 500281, 491022, 431360, 246129, 5965, -116478, -65132, 34751, 73678, 107820, 218015, 309437, 204129, -84057, -319686, -330622, -198467, -102801, -90572, -96371, -98744, -124173]
41408a24173j4992O4527J14483M2369p7876j07933n0113k4114n9749l8677J23133
41397a53115L22014L65195K01016r067p5565m475K7464p4961j89899j62229m0338
41386B06040l690r0007j45253o4662N8209Q3901J7159l4984j9611K4090L9868
41375G1060J3896j4255J5209R7492J22087p750k16149l06710j86767M3520K26486
41364a41881K77680J93008M6590k0276N8422J42306M6803j65601k42479j08682
41354H5890L9238N6720K9760L2840l7450k20021l06515j23479J63058K51964J03322
41343G5327p6333j47275j30731o7431J6297M5944k4289j04427p5234M3643J44720
41332b99789J79060J43784K4681j23858j50433N054J96905K67135K26110J29149
$$ y = [-124173, -139165, -74638, 39845, 82214, 4338, -103595, -153708, -177822, -237571, -276248, -153115, 168899, 534094, 735110, 726043, 650478, 646003, 673467, 598506, 408607, 246378, 206040, 202350, 112343, -32910, -97572, -39363, 44538, 61697, 26713, 7102, 31192, 71060, 84956, 70701, 85910, 183402, 305489, 297739, 81590, -225120, -411887, -368367, -141881, 135799, 328807, 375397, 355121, 413543, 555849, 602652, 437051, 194572, 85890, 125128, 181848, 211608, 244448, 206998, -13023, -319538, -443017, -279959, -27995, 75327, -1006, -148281, -279012, -346443, -330146, -284202, -308491, -412918, -488152, -444509, -299789, -120729, 23055, 47736, -76122, -226555, -221501, -24596, 242539, 468649, 597798]
41322E97798m3259k28257k18371K6390K09622R9152j03057r0851M4114R572j45433
41311A57420j19777Q0253J22214r2345k69800k07017n9745j7113l1142M769P8075
41300c54208J60429K50311K54888Q0830j25586j15021N7191Q0337j04752k00519
41290a6100m6528J40171J50277O2019j4883j30542k56908k04016K2695J17822
41280a75993m7118j79621n1667J15813O1255n5771K6470J74499J05031q4512q0112
41269a91726Q7307R4172j13740k32674r3620J17326J86750J25920L7260k3140
41259f165m544J00007J50042k33k44065l14744j49383M4320R9730O3414K8469
41248b33152l346m2626o2155o7320p6407k5848J42411K99380K30134m5258k39497
$$ y = [597798, 554539, 326282, 107911, 134301, 343923, 443075, 340018, 249167, 293281, 302853, 157420, 37643, 117896, 240110, 147765, -122035, -329052, -388797, -405910, -437052, -432283, -354208, -193779, 56532, 311420, 392250, 266664, 151643, 208834, 289171, 184419, -16100, -62628, 77543, 227820, 289839, 274956, 144414, -112494, -316510, -293815, -175993, -223111, -402732, -454399, -338586, -277331, -333102, -306632, -132133, -27102, -111614, -191726, -104419, -10247, -123987, -356661, -450281, -332955, -146205, -20285, 16975, -6165, -10709, 89298, 239340, 239107, -4958, -319702, -469085, -424765, -325035, -261621, -233152, -236498, -279124, -341279, -408599, -485006, -510854, -368443, -69063, 161071, 115813, -123684]
41237a23684j56009P9038K17628J81328O5782k7074o2605n5516n8867j21570k07279
41226b68828k07872q0435P8128J36841P7444k767j8580O665j2121q7080j14997
41215d93602j4382J35154J78549R3051J072k0233o428K9167J28048K33616J93369
41204D57381J0711r1290O245J09963R396j78435j84453J438J40740J17405N5875
41193D54976N8658M1882r5179k78152l26576j66065P7234K01890J60411J19936
41183B49015K14088K99382J44039j65750k80732j10134K5209q4378j87754q795
41173I4190K56974K38533k0485j64606j02178p3737j82562k43708j39473L327
41163c33725O1879P7576J02549J07834R0571Q3033M7585n0288r7511J8709J61235
$$ y = [-123684, -279693, -200655, 16973, 198301, 264083, 237009, 174404, 118888, 60021, -61549, -268828, -476700, -557135, -479007, -342166, -264722, -267489, -286069, -279404, -291525, -378605, -493602, -507984, -372830, -194281, -101230, -100158, -120391, -126819, -97652, 30396, 264012, 457381, 468092, 376802, 383047, 493010, 502406, 323971, 139518, 140956, 281696, 399101, 454976, 513634, 555516, 460337, 182185, -144391, -310456, -233222, -31332, 129079, 249015, 463103, 762485, 906524, 740774, 460042, 349908, 375117, 290739, 102985, 94190, 351164, 589697, 569212, 404606, 302428, 228691, 46129, -197579, -337052, -333725, -271846, -194270, -91721, 16113, 106684, 189717, 237302, 187014, 89503, 108212, 269447]
41152B69447R5801j31048k36401j19370L5431P9706N5817J4592m9344o1018O2666
41141A6279J88754J04275j07269j42867K8218R3832r4607k88200k46578o5933
41131e14096N1980P8688N5060k8208j01083k0669J60981K01424O0634j4815O2289
41120g815M6122j61468k33060O4203L93260K92168j26620l45215j83478M3539
41110b18364P3963J1259K5738O5216L946j16766j41570j4830J44765J71277M2449
41099D7083o9875k115J56507J50957p2552k49181j44564J21402K36810Q8429j43282
41088A19619k26133j11376M7196O3514o4207j31268L928J98192K22193J03181
41078B24839M4594O2521n433j45360j63062o8583q7527k03785j10341K19173L51279
$$ y = [269447, 365248, 234200, -2201, -121571, -86140, -6434, 49383, 63975, 14631, -46387, 16279, 205033, 309308, 202039, 59172, 87390, 181222, 86615, -201585, -448163, -514096, -462116, -383428, -328368, -356576, -457659, -478328, -317347, -115923, -55289, -70104, -7815, 38307, -123161, -356221, -292018, 101242, 393410, 266790, -78425, -261903, -218364, -144401, -133142, -107404, -42188, -38242, -155008, -296578, -311408, -166643, 4634, 47083, -22792, -24907, 131600, 282557, 210005, -39176, -183740, -62338, 174472, 262901, 119619, -106514, -217890, -170694, -107180, -171387, -302655, -298727, -100535, 121658, 224839, 269433, 331954, 326521, 181161, 18099, -50484, -138011, -341796, -452137, -232964, 118315]
41067A18315N6035k60918j53713J78675K31162l3823k08074r1037J05404J48454
41057I0480K9038j54434k76359j95600P5019K86028K46856Q4374K883l3937j29972
41046B4376j67291n012J99991K03466O2614r387k2282r5850j31184J4222J62273
41035B35936M7298j93027j98906J5484J01143l0667j13539k7054N6561N7817R5715
41024D6761J68658J36681M9102Q1557J43970r70k29339j75602J04558J52521j17047
41013C60850k57088p7153L1272j69764l15955j04222J53847R6487o2165K1201
41003c22690J73420O5015j33058m8066J97947J94830k8444q2756P6141J10710
40993B03049n4546j15544L4392J24048N328j19669j01416o4269q3458k2412J43057
$$ y = [118315, 174350, -86568, -240281, -61606, 169556, 135733, -72341, -163378, -57974, 90480, 119518, -34916, -311275, -506875, -431856, -145828, 101028, 185402, 188285, 154348, 24376, -142915, -147927, 52064, 255530, 318144, 308757, 286475, 190625, 59441, 73663, 235936, 283234, 90207, -108699, -93215, 7928, -22739, -136278, -163332, -106771, -48954, 46761, 215419, 352100, 401202, 482759, 626729, 625759, 396420, 220818, 325376, 477897, 360850, 103762, 26609, 57881, -111883, -427838, -532060, -378213, -281726, -343891, -322690, -149270, -84255, -217313, -265379, -67432, 127398, 98954, 16198, 92339, 203049, 148503, 32959, 67351, 191399, 196727, 77058, -24358, -88627, -172085, -194497, -51440]
40982e1440J90863L0618j05626n4915k094j23843k27550n0580K68201L44567R4704
40971C12905j67417j71864N215J23430Q6073j0255m0340M230K1617n4066j30541
40960b1013n7179J33525K05506K8980k02126k10110j7833R2874r602j45697j30509
40949c33184m4548o0476j38202q3708J36635L21147K88744P6257j46733k49405
40939b33473k00757o3302M5886P6449J23426K65636L51036J46434k64017m75766
40929b28448k82039L7109J25909L3602L2926J41107J45182J0135p4907l9879j3163
40918a12466m0527j7521N5840L6182q2206j18394j6685N8961L2594L8748J15811
40907d9663O9016j77688l58690k29810N5042J78312J02011J9623k425n4754j19313
$$ y = [-51440, 139423, 170041, 64415, 9500, 7406, -116437, -343987, -394567, -126366, 218201, 312905, 145488, -26376, -21161, 102269, 188342, 178087, 137747, 141977, 163594, 109528, -21013, -78192, 55333, 260839, 289819, 87693, -122417, -140250, -47376, -56978, -202675, -333184, -377732, -438208, -576410, -660118, -523483, -202336, 86408, 162665, 15932, -233473, -434230, -497532, -451646, -375197, -251771, 13865, 364901, 511335, 247318, -228448, -510487, -473378, -347469, -313867, -280941, -139834, 5348, 15483, -59424, -99303, -112466, -152993, -170514, -114674, -78492, -160698, -279092, -295777, -236816, -204222, -165474, -49663, 19353, -158335, -517025, -746835, -691793, -513481, -411470, -391847, -394272, -449026, -568339]
40896e68339m3998J95668M05121L91766J67803q6971j94752j22353j443K4586
40886A67088j4209L1009J74547K41036J25304m2823r1403l3113O689k5638r6438
40875D42049j48132j10100K8029J11455l0093k73119k80943J378K08589Q6455
40865C5568j22517p8981J25716J68565K5219o5620m2558m9682q6212L013J88528
40854A01039K43898J05757m7879j10818j55600j92137j13471M9757J00996n125
40844b3583p7635j7575L2355j2241N18J56960K41680M5176k62222l29399j09522
40833c55488J06395J16578L3736L6403R1411M8549r1790j56803m8274J06906J24986
40822A2609J9939k0384R1957K15058J74382n322j47379j42116m1979J9532n1037
$$ y = [-568339, -612337, -416669, -11548, 380218, 548021, 461050, 266298, 143945, 142502, 167088, 152879, 183888, 358435, 599471, 724775, 681952, 590549, 557436, 564125, 538487, 442049, 293917, 183817, 211846, 323301, 293208, 20089, -260854, -259476, -50887, 35568, -86949, -165930, -40214, 128351, 153570, 87950, 45392, -4290, -90502, -87489, 101039, 344937, 450694, 402815, 291997, 136397, -55740, -169211, -119454, -18458, -23583, -101218, -118793, -86438, -98679, -98161, 58799, 300479, 345655, 83433, -245966, -355488, -249093, -132515, -98779, -62376, 29035, 77584, -14206, -171009, -219283, -112377, 12609, 32548, 12164, 104121, 319179, 493561, 488239, 340860, 198744, 156765, 176297, 125260]
40811A25260k17131l06787j77004P8032J97441R2527k9724J6224J17179O9601
40801c4382p3176q8183N4301J51717Q9412q169R144J06538J31111P180j72895
40790A72598k28314q7143Q8233P0160j15782k01705p1851O5908L4147k9436M3706
40779b59479J18844P419j41118n8910J57242J78442n422q1657L8865R2471m7646
40768i49j55646o8133M2395l121q7329l2932R7440J46483J18466R8400O6722l3354
40756A88442j57680k21405k01610j05399M4399J46801R9896k0004l3558N6570
40746b03548P1015j5989j3108J33933K03813O2444r5392n8629O8532O5177n3246
40735A65002j06136m7075J5811J7400j2491l4343k4476J5391J5820p8842j56430
$$ y = [125260, -91871, -398658, -575662, -497630, -300189, -207662, -237386, -221162, -103983, -34382, -107558, -195741, -141440, 10277, 99689, 91520, 100664, 207202, 338313, 345493, 172598, -55716, -142859, -54626, 15534, -100248, -301953, -373804, -307896, -273749, -303185, -259479, -140635, -133216, -274334, -333244, -176002, 2440, -2982, -84639, -45774, 46697, -949, -156595, -224728, -182333, -185454, -272783, -305715, -208275, -61792, 56674, 155074, 221796, 188442, 30762, -190643, -392253, -497652, -453253, -306452, -206556, -226560, -260118, -203548, -132533, -148522, -161630, -27697, 176116, 238560, 143168, 84539, 153071, 218248, 165002, 58866, 11791, 27602, 45002, 32511, -1832, -26308, -10917, 4903, -73939, -230369]
40724b30369m7414J62139J70330q0863k48523o7708K52928L39635J61584j5741
40714C95998l6311L2771R0560Q6981n664j33713j62777p6445m4674j49297k11040
40703b13611p7567R2349O9303p0659p8238O4099J44277P4547j1243J56P1712J22091
40691A87216R7209l3589k08081k56254j02418Q8336J11274j5092j30143j63593
40681d25135j25671O384J98825K78564J48120k5620m2464L4935L7139p63N1266
40670A35580J23211N8574p2036q1966j6524o1116j57910p2521J64802K48940P5633
40659C44667j12456j27379o3790l5737N008P1260M7808o8718r6996K3566J00803
40648H8036J0231r0191l5297P2519N4891n3043j01825p9247p0593o5317J7033
$$ y = [-230369, -277783, -115644, 54686, -26177, -274700, -342408, -89480, 250155, 411739, 395998, 359687, 392458, 483018, 569999, 564335, 430622, 267845, 191400, 146726, -2571, -213611, -291178, -198829, -129526, -200185, -278423, -214324, -70047, 4500, -6743, -6587, 65125, 187216, 284425, 250836, 42755, -213499, -315917, -227581, -116307, -131399, -261542, -425135, -550806, -544422, -345597, -67033, 81087, 55467, 13003, 47938, 85077, 84314, 135580, 258791, 317365, 245329, 163363, 146839, 85723, -72187, -144708, 20094, 269034, 344667, 232211, 104832, 41042, 5305, 10313, 81573, 129381, 60663, -36333, -12767, 88036, 98267, 8076, -27221, 45298, 100189, 47146, -54679, -133926, -204519, -269836, -252803]
40637b52803J58431K39112J82869K9085j11069j39377o3824n926l7713n1622P0632
40626A7795K07357J26808j31512k53681r5861J09846J09318l2830r8491m0190
40616h1441L2521N7728M7206j256q2965j43352j42611r3373L23J24563J64403
40605a18254J7862j62561q6614K19720L52021R5061k17391j72449J15617K03323
40595B46335j5836k12821j58531k922M4953J6327K8744M8638k6271j62112k05255
40584c98751o5551J81877L48933K81048J4162k15232k00454r390R8439J2889r0805
40573d2835j7636J57042J81981k8470k71269k97500r2100J41961K23055J41246
40563I5475j407j02550r4680L2124J82415K06504P2989p4629j09017q5431j13231
$$ y = [-252803, -94372, 144740, 327609, 356694, 245625, 106248, 42424, 36498, -1215, -52837, 17795, 225152, 351960, 220448, -33233, -129094, -19248, 90070, 57240, -41251, -81441, -48920, 8808, 56014, 54758, -28207, -171559, -314170, -407543, -407220, -282657, -118254, -100392, -262953, -349567, -129847, 222174, 317235, 99844, -72605, 43012, 246335, 230499, 17678, -140853, -143775, -98822, -82495, -53751, -5113, -31384, -193496, -398751, -464302, -282425, 66508, 347556, 361718, 146486, -53968, -63358, 35081, 47970, -42835, -60471, 96571, 278552, 250082, -21187, -318687, -410787, -268826, -45771, 95475, 94068, -8482, -103162, -71038, 111377, 317881, 390870, 316241, 207224, 121793, 8562]
40552H562j50966q2917O5415J71024K29666L16647L50248J51488k12417m09135
40542D37615k80275o1415j5351p5533n3269J0836l2522j17499n9785R4343J17587
40531c5268p157m1896R8813J72919j3538k71590k72888p746K14138J89533N1588
40520G6908K4292J01831R8949m6851j77143j42519l576Q0125O7485K5709k5797
40509G9413j03442j24689J9456K28067K32167k9405k59882j82169P8981J83657
40499A22154M7590r5637p2337J9788K8396j7237l621N2081L0456p8069j19743
40488h6179J6220K10788K26473Q917k14026k00452N492J51600J19623L7309K8175
40477C03940K1315q6902k14293j89731q572J53029J63428N7528o2978j39739j47771
$$ y = [8562, -142404, -225321, -159906, 11118, 240784, 557431, 907679, 1059167, 846750, 437615, 157340, 95925, 80574, 5041, -48228, -37392, -69914, -187413, -247198, -152855, -35268, -42425, -84321, 14492, 187411, 173873, -97717, -370605, -378351, -164213, 25320, 76908, 101200, 203031, 301980, 255129, 77986, -64533, -68109, 12016, 79501, 105210, 79413, -24029, -148718, -129262, 98805, 330972, 301567, 41685, -140484, -61503, 122154, 169744, 74107, 1770, 21558, 49954, 32717, 29096, 81177, 111633, 33564, -86179, -69959, 140829, 367302, 376219, 162193, -38259, -32767, 118833, 238456, 275765, 303940, 325255, 238353, 24060, -165671, -174243, -21214, 142214, 199742, 136764, -2975, -150746]
40466a50746p3144M9378J35547J38919J06463J04026J10864M8041q2593j59127
40456B27628r6293J3390J6954o6612p5212J9040M5913o6101j31872j0902J28084
40445D017Q1979j7406P3423K36045J33596j98953l37276j15241J31107J17806
40435A09097L212L335R551j06922j56675L0674K13531R6093j39320j02246J56517
40424A16847K35163M3796j00520m6340r576j15336j66219k9762J03561N2784m9645
40413C4753m25J48862K12622J48278L2752r5384k04063j96493l2689J53400J85942
40402C87555M8527j23952k00713j54418o4621m3416r8185r5690M3821J83623J58915
40391D1446N5358P2342J57940P6841j47888k04782l98J56314N4183p1748M6107
$$ y = [-150746, -223890, -174512, -38965, 99954, 206417, 310443, 421307, 469348, 386755, 227628, 131335, 144725, 161679, 95067, 19855, 38895, 84808, 18707, -113165, -124067, 4017, 85996, 68590, 142013, 378058, 511654, 312701, -24575, -139816, -8709, 109097, 112309, 115644, 125195, 18273, -138402, -107728, 105803, 201896, 62576, -39670, 116847, 352010, 395806, 295286, 248946, 239370, 124034, -42185, -71947, 31614, 84398, 34753, 34328, 183190, 395812, 544090, 576842, 481458, 277395, 80902, 48213, 201613, 387555, 436082, 312130, 111417, -43001, -107622, -151038, -249223, -344913, -301092, -117469, 41446, 96804, 169146, 327086, 403927, 256039, 51257, 50859, 207173, 261356, 189608, 235715]
40380B35715K36302J67217j08601k55204j74400o2607j2736P4279J79882J26186
40370D06033q1519j82656n3303R3222M6653q4677p9526M8371J09721L8726n9403
40359B01642j03479j10915r9617n6702o973j555k7792j6002N4867J27182J43660
40348A04316R8684J8110n4016o4757j4928R654m7678r5038m613J59536J79419
40337B88689k375j66299j20801K1262L4586n8924l9930J35029K43070J23077j03766
40326C53618k27439k02230j05996J0429J09237J15116J4624p4427n6958q596m1783
40315a14405r7865k7304J62484K96304K61735J12760n8017k10894k98532k50819
40305b24553q5722N9865Q2751L5930L2183P0865M3791q5387j86819j12164R4496
$$ y = [235715, 472017, 639234, 530633, 275429, 101029, 38422, 25686, 99965, 279847, 406033, 324514, 141858, 88555, 181777, 228430, 143753, 64227, 112598, 222319, 261045, 201642, 98163, -12752, -112369, -169071, -176044, -177599, -205391, -221393, -166526, -39344, 104316, 203000, 221110, 167094, 102337, 87409, 97063, 49385, -45653, -50266, 109270, 288689, 286314, 120015, -786, 20476, 55062, -3862, -43792, 91237, 334307, 457384, 353618, 126179, -76051, -182047, -171618, -62381, 52735, 67359, -7068, -64026, -72622, -114405, -212270, -239574, -77090, 219214, 480949, 593709, 535692, 324798, 26266, -224553, -310275, -250410, -167659, -131729, -99546, -28681, 15110, -70277, -257096, -369260, -274764]
40294b74764K29069J93094J11505J03266O6785j30001l41953k87802J3330K28694
40284h8777J88559Q3979Q3856O9860o2556j46646m8862M1022o4148j75548m3947
40273a63208J62451J19940o8182l1809K00916K15851q4190k97543j66292N9694
40263e2372Q2252k5916p4496p7928j02425r1455m3149p5112j44266k5163K55174
40252c74856L32445Q5650r7014N7932K22532J5472l22727l09186n136J34525K5579
40241b34784j3811Q5375N5706j20915j22016J02317J70324p4909k48900m9772
40231d51385K32789J88582p0779j39931L9191J70071J11585J8705Q765O369n3142
40220F0820j07102r4518l3705M3433J03973Q6648q920o3184j1165J3012j03700
$$ y = [-274764, -45695, 147399, 258904, 362170, 428955, 298954, -42999, -330801, -317471, -88777, 99782, 183761, 267617, 337477, 274921, 128275, 79413, 120435, 56287, -119261, -163208, -757, 119183, 51001, 19192, 220108, 435959, 351769, 54226, -112066, -52372, 29880, 3964, -70532, -148460, -250885, -342340, -385489, -460601, -604867, -630030, -374856, -42411, 43239, -53775, 4157, 226689, 242161, -80566, -389752, -394888, -260363, -234784, -248595, -163220, -107514, -228429, -350445, -248128, -77804, -152713, -401613, -451385, -218596, -30014, -100793, -240724, -201533, -31462, 80123, 98828, 107593, 113962, 60820, -46282, -140800, -174505, -131072, -27099, 59549, 50629, -12555, -23720, -10708, -114408]
40209a14408j92175l0983K26697K00663j17257k88284p6986J96828J79862P089
40199h954k3263J0198j27677k82328j08336K63320L15917l4218k59720m5328K34398
40188f5991J64035n5227j9555J73071J36344j19187k32928j08690N332Q5R927
40177a12784M3612m3398j81068j25965P2048Q3287j26356j83022P6676L16113
40167a80857K48110O1555K2733K7807j11032k52011j78124k5598o3918k10302
40157f61637j50622J42743L64484L17102J10341o1537j00405J2481J96238K59944
40147D29132J04815j02146j32872j4363M6926j1334o7187n2243k1483l594L0873
40136B06524N5903O394r0377j30680p8592J277K9310l6109j62842k09628m8172
$$ y = [-114408, -306583, -337566, -110869, 89794, -27463, -315747, -392733, -195905, -16043, -8954, -32217, -22019, -149696, -432024, -540360, -277040, 38877, 4659, -255061, -300389, -65991, 98044, 42817, 23262, 196333, 332677, 213490, -19438, -128128, -122796, -122711, -112784, -69172, -112570, -293638, -419603, -347555, -264268, -390624, -573646, -496970, -180857, 67253, 128808, 151541, 179348, 68316, -183695, -361819, -387417, -451335, -661637, -812259, -669516, -305032, 12070, 122411, 60874, -39531, -27050, 169188, 429132, 533947, 431801, 298929, 284566, 331492, 320158, 252971, 200728, 179245, 175651, 206524, 262427, 268821, 178444, 47764, -30828, -29551, -241, -36350, -199192, -408820, -456992]
40125d56992K11376K83398R5590q2881m0723P3444M6410l3820K0324J20848N2898
40114B89872j29385j84678q6296k8012p1590q6005k2286K3312K1115M5386J03116
40103a25451J30447J33096J43509J01675k8995j22389p6445j7884q6886j67431
40093a16754j07799l7867j26285j91154K8457L37944L02312n5958k70339j51702
40083c89145N644M752K2651J62615K09894M4414j14446r6212m6121r3117j03938
40072c93009J3691R8883M9687K2737J03188J09961l1484o6859J51064L28991J68056
40061E54906j42207k18784n3334P0797N6517L4234M3260L031o1853m6722K3475
40050B63320L0697l3817p7925o0072j485O3671N9330o4767j64220k8405K21505
$$ y = [-456992, -245616, 37782, 133372, 50491, 9768, 83212, 129622, 95802, 116126, 236974, 289872, 160487, -24191, -110487, -138499, -210089, -296094, -318380, -295068, -273953, -228567, -125451, 4996, 138092, 281601, 383276, 354281, 231892, 155447, 137563, 50677, -116754, -224553, -262420, -388705, -579859, -551402, -213458, 88854, 32896, -237443, -389145, -383501, -378749, -356098, -193483, 16411, 60825, -53621, -149833, -195954, -289071, -393009, -379318, -280435, -230748, -208011, -104823, 5138, -26346, -93205, 57859, 386850, 554906, 412699, 193915, 140581, 211378, 267895, 302129, 345389, 348420, 286567, 239845, 263320, 294017, 260200, 182275, 122203, 120718, 184389, 243719, 178952, 14732, -13673, 207832]
40039B07832J76442k27911m73570j69612L17821L64142j5972k54528r5354J35503
40029c5207J36922L5906M8515J14398P5034l3642p2442l3958j6486m5563n6036
40018A17441k5038k5653j15355k06921j31724J12643K67966J19997j59000j98679
40008b44323L8786J96658O7750j04298l4631J68633K12005M6934j45232k32337
39998c0055j84542r714J72908J68965m039p6488M5378Q2473j41294l24070j27139
39987d27617K62577M03703K39044N7822k0464j01742j73590j28872n6247j09787
39977e5173j67924k1058J92860J74715L940J1113J59736Q8667k03115k76708J3723
39966g9224K45152J00774j54042j47178M8369J44898J02193M9894n034j03061
$$ y = [207832, 384274, 156363, -317207, -486819, -168998, 195144, 179172, -75356, -170710, -35207, 101715, 137621, 186136, 300534, 375568, 341926, 269484, 235526, 219040, 173477, 117441, 92403, 66750, -48605, -255526, -387250, -274607, -6641, 113356, -45644, -244323, -205537, -8879, 58871, -45427, -80058, 88575, 300580, 347514, 202282, -30055, -214597, -224311, -51403, 117562, 113523, 37035, 82413, 164886, 23592, -300478, -427617, -165040, 238663, 477707, 535529, 515065, 413323, 239733, 110861, 54614, -55173, -223097, -244155, -51295, 123420, 127360, 138473, 298209, 386876, 183761, -92947, -79224, 165928, 266702, 112660, -34518, 13851, 158749, 260942, 310836, 305802, 202741]
39956B02741j50382o5367L5898M371j14028j70142j10189K8958J86357K55654
39946A03871J53935k2830q5119k9208k1671p8156k5162J54423K30513Q9823q6887
39935C83532j33715j14136j03681m1977N8512M4198q4857j02151O0921J62814
39925A29460O2792m2648o763p977j65437k23740L1100L36892L26089R0605l0630
39914D99743k4163j19835k77801k24185M3804K15259J47820K7784J0622K5587
39904C24635q658n6294j04620j86905k32134j24536O5467J38653P1311L4683R7413
39893A9015J41800R9883M3772J0367m3496q3637j8269R8024J08001K6532K5905
39882D27897J08161O9396j23279k07574l4936J52005O7879j77159k35703j9538
$$ y = [202741, 52359, -13008, 22890, 27261, -86767, -256909, -367098, -338140, -151783, 103871, 257806, 234976, 149857, 120649, 98978, 20822, -4340, 150083, 380596, 470419, 383532, 249817, 135681, 32000, -9977, 48535, 92733, 7876, -94275, -33354, 129460, 192252, 149604, 142841, 134864, -30573, -254313, -223213, 113679, 439768, 530373, 499743, 475580, 355745, 77944, -146241, -102437, 112822, 260642, 288426, 299048, 324635, 315977, 259683, 155063, -31842, -263976, -388512, -323045, -184392, -113081, -78398, 19015, 160815, 260698, 304470, 314837, 271341, 187704, 169435, 267459, 375460, 401992, 427897, 536058, 605454, 482175, 274601, 239665, 391670, 459549, 282390, 46687, 27149]
39872B7149J99397J68384m9899j97804j28384O3030J73508J16910r477p6606p2500
39861B13708n0629j7799K1073r261j29013j79093k3061J75989J30503j23759k41875
39850b33217q5755Q4632N9402l630P9672J62311N0388j00539m0610R9443J0580
39839H2677k12841j64702J82030L60858J30455j47372j02649O9659r772k58819
39829g0476l03502j06342L1916J6581M9928J73128J65786l620n1046J26985K18617
39818B47955K776k51165k02332K0476O3194o7241o5809J25217K41913J58593M6031
39807C19608J8478l4884j59707j81712m729J70648J14284j00433k02719p4827
39797a35993J35782K09085Q1906q8810q7073R3190K02201O2884j51588j59174
$$ y = [27149, 226546, 394930, 345031, 147227, 18843, 81873, 255381, 372291, 362814, 286208, 213708, 163079, 145280, 166353, 157092, 28079, -151014, -174075, 1914, 132417, 8658, -233217, -318972, -234340, -174938, -178568, -98896, 63415, 113803, 13264, -27346, 72097, 82677, -130164, -294866, -112836, 248022, 378477, 231105, 128456, 198115, 188343, -70476, -373978, -480320, -448404, -431823, -381895, -208767, -42981, -46601, -97647, 29338, 247955, 250731, -434, -202766, -182290, -119096, -186337, -252146, -126929, 114984, 273577, 319608, 338086, 303202, 143495, -38217, -42946, 127702, 241986, 141553, -61166, -135993, -211, 208874, 290780, 201970, 114897, 208087, 410288, 473172, 321584, 162410]
39787A62410k448L1573j06070j51679J1748J58988J14976K4701M7903P7971l481
39776C66592n6414N4491J47262q296k67713k92854o1244J33794J45700J12329
39766B73647J22373O0179j29605k79326k34640q0068K852j2741j0503P0293J54416
39755f3123J45051N6187p133O88q658j14171k16459j47655N6063J69227J06720
39744b3263L7363P6391Q6383n1784j77989r4692Q7928J15137p323m9962N3145
39733E1334J32977R5261L8517L1054Q437m8993m7921L4304Q1590L5648l869L3944
39721D42283N1860n5812k11757k44072j12937M7093R6134L9175k788M7906J20577
39710B17662Q4837o7118k00117k11222j30927j9954J10679K14646J87291L1530
$$ y = [162410, 159962, 191535, 85465, -66214, -54466, 104522, 219498, 244199, 292102, 370073, 366592, 310178, 364669, 511931, 503635, 235922, -56932, -118176, 15618, 161318, 273647, 396020, 456199, 326594, 47268, -187372, -267440, -264588, -277329, -287832, -217539, -63123, 81928, 138115, 130982, 131670, 123012, 8841, -207618, -355273, -299210, -129983, -23263, 14100, 90491, 176874, 125090, -52899, -147591, -59663, 55474, 48151, -1811, 51334, 184311, 279572, 318089, 349143, 357580, 308587, 260666, 294970, 376560, 412208, 408339, 442283, 494143, 438331, 226574, -17498, -130435, -83342, 12792, 51967, 49179, 97085, 217662, 302499, 235381, 35264, -175958, -306885, -326839, -216160, -1514, 185777, 217307]
39700B17307q5794o5218k6974r0631j51465o5130P7561Q9222K566J329R4565J15446
39688A12784K7282j6418N8307J27118O3041j05533k54011k59752p5262J69149
39678a53295K15966l328k07959j29400Q8628J17961l9525r9931O931P0531K6190
39667a07231M9512J60031J26762j02127k43065j19919O9283J11451Q4518J02934
39657A32149P7010l1643k0590J99392L35843J29908j89482k26899j8375P3581
39647D60894n5247j64670j21973n9071n5138l115J34140K18316J75133J04317
39637F33586P2059J1829r2720j42300j24797j65233k65900k22581M0987K61477
39627F407J77111p0820j33898L0035J21845j6274j61704o3019J83920K81351J24652
$$ y = [217307, 131513, 66295, 39321, -51310, -202775, -267905, -190344, -101122, -98556, -97227, -2662, 112784, 140066, 123648, 181955, 309073, 372114, 266581, 12570, -247182, -322444, -153295, 62671, 59343, -148616, -278016, -189388, -71427, -110952, -210883, -203952, -133421, -107231, -57719, 102312, 229074, 126947, -116118, -236037, -166754, -55303, 29215, 132149, 209159, 177516, 156926, 356318, 692161, 822069, 632587, 405688, 387313, 460894, 405647, 240977, 119004, 59933, 4795, 1680, 135820, 354136, 529269, 633586, 705645, 717474, 624754, 482454, 357657, 192424, -73476, -296057, -255070, 6407, 183518, 112698, -21200, 8835, 130680, 114406, -47298, -110317, 73603, 354954, 479606]
39616D79606j20671k66079k59920j37861K2980J01006L1145p0967k3715J54318
39606i0158K38168J06400q9258j42875m9408N7536J03767R5247L8687l5710m2355
39595A90041N9190J85423K29714J75275N1483j16525k46774k22073o6318L7391
39585B76827L970l4171K4927P4074J5181m5676r351J4614o3873j01430K329M0359
39573A97780j61259l47427j75181K09386L70436K43700J33077J24093J4191j76986
39563D31810j64064N6991J31670n1884j77981q4257l0124j63178k06648K4981
39553b32684K41682J54515m8840p1766p987q0351j77142o9031J36547J69717N8831
39542G3491L3830J04472R6042m70m6978l6798n3742n0211M3329R3124n1518k38859
$$ y = [479606, 358935, 92856, -167064, -304925, -281945, -180939, -149794, -220761, -244476, -90158, 148010, 254410, 165152, 22277, -27131, 30405, 134172, 229419, 268106, 232396, 190041, 249231, 434654, 664368, 839643, 891126, 774601, 527827, 305754, 239436, 276827, 280797, 246626, 271553, 345627, 360808, 315132, 305781, 320395, 256522, 155092, 157421, 197780, 36521, -310906, -486087, -276701, 93735, 337435, 470512, 594605, 608796, 431810, 267746, 324737, 456407, 404523, 226542, 142285, 112161, -51017, -257665, -232684, 8998, 163513, 114673, 42907, 34920, -45431, -222573, -291604, -155057, 14660, 73491, 107321, 211793, 307835, 307365, 260387, 223589, 169847, 119636, 162965, 256089, 204571, -34288]
39530c4288j89306P7028K80096K90221K14195J25323J248r4441n2380N8691O0628
39519G37015m1320p4874p737J0474o4930q9450Q207R4007M8157n0782o2996Q031
39507E13802M9902J8515q907M2311J22011J11172K237o5840j5221M4441K8571
39496H42994P5656L01351M83000L31486J3279k5047K20872K53307j18901m14861
39486A963136k09887K14968L29192J01313j28655k44178l68225m64573l58449
39477H34642p9976J51068K29376K13249J73241J84438L04596L86805J58228l15996
39467B239671n59767l35133j6216N930r0105J8800J66120J9587k55264k44096
39457I49527K262Q9922k1514l0586Q4138L8933j75246k36122m6711J36762J70143
$$ y = [-34288, -223594, -146566, 133530, 423751, 637946, 763269, 764517, 670076, 617696, 676387, 737015, 695695, 620821, 613084, 623558, 558628, 469178, 477385, 571392, 619549, 568767, 505771, 513802, 563704, 582219, 573312, 615623, 737634, 848806, 851043, 785203, 769982, 814423, 842994, 918650, 1220001, 1703001, 2034487, 2047766, 2022719, 2243591, 2496898, 2377997, 1963136, 1753249, 1968217, 2297409, 2398722, 2270067, 2025889, 1657664, 1193091, 834642, 754666, 905734, 1135110, 1348359, 1521600, 1706038, 2010634, 2397439, 2555667, 2239671, 1679904, 1344771, 1328555, 1334485, 1244380, 1263180, 1429300, 1448887, 1193623, 949527, 951789, 1041711, 1020197, 989611, 1073749, 1112682, 937436, 701314, 654603, 791365, 961508]
39446I61508J70688J75396P6540o9308o3017P7224J29131L5479o3525j12055j30219
39435A187842k9632K16458L58428J98888k8970o407J50572J52618P9775J56672
39425B436244K28101L5208k03592j10432J50733J52472K95J31168M53154M49320
39415C722671Q3700j38001J073K29080L86904N62446O78855N91378M90757O01486
39405G210349P09465O34369P83233J459095K128247K321052K639841L680464M630238
39396B6196353M423698L659374L676502M419166N210576O838977J0413407J5153178
39388G9991231K0592226K9537606M3031238N1865685M0872956O986340l1815003
39381B41062279n2275567m8655280l4384126k3442794j7680443j2688688p699913
$$ y = [961508, 1132196, 1307592, 1384132, 1314824, 1251807, 1329031, 1458162, 1493641, 1430116, 1318061, 1187842, 1158210, 1374668, 1733096, 1931984, 1903014, 1896607, 2047179, 2199797, 2279572, 2436244, 2664345, 2699553, 2495961, 2385529, 2536262, 2688734, 2689029, 2820197, 3273351, 3722671, 3806371, 3668370, 3669443, 3898523, 4285427, 4847873, 5526728, 6118106, 6608863, 7210349, 7919814, 8554183, 9337416, 10796511, 12924758, 15245810, 17885651, 21566115, 26196353, 30620051, 34279425, 37955927, 42375093, 47585669, 54424646, 64838053, 79991231, 100583457, 130121063, 173152301, 225017986, 265890942, 272877282, 241062279, 188786712, 140131432, 105747306, 82304512, 64624069, 51935381, 44235468]
39374D4235468n012051m517232m082659l401295l606879m262720l864988k575286
39366A2912358j844184j844973j519489p65394n21506q79935r38659m87745k60850
39357C849623m78423n33549k20135n2058k22084k97283r8641K5670o3923q5638
39347A823559L3134J7852j71744k42866j14973k2870n6684q1318q1690j42499
39337I59901j67635m4418M8393p8951k20496r2870J44933J56941K294l8861R374
39326F78605l8302r1040J993M5416j52057k88236k9778K96813J56477k63144l16474
39315B73L4441K05175R666j02851Q1290J99273L8744q5212M8002J62982K1965
39304F13748j40500m2736J86410K77888K25721J63661J16457Q1114J02903J13231
$$ y = [44235468, 39223417, 34706185, 30623526, 27222231, 23615352, 19352632, 15487644, 12912358, 11068174, 9223201, 7703712, 6938318, 6416812, 5536877, 4598218, 4110473, 3849623, 3371200, 2837651, 2617516, 2565458, 2343374, 2046091, 1947450, 1973120, 1909197, 1823559, 1856693, 1874545, 1702801, 1459935, 1344962, 1322092, 1265408, 1184090, 1102400, 959901, 792266, 747848, 796241, 717290, 496794, 403924, 548857, 705798, 708092, 669231, 678605, 640303, 549263, 551256, 596672, 444615, 156379, 126601, 423414, 579891, 316747, 273, 34714, 239889, 249555, 146704, 227994, 427267, 466011, 380799, 428801, 591783, 613748, 473248, 430512, 616922, 894810, 1120531, 1284192, 1400649, 1481763, 1584666, 1697897]
39294A697897m9372l26712m23256k30199L137M8342j7210l1399M822L8008R5570
39283H09628J84241K40570K54520K61536K04225K8014j12795l8217R2117m4055
39273A879784l78370m88319k57913n6764j13008j65701J4601J87512O1182j96541
39263D86463k42824r5570n188L610P2316J38678K5454j73908j79888J2621J10885
39252A52649m17r3704q361P6169m1956k20064j60363J39981L61768K83974M4602
39241E34278p9965k0461P0978P6400M0017L8420M9435O992r4816k08587k77303
39230A35388k29459k4246K31158L13806J40221r6423j64096q5347m8724r9159
39220G3119j04563j3911M5559k2712j27426j18738J3632J36620J25078j1859j31862
$$ y = [1697897, 1648525, 1321813, 898557, 668358, 671495, 719837, 702627, 671228, 676050, 714058, 809628, 993869, 1234439, 1488959, 1750495, 1954720, 1982734, 1869939, 1831722, 1923839, 1879784, 1501414, 1013095, 755182, 698418, 585410, 419709, 434310, 621822, 683004, 486463, 243639, 148069, 142881, 146491, 218807, 357485, 382939, 209031, 29143, 41764, 152649, 152232, 58528, 50167, 126336, 84380, -135684, -296047, -156066, 205702, 489676, 534278, 454313, 433852, 504830, 581230, 621247, 659667, 709102, 716094, 621278, 412691, 135388, -94071, -118317, 112841, 426647, 566868, 470445, 306349, 221002, 172278, 73119, -31444, -45355, 204, -22508, -149934, -268672, -255040, -118420, 6658, -5201, -137063]
39209a37063r7450O4255J86300J77833J26834J19908P8857q3506k37109j60406
39199C8453J20682L02243J60584j80076l96107l10936m8254J33307J31210Q9207
39189D0313J52998K09453M2067k65061l38804m2446K68806K23152n4308j70935
39179F5235m4140O3061o757j34395j81793j45321m9932P3772J15509R979r3071
39168c27853j5395J34461R4611j29157k60768j70593m031J19050K24796K66398
39158f8481J14248j41397j92647M3881K65447K14198J3829q3853m5028L0358J12470
39147B63025J66075P3529j57224k82192j36496Q7600J01908o0629j28613j3192
39137h6209R7800N1812p4207j26171o5383L9118J05950Q6183j4257j17464j23080
$$ y = [-137063, -234513, -170258, 16042, 193875, 320709, 440617, 519474, 435968, 198859, 38453, 159135, 461378, 621962, 441886, 45779, -265157, -313411, -180104, -48894, 40313, 193311, 402764, 444831, 179770, -159034, -201480, 67326, 290478, 236170, 65235, 21095, 84156, 77399, -56996, -238789, -384110, -434042, -360270, -244761, -234782, -327853, -343248, -208787, -114176, -243333, -504101, -674694, -678725, -559675, -334879, -68481, 45767, -95630, -288277, -244396, 21051, 235249, 249078, 165225, 120197, 150555, 263025, 429100, 502629, 345405, 63213, -73283, 14317, 116225, 55596, -73017, -86209, 11591, 63403, -10804, -136975, -202358, -163240, -57290, 28893, 14636, -102828, -225908]
39126b25908j0304J25759J63781Q3965j2491k7505J7694L7559K2314L0027N4283
39115B59174L4878Q483P1662J55167O1455j79393k56735n1114J21100j3548k32088
39104b0959j72431R1053K24804J96397K08594K19271L0250k21377j92879N1178
39094D13901R3991j25563k17060m7377L3182j48243k70959j21924K5824m8702
39084d12930j01790Q3299K57111J65618K6551R8422J63081o3456l34185k29806
39074c48085J23673K44245N1091q8297J0530J46324J41384N1675l2755p7094k1755
39063B00936J16736J49841j8432j68761q6802P2949O2675k3555L2802J25088K7661
39052D91138j23783m6628J30691N7452j80226j64253J08438J88623m0111j46817
$$ y = [-225908, -236212, -110453, 53328, 137293, 124802, 97297, 114991, 152550, 174864, 204891, 259174, 294052, 302535, 374197, 529364, 590819, 411426, 154691, 103577, 224677, 211129, -20959, -193390, -102337, 122467, 318864, 527458, 746729, 776979, 555602, 362723, 413901, 507892, 382329, 165269, 117892, 151074, 2831, -268128, -390052, -364228, -412930, -514720, -431421, -174310, -8692, 17859, 116281, 279362, 215906, -118279, -348085, -224412, 19833, 70924, -17373, -6843, 139481, 280865, 332540, 299785, 222691, 200936, 317672, 467513, 449081, 280320, 193518, 266467, 329142, 305587, 338389, 463477, 491138, 367355, 320727, 451418, 508870, 328644, 164391, 272829, 461452, 421341, 274524]
39042B74524R4771L11128J69739p6554m2444J77392K37286J10673M8098J25340
39032A429953J72478R1745n408K9468K16187M39107N45457M94286M11549M24179
39022D249001M97680N70494P45532J125298J558613J853931K155190K686867L114352
39013A8556958K653779J032016j027825k517765l061468k932986k502639j985846
39005H214224j528683j199395r36589o81356m84642l80985l00807k18897k23444
38996B259426l22099l59884k53507j24680q3254p7902p9371j76686l39691l34401
38986A07951p2542J83077J80900L4483j9648n676p4502j66719j20612J598L804
38975E2114r5698r6192L2633R6446j0127j56089j79069p6842L9415P4868K6019
$$ y = [274524, 369295, 680423, 850162, 773608, 731164, 908556, 1145842, 1256515, 1304613, 1429953, 1602431, 1694176, 1688768, 1718236, 1934423, 2373530, 2918987, 3413273, 3824822, 4249001, 4746681, 5317175, 6062707, 7188005, 8746618, 10600549, 12755739, 15442606, 18556958, 21210737, 22242753, 21214928, 18697163, 15635695, 12702709, 10200070, 8214224, 6685541, 5486146, 4549557, 3868201, 3383559, 3002574, 2701767, 2482870, 2259426, 1937327, 1577443, 1323936, 1199256, 1116002, 1038100, 958729, 782043, 442352, 107951, 35409, 218486, 399386, 433869, 414221, 408545, 334043, 167324, 46712, 48310, 52114, -43584, -139776, -107143, -10697, -20824, -176913, -355982, -432824, -393409, -318541, -292522]
38964b92522q962O5902J84080J57888n2561k40267k16468m1647J09400J63338
38954a71819J19290j9893j51653r8403J10297J81609k5096k44273k00069l1342
38944e31352k1923j09907l5522J60131J91941K9406o3012J0959N8328r010k3528
38933c43489R0106J44244J3937j35808j11008L5362J39427J63485J60761J47299
38923C04316J23718J05636N6786q1124k39850k57185j15509J1983J7426p247L1540
38912d9510O9867K9405l5356m9567m5214n9869k9765R2072K11814K14216J28372
38901D76465N7411P078r3324k29461k74498j44388P4244J85210Q1470j25022k18474
38890b03289j39050m0927l9745l3989R1776K17346J51736l6710j08343l3831r020
$$ y = [-292522, -301484, -235582, -51502, 106386, 53825, -186442, -402910, -444557, -335157, -171819, -52529, -72422, -224075, -322478, -212181, -30572, -55668, -299941, -500010, -531352, -553275, -663182, -698704, -538573, -346632, -317226, -380238, -369279, -310951, -319961, -343489, -253383, -109139, -95202, -231010, -342018, -306656, -167229, -3744, 157017, 304316, 428034, 533670, 590456, 509332, 269482, 12297, -103212, -91229, -73803, -81050, -49510, 20357, 49762, 14406, -35161, -80375, -140244, -170009, -77937, 133877, 348093, 476465, 533876, 540954, 447630, 218169, -56329, -200717, -126473, 58737, 140207, 15185, -203289, -342339, -383266, -423011, -457000, -365224, -147878, 3858, -32852, -141195, -175026, -184046]
38879a84046q1966p1951P2085J48539O9070L5098J50839J60893j33926m36319
38869b71684l03285J75401M38151K05238j73350k37632j2485J18156j7741j73780
38859b53011o5215K17112L15151R7129j33756m8315K15854K13068j68518n12055
38849a22556m38893j07159P4769K6565o780Q2116J36597O7781O846M9437R3711
38838a37566M2962k7481k8922k0894p6571j17482l4223J15007J73339J01155n742
38827a6418p5999j13505j06479j5657J25903K05247J62398O0462q715k5015j4128
38816A78094J3096M7326N8409L8211K1836J5465m2156j71735k60335j86414j2617
38805c00820P6777L6259R832P7296J09546j4834j79152j70495J6815J72169J37641
$$ y = [-184046, -266012, -337963, -265878, -117339, -48269, -13171, 137668, 298561, 164635, -271684, -574969, -399568, 38583, 243821, 70471, -167161, -179646, -61490, -79231, -253011, -318226, -101114, 214037, 311166, 177410, 129095, 344949, 558017, 389499, -122556, -561449, -668608, -593839, -567274, -574054, -491938, -355341, -287560, -280714, -231277, -137566, -94604, -122085, -151007, -171901, -248472, -365954, -400177, -285170, -111831, -10676, -16418, -92417, -205922, -312401, -328058, -202155, 3092, 165490, 225952, 217237, 192222, 178094, 191190, 238516, 296925, 335136, 356972, 372437, 330281, 158546, -101789, -288203, -300820, -224043, -187784, -177952, -100656, 8890, -5944, -185096, -355591, -338776, -166607, -28966]
38794b8966l7033j89874j94374m0185J38572J60030J4923q3290J2483J47361R6645
38783c708o5325p5810Q6901J71885O7077n3880o5956q0143j69339j78363J1135
38772c55526K41576K94357J74830K2375r3436j38382o5888L8317k5018k27244
38762a34039k32064J07744M24450L18508m7468k08300q4970O341o1864r0411J448
38751f25L7306l0192k036J62507J93202n2795l15714l13314j37197m1284m9717
38740e49859k1461M8944M3589m3307q5893j6480R9682J61594J28263M8120K2266
38729a64542Q2027J14785J5269j20686j16267p440k088j28716j73105l3891J10549
38718d24105J06902O2879J23249K09468J59574j3879j55776j55541j9270J26991
$$ y = [-28966, -65999, -255873, -450247, -490432, -351860, -191830, -176907, -260197, -247714, -100353, -3708, -69033, -144843, -57942, 113943, 181020, 127140, 61184, -18959, -188298, -366661, -355526, -113950, 180407, 355237, 377612, 284176, 145794, 79906, 118223, 93205, -134039, -366103, -258359, 166091, 484599, 437131, 228831, 143861, 150202, 88338, -2073, -625, 36681, 6489, 4453, 166960, 360162, 307367, -8347, -321661, -458858, -500142, -549859, -571320, -522376, -478787, -522094, -607987, -624467, -524785, -363191, -234928, -186808, -164542, -82515, 32270, 47539, -73147, -189414, -196854, -198942, -327658, -500763, -534654, -424105, -317203, -254324, -131075, 78393, 237967, 224088, 68312, -87229, -106499, 20492]
38708B0492Q6074j74999l47826j16958L17460M18684Q8719j74291n9555J05245
38698A63045k1596k12634j40484P992p9882j98735J7541L57780L15025n6414k42537
38687i0899j38980j16466k31156j14880K35748L05649n8855l04850n0649L07695
38677b57643K81034L0207n2012k7905j46364k63206j01644J71590J91298L1669
38667a42976N2600K27781J78746j41815l26343j54684Q6973P9683q9020j45970
38657c75025m0139O3467N3782j6276l3328M2916J40853J70954J46958J35787J02733
38646C92682k5630j33267j2294K25394J67709k63205n46918k65517K42416L60445
38636A41815Q1347j02244l8712n4754k60679l20599o7941J67790R3658r6589p6178
$$ y = [20492, 106566, -68433, -416259, -533217, -215757, 202927, 291646, 117355, 57800, 163045, 141449, -71185, -211669, -203677, -283559, -482294, -464753, -106973, 208052, 151638, -90899, -229879, -346345, -577501, -692381, -456633, -150984, -209839, -514689, -565338, -257643, 23391, 53598, 1586, -26319, -172683, -435889, -537533, -365943, -174645, -142976, -90376, 137405, 316151, 174336, -152007, -306691, -219718, -140035, -229055, -375025, -415164, -351697, -297915, -314191, -347519, -304603, -163750, 7204, 154162, 289949, 392682, 367052, 233785, 221491, 446885, 614594, 351389, -195529, -461046, -218630, 141815, 223162, 120918, 82206, 27452, -233227, -553826, -621767, -453977, -360319, -456908, -533086]
38625e33086J29494K74813K58304J20885r6827k81005k39389K0448K02651J14401
38615b9311m9631k6364J06677R3504p8140j84784j14489K9547J23956J28023L4250
38604C3238j11593j78841q9992M9902R2344N5377N7473J04817J01627L3726j4908
38593A33170j6433k8343o2818n2132K8701J00058P6986k4711j11914j20067p9561
38582a57064p0816j07577j00378J4434J48263J54026K9860p7161p1802o638K9772
38571b15081J1713m1399p2745P746J97794L12028J88129m1482r7540L1428P9148
38560C59739n8408j65199q9531O080n2196j52950j09369M4044J63726K14585J90790
38549C51311L1087j82481j73378J28433L57979J90838j51614k22792j6692Q5888
$$ y = [-533086, -403592, -128779, 129525, 250410, 153583, -127422, -366811, -346363, -143712, -29311, -78942, -105306, 1371, 94875, 16735, -168049, -282538, -252991, -129035, -1012, 33238, -78355, -257196, -347188, -297286, -204942, -149565, -92092, 12725, 114352, 148078, 133170, 116737, 88394, 25576, -26556, 2145, 102203, 179189, 154478, 42564, -77503, -157064, -227880, -335457, -435835, -421401, -273138, -119112, -89252, -166413, -238215, -244853, -215081, -203368, -244767, -317512, -309766, -111972, 200056, 388185, 346703, 249163, 280591, 359739, 301331, 136132, 46601, 52681, 485, -152465, -261834, -217790, -54064, 160521, 351311, 382398, 199917, 26539, 154972, 512951, 703789, 552175, 329383, 312691, 398579]
38539C98579n3880j81952j28415l2379j9311r152M3046K5917p6684q8880N1531
38528g1580J36544J2325j48786j02680R2608J71732M8016r5630q7180K3645P7061
38517E6075K7086k4859j224K9395l4894j42289j37728p651P9684L8157k123O2559
38505e7812J07508m657j53894j28266M0582J36930R0404J9603q630l9063p1315
38494f8610n4562k3844m7772o7581J5014J26616J11469O51k8433O1225J37745
38483A61918J31991P8904l1371k06010l00804j80834J5627N4680p548N7822J99462
38472b6163J40803j07158k11341o4314N9637J4318J5886J89606L01129J77197
38462D89600J4447K085p933j57625k46481q0855J28104Q4979j03433j35806k2220
$$ y = [398579, 344699, 162747, 34332, 1953, -17358, -26510, 16536, 42453, -34231, -123111, -71580, 64964, 77289, -71497, -174177, -81569, 90163, 138179, 42549, -44631, -20986, 56075, 83161, 58302, 57078, 86473, 51579, -90710, -228438, -236089, -156405, -118248, -120371, -57812, 49696, 45039, -108855, -237121, -196539, -59609, 30795, 50398, 41768, 2705, -68610, -123172, -147016, -194788, -262369, -247355, -120739, -9270, -8619, -37052, 24173, 161918, 293909, 372813, 341442, 135432, -165372, -346206, -330579, -275899, -283447, -225625, -26163, 114640, 7482, -203859, -268173, -208536, -194218, -178332, 11274, 312403, 489600, 504047, 506132, 498199, 340574, 94093, 13238, 141342, 226321, 122888, -12918, -35138]
38451c5138k944r6839j03237J7854R6691M9781m1496j09132j35971p9172M9062
38440c90541J15754O1227L0090J25444J98882R5837p3847j42325j55760j81157
38430c16396p9122K04826L58874J16281k45095k61520O668J08148n6528j50541
38420c14405l4307N6414K3425P2680K39603K40352j4644k03062j09859L6133j0903
38409a8573j19796q9439j8668o3429j00176M6253K48817K63533J14298J1964J0077
38398B84861m862p0506j14300r4454j6396J02966J68921M8507j95335k85085j01623
38387b77306J12564J09253n087L874R8973Q4479j9144k2015Q9551J48110J04549
38376D27801N7300R902j22472k64085k14766K2139J97816J64029L5069n3634j11914
$$ y = [-35138, -38082, -134921, -238158, -220304, -123613, -73832, -115328, -224460, -360431, -439603, -390541, -274787, -213560, -183470, -58026, 140856, 236693, 162846, 20521, -135239, -316396, -395518, -190692, 168182, 284463, 39368, -222152, -215484, -107336, -163864, -314405, -348712, -292298, -268873, -196193, 43410, 283762, 269118, 66056, -43803, -7670, -18573, -138369, -227808, -246476, -309905, -410081, -363828, -115011, 148522, 262820, 274784, 284861, 279999, 209493, 95193, 739, -15657, 87309, 256230, 304737, 109402, -175683, -277306, -164742, -55489, -60576, -56702, 42271, 126750, 107606, 85591, 175142, 323252, 427801, 485101, 495003, 372531, 108446, -106320, -84181, 113635, 277664, 312733, 259099, 147185]
38365A47185j36240l1228J69209K22146P988k27769j86376M9940J43056L46j19772
38354C8485l5899Q4582J9141j42236j38497M9358J69359Q8609k0043K3430J17328
38343B53617O0963j04629j61587p2603l6492j52174k45338j38202P2130J52258
38333c72057N3251n3424j9530J19882K22403J93951O8086k9107r296O6945N7934
38322B99038o4438j66787j37870k9701M3173N2440K6005l7611j20214j27229n905
38311b69099J30001J22772r251r7651n5459L9225Q8976Q1525K9978o9353j72996
38300a81332j85758q3472L2818O6154M7329O6922J34058J75588J48448Q0397O520
38289C07672o6129j18784j08430l0440M7352N5606M108m7350p1695p6419m8752
$$ y = [147185, 10945, -20283, 148926, 371072, 379060, 151291, -35085, 14855, 157911, 158257, 38485, 2586, 87168, 106309, -35927, -174424, -125066, 44293, 132902, 112859, 136289, 253617, 314580, 209951, 48364, -24239, -60731, -212905, -458243, -596445, -524315, -372057, -318806, -372230, -391760, -271878, -49475, 144476, 212562, 183455, 174159, 241104, 299038, 234600, 67813, -70057, -99758, -56585, -4145, 21860, -15751, -135965, -263194, -269099, -139098, -16326, -25577, -123228, -178687, -139462, -50486, 31039, 61017, -8336, -181332, -367090, -450562, -417744, -351590, -304261, -237339, -103281, 72307, 220755, 301152, 307672, 241543, 122759, 14329, -16111, 31241, 86847, 90955, 43605, -28090, -104509, -153261]
38278a53261K2479P5734K5177r3949j31511l0000P6154N4552k8095k2774O2956
38267a42538Q9576R516q3048j11343q3438j2707P9315Q9585o0785k30204j62384
38256f18455J46779L77210K85382J3524j32294p4193K1957K2486m7796j07174
38246a12574j06680l7280N7037R8172P2358N9781J04258J28989O3418k6411l7195
38235B63873Q627R837n2310j04232r4616l1237N4268J01326L9720j01656j74804
38224h1204r6589K2187L9242j1116p285L9405K0759n7015p6300j2690L2728J8407
38212a69471J9687O9353Q9810L8141q073K2432P7794N9110n0402j75968k22907
38201b50494j45905l053O9546J3184m6909M1976K17300K62908J26702L540L2982
$$ y = [-153261, -130782, -55048, -29871, -123820, -255331, -285331, -209177, -154625, -182720, -205494, -142538, -52962, -43446, -126494, -237837, -321275, -333982, -254667, -165082, -225867, -456071, -618455, -471676, -94466, 190916, 204440, 72146, -2047, 19910, 42396, -5400, -112574, -219254, -256534, -199497, -101325, -28967, 30814, 135072, 264061, 327479, 301068, 263873, 272500, 282337, 230027, 125795, 31179, -58, 54210, 155536, 195256, 93600, -81204, -177793, -155606, -116364, -127480, -134765, -95360, -74601, -131616, -207916, -220606, -187878, -169471, -149784, -80431, 9379, 47520, 39447, 61879, 139673, 198783, 148381, -27587, -250494, -396399, -399452, -329906, -316722, -363631, -321655, -104355, 158553, 285255, 288795, 321777]
38190C21777Q5802j6442k01279k42910r6872M5268L5398n6826r1650n0678o969
38179b75381K560j2032m7406q1338m1086R7984K10409J45439l7305j00057M6357
38168i1856J90489J12098r1098j39400K7803J83250J47785Q233n7309j9070K4583
38157B95508K14q5866j70911j67909n3291N5771J6311j27954j79906o8016N9143
38146d26906P1779K7323J7062J0292l7362p0962n1078l9182n4747o339J10601
38135d49519J32618L476o9671N7719J85108P5241j31333j31788L7582Q1092l8256
38124b47731n2261J18355K04820L4432j90075k11467o4868N6556Q0001M5683j2790
38113b39345m5154K0572J49788J93636R3008l8542r6209r9269p1760J5088J10204
$$ y = [321777, 407579, 391137, 189858, -53052, -149924, -104656, -69258, -126084, -217734, -268412, -275381, -272821, -284853, -332259, -413597, -454683, -356699, -146290, -851, -38156, -138213, -91856, 98633, 210731, 119633, -19767, 8036, 191286, 339071, 347304, 289995, 270925, 295508, 295722, 209856, 38945, -128964, -182255, -126484, -110173, -238127, -418033, -486049, -426906, -355127, -327804, -310742, -300450, -337812, -408774, -459852, -499034, -553781, -560120, -449519, -316901, -313425, -383096, -325377, -140269, -65028, -196361, -328149, -290567, -209475, -247731, -299992, -181637, 23183, 57615, -132460, -343927, -408795, -352239, -272238, -226555, -239345, -284499, -263927, -114139, 79497, 172505, 133963, 37754, -61515, -133275, -118187, -7983]
38102g983Q2007n7639j20254l7489J3262q1254j44115J1335K45491K71717O6043
38091B41121j33268j77019j36029r6290k9047R0570J84107J62332M4675o4195
38081H6957q7685m4772j0954j8856k4721J829R843l8689o8299k494P8091N0375
38069f9375k1585K1020J26822P8023j24226k02392l4313J39907J02967j6370j4335
38058a3857M3328P351m1115L5856J17840J5556j50951j15900P0761J16982n821
38047H0030k3413J33606J80146l4397k49044k08415n4772m8583j37514j00774
38037d63130L8866O5518m1999p8007L4533J30608J00410N9033J14997J69767R5199
38026B25795l5948o7429j3366j4962r0328j10985l0658L5516N578m4968k4863
$$ y = [-7983, 74024, 16385, -103869, -141358, -128096, -209350, -353465, -342130, -96639, 175078, 241121, 107853, -69166, -205195, -301485, -330532, -239962, -55855, 106477, 151152, 86957, -728, -45500, -56454, -75310, -100031, -98202, -88359, -127048, -195347, -197841, -119750, -69375, -90960, -69940, 56882, 134905, 10679, -191713, -226026, -86119, 16848, 478, -13857, 29471, 36822, -4293, 31563, 149403, 164959, 14008, -101892, -31131, 85851, 80030, 56617, 190223, 370369, 335972, 86928, -121487, -176259, -224842, -362356, -463130, -424264, -358746, -400745, -478752, -444219, -313611, -213201, -154168, -39171, 130596, 225795, 189847, 122418, 109052, 94090, 3762, -107223, -137881, -102365, -96787, -141755, -166618]
38015a66618L1648M9115L1898J6072l277j6164K4745Q6528M6884q7926j13572
38004a00667N9783J88686K7925k47873k54092L4594K54373K01463P5278Q8223
37994C27693J47339Q2995n5534j21401j10551j09566j27966j13433l9103R1866
37984b7661K18303J90921n2849k90132k36786J1989P0210j51314l00940j52274
37974g20533O9230J22568J24339K11601K08366j6387j89266m3526J85274J20539
37964G2205j26073j66555m644J9273j44155j91785j7190J46774J55105J00852
37954a56193K4678j18853k01977n4180J40283K8920k91127l30300K7118L15129
37944f16502K07935l1336m9783Q5621J47578J37245J29952N9975p3068q7518M6042
$$ y = [-166618, -134970, -85855, -53957, -37885, -41162, -57326, -32581, 53947, 100831, 12905, -100667, -40884, 147802, 175727, -72146, -326238, -291644, -37271, 164192, 239470, 327693, 475032, 558027, 502493, 381092, 270541, 160975, 33009, -80424, -119527, -27661, 190642, 381563, 328714, 38582, -198204, -186215, -116005, -267319, -568259, -720533, -651303, -528735, -404396, -192795, 15571, -816, -190082, -233608, -48334, 72205, -53868, -220423, -225067, -205794, -349949, -541734, -558924, -412150, -257045, -156193, -131515, -250368, -452345, -506525, -366242, -337322, -628449, -958749, -931631, -616502, -408567, -439903, -489686, -404065, -256487, -119242, 10710, 70685, -2383, -89901, -43859]
37933d3859P3567r0588j34145J26589L47160J66573j87085k43941j6106R5544
37923I3709k5279j04259J253J06306O1267l7455o4937l2711J2191M9349L8256
37912I7690j5900N776J52614K36710P8745j60763j71218L1936J18710n6589k56359
37901F1352k28067k8786J19570J20000M5090Q366N8322J31891J08942k6054j34425
37890B36201j20338p3557q8297p6694M5103J24124j2793k12056j76037N5105J44584
37879a54655o943j22625k4994R5100L9382p0249l2656J00825J58468J28301Q6590
37868A96544J561j59136k44481r4480J60778K19487K3891j58169j11001N2529
37858a12477Q0473q1213k53935k63449j04828J10336K72667L12849K00914j2798
$$ y = [-43859, 29708, -60880, -195025, -68436, 278724, 445297, 258212, 14271, -1835, 93709, 68430, -35829, -34576, 71730, 132997, 95542, 30605, -2106, 10085, 59434, 97690, 81790, 87566, 240180, 476890, 555635, 394872, 223654, 255590, 374300, 317711, 61352, -166715, -195501, -75931, 44069, 89159, 97525, 155847, 287738, 396680, 370626, 236201, 115863, 42306, -45991, -122685, -77582, 46542, 33749, -178307, -354344, -299239, -154655, -161598, -284223, -309217, -214117, -174735, -244984, -277640, -176815, -18347, 109954, 196544, 198105, 38969, -205512, -299992, -139214, 80273, 104164, -54005, -165006, -112477, -32004, -113217, -367152, -630601, -735429, -625093, -352426, -39577, 161337, 148539]
37848A48539j81924j79065m5561M7250J4585m6037k3454L6767K2157n8681r5736
37837c61160m8815J5521M2167L6133n62p6548j46895j32508k3453J02269J69525
37826d24326J61522R6557J0812m4955m2028N414P6734J48227J44948K091j75701
37815d0705j71199K4859J28706l0102k04312q8469J76224K04486q211p5606J33717
37804D9388K68658P0660k05976k05926p024P0675j6751n1193K1525J6941j36333
37793a25356k48167j43998R0922K25578J38981q5598k54443k30538n2796J12802
37783e72613J60531J36060J16457R2056L6045l270J7418L7364j4771q4852o5973
37772a45548L2976J02066Q5577K5192k2883k4443M0076J25649J13289l7315j69356
$$ y = [148539, -33385, -212450, -258011, -210761, -196176, -242213, -265667, -228900, -206743, -265424, -361160, -409975, -394454, -352287, -316154, -316716, -393264, -540159, -672667, -696120, -593851, -424326, -262804, -166247, -155435, -200390, -242418, -237004, -160270, -12043, 132905, 134996, -40705, -211904, -187045, -58339, -88441, -292753, -381222, -204998, -512, -8723, -84329, 49388, 318046, 388706, 182730, -23196, -30220, 40455, 23704, -27489, -5964, 10977, -125356, -373523, -517521, -426599, -201021, -62040, -147638, -402081, -632619, -685415, -572613, -412082, -276022, -159565, -67509, -31464, -34734, -17316, 20048, 5277, -79575, -145548, -112572, -10506, 75071, 100263, 77380, 52937, 93013, 218662, 331951, 294636, 125280]
37761A25280r8590J15713K12973O2278j77613k69842j62993J0953J13926J07732
37751C9817L7188k3078j9444M1144R9980J05134N6462n673m5148o2902q4479j10089
37739B8912j01131n1377l6933j15805j97348j30963O0588J79927J40045Q8556
37729a35529J43604J76807L6294j54392j59184j2248L1851q2478j25304K6286
37719b54293J79637J40014L244l8813m38p338m2618j2167L5055r490p0489J6484
37707f1212J83302J77506k0920j11667P1311K74781J96864o4793j95063j45547
37697C04562j29534k02641j88776n0139R638p4621p1753J24478K15650n4272l96743
37686e14151l20171J23985L64718J17008k43766k65650k5832R8858Q309q4248
$$ y = [125280, 26690, 142403, 355376, 417654, 240041, -29801, -192794, -181841, -67915, 39817, 77005, 53927, 34483, 75627, 175607, 280741, 337203, 331530, 286382, 223480, 139001, 28912, -72219, -123596, -160529, -276334, -473682, -604645, -544057, -364130, -224085, -135529, 8075, 184882, 221176, 66784, -92400, -104648, -72797, -155275, -280579, -254293, -74656, 65358, 68602, 29789, 29351, 22013, -20605, -32772, 2283, -7207, -77696, -61212, 122090, 299596, 278676, 167009, 238320, 513101, 709965, 645172, 450109, 304562, 175028, -27613, -216389, -266528, -256890, -331511, -403264, -278786, -63136, -117408, -514151, -834322, -710337, -345619, -228611, -472377, -738027, -763859, -665001, -656692, -740940]
37676g40940n0404K4808O5262R2887R4935K4141n0141O092J53365J89466N9886
37665a30643l6608M1825J42713N5481j43936j94997m8768O3973m10p5461L8701
37654b88130K31702K27651J4561j17368j4622J04161M401j75180j39850P4410
37644g8264J45292j6682j24592J4345J94009J60628O789m0117k0584j22018k77457
37633a58651k29417K8131J97548J19128j9930j1955Q7142J30689J24441J35944
37623D03070J24505L1987p2525r5328p5190r6120j25828q5887j3573l361l7590
37612d5840k9981n986p2313k00334k09078k7300J62630J49190j8748r3932L0433
37601c61259J71905J16397o6250j08010O2163J90996P3662j14302p3234J35471
$$ y = [-740940, -791344, -766536, -701274, -608387, -513452, -489311, -539452, -533360, -379995, -190529, -130643, -167251, -125426, 17287, 72768, -71168, -266165, -314933, -250960, -251370, -326831, -288130, -56428, 171223, 185784, 68416, 53794, 157955, 162356, -12824, -152674, -78264, 67028, 50346, -74246, -59901, 134108, 294736, 301525, 261408, 240824, 118806, -158651, -388068, -359937, -162389, -43261, -63191, -75146, 11996, 142685, 267126, 403070, 527575, 559562, 487037, 391709, 316519, 220399, 94571, 8684, -4889, -8250, -45840, -75821, -81807, -154120, -354454, -563532, -590832, -428202, -279012, -297760, -391692, -361259, -189354, -72957, -139207, -247217, -185054, 5942, 79604, -34698, -107932, 27539]
37591B7539J62988o4111k02748m8366J15446o922j89510l1368L33078L59421o8941
37580C86506m13836k51764J46981K75432R6768n1976m1286m0595j16969j20555
37570a31294K081Q7449K9460o1491o4573k0313n659q047j8358r0655k00548j87374
37558f69322L1359K95491L82113K70532J11182L630p1020j46063k14304k54426
37548b60828k32439j14769N3208J44032J03822M0131N9675R6880K8178j07392
37538a89502j48509m1350J06704J81918J48932J6489j38216j45932P8452L40738
37528B09724L35588M0412k37447k56075j03256M336M027m1963j00105j48184j18531
37517d11474R75R1859N5210l6962n7298j6354j2938m8300k6112Q0620J74056J48201
$$ y = [27539, 190527, 126416, -76332, -124698, -9252, -16174, -205684, -237052, 96026, 455447, 386506, -27330, -279094, -132113, 143319, 240087, 188111, 146825, 106230, -10739, -131294, -129213, -41764, -12304, -73795, -138368, -158681, -164340, -172387, -190745, -281400, -481948, -669322, -637963, -342472, 39641, 310173, 421355, 424985, 353965, 207902, -6402, -260828, -493267, -608036, -554828, -410796, -306974, -266843, -207168, -110288, -82110, -189502, -338011, -379361, -272657, -90739, 58193, 74682, -63534, -209466, -131014, 209724, 545312, 585724, 348277, 92202, -11054, -6718, -2691, -44654, -144759, -292943, -411474, -410499, -318640, -263430, -300392, -357690, -374044, -386982, -435282, -461394, -380774, -206718, -58517]
37505e8517k29j64242k00924o7168R2953Q8171n3398q7442R8649K89653K28272
37494A65778l1721k24897k23995j08494K7965J31438J11044o2514k03988r0989
37484e10373J93774L26121J84991P11j8622K5740m5899j67264j36246N2006J81021
37473H5960J02574r4540k16042j64423P679J74550K33837J57995q794j79407k56650
37462a57261j89226l1152R3385J22879J08904R8452N2923m1722q7962k3525L8560
37451a5745k3941j15239n1912J37736K61006K66675K57007K14023P946k80141
37441F57415l57495j54561L1291j8384j31628p8199M9381L9553o8356r7755n2191
37430a80929l7080n134J26073K20424J01241j02255j15389K6868L3929j38040
$$ y = [-58517, -58746, -222988, -423912, -491080, -398127, -309956, -363354, -450796, -352147, -62494, 165778, 134057, -90840, -314835, -423329, -395364, -263926, -152882, -215396, -419384, -510373, -316599, 9522, 194513, 195224, 176602, 202342, 156443, -10821, -147067, -95061, 85960, 188534, 93994, -122048, -286471, -278792, -104242, 129595, 287590, 278796, 99389, -157261, -346487, -377639, -284254, -161375, -52471, 45981, 98904, 57182, -30780, -54305, -15745, -39686, -154925, -206837, -69101, 191905, 458580, 715587, 929610, 937556, 657415, 299920, 145359, 176650, 158266, 26638, -51561, -2180, 37373, -30983, -128738, -180929, -218009, -223143, -97070, 123354, 224595, 122340, 6951, 33819, 67748, -70292]
37420g0292k05034l9612J20541Q1668q253M0438J28584P0226o8255p5554P2020
37409D6477J99378J88798P7189n5196j54546j86742j61387j23817o7565N7669
37399a79742J94428J72840l5054j98923j22367O6978J00969m7408j69642j49545
37389c67466o4985K0492J38643K51790K20859L0232j21969p4565P3400J08843
37379B15274n396j04992n5840Q2299J31109l605k08155k57917p9316J23200J01679
37368f1660r5941j76473k1215J37138P3489p5757k9043J82450K46105N1521j34194
37357I6420p4039R0673Q1460q8987j60900l0992J26252J52509J00129N5095l6758
37346C10862k15592l22587j80399R3922J80899l564j71598p1965J44830J56910
$$ y = [-70292, -275326, -314938, -194397, -112729, -120982, -80544, 48040, 118266, 50011, -25543, 46477, 245855, 434653, 511842, 456646, 302100, 115358, -46029, -169846, -237411, -179742, 14686, 187526, 152472, -46451, -168818, -101840, -871, -48279, -217921, -367466, -432451, -411959, -273316, -21526, 199333, 229565, 107596, 33031, 106431, 215274, 209878, 104886, 49046, 131345, 262454, 258849, 50694, -207223, -286539, -163339, -61660, -157601, -334074, -355289, -218151, -144662, -220419, -249462, -67012, 179093, 230614, 96420, 22381, 113054, 194514, 105527, -55373, -86365, 39887, 192396, 292525, 347620, 310862, 95270, -227317, -407716, -313794, -132895, -136459, -308057, -380022, -235192, -78282]
37336g8282m5780j53881o455J83653J66179P157o1463l423K0603n4081j21016
37325a46789j19801j22921j53249r7335R9367K87698K85251J07205p3661j31327
37315f5562o9613K9588O3544j6095j18212r0910M7950Q7359o3211j88541p0174
37304d53877J60853K09802O4330k7961Q402r294j29099j22522J12588L01366J76133
37293B90721j06891k02098p5086J8650l0408p4120k8907k1540j27615j93240o2095
37282f12629J62503K39105J09421l6306j3496J32506J99610Q7670p9127j16384
37272G2873j9509M1101l8226j59446j72397o5181O4595J47066J65752J19540N0002
37261B06170L8049P9889M8201j07736k16428j03871J08224J30641p6672k29174
$$ y = [-78282, -124062, -277943, -284398, -100745, 65434, 72591, 11128, 7705, 28308, -25773, -146789, -266590, -389511, -542760, -640095, -540728, -253030, 32221, 139426, 65765, -65562, -135175, -105587, -42043, -58138, -176350, -267260, -219310, -131951, -195162, -383703, -453877, -293024, -83222, -18892, -46853, -38451, -47745, -176844, -299366, -186778, 114588, 290721, 183830, -18268, -93354, -74704, -105112, -179232, -208139, -229679, -357294, -550534, -612629, -450126, -211021, -101600, -137906, -151402, -18896, 180714, 268384, 189257, 72873, 53364, 94465, 56239, -103207, -275604, -340785, -276190, -129124, 36628, 156168, 206170, 244219, 324108, 372309, 264573, 48145, -55726, 52498, 183139, 106467, -122707]
37251a22707j08153J60966L08282K47721R9855j035j1380L8456O9093K690j45387
37240E38401k61384k57838j57137l0380P5327J20072O8686m1605j01983n5729
37230a03570L5009Q4959Q1664M7462j4765q1324q5147j148R7983J27817Q6140
37219B75080J6603o2533j40316j76989j40553m2601Q9611K22473K81874J96295
37209E18944J0615j33370j71801j73116j74489j00546O6452J76327J10881j4843
37199A15054j3070R4717J30854M4224m3468n2824k8893o346L4732O1369P259o8526
37187B75082j8022J45461K11202P0554j17844j75654j50901j61238j44996J1988
37177e4368J95197J66731n5856j79362n6484J05967Q6576j1176L6712J74211J36721
$$ y = [-122707, -230860, -69894, 238388, 486109, 585964, 584929, 573549, 612005, 681098, 683788, 538401, 277017, 19179, -137958, -168338, -93011, 27061, 95747, 54142, -47841, -103570, -68561, 16398, 98062, 145524, 130759, 49435, -35712, -36860, 61123, 188940, 275080, 291683, 229150, 88834, -88155, -228708, -271309, -181698, 40775, 322649, 518944, 529559, 396189, 224388, 51272, -123217, -223763, -157311, 19016, 129897, 115054, 101984, 196701, 327555, 371779, 328311, 275487, 246594, 240248, 274980, 336349, 343608, 275082, 257060, 402521, 613723, 684277, 566433, 390779, 239878, 78640, -66356, -54368, 140829, 307560, 251704, 72342, 15858, 121825, 208401, 197225, 233937, 408148, 544869]
37166E44869j13406k95905k18728l5129L4295K9402J02426J95096J24824o8223
37156B99521j38758k6786L4138j03859k52888j81645K8604J26226O1576l855J4465
37145a43261N1072P1967J07097J03005l0533j91778j40272J29683K90633J10023
37135C57636k02601k71542n3520J58673J63853N3057j9221m7722q8686j19192
37125f9265q6561o583O8007J13241J14996N4232l7844q2085o1559n1120p9083
37114a23624n6410O4691J59695R6511m0460o5249J400n4382k78757m11020k26856
37103i34461J31341L24769K28320J7262r5694n4080Q1822K12143K26384Q7136
37093B24942q9757j40860n4347L3119L6680N467l93J3818M2279Q6435P6313o2683
$$ y = [544869, 431463, 135558, -83170, -118299, -84004, -54602, 47824, 242920, 367744, 299521, 160763, 133977, 168115, 64256, -188632, -370277, -341673, -215447, -153871, -157726, -143261, -92189, -20222, 86875, 189880, 159347, -32431, -172703, -43020, 247613, 357636, 155035, -116507, -170027, -11354, 152499, 205556, 186335, 138613, 49927, -69265, -155826, -162409, -94402, 18839, 133835, 188067, 150223, 68138, 6579, -44541, -123624, -180034, -115343, 44352, 140863, 100403, 35154, 36554, -17828, -296585, -707605, -934461, -803120, -478351, -250031, -232769, -328463, -382543, -300721, -88578, 137806, 224942, 135185, -5675, -60022, -26903, 9777, 15244, 14851, 28669, 70948, 157383, 233696, 171013]
37081A71013k29416k16778l2974N2708q8043k08804n9599J95494K12807L911r4370
37070b94051M0120J48792M1673j03611n7066R9612J41835O2184K5294O4006N3759
37059B22547m5948j29797j30486r4113n2596K6534J25283J44231M2803r1207j60557
37048a43306j55858r5905K2197J53476J91724J12523M0487P2741J17555L8226
37038C53860j04158j15986L3843J57088J21627K1282p606P993k5423q2999q3443
37027B76078n6862q7153j34809r4054j0391m7642k06500k68092j00534J44979
37017e84980K55272K25779J73792J12800p163j19883j06184q085J3921n5024n4183
37006a53938P0488J41811J9125j56901j46422M0351J51688N1340r3458n4892J34767
$$ y = [171013, -58403, -275181, -308155, -255447, -343490, -552294, -611893, -416399, -203592, -199681, -294051, -253931, -105139, -63466, -167077, -224143, -124531, 17304, 79488, 104782, 168788, 222547, 176599, 46802, -83684, -177797, -230393, -203859, -78576, 65655, 108458, 17251, -143306, -299164, -395069, -372872, -219396, -27672, 84851, 125338, 198079, 315634, 353860, 249702, 133716, 167559, 324647, 446274, 467556, 459950, 467943, 442520, 359521, 276078, 219216, 132063, -2746, -96800, -107191, -154833, -361333, -629425, -729959, -584980, -329708, -103929, 69863, 182663, 175500, 55617, -50567, -58652, -44731, -99755, -153938, -83450, 58361, 77486, -79415, -225837, -185486, -33798, 17542, -75916, -130808, 3959]
36995C959K33457J27045k9281n6069l079k8582j10198p1470J00437J75956J3801
36984C55976k10013k48697j16125L425N4404R9536R2824p3621l00882l21077o7106
36973g31356K10954K79172J77115O0005j4926l0555O4079K13441K08554l7256
36963C99227k95746k94983p9013R0357R5509K3674n2373j21322j03574P7586K86501
36952B5843K76814N2558r6091m36J55099J33096j2537o6329M950L8706m6388j44018
36940C21267j41180o6584j4934j2516j5241j904j4905q7873j49003o0839J82572
36929f1140L52796K16107j26326k93304j02039J69965J60044p2053j50963M2824
36919A35911J94816M0239k25343k26595M6251K29300R7345j56138k22426p2930
$$ y = [3959, 237416, 364461, 335180, 279111, 276032, 247450, 137252, 65782, 166219, 342175, 355976, 145963, -102734, -218859, -215434, -161030, -61494, 31330, -42291, -343173, -664250, -731356, -520402, -241230, -64115, -4110, -19036, -49591, 14488, 227929, 436483, 399227, 103481, -191502, -270515, -180158, -84649, -60975, -113348, -234670, -338244, -260658, 25843, 302657, 355215, 259124, 258688, 413787, 546883, 534346, 468017, 472967, 511673, 465285, 321267, 180087, 113503, 98569, 86053, 70812, 68908, 54003, -33870, -182873, -243712, -61140, 291656, 507763, 381437, 88133, -13906, 156059, 316103, 244050, 93087, 135911, 330727, 370966, 145623, -80972, -34721, 194579, 291924, 135786, -86640, -159570]
36909a59570Q1921J08914O1950K0473j9504p0163r2005o3539k8678k3359k2035
36898b05595m622o724m3518n3989l61M1433o404p2700k9894Q5952J04586o294
36886a98130o4072N3789K05681J87220K7709p7594o6097n1111p6453k9289J32850
36875D4503K37391J12723j46914k76737j67064L0351J19229P3900J0116K1695
36865E9193R1177J22973M0008j23409k22008j39676O4759K08786J94531R3825
36855C90159L926p7328j58786j46530K4845K05072J59686r1565k54314j52657
36845i7492L9337R0194N5186J10630J80362L7048k52720l31206q8063J36202P2470
36834d8052o1979L4665J94787M8169k99195l48490J1514L04428K04736R183P9981
$$ y = [-159570, -77649, 31265, 93215, 113688, 94184, 24021, -67984, -131523, -160201, -183560, -205595, -210217, -216941, -260459, -314448, -314809, -273376, -279780, -352480, -382374, -296422, -191836, -198130, -262202, -208413, -2732, 184488, 212197, 134603, 68506, 17395, -59058, -88347, 44503, 281894, 394617, 247703, -29034, -196098, -165747, -46518, 27382, 37498, 59193, 150370, 273343, 313351, 189942, -32066, -171742, -106983, 101803, 296334, 390159, 394085, 316757, 157971, 11441, 36286, 241358, 401044, 309479, 55165, -97492, -58155, 32039, 87225, 197855, 378217, 415265, 162545, -168661, -256724, -120522, -48052, -110031, -75366, 119421, 167590, -131605, -480095, -468581, -164153, 40583, 49766, 129747]
36823A29747K26815P6272k22503j85971K09858M42986K08159j84075l20389k19192
36813A61707j34594j22128o8408K9615O8689K7718l3190q3065r1032J1923K03606
36802b9159L07396K03734Q581r9513j23746j62172j84891r5692M9703Q9417k441
36791c8783r3926j05910q9150r3254r5805o5427O997J15140J87369J05908j04193
36780b71034k07439m8486J88754K24489R6318O4985J63340J59381r943j05209
36770B55156O958J19394L3386j14036q9793O1480J19161L3980n3101o4631n8230
36759B49724p8394r6432q2357k6415P6923J79582J76896M5601q9069j20323j06196
36748A29540j36332j50349m3033J17322J51857L5095o4826k8642O4219P3866o345
$$ y = [129747, 356562, 432834, 210331, 24360, 234218, 677204, 885363, 701288, 380899, 161707, 27113, -95015, -163423, -133808, -65119, -37401, -70591, -153656, -244688, -232765, -29159, 278237, 481971, 490552, 391039, 267293, 105121, -79770, -175462, -125759, -36342, -38783, -132709, -238619, -327769, -421023, -516828, -582255, -575258, -460118, -272749, -166841, -271034, -478473, -526959, -338205, -113716, -17398, 47587, 210927, 370308, 360365, 255156, 262114, 381508, 414894, 300858, 211065, 272545, 391706, 425686, 372585, 307954, 249724, 171330, 74898, -7459, -33874, 43049, 222631, 399527, 445128, 356059, 235736, 129540, -6792, -157141, -200174, -82852, 69005, 104100, 39274, 10632, 74851, 148717, 142372]
36737A42372n9178j5109L5270o1872k93178m05963j81725K30024M14720J89355
36727e284j61320k50267m7395J67855J93715O8697q4105j91153k12283j29494
36717f51034K2560J76264K66326K27369N1905j05163l0621K32877L40914Q3392
36707F14789k81332l48984j14560O6480N808j14419r0267J4304K6579o8125j33748
36696d23475o1507J25886K90422K95096J65788R0467J66153K28000P3782k18589
36686G32023l79533l00023j07087N7989J28333L7527j90648l12085j05799K50098
36676a89205L47832J27322m7923K5022R1181r4364l34345k99318l1486J57398
36666b47886J38604M1780k0036m8543m1961R973N1118L8953L6510Q1371O3988
$$ y = [142372, 83194, 68085, 103355, 41483, -251695, -657658, -839383, -609359, -194639, -5284, -166604, -416871, -464266, -296411, -102696, -33999, -118104, -309257, -521540, -651034, -628474, -452210, -185884, 41485, 93390, -11773, -42394, 190483, 531397, 614789, 333457, -15527, -130087, -63607, -57799, -172218, -262485, -248181, -221602, -289727, -423475, -484982, -359096, -68674, 226422, 392210, 482677, 648830, 876830, 950612, 732023, 352490, 52467, -54620, 3369, 131702, 169229, -21419, -333504, -439303, -189205, 158627, 285949, 238026, 263048, 354229, 259865, -74480, -373798, -405284, -247886, -109282, -67502, -87538, -136081, -178042, -168069, -116951, -77998, -41488, 39883, 103871]
36655A03871q9442k18714j30078P9512J37662N960p3248L5438J61904J10956m3611
36644H0210q4076L3702J30296N5969j06866j45710K093J44958P3160j47494k41105
36633b04863r2023R7531R6861l9041p6624N4953J77293J05409j27936l07950k58479
36622e74869l0614J37043R5153j5893L9721K29004K77022Q7923r8209p6837K9936
36611I9380K7642k4764J9748Q3185K072j33447q8560J11081J83567K0524j55033
36600A45395j27145L5282J27702P2473n4107j40991j24461l1668L0058j0106r6566
36589a74134j39147j35838j14117l7086J04936K00104J61939P6785M5686L850
36579g022j02037j08328J13272L30672K32798m8824j11537N3643M7201k17504
$$ y = [103871, 14429, -204285, -334363, -254851, -117189, -111229, -184477, -149039, 12865, 123821, 80210, -3866, 29836, 160132, 216101, 109235, -36475, -34382, 110576, 183736, 36242, -204863, -296886, -199355, -102494, -141535, -218159, -163206, 14087, 119496, -8440, -316390, -574869, -605483, -468440, -373287, -389180, -349459, -120455, 156567, 244490, 146281, 69444, 99380, 127022, 102258, 122006, 205191, 207263, 73816, -14744, 96337, 279904, 300428, 145395, 18250, 53532, 181234, 253707, 199600, 58609, -65852, -97520, -67462, -77568, -174134, -313281, -449119, -563236, -600322, -495386, -295282, -133343, -56558, -10872, -7022, -109059, -217387, -104115, 226557, 459355, 410531, 298994, 352637, 399838, 182334]
36569A82334l01573K7574L41520J92430j80767k42868P364J04730j05680k65894
36559b40830j11151J53397K20355J03688J1053P579R37n0778q2953m9083r2k3259
36547f1137j29411k17035j75909l0726P6473P0553K7160K4165J3391o6110j40367
36536f08953r6213L2107J05130P7771L4768M2631P9905J10681J25311J04680L3420
36525D1238m3764n5000O2M3423J6239n8184j04234o3254M2280J04175M4349n7572
36513i0242n1119M3591K5349j71225l03560j28763K23744L86310K16923n9949
36503I1059j72024q6640M5673Q8137J1442j05891j35338k9868J01240J24133N8291
36492i786J9825K2150k5465j24834j48135k8710J31609J92494J16491m4185j98038
$$ y = [182334, -119239, -91665, 249855, 442285, 261518, 18650, 26014, 130744, 25064, -240830, -351981, -198584, 21771, 125459, 136512, 144091, 145028, 94250, 11297, -37786, -37878, -61137, -190548, -407583, -583492, -614218, -537745, -467192, -440032, -415867, -402476, -468586, -608953, -705166, -673059, -567929, -490158, -455390, -412759, -332854, -222173, -96862, 7818, 41238, -2526, -57526, -57464, -14041, 2198, -55986, -160220, -223474, -181194, -77019, -32670, -90242, -141361, -97770, -72421, -243646, -547206, -675969, -452225, -65915, 151008, 91059, -80965, -167605, -121932, -33795, -22353, -128244, -263582, -293450, -192210, -68077, -9786, 10039, 32189, 6724, -118110, -266245, -294955, -163346, 29148, 145639, 101454, -96584]
36481i6584k30015q4595J28188K18517J45940N0508K0800k5641j51664k32107
36471b56653j17209J13333K11948P1331j42620j93374m2884J18746R4055r4902
36461b38229k21488j10878J48556L00706K12829L900j19397q1427K9763Q6169
36451A0504M1701l6930m8635J2340L5323m8286j36878q7336O3945J39489P3051
36440A8288k0754m5804l8625m1222k2080M434n4881j81979j89105L934J82059
36429c85735J13564r5549j46879J5693J57863J34853P4103J13657J71593J01556
36419B54719o5078j68036j29379j0926Q2480P9636j8360j08441o0398J08174K04530
36408A68921R5343r9911j57707m1406P9885P7930N85m6708l5474m11J2816m0268
$$ y = [-96584, -326599, -411194, -283006, -64489, 81451, 131959, 152759, 127118, -24546, -256653, -373862, -260529, -48581, 22750, -119870, -313244, -356128, -237382, -143327, -238229, -459717, -570595, -422039, -121333, 91496, 95396, -24001, -105428, -75665, 10504, 52205, 15275, -33360, -21020, 14303, -33983, -170861, -258197, -194252, -54763, 18288, -2466, -48270, -86895, -128117, -150197, -145763, -200644, -382623, -571728, -567794, -385735, -272171, -367720, -514599, -498906, -341043, -206190, -132087, -18430, 153163, 254719, 189641, 21605, -107774, -118700, -36220, 43416, 25056, -83385, -143783, -35609, 168921, 264264, 164353, 6646, -34760, 45125, 123055, 123640, 76932, 41458, 41047, 53863, 13595]
36396A3595j51039k00415o7680J69870K80176J84211P2401J04310J49459J3259
36386E68147k00364k09475j23J28376J4673j37045j07163J488k3799j33194j04418
36375b02897Q4255K17714J60142l644j46311k23835k04020o1077J09295J44088
36365a26290M6191o23P8140J20655N269j19379n4626J21048J52970j6500j80147
36354B6708j73240o5532m06M724J4076L4781K1546k6941n3619j4412P1322J30483
36342c0510R2734k5769r7906j3515J50488J79605L737j59572o3844K09323L10145
36331E54916O9475k61293l20842q3437J52536J73158P0497K4976L2838l0934j69876
36320B12014k34530j30681M8963J36974P6370m3545j08732j01707q8034r0849
$$ y = [13595, -137444, -337859, -405539, -235669, 44507, 228718, 301119, 405429, 554888, 568147, 367783, 158308, 158185, 286561, 301234, 164189, 57026, 58514, 34715, -98479, -202897, -118642, 99072, 259214, 255570, 109259, -114576, -318596, -379673, -270378, -126290, -80099, -80722, -2582, 118073, 123342, 3963, -50663, 70385, 223355, 206855, 26708, -146532, -212064, -212470, -207746, -193670, -158889, -137343, -164284, -217903, -232315, -160993, -30510, 62224, 36455, -61451, -74966, 75522, 255127, 258864, 99292, 35448, 244771, 554916, 624391, 363098, 42256, -41181, 111355, 284513, 355010, 379986, 412824, 381890, 212014, -22516, -153197, -104234, 32740, 109110, 65565, -43167, -144874, -232908, -323757]
36310c23757k9538J53970L37031L05913M3169j97758j97686m6146J7341n3333
36300I206j00361m8757n04k5996n5918m1418m5331q4169m4311J17823K33195J38616
36288E2075o0345j19890M756J27405J14751K9981k2677l7788m5681m4123n5463
36277e6999j31734k25377j72729P7189L09698K75973L7592r3128K6505J86734
36267B33724J44783l6031j21822o9187l9347q8613q0634M1540J14481P464j54058
36256d7700j72120n5912M2852O5935M9947p099q9346o5202J32178K99775J93452
36245C46760q3279j98027p7321L8744M3254R4067K05154J09708k52436m76418
36235b49794k36653J92261L14048R4897j10026j47494j60803j77408m3617K04519
$$ y = [-323757, -353295, -199325, 137706, 443619, 486788, 289030, 91344, 45198, 62539, 9206, -91155, -139912, -140416, -166412, -222330, -263748, -309079, -393248, -437559, -319736, -86541, 52075, -8270, -128160, -123404, 4001, 118752, 148733, 126056, 88268, 42587, -1536, -56999, -188733, -414110, -586839, -509650, -199952, 76021, 113613, 20485, 46990, 233724, 378507, 342476, 220654, 151467, 112120, 23507, -57127, -15587, 98894, 106358, -47700, -219820, -275732, -232880, -166945, -116998, -124097, -213443, -278645, -146467, 153308, 346760, 263481, 65454, -11867, 26877, 70131, 164198, 369352, 479060, 226624, -249794, -486447, -294186, 19862, 114759, 4733, -142761, -303564, -480972, -524589, -320070]
$$ [...]
##END NTUPLES=NMR SPECTRUM
##END=
