##TITLE=31Pdec_IBTB3005
 CDCl3, 24 sc
 31.5.2019
##JCAMPDX= 6.0         $$ Bruker NMR JCAMP-DX V2.0
##DATA TYPE= NMR SPECTRUM
##DATA CLASS= NTUPLES
##ORIGIN= UXNMR, Bruker Analytische Messtechnik GmbH
##OWNER= root
$$ XWIN-NMR		Version 3.5
$$ Fri May 31 12:42:52 2019 Russian Standard Time (UT+4h)  she@DPX200
##.OBSERVE FREQUENCY= 81.013821
##.OBSERVE NUCLEUS= ^31P
##.ACQUISITION MODE= SIMULTANEOUS
##.ACQUISITION SCHEME= undefined
##.AVERAGES= 24
##.DIGITISER RES= 17
##SPECTROMETER/DATA SYSTEM= spect
##.PULSE SEQUENCE= zgpg30
##.SOLVENT NAME= CDCl3
##.SHIFT REFERENCE= (INTERNAL, CDCl3, 0, 182.463)
##AUDIT TRAIL= $$ (NUMBER, WHEN, WHO, WHERE, WHAT)
$$ ##TITLE= Audit trail, XWIN-NMR		Version 3.5
$$ ##JCAMPDX= 5.01
$$ ##ORIGIN= Bruker BioSpin GmbH
$$ ##OWNER= she
$$ F:/spectra/data/she/nmr/P31/1/pdata/1/auditp.txt
$$ ##AUDIT TRAIL=  $$ (NUMBER, WHEN, WHO, WHERE, WHAT)
(   1,<2019-05-31 12:41:44.67 +0400>,<she>,<DPX200>,
      <created by zg, POWCHK disabled, PULCHK disabled
       configuration hash MD5:
       00 E9 B6 7A A2 85 ED C7 34 08 36 98 17 FE 4E 26
       data hash MD5: 32K
       23 E1 11 5E 05 2D 48 D6 C0 30 BB B9 C4 EB 70 52>)
(   2,<2019-05-31 12:41:47.50 +0400>,<she>,<DPX200>,
      <Start of raw data processing
       efp BC_mod = 2 LB = 1 FT_mod = 6 PKNL = 1 PHC0 = -2174.15 PHC1 = 68.7991 SI = 64K 
       data hash MD5: 64K
       76 AA 1E BA 8F 69 9A EB BD D2 BA 54 6B E8 41 EC>)
(   3,<2019-05-31 12:42:17.25 +0400>,<she>,<DPX200>,
      <pk PHC0 = -16.57873 PHC1 = 51.59997 
       data hash MD5: 64K
       C8 AA 77 54 A6 E9 34 73 0F EC CC 60 B0 75 5C E0>)
(   4,<2019-05-31 12:42:20.42 +0400>,<she>,<DPX200>,
      <abs ABSG = 5 
       data hash MD5: 64K
       0A 72 42 D4 ED 9F F3 3B AF 43 6A 38 5E 0F 32 19>)
$$ ##END=
$$ 
$$ hash MD5
$$ 14 A4 18 FD D9 35 62 9E 14 49 81 8E 95 1D DB 52
##$RELAX= 
##$RELAX= 
##$RELAX= 
##$RELAX= 
##$RELAX= 
##$RELAX= 
##$RELAX= 
##$RELAX= 
$$ Bruker specific parameters
$$ --------------------------
##$DU= <F:/spectra>
##$EXPNO= 1
##$NAME= <P31>
##$PROCNO= 1
##$TYPE= <nmr>
##$USER= <she>
##$AMP= (0..31)
100 100 100 100 100 100 100 100 100 100 100 100 100 100 100 100 100 100 
100 100 100 100 100 100 100 100 100 100 100 100 100 100 
##$AQSEQ= 0
##$AQ_mod= 1
##$AUNM= <au_zg>
##$AUTOPOS= <>
##$BF1= 81.014009
##$BF2= 200.13
##$BF3= 200.13
##$BF4= 200.13
##$BF5= 200.13
##$BF6= 200.13
##$BF7= 200.13
##$BF8= 200.13
##$BYTORDA= 1
##$CFDGTYP= 0
##$CFRGTYP= 5
##$CHEMSTR= <none>
##$CNST= (0..31)
1 1 145 1 1 1 1 1 1 1 1 1 1 1 1 1 1 1 1 1 1 1 1 1 1 1 1 1 1 1 1 1 
##$CPDPRG= <waltz16>
##$CPDPRG1= <>
##$CPDPRG2= <waltz16>
##$CPDPRG3= <>
##$CPDPRG4= <mlev>
##$CPDPRG5= <mlev>
##$CPDPRG6= <mlev>
##$CPDPRG7= <mlev>
##$CPDPRG8= <mlev>
##$CPDPRGB= <>
##$CPDPRGT= <>
##$D= (0..31)
0 1 0 0 0 0 0 0 0 0 0 0.03 2e-05 3e-06 0 0 0 0 0 0 0 0 0 0 0 0 0 0 0 0 
0 0 
##$DATE= 1559292104
##$DBL= (0..7)
120 120 120 11 120 120 24 19 
##$DBP= (0..7)
150 150 150 150 150 150 150 150 
##$DBP07= 0
##$DBPNAM0= <>
##$DBPNAM1= <>
##$DBPNAM2= <>
$$ [...]
##$SUBNAM3= <"">
##$SUBNAM4= <"">
##$SUBNAM5= <"">
##$SUBNAM6= <"">
##$SUBNAM7= <"">
##$SUBNAM8= <"">
##$SUBNAM9= <"">
##$SW= 369.568048894756
##$SWIBOX= (0..15)
0 1 3 0 0 0 0 0 0 0 0 0 0 0 0 0 
##$SW_h= 29940.119760479
##$TD= 32768
##$TD0= 1
##$TE= 0
##$TE2= 300
##$TE3= 300
##$TEG= 300
##$TL= (0..7)
0 120 53 12 22 120 120 120 
##$TP= (0..7)
150 150 150 150 150 150 150 150 
##$TP07= 0
##$TPNAME0= <>
##$TPNAME1= <>
##$TPNAME2= <>
##$TPNAME3= <>
##$TPNAME4= <>
##$TPNAME5= <>
##$TPNAME6= <>
##$TPNAME7= <>
##$TPOAL= (0..7)
0.5 0.5 0.5 0.5 0.5 0.5 0.5 0.5 
##$TPOFFS= (0..7)
0 0 0 0 0 0 0 0 
##$TUNHIN= 0
##$TUNHOUT= 0
##$TUNXOUT= 0
##$USERA1= <user>
##$USERA2= <user>
##$USERA3= <user>
##$USERA4= <user>
##$USERA5= <user>
##$V9= 5
##$VALIST= <valist>
##$VCLIST= <CCCCCCCCCCCCCCC>
##$VD= 0
##$VDLIST= <DDDDDDDDDDDDDDD>
##$VPLIST= <PPPPPPPPPPPPPPP>
##$VTLIST= <TTTTTTTTTTTTTTT>
##$WBST= 1024
##$WBSW= 4
##$XGAIN= (0..3)
0 0 0 0 
##$XL= 0
##$YL= 0
##$YMAX_a= 17961
##$YMIN_a= -19173
##$ZGOPTNS= <>
##$ZL1= 120
##$ZL2= 120
##$ZL3= 120
##$ZL4= 120
##$ABSF1= 182.463
##$ABSF2= -187.1042
##$ABSG= 5
##$ABSL= 3
##$ALPHA= 0
##$AQORDER= 0
##$ASSFAC= 0
##$ASSFACI= 0
##$ASSFACX= 0
##$ASSWID= 0
##$AUNMP= <proc_1d>
##$AZFE= 0.1
##$AZFW= 0.5
##$BCFW= 0
##$BC_mod= 2
##$BYTORDP= 0
##$COROFFS= 0
##$CY= -3
##$DATMOD= 1
##$DC= 0
##$DFILT= <>
##$DTYPP= 0
##$F1P= 0
##$F2P= 0
##$FCOR= 1
##$FTSIZE= 65536
##$FT_mod= 6
##$GAMMA= 0
##$GB= 0
##$INTBC= 1
##$INTSCL= 5.30512e-09
##$ISEN= 30
##$LB= 1
##$LEV0= 0
##$LPBIN= 0
##$MAXI= 10000
##$MC2= 0
##$MEAN= 0
##$ME_mod= 0
##$MI= 50
##$NCOEF= 0
##$NC_proc= -5
##$NLEV= 6
##$NOISF1= 182.463
##$NOISF2= 159.3651
##$NSP= 0
##$NTH_PI= 0
##$NZP= 0
##$OFFSET= 182.463
##$PC= 4
##$PHC0= -2190.729
##$PHC1= 120.3991
##$PH_mod= 1
##$PKNL= yes
##$PPARMOD= 0
##$PSCAL= 0
##$PSIGN= 0
##$REVERSE= no
##$SF= 81.0140089999434
##$SI= 65536
##$SIGF1= 159.3651
##$SIGF2= -187.1042
##$SINO= 113.3802
##$SIOLD= 16384
##$SREGLST= <1H.CDCl3>
##$SSB= 0
##$STSI= 65536
##$STSR= 0
##$SW_p= 29940.119760479
##$SYMM= 0
##$S_DEV= 0
##$TDeff= 32768
##$TDoff= 0
##$TI= <>
##$TILT= no
##$TM1= 0
##$TM2= 0
##$TOPLEV= 0
##$USERP1= <user>
##$USERP2= <user>
##$USERP3= <user>
##$USERP4= <user>
##$USERP5= <user>
##$WDW= 1
##$XDIM= 65536
##$YMAX_p= 533594420
##$YMIN_p= -26854424
$$ End of Bruker specific parameters
$$ ---------------------------------
##NTUPLES= NMR SPECTRUM
##VAR_NAME=  FREQUENCY,     SPECTRUM/REAL,   SPECTRUM/IMAG
##SYMBOL=    X,             R,               I
##VAR_TYPE=  INDEPENDENT,   DEPENDENT,       DEPENDENT
##VAR_FORM=  AFFN,          ASDF,            ASDF
##VAR_DIM=   65536,         65536,           65536
##UNITS=     HZ,            ARBITRARY UNITS, ARBITRARY UNITS
##FACTOR=    0.456856943014862, 1,           1
##FIRST=     14782.0589164792, 0,            0
##LAST=      -15158.0608439998, 0,           0
##MIN=       -15158.0608439998, -26854424,   0
##MAX=       14782.0589164792, 533594420,    0
$$ Real data points
##PAGE= N=1
##DATA TABLE= (X++(R..R)), XYDATA
$$ [...]
42232b144216k70607K90871O36152N63448M37048N38100N39171N8972n48682n42411
42222d42154J26334O54238M58208p8572k42617n331O9025k19662l97288j08078
42212a85897K55106J08226l95571n12854J9071N59900M28068j92254n30073j86916
42202f33194N10369R77432Q81188K71413m76983q59143o36924q0705L22430L47063
42192F22946R6537k31419m18606k58046J62210L61598L5530m11707l65292N7321
42182c48928J37366l25274o62669l56248J90783L30261J51639K09486N26759N19045
42172C72220n3682o00396m26510L40717Q72172O25290o1339m79354m43645l50029
42162b04556l84411j75766M73293R77643O87218m2678k45069K29395M98039N0487
$$ plain form
42232 -2144216 -2414823 -2123952 -1487800 -924352 -487304 50796 589967 648939 100257 -442154
42222 -442154 -315820 338418 796626 718054 475437 470106 539131 319469 -77819 -185897
42212 -185897 69209 177435 -218136 -730990 -711919 -152019 276049 83795 -446278 -633194
42202 -633194 -122825 854607 1735795 2007208 1530225 671082 34158 -46547 275883 622946
42192 622946 719483 488064 69458 -188588 -26378 335220 370750 -40957 -406249 -348928
42182 -348928 -211562 -536836 -1199505 -1555753 -1364970 -1034709 -883070 -673584 -146825 372220
42172 372220 318538 -281858 -708368 -367651 504521 1129811 1068472 589118 145473 -204556
42162 -204556 -588967 -764733 -291440 686203 1373421 1330743 1085674 1315069 1813108 1863595
42152A863595m86179m47542k19915m99858j025876r34669j14208O57237Q40444
42143c66971O17607K50438k44926o47478n29323J5626L18769J37269K9870L19780
42133i9339M19746j40362o68388k42968P08786Q88842R8730m62909j23687K43107
42123F21558k32067r02956o64514K15485N56023J70446o156L63036N20841J14960
42113G56656j00935L49209P25014L33229k46275k01523M9019l74351j140540j118378
42103i68875k06661N32090N35498L17199K65384P3516l11832k95377L04315P20774
42093I66031L39453m05670p45972n22845K0089O83046J082296P10329k26992p27249
42083A172516l27426J67319p3580o47454o77188j88295J61175K17726K66883K25006
$$ plain form
42152 1863595 1377416 929874 709959 210101 -815775 -1750444 -1864652 -1207415 -366971
42143 -366971 250636 501074 256148 -391330 -920653 -905027 -586258 -448989 -419119 -99339
42133 -99339 320407 180045 -488343 -731311 -22525 866317 965047 502138 378451 621558
42123 621558 389491 -513465 -1177979 -962494 -406471 -236025 -242181 120855 641696 756656
42113 756656 655721 1004930 1729944 2063173 1816898 1615375 1664394 1290043 149503 -968875
42103 -968875 -1175536 -643446 -107948 209251 474635 548151 236319 -59058 245257 966031
42093 966031 1305484 899814 153842 -369003 -348914 334132 1416428 2126757 1899765 1172516
42083 1172516 845090 1012409 938829 291375 -385813 -574108 -412933 -195207 71676 296682
42073B96682j43978m72484j97122M28760O14388K25328j43184k08774k65014m11072
42063b76470l62399j14168j7427p3353J19154N66932P37719M10808L6114J6350
42053A043260J80779J83259n5998m54658q54717r24445m64723J37992K93053N8305
42043h57893O530K21181J66365k88106n05656r0721M45256M76197J37999p1793
42033c60641p9088j00656j11905K7858J77000J04796r4501j66813j24041j58662
42023h86653k51303j80896J17530M32189N07692K99272K8308j6621J72953K62377
42013D84848M3775j81514l0594K71729J20929n28509r79097p19959q1733K97715
42003a302410K95696K76603M64706O46861M68869r0406n76307n15026o9364P3577
$$ plain form
42073 296682 152704 -319780 -516902 -88142 526246 751574 608390 399616 134602 -276470
42063 -276470 -638869 -753037 -770464 -843817 -724663 -157731 579988 990796 1026910 1043260
42053 1043260 1224039 1407298 1351300 896642 41925 -882520 -1347243 -1209251 -916198 -857893
42043 -857893 -851363 -630182 -463817 -751923 -1257579 -1348300 -903044 -426847 -288848 -360641
42033 -360641 -439729 -540385 -652290 -624432 -447432 -342636 -437137 -603950 -727991 -886653
42023 -886653 -1137956 -1318852 -1201322 -769133 -261441 37831 66139 49518 222471 484848
42013 484848 528623 347109 316515 588244 709173 180664 -798433 -1518392 -1600125 -1302410
42003 -1302410 -1006714 -730111 -265405 381456 850325 759919 183612 -331414 -400778 -327201
41993c27201k94875m52088J91245R85893Q14391k22104q39659l86186L17091K88152
41983G4659k75053n07022j68469J72797K2239m07348m37159K71417J123039J078042
41973I47142J2333q70257n71261K70300L98087q0916m9586M99151L19464q56576
41963A7881j596348r55140Q3831K83342k5873R1951M84808M39870Q7264L0483
41953a057931J79138R6191j8301K19106M32544P7295m74723n00899j52439n0314
41943a250333q6254K42186O69139N24455n39j38627Q7150k7215m97981n90577
41933a068596j34235K37823K41165K62990M29534L92401J88916K94981O15044
41924A460023M04173n06943j278981j179573m16719L71201P91314P17582L02540
$$ plain form
41993 -327201 -622076 -1074164 -882919 102974 917365 695261 -144398 -530584 -213493 74659
41983 74659 -200394 -707416 -875885 -703088 -680849 -1088197 -1525356 -1253939 -130900 947142
41973 947142 959475 89218 -482043 -211743 186344 105428 55842 554993 874457 17881
41963 17881 -1578467 -2533607 -2449776 -2166434 -2192307 -2100356 -1615548 -1175678 -1088414 -1057931
41953 -1057931 -878793 -782602 -800903 -581797 -149253 -71958 -546681 -1047580 -1200019 -1250333
41943 -1250333 -1336587 -1094401 -425262 99193 98654 -39973 47177 19962 -478019 -1068596
41933 -1068596 -1202831 -965008 -723843 -460853 -31319 361082 549998 844979 1460023
41924 1460023 1864196 1357253 78272 -1101301 -1518020 -1146819 -355505 362077 664617
41915F64617O1536K99534M78583r4570j010068j086219l5484J083859J244237
41906A606025N04760m09945q39060m66668L62443O61979n7216q59741n70199L94204
41896C26582O42879O1111j35132L48875L66143m79819r13326j27130P40501M07640
41886A238324n65315q33436k80014K79723N77763Q28321Q00610J43074p46565
41877A442485j131419r02240m38239M5369L96377L44647J1658o1478Q5173k93639
41867e01306j146057j152569K70146J651507J440574K82879j72446J36884L3977
41858H43589n73794o53141j19978n1797o76388q85625j47039O29782O62123L84729
41848e87539L60458K94388j36821m44799j06244N03914O38660J61008m82810q46184
$$ plain form
41915 664617 726153 1025687 1504270 1409700 399632 -686587 -722071 361788 1606025
41906 1606025 2110785 1700840 861780 395112 757555 1419534 1362318 502577 -67622 326582
41896 326582 969461 1030572 895440 1244315 1610458 1130639 217313 90183 830684 1238324
41886 1238324 673009 -160427 -440441 -160718 417045 1245366 2045976 2189050 1442485
41877 1442485 311066 -591174 -1029413 -984044 -587667 -243020 -231362 -292840 -207667 -501306
41867 -501306 -1647363 -2799932 -2529786 -878279 562295 845174 672728 809612 843589
41858 843589 269795 -383346 -503324 -555121 -1231509 -2117134 -2264173 -1634391 -972268 -587539
41848 -587539 -227081 67307 -69514 -514313 -620557 -116643 522017 683025 200215 -645969
41838f45969p05259j38012L77053L86565J20652K07347O65469Q45606M97934J41778
41828A753164J18579M0495m18766q54332p46363k48569J02626J00019q0781k30425
41818d64353k31835j02673n1730j98108k45083J16301N35104L71422k39757m67742
41808i78454p7100K23199L7577k8146M95354R56555N53415l17305o06219j65923
41798I2953J58312j14689m99780m10021O1094M68662O28091N78089K57655l86402
41788H33964j033204j071652k52667Q53835J324531Q73954J31043k04002j49214
41779A306588j12144j53449q5998l2692k42393m95181l80722p6056n9481r4630
41769d26158N06997J434821J335733k04878j670264j487967j28732O93535L69345
$$ plain form
41838 -645969 -1351228 -1489240 -1112187 -725622 -604970 -397623 267846 1113452 1611386 1753164
41828 1753164 1871743 1912238 1493472 639140 -107223 -355792 -253166 -153147 -233928 -464353
41818 -464353 -696188 -798861 -850591 -1048699 -1293782 -1177481 -642377 -270955 -510712 -978454
41808 -978454 -1055554 -832355 -794778 -822924 -327570 628985 1182400 865095 258876 92953
41798 92953 251265 136576 -363204 -773225 -712131 -243469 384622 962711 1220366 833964
41788 833964 -199240 -1270892 -1523559 -669724 654807 1528761 1659804 1455802 1306588
41779 1306588 1194444 1040995 954997 922305 679912 184731 -195991 -272047 -331528 -426158
41769 -426158 80839 1515660 2851393 2646515 976251 -511716 -640448 53087 422432
41760D22432j97108k32925N2138K90743N16472O04999J18576q07122j195905m73291
41750i00991N80679Q00276J82609k60573j5159L50469K00999k70164m88933l20068
41740a40856k164L50170O62365O00785j0791n97922l69022M86153Q56756K23242
41730B058716n92309o11031J2679M61400M59527L03700J16531j56120l01294j60234
41720A591565j30724n49517q51772k98364O49338P91509K5482m67116q2878L61958
41710A039481J08793l67265l44702m3776p597q6998Q0200K13931p9134m21326
41700I1607k26541K17054J46856l99111n87526m0591O61120Q11611L77084j19688
41690I31875j63828K75036O08728J94953p34885j127999m72342L89720L94651
$$ plain form
41760 422432 225324 -7601 44537 335280 851752 1456751 1575327 768205 -427700 -900991
41750 -900991 -320312 479964 662573 402000 386841 737310 938309 668145 179212 -140856
41740 -140856 -143020 207150 869515 1470300 1459509 861587 492565 978718 1835474 2058716
41730 2058716 1466407 855376 868055 1329455 1788982 2092682 2209213 2053093 1751799 1591565
41720 1591565 1460841 911324 59552 -238812 410526 1202035 1227517 760401 677523 1039481
41710 1039481 1148274 781009 436307 392531 384934 297936 378136 592067 512933 91607
41700 91607 -134934 82120 228976 -170135 -757661 -798252 -137132 674479 1051563 931875
41690 931875 768047 1043083 1651811 1846764 1111879 -16120 -488462 -98742 295909
41681B95909k48041m70698K9429M68802K60265k05275k78425N0377K94212J88189
41671C84744n996J39521N99298P22915k7998j154803j447286m80441P41034J006941
41661D77929K64718o47924j066441q04019j3180O52023L82366n81322q22882K87233
41651a871499J313846O58381r58092j451784m02158O06042N84508K68906L58349
41642h93501M07673J23045J55950P11439P73175k14243j107015p28495K25652
41633e46320K97615m59713p56600j88084L40224K18810r8723j05195L762r4497
41623a388721k43284j19452K78330O52243O56725J57054m87121n78084R4551P96332
41613a81427O92362l6369m59444j47764M20931O56913M81312J23992j64005j16022
$$ plain form
41681 295909 47868 -422830 -393401 75401 335666 130391 -148034 -97657 196555 384744
41671 384744 378748 518269 1117567 1840482 1812484 657681 -789605 -1270046 -529012 477929
41661 477929 742647 94723 -971718 -1775737 -1788917 -1136894 -754528 -1335850 -2158732 -1871499
41651 -1871499 -557653 100728 -857364 -2309148 -2711306 -2105264 -1520756 -1251850 -893501
41642 -893501 -485828 -362783 -206833 504606 1277781 1063538 -43477 -771972 -546320
41633 -546320 -248705 -708418 -1465018 -1653102 -1312878 -1094068 -1192791 -1297986 -1294224 -1388721
41623 -1388721 -1632005 -1751457 -1473127 -820884 -164159 -7105 -494226 -1072310 -977759 -181427
41613 -181427 510935 474566 15122 -132642 288289 945202 1426514 1550506 1386501 1270479
41603A270479L37051P54022N64071r1968l87305O3588N37322Q5470j140881j936085
41593E5764j467510k83156L88531J64802j27115K55472Q36940O48131k14865o14475
41583c57481m6538O12411M76607m4896n5551L40430L28315j56758l14098J60768
41573I43209N66761L18085k21101m34596l63519m03616n20194l49595O6998J68808
41563b28760l82014j106822j094249l4798J247276J540834N96042n56010q18383
41554h36884k36291L41205M62459L82636L62765L23703K34524K53111L35562J93015
41544A815805k12635n55224o25730m94045j56178M24562Q46238N23409l47248
41535A218954p76655l12219L08651L14858J955O412J50726p1647l51722p409O54568
$$ plain form
41603 1270479 1607530 2361552 2925623 2833655 2446350 2509938 3047260 3132730 1991849 55764
41593 55764 -1411746 -1694902 -1306371 -1141569 -1268684 -1013212 -176272 471859 256994 -357481
41583 -357481 -404019 208392 684999 640103 584552 924982 1253297 1096539 782441 943209
41573 943209 1509970 1828055 1606954 1172358 808839 405223 -114971 -464566 -397568 -228760
41563 -228760 -610774 -1717596 -2811845 -2846643 -1599367 -58533 537509 -18501 -836884
41554 -836884 -1073175 -731970 -269511 113125 475890 799593 1034117 1287228 1622790 1815805
41544 1815805 1603170 1047946 422216 -71829 -228007 196555 1042793 1566202 1218954
41535 1218954 442299 130080 438731 753589 755544 761956 912682 841035 489313 481904 1136472
41524A136472N99024k53289p66839l46834J40459k00900q83861q84422k11825
41515a672015L08983L86113M15453N04731L13966j27007l18351j29390M9313J33507
41505a34697M84186R64329P73806k64998j103130q68479j58535m6087l86763k19996
41495i60364M85439P32508J49745m44647l95855o9026M5785R7821K12809j0904
41485a56689o56144r43137l29860N18804P03977M19831L85160N22784K91749r9626
41475F56849k8119K52134n6912p45804p41770N1919M60775j8206l62436J96444
41465c35126Q05955L89712n84524q63531k52099M01319N76296M07533J9137m80612
41455H4060o35115k02270K01355n8162m74149j35764O55706P43843J6905l75763
$$ plain form
41524 1136472 1735496 1482207 715368 368534 508993 308093 -575768 -1460190 -1672015
41515 -1672015 -1363032 -976919 -561466 -56735 257231 130224 -188127 -317517 -268204 -134697
41505 -134697 349489 1313818 2087624 1822626 719496 -148983 -307518 -353605 -740368 -960364
41495 -960364 -474925 257583 407328 -37319 -433174 -502200 -456415 -358594 -145785 -156689
41485 -156689 -812833 -1755970 -2085830 -1567026 -863049 -443218 -58058 464726 756475 656849
41475 656849 628730 880864 823952 78148 -663622 -611703 -150928 -169134 -531570 -335126
41465 -335126 470829 860541 276017 -587514 -839613 -438294 138002 545535 564672 84060
41455 84060 -551055 -753325 -551970 -610132 -1084281 -1220045 -564339 179504 196409 -179354
41445a79354J07576O20771M35066m320j50821l65272j009963j446142r27447J23928
41435b795978O91684N84084L94973L94198L45012K20185K50367L26201R7544l26909
41425A81361m20579j4781M94684P08678N18761o7149q50456j258980q27770J01074
41415a435157O70087N29560J04075j36954j52810o5495M8505M1765j60302k96810
41405h53536j27079M3776j97457n09756j71600O49582R31724L58358j07686K98272
41395C14598R75310R74046M47435J97961K69115l1907q78654j568950j486676
41386g87722p83742q555M61633N34277L26587O9236j09109k46395k93542q8969
41376i26301K09807J14532l85675n01349K67591J159674J069884J52641m09266
$$ plain form
41445 -179354 -71778 548993 984059 979739 828918 463646 -546317 -1992459 -2919906 -2795978
41435 -2795978 -2104294 -1520210 -1125237 -731039 -386027 -165842 84525 410726 508270 181361
41425 181361 -239218 -253999 240685 949363 1468124 1400975 550519 -708461 -1536231 -1435157
41415 -1435157 -765070 -235510 -131435 -268389 -421199 -486694 -438189 -396424 -556726 -853536
41405 -853536 -980615 -936839 -1134296 -1644052 -1815652 -1166070 -234346 124012 16326 314598
41395 314598 1289908 2263954 2711389 2909350 3178465 3146558 2267904 698954 -787722
41386 -787722 -1571464 -1580019 -1118386 -584109 -257522 -188286 -297395 -543790 -837332 -926301
41376 -926301 -716494 -601962 -987637 -1488986 -1221395 -61721 1008163 1160804 751538
41367G51538j27359K84016K11903l8051m6435L282j01869r3050J33465M7490o25243
41356C99687j117624n94027M47622P03982q9751p96678n39540J62687L86419K04450
41346h32773L34644P79711P41537l8267o76002l19780O20890J013255M81573k78903
41336A825885n60261l62551N753L93425O13465L44798l73565r36039q45222l15584
41326b09896Q7851J06999j66215n21233o18143j79328M82347O11816N7974l86981
41316g34809j33431L75987N42551N51802O64201L90649n46317j172643n40180
41307f02190N25455N16597l03117l24439O39653R90872N1425q51428o86549k30502
41297b74223l09342k93657L66188O65930l09117j479743j222432J22374Q59396
$$ plain form
41367 751538 624179 908195 1120098 1082047 1035612 1038894 937025 843975 977440 1024930 399687
41356 399687 -717937 -1311964 -864342 -160360 -250111 -1046789 -1586329 -1423642 -1037223 -832773
41346 -832773 -498129 281582 1023119 984852 308850 -10930 609960 1623215 2104788 1825885
41336 1825885 1265624 903073 908826 1302251 1915716 2260514 1886949 950910 105688 -209896
41326 -209896 -122045 -15046 -181261 -702494 -1320637 -1499965 -1017618 -405802 -347828 -734809
41316 -734809 -868240 -492253 50298 602100 1266301 1656950 1110633 -62010 -602190
41307 -602190 -76735 439862 136745 -187694 451959 1442831 1494256 642828 -43721 -274223
41297 -274223 -583565 -877222 -511034 154896 -154221 -1633964 -2856396 -2734022 -1874626
41288a874626M60664j11010j80023N6541M41669R27637R24626m6019j156726j063743
41278a621010J22149R20104N88095o8097j34052L04935P26579Q52237N28468k21715
41268A997693q60939q05265k77654L4170N7854K26076M58269K67212j97349k76789
41258F23278K5658N5190l01954n08133m65059n82118p24323l17241L76570L65316
41248a452816m38660r34709m93653K90781Q00081J101125J140540N35065m16650
41239A31104p88302n00169m25085o71140l04751P01630R69651j8546q49378m12233
41229b167219M24462N59029M47942P38951P01262k76333j027432l67782O66345
41220c00775L99608o25913n79403N60932J130360O39187K44746M17988L01137
$$ plain form
41288 -1874626 -1413962 -1524972 -1704995 -1648454 -1206785 -279148 645478 599459 -557267 -1621010
41278 -1621010 -1498861 -578757 9338 -58759 -192811 112124 838703 1690940 2219408 1997693
41268 1997693 1136754 331489 53835 88005 145859 371935 830204 1097416 900067 623278
41258 623278 648936 704126 402172 -105961 -571020 -1153138 -1877461 -2194702 -1818132 -1452816
41248 -1452816 -1891476 -2826185 -3319838 -3029057 -2228976 -1127851 12689 547754 131104
41239 131104 -657198 -1157367 -1582452 -2253592 -2558343 -1856713 -887062 -905608 -1754986 -2167219
41229 -2167219 -1742757 -1183728 -735786 3165 704427 428094 -599338 -967120 -300775
41220 -300775 98833 -527080 -1106483 -545551 584809 1223996 1468742 1886730 2187867
41211B187867l86663p52931l99958J7698K12855O00270R33438L17145j003063
41202A726658j540676p95480J4936L6660k6342M51780P75710L15629k38539j20443
41192E99893J58036j74602p32036p02041k34388k1311q2281M7984L54933M02136
41182c83677M1174n04830r00864p15647K11663J130209R51226j38730o39938J32164
41172h17250R97485P72229K1627j35556O8564k75189r22425q47431q3401K62843
41162i58504k25140p38128n56974J12832P29316R92413P73069K03930j60174N6634
41152B29274L91583J72811l76866m63625O510L64335L17439K29731K18005r6563
41142I92634p30370j066265p47668j77141J59418K93596M55660O60752Q17999
$$ plain form
41211 2187867 1801204 1048273 648315 666013 878868 1479138 2412576 2729721 1726658
41202 1726658 185982 -609498 -594562 -557902 -584244 -132464 643246 958875 720336 599893
41192 599893 757929 583327 -148709 -850750 -1085138 -1106449 -1188730 -1140746 -785813 -383677
41182 -383677 -342503 -847333 -1748197 -2463844 -2252181 -1121972 -170746 -309476 -949414 -817250
41172 -817250 180235 952464 974091 838535 907099 631910 -290515 -1137946 -1221347 -958504
41162 -958504 -1183644 -1921772 -2478746 -2365914 -1636598 -644185 128884 332814 172640 229274
41152 229274 620857 793668 416802 -46823 -40313 324022 641461 871192 1089197 992634
41142 992634 262264 -804001 -1551669 -1728810 -1569392 -1275796 -820136 -159384 658615
41133F58615Q34734N40935n0629m70253l51778j57848n79098j256897j084506
41124a916725M2574Q61964O00007J21976M28197R31750M06183q85207j360840
41115g70121m12196P04977O65028k08811o71421l26735J59750K95869L22249M92235
41105B50824N75599L88024J99287J77420m0691o38690r57787l73808M56424K78803
41095C15405q13450j286777m01662O13399L91548n54236p46957j1827M78086J61091
41085a855380k19110k234M42005N34716L73615L10816K77777K5954l62941n97657
41075a072439n41830k26600K35558N90399N61068J61143l03851n52045m46018
41066a594615M3617O61654Q61499M35666m7166K0693L44831K21610k42141l07006
$$ plain form
41133 658615 1493349 2034284 1983655 1513402 1161624 1003776 424678 -832219 -1916725
41124 -1916725 -1874151 -1012187 -412180 -290204 137993 1069743 1475926 590719 -770121
41115 -770121 -1182317 -477340 187688 -21123 -692544 -1019279 -859529 -563660 -241411 250824
41105 250824 826423 1214447 1413734 1591154 1550463 911773 -46014 -419822 36602 315405
41095 315405 -498045 -1784822 -2186484 -1573085 -1181537 -1735773 -2482730 -2494557 -2016471 -1855380
41085 -1855380 -2074490 -2076724 -1634719 -1100003 -726388 -415572 -137795 -111841 -474782 -1072439
41075 -1072439 -1614269 -1840869 -1605311 -1014912 -453844 -292701 -596552 -1148597 -1594615
41066 -1594615 -1550998 -889344 -27845 407821 360655 381348 726179 947789 705648 398642
41056C98642O3448R3804m07439o30208j48119L11580R3042l12855j80152K42038
41046d76219K92897M0458o2417j36075m65437n14672M78619J987202K425766J180329
41036D750451n22469j217851r30366p11125r85798j132756n84845L29948Q56357
41027a48454P01814J57536m01668p43518o45733o7842M68847K57362n48394q58643
41017a828693j16316P64556O91093O8961R6057P27026P37749j39448o70400j86459
41007A44126K70026k61981r95364o90301L54918R12642P21166M23874J34034m99841
40997E13299j060277o68073M20801Q58193J02808q61695j025182n31716J6018
40988b235824M48663P09664M90263j77909n76531j68373N92580Q22509K80260
$$ plain form
41056 398642 462090 555894 148455 -481753 -629872 -318292 -225250 -538105 -718257 -476219
41046 -476219 -183322 -142864 -205281 -341356 -806793 -1321465 -842846 1144356 3570122 4750451
41036 4750451 4227982 3010131 2079765 1368640 382842 -749914 -1334759 -1004811 -148454
41027 -148454 553360 710896 309228 -434290 -1080023 -1147865 -679018 -421656 -970050 -1828693
41017 -1828693 -1945009 -1180453 -489360 -420399 -324342 402684 1140433 1000985 330585 144126
41007 144126 414152 152171 -843193 -1533494 -1178576 -265934 455232 879106 1013140 513299
40997 513299 -546978 -1215051 -794250 63943 166751 -694944 -1720126 -2251842 -2235824
40988 -2235824 -1787161 -1077497 -587234 -765143 -1341674 -1510047 -917467 -94958 185302
40979A85302n00697q79553o01097J26294P82366R42714O70154L32117P3358k07087
40969I23871m29682l51899k1347K56451M06219N38241M54778j53779r53198j108383
40959d38728l94834M54799P37705N11373J29427k86507o13887o04526l28943j65333
40949i99454q6813L45976R87256R58151J0017q17146o19975M0868J08126l19376
40939c92370l32667K10224N48366L07368p0567j97534j92466j92797j37671r8830
40929e48944j85395j34851L18037P09832K98790o77813j064078l55162O10624
40920a028960Q97629O21395L27211l6099p26585j266341q30735M69498J474343
40911i8644J332125M24455l13309n53148o70097r22555j024688o32519O4743N11633
$$ plain form
40979 185302 -315395 -1194948 -1796045 -1669751 -887385 55329 725483 1057600 1130958 923871
40969 923871 494189 142290 120943 377394 783613 1321854 1776632 1622853 669655 -438728
40959 -438728 -833562 -378763 358942 870315 999742 713235 99348 -505178 -834121 -999454
40949 -999454 -1086267 -740291 246965 1205116 1215133 397987 -221988 -181120 -72994 -392370
40939 -392370 -725037 -514813 33553 340921 270354 72820 -119646 -312443 -450114 -548944
40929 -548944 -734339 -869190 -551153 158679 457469 -220344 -1284422 -1639584 -1028960
40920 -1028960 -131331 490064 817275 781176 54591 -1211750 -2042485 -1572987 -98644
40911 -98644 1233481 1657936 1344627 791479 121382 -801173 -1825861 -2458380 -2393637 -1882004
40901a882004M66599K59603K96620N01713M46486j5318m51453l13790L53592Q25694
40891D87742M51069n40450j194930r06449j23079K49947j4133k80378K9081P10046
40881a131534J078960P43920k0979n03494j91316N98739Q72083R5381r94127j249471
40871g01838o26851r6788q8317K451N03087P35361K24271k86836P9007Q93826
40861F37373J043059L54146l29917m27232j12242K51300L99944J13192m30462
40852A499161n60316r2295R4765o19095j288802o99453M99838N88088m45176p78644
40842a801929K63539J055500L57135o19401k26411Q85083P98464o26926j537107
40833a452053q02524N58115R89400L43187k99733j19632O22060J042329O61991
$$ plain form
40901 -1882004 -1415405 -1155802 -859182 -357469 89017 73699 -377754 -691544 -337952 487742
40891 487742 938811 398361 -796569 -1703018 -1826097 -1576150 -1590283 -1870661 -1841580 -1131534
40881 -1131534 -52574 691346 670367 166873 -24443 574296 1446379 1541760 547633 -701838
40871 -701838 -1328689 -1425477 -1513794 -1511343 -1008256 -272895 -48624 -335460 -256453 637373
40861 637373 1680432 2034578 1704661 1277429 1165187 1416487 1816431 1929623 1499161
40852 1499161 938845 846550 941315 322220 -966582 -1666035 -1166197 -578109 -1023285 -1801929
40842 -1801929 -1538390 -482890 -125755 -745156 -971567 -86484 711980 85054 -1452053
40833 -1452053 -2254577 -1696462 -707062 -363875 -663608 -783240 -161180 881149 1543140
40824A543140o5677l34350k5809K03501o5181m58907n03168k73299j98L49951
40814C70003O25706K79924p28733j410177r23091J69561O76734M41156K90397
40805b08520N71372P50095M62011K0889k69437n11956p15937n82035l7179N46825
40795B6128Q53604Q88439O72542J83193l15668m09620j30215N0911q7542l03240
40785A428532m23018n54579o56522m48275N7830M26215M18080L06645L60045M19355
40775A334308K32928j23921l81162l66723m7151M37732O95606L63791l97687r47247
40765H00474p88054O737R13082J279478P46032k86152q26206l88201L36565M24456
40755B218211k6977l28493m79393r40151j345821q03769L82801P25471k06829
$$ plain form
40824 1543140 1477463 1143113 1117304 1320805 1255624 796717 293549 20250 20052 370003
40814 370003 995709 1275633 546900 -863277 -1786368 -1616807 -940073 -498917 -208520
40805 -208520 362852 1112947 1574958 1595847 1326410 814454 98517 -483518 -520697 26128
40795 26128 879732 1768171 2440713 2623906 2308238 1898618 1768403 1819314 1731772 1428532
40785 1428532 1005514 450935 -205587 -653862 -596032 -169817 248263 554908 914953 1334308
40775 1334308 1567236 1443315 1062153 695430 648279 1086011 1781617 2145408 1747721 800474
40765 800474 12420 19157 932239 2211717 2957749 2671597 1845391 1457190 1793755 2218211
40755 2218211 2191234 1862741 1383348 443197 -902624 -1706393 -1323592 -598121 -804950
40746h04950r18724j77565J127168J369988M79416l37674m53633k00971R8068
40737A81123L25298J63496m26707o90600j00306N43390K48055l66536P4080J235479
40727A186772J254107l42141j668567j177030K38310Q67203O00546M17315M58761
40718A835276J35280l95965l64194J76219L60368l2322l35258k95337m18513p58333
40708i2779n62536L45087R16589L82818m69519m45606K82146N67773M8952n46081
40698D26844o64097m72780j58000L28173O88201M13197k44794l66302K16493N56378
40688G23313J43661k12514J64949M98159j69564j165771j109144j97083O0991
40679a263003o31510q10929L08723J439515J181786J23398k28121K54325M34380
$$ plain form
40746 -804950 -1723674 -1901239 -774071 595917 1075333 737659 284026 83055 181123
40737 181123 506421 669917 243210 -447390 -547696 -4306 243749 -122787 -48707 1186772
40727 1186772 2440879 2098738 430171 -746859 -508549 358654 959200 1376515 1835276
40718 1835276 1970556 1574591 1210397 1386616 1746984 1714662 1379404 1084067 665554 -92779
40708 -92779 -655315 -310228 606361 989179 519660 74054 356200 923973 972925 426844
40698 426844 -237253 -710033 -868033 -539860 148341 561538 316744 -49558 166935 723313
40688 723313 866974 654460 819409 1317568 1148004 -17767 -1126911 -1323994 -1263003
40679 -1263003 -1894513 -2705442 -2396719 -957204 224582 347980 119859 374184 808564
40670H08564j06470n40463k45308L15446M26751O3398l15158l92498j59625J93648
40660D8285L78860K46743j5430j28852j06014j47124k77657l86049m75570n37459
40650a400267l50390J69315N83392M18625o2035j74554J04688O5332n26210q36692
40640b008796q7345J190027J665344Q57179l09003o95407k41640K34166K08466
40631H12991o2899j93321k38692l47103l12288J9006K47762L520k30681K40213
40621f1492R47179O56405o14186j244821l48979P61628N21786n19465p11280O0207
40611e53018M63628J31575J22107P99738J040768J79140p66085o88401j7281K13829
40601I26000o4472l20043n15188p81906o75676J37071R33603P75366m2476m35055
$$ plain form
40670 808564 702094 161631 -83677 231769 658520 721918 406760 14262 -145363 48285
40660 48285 427145 673888 658458 529606 423592 276468 -1189 -387238 -862808 -1400267
40650 -1400267 -1750657 -1581342 -997950 -579325 -641360 -815914 -711226 -645894 -1172104 -2008796
40640 -2008796 -2096141 -906114 759230 1616409 1307406 611999 370359 604525 812991
40631 812991 750092 556771 318079 -29024 -341312 -322306 -74544 -71024 -301705 -61492
40621 -61492 885687 1542092 927906 -316915 -665894 95734 617520 98055 -613225 -553018
40611 -553018 -89390 42185 164292 964030 2004798 2183938 1417853 729452 712171 926000
40601 926000 861528 541485 26297 -755609 -1431285 -1294214 -360611 414755 372279 -62776
40591f2776j59059P9924q457K0806K54314J42818m00988o41381j93726L12983
40581f55542K78473N9145J98961L97080P1077m87909m55832J75685N08561J15541
40571B05240l27987j52757K61500J46150m11074o12654j79766K95320L07199R5164
40561c73665P8847J77718R7806q2790o2054J82027M20178N18451M34965J06114
40551A497597l22780m33393j03615J59833p3967m54890m23674j41277j27456k87003
40541g10625j78701j7354l45088p92080m00403O50703R61038J8141q85339n79037
40531b278745L06100N60727L01356M54653J040569J236757P62375N2145o66242
40522A769695j377503j591085p92435M57939R49371M40547j03083k2907K32228
$$ plain form
40591 -62776 -221835 -141911 -150368 -129562 124752 267570 -133418 -774799 -968525 -655542
40581 -655542 -377069 -317924 -118963 278117 349194 -138715 -594547 -418862 89699 205240
40571 205240 -122747 -275504 -14004 132146 -278928 -891582 -1071348 -776028 -468829 -373665
40561 -373665 -294818 -117100 -19294 -102084 -164138 17889 438067 956518 1391483 1497597
40551 1497597 1174817 741424 637809 797642 723675 268785 -154889 -296166 -423622 -710625
40541 -710625 -889326 -906680 -1251768 -2043848 -2444251 -1793548 -832510 -814369 -1699708 -2278745
40531 -2278745 -1972645 -1411918 -1110562 -655909 384660 1621417 2383792 2435937 1769695
40522 1769695 392192 -1198893 -1991328 -1533389 -584018 -143471 -246554 -269461 -37233
40513c7233R9601j65665l0908M14925N90337J94509m33195o51049k16368K99042
40503F3996R7624o65405q47947Q9519J117790J014288J00038l85630j43023J42240
40493E83490K39242M69509N19088l13798j536979j669855m48067O21186M85250
40484a050934o8347m851L28052J71143j89593r3180K42947K63126J39021K30622
40474c1994J82973l36100o58711q2463P29629N92367l35302q08061l86720J77838
40464i56544L32797K72964J19158k64934n55095k03858M62102M94743j26009l30762
40454g55438L28774R37084O80534J9728k44664j78784k38515l15748q0020K43566
40444C96517K24442L649J5123J83226N0863m32478q10784p56494l88627q183J73670
$$ plain form
40513 -37233 62368 -103297 -134205 280720 871057 1065566 632371 -18678 -235046 63996
40503 63996 161620 -503785 -1351732 -1262213 -144423 869865 969903 584273 441250 583490
40493 583490 822732 1292241 1811329 1497531 -39448 -1709303 -2157370 -1536184 -1050934
40484 -1050934 -1119281 -1124132 -796080 -624937 -814530 -907710 -664763 -401637 -262616 -31994
40474 -31994 150979 -185121 -843832 -926295 -196666 395701 60399 -747662 -1134382 -956544
40464 -956544 -623747 -350783 -231625 -496559 -1051654 -1255512 -793410 -298667 -424676 -755438
40454 -755438 -426664 510420 1190954 1210682 966018 787234 548719 232971 152951 396517
40444 396517 620959 624608 639731 822957 873820 441342 -369442 -1125936 -1514563 -1522746 -1349076
40433a349076J20894J0498O3146K11414J94094Q9164L10490Q21684Q85774P9340
40423A437422q95927j048989m34842N4194M0136r728J74191J39050m36662j030921
40413b012076r38310k41532L93520O47750P57369R05258R34151P43133N26385
40404A715648M15971K15456k53736p79887j014517r10832o14574j25157N12498
40395h39130Q34772L76576m88039p62630j29087N78099N68946J46842Q965J02649
40385C97963k4407j99855M7356L88469N1671p26642q05671L5750N79456K8657
40375b27253p37706o11458J5058P6249l17586j74654N65497Q75900L62059j03262
40365b77156J60771N81023L33026l44108n66917j21586L49821L40858P2463J5390
$$ plain form
40433 -1349076 -1228182 -1217684 -1154538 -943124 -749030 -659866 -349376 472308 1358082 1437422
40423 1437422 541495 -507494 -942336 -888142 -848006 -857734 -683543 -544493 -981155 -2012076
40413 -2012076 -2950386 -3191918 -2798398 -2150648 -1393279 -488021 446130 1189263 1715648
40404 1715648 2131619 2347075 2093339 1313452 298935 -611897 -1226471 -1351628 -839130
40395 -839130 -4358 372218 -115821 -878451 -1007538 -429439 139507 286349 295314 397963
40385 397963 373556 173701 221057 609526 661197 -65445 -871116 -835366 -255910 -227253
40375 -227253 -964959 -1576417 -1561359 -1485110 -1802696 -1977350 -1411853 -535953 -173894 -277156
40365 -277156 -116385 464638 797664 453556 -113361 -234947 114874 455732 528195 543585
40355E43585K16442L09846M5305m00976o73430o57088n03384l09409k4688K91977
40345a161820M28218L58192L16690L69468K77684J8808j4241K93166L79808j35104
40335A130869o48645l65700M37788P99947N19671K66113K93815Q8485n23589r14491
40325A084263o73535k21185P610J75445L93710L05409j20693j94054M12033R19178
40315B088181N62149k22836n73364n27628n97845n73272Q3065R51406R85209R0970
40305B266035p03364p33976l71678r3700J44291L80261L68484J17054m4816j34820
40295A193771m73647q24050n10487L19050N72914j46926p81625l85678M42698
40286e93980N83222R4715j42391M8425R2286j40644j94616j5172m8313k84095
$$ plain form
40355 543585 760027 1069873 1115178 714202 40772 -616316 -1119700 -1429109 -1453797 -1161820
40345 -1161820 -733602 -375410 -58720 310748 588432 607240 592999 886165 1265973 1130869
40335 1130869 482224 116524 554312 1354259 1873930 2140043 2433858 2522343 1998754 1084263
40325 1084263 410728 189543 197153 372598 766308 1071717 951024 756970 1169003 2088181
40315 2088181 2650330 2427494 1854130 1326502 728657 155385 238450 1189856 2175065 2266035
40305 2266035 1562671 828695 457017 363317 507608 887869 1256353 1373407 1328591 1193771
40295 1193771 720124 -103926 -614413 -295363 277551 130625 -651000 -1036678 -593980
40286 -593980 -10758 83957 -58434 -10009 82277 -58367 -252983 -268155 -316468 -600563
40276f00563j83566K40268K45818l35233n60910J69805R02244L60084j011551
40267g73604j417208k22445J047578Q24017k95193n02721N10520J147366L55074
40258F73384q46244j001165k98478R8084K4598K12415N94280L07994n35270o73692
40248a444094K52154R39474M61717k85326j74074L46956L07608L8608L92002Q74206
40238A709231L08431r56160j270236j96600Q36809P34200R8053j35499p7718j65035
40228H85476j97463L3375O5055l93276o92306k37183L82645K60678k84958j26612
40218c04569Q77491J547991R97898k44246j050929j041044o73180l49371K2502
40209b17457N19442O94044K7448j129574j605445p69705N43769J038243N95640
$$ plain form
40276 -600563 -784129 -543861 -298043 -633276 -1194186 -1024381 -122137 237947 -773604
40267 -773604 -2190812 -2413257 -1365679 -541662 -836855 -1339576 -829056 318310 673384
40258 673384 -172860 -1174025 -1472503 -1374419 -1349821 -1137406 -543126 -235132 -770402 -1444094
40248 -1444094 -1191940 -252466 209251 -76075 -250149 96807 404415 443023 835025 1709231
40238 1709231 2017662 1061502 -208734 -405334 431475 1165675 1263728 1128229 1050511 885476
40228 885476 688013 721388 786443 393167 -299139 -536322 -153677 107001 -177957 -304569
40218 -304569 572922 2120913 3118811 2874565 1823636 782592 109412 -239959 -217457
40209 -217457 301985 996029 1023477 -106097 -1711542 -2481247 -1937478 -899235 -303595
40200c03595J80026K68420L42202O2905r4157J60927K44667k92071q36733o31899
40190h99308l0742Q5919k59171k64972K87395P46401O67190L47995J68175Q7525
40180I36407j3306n7464k1123j9424l8190K2819K5044k39667n65152n41278k64555
40169g75889k29500m11935j68948O34979J089713M09520q06663j180722k76707
40160a716152Q98360J163106M36329m28193p01916l83719O8126K79243K04390
40151a80426L2240l6202L7248J21241J01184M5131Q1793J27220o5579m85065p08013
40140i29228l97746J81984M30045J33678l21677m39815q2929M96046Q50028O37604
40130E57990l711m60870l06937J49086K93107K7077k44714k76843j39238J17330
$$ plain form
40200 -303595 -123569 144851 487053 549958 455801 616728 861395 569324 -267409 -899308
40190 -899308 -930050 -844131 -1103302 -1368274 -1080879 -334478 332712 680707 848882 936407
40180 936407 923101 865637 844514 825090 786900 809719 834763 595096 29944 -511334 -775889
40169 -775889 -1005389 -1417324 -1586272 -951293 138420 547940 -258723 -1439445 -1716152
40160 -1716152 -817792 345314 781643 353450 -348466 -732185 -664059 -384816 -180426
40151 -180426 -148186 -184388 -147140 -25899 75285 120416 202209 329429 263850 -221215 -929228
40140 -929228 -1326974 -1144990 -714945 -581267 -902944 -1342759 -1425688 -929642 -79614 557990
40130 557990 554279 93409 -213528 -64442 228665 255742 11028 -265815 -405053 -287723
40120b87723L87193K94811k64809n81674J4859R24504R52206J47800k92678o2432
40110A232057j82463r85470j283882l89629N74102N28116J90146N71208J020257
40101A274442M80138l74858k23890M33924K8817j257820j614592n34595M82851
40092a305583M57420J77604L97061O02896L30224J30663L95346N40718J44842
40083A871191l03851m62045p15130j066806p57852K60250Q06192K99739k03269
40074b71581J92044O95113L09620l63078k18633M11711M22985j62414m29178j97500
40064C89089j8430O9978M30594P47789L67092m30888p01635l06567M151o7093
40054D84080l1913L17423N09692K38371j86701l76333k45702J36419N38429N44923
$$ plain form
40120 -287723 99470 394281 129472 -452202 -437343 487161 1439367 1587167 1294489 1232057
40110 1232057 1049594 64124 -1219758 -1609387 -1035285 -507169 -317023 254185 1274442
40101 1274442 1754580 1379722 1155832 1589756 1618573 360753 -1253839 -1788434 -1305583
40092 -1305583 -848163 -670559 -273498 329398 659622 790285 1185631 1726349 1871191
40083 1871191 1567340 1105295 390165 -676641 -1434493 -1174243 -368051 -68312 -271581
40074 -271581 -79537 615576 925196 562118 343485 755196 1178181 1015767 586589 389089
40064 389089 370659 440637 871231 1619020 1986112 1555224 853589 547022 551173 484080
40054 484080 452167 769590 1279282 1517653 1330952 954619 708917 845336 1383765 1928688
40044A928688Q4663k83663j82468j00094n61533j102332r58853l23483J23077
40035a375998N12373J385334K235895J844031J64378j355772j607541r41351k43466
40026F17883J06494R6020j66724k60817J85931P48339O06613k04285q18362q69699
40016D1393p93839o93677p9581R26081J300670O02011k62850l69299O431J39111
40006H16451J4199K9316J80122K09269Q1185j73939n76823q06363l45866N90053
39996A7604J001558M42043l06783l84615N8365M33197N88789N26357L7332o83891
39986A729956q37383j92425K82056j91953r01762p01632K58819R15675Q81099
39977A242450N44747J1548q44635j477177j040319K81261J330037J447784J004644
$$ plain form
40044 1928688 2013351 1729688 1547220 1447126 885593 -216739 -1175592 -1499075 -1375998
40035 -1375998 -863625 521709 2757604 4601635 4766013 3410241 1802700 861349 617883
40026 617883 724377 820397 653673 392856 578787 1327126 1933739 1729454 911092 41393
40016 41393 -752446 -1446123 -1525704 -599623 701047 1303058 1040208 670909 677340 816451
40006 816451 830650 859966 1040088 1249357 1330542 1156603 579780 -226583 -572449 17604
39996 17604 1019162 1461205 1154422 769807 828172 1261369 1850158 2376515 2413847 1729956
39986 1729956 892573 700148 982204 790251 -111511 -813143 -554324 361351 1242450
39977 1242450 1787197 1798745 954110 -523067 -1563386 -1282125 47912 1495696 2500340
39968B500340M45140k19823q10893q19170k09658L19722K25894k65542o47724
39959E18286p07030m38189Q0558N34697N68777K81031P7055j9984l50241q12497
39949b67537p44703Q9601R48006R51364J34935o70932p59577j20830O58691Q86549
39939A105567L83112k70357l40428J46738M24199L531o93798r15822m89563R1468
39929e55353L11753J52468M285J36446L01396N5422m62680m76100L43238J125846
39919I36721P91546m10496j122948o68891J70789L95061M4306k24116k28238l10238
39909f26504n78470o77467l10788L41764Q03984P97658N22534L75897L76210J45903
39899A170721l44122m74144P6121N54476J43844o16433n39151K45494M38014j68808
$$ plain form
39968 2500340 2945480 2725657 1914764 1095594 885936 1205658 1431552 1166010 518286
39959 518286 -188744 -626933 -546375 -11678 557099 838130 915185 895201 544960 -267537
39949 -267537 -1012240 -922639 25367 976731 1111666 440734 -318843 -439673 219018 1105567
39939 1105567 1488679 1218322 877894 1024632 1448831 1452362 758564 -157258 -646821 -555353
39929 -555353 -243600 -91132 -86847 49599 350995 406417 -56263 -532363 -189125 936721
39919 936721 1728267 1317771 194823 -474068 -303279 91782 136088 -88028 -316266 -626504
39909 -626504 -1204974 -1882441 -2193229 -1851465 -1047481 -249823 272711 648608 1024818 1170721
39899 1170721 826599 352455 428576 983052 1126896 510463 -28688 216806 654820 486012
39889D86012k30271P10169J066302k42156j629530j062197O58750J036637k45748
39880E47968j005303j86258O45430J93590m13659K52328J359947J128820l75669
39871B147194j499393j426779p56168l8497P09192J152980P51898j45730n06716
39862C87981p6555L98756M79178M47204L23949k83058j063961j022664j06050
39853e15220M29465m9656m92308N7707Q02500N45030k43963k00652O71955J082592
39843B087450N60191l4406j54062k87060p29932r32022n80088k52049l68579l95810
39833a086367K19370J037708J252226P93087J95110j88121l00356j47653M8985
39824A823989j07412n33736n42301J11863O14619J99961o27686q06785k86594
$$ plain form
39889 486012 255741 965910 2032212 1790056 160526 -901671 -242921 793716 547968
39880 547968 -457335 -643593 1837 195427 -218232 34096 1394043 2522863 2147194
39871 2147194 647801 -778978 -1535146 -1573643 -864451 288529 1040427 894697 387981
39862 387981 311426 710182 1189360 1636564 1960513 1677455 613494 -409170 -515220
39853 -515220 -85755 -135411 -627719 -570012 232488 777518 533555 332903 1004858 2087450
39843 2087450 2647641 2613235 2459173 2172113 1442181 510159 -69929 -321978 -690557 -1086367
39833 -1086367 -866997 170711 1422937 2216024 2411134 2223013 1922657 1775004 1823989
39824 1823989 1716577 1182841 640540 752403 1367022 1566983 939297 132512 -154082
39815a54082N7862j05629k00814O9930J49898l79282r74468q32271L0807Q77636
39805a460413J161721R46649N88085L39166K21455P8883k16363n36119n88242
39796E34822l10925p380N1076N306J81471N48746O61721K48813l31694m79455
39786A102501j68144l4925m60962q91838n30271M49132R97743O09920l244j2243
39776A057669L40871K60292k73387m66188M4359O26760N51305p0849n54434n12747
39766A003651j42881J73766K48641R8558j90909n20223p50585p15960l44377K16014
39756i24305O66712P97663O13576K48509j17076k69017r9421J99616K84805R9648
39746A500710l7690J00162L03009J99929k68463p83725r38810n51771J45040O43441
$$ plain form
39815 -154082 -96220 -201849 -402663 -332733 -182835 -562117 -1536585 -2368856 -2338049 -1460413
39805 -1460413 -298692 647957 1236042 1575208 1796663 1875546 1659183 1123064 534822
39796 534822 223897 216517 267593 272899 454370 1003116 1664837 1913650 1581956 1102501
39786 1102501 934357 899432 438470 -453368 -983639 -534507 463236 1073156 1069912 1057669
39776 1057669 1398540 1658832 1385445 919257 963616 1590376 2141681 2070832 1516398 1003651
39766 1003651 860770 1034536 1283177 1381735 1190826 670603 -79982 -795942 -1140319 -924305
39756 -924305 -257593 540070 1153646 1402155 1285079 1016062 916641 1116257 1401062 1500710
39746 1500710 1463020 1563182 1866191 2066120 1797657 1013932 75122 -476649 -331609 311832
39736C11832P13070P23141J041835J261392O77356m31609q54946j30803O58794
39727C970062L93665m91200p36972p4557O20624P10940M18135J41904k7291p3919
39717D851391n38l9550l60460o24139m19882m6825j76637p78614j109594q19208
39707D75944l35421l4908K29983N46726N82881J81726k10833j17738L08146N12335
39697B138841K17765l13701n67449l00437J17977Q1606l64267m36249J91650O76435
39687A442171K18615n51798m57512L10901M70797k16400n32053J49215P95780
39678A629716L85827n40504q74169n55935k36056j0833M77886J066975J106662
39669B449569L61050o94972j345707j101476n9542R15801Q79564j857n36340j18544
$$ plain form
39736 311832 1024902 1748043 2789878 4051270 4728626 4297017 3442071 3311268 3970062
39727 3970062 4363727 3872527 3135555 3060998 3681622 4392562 4810697 4952601 4925310 4851391
39717 4851391 4850853 4811303 4450843 3826704 3406822 3359997 3183360 2404746 1295152 475944
39707 475944 140523 105615 335598 882324 1465205 1646931 1436098 1318360 1626506 2138841
39697 2138841 2356606 2042905 1475456 1175019 1292996 1374602 1010335 574086 765736 1442171
39687 1442171 1660786 1108988 651476 962377 1433174 1216774 684721 833936 1629716
39678 1629716 2015543 1475039 600870 44935 -191121 -201954 275932 1342907 2449569
39669 2449569 2810619 2115647 769940 -331536 -391078 524723 1404287 1402430 866090 747546
39659G47546N05977N58576L87812N36104N42744k04910j071384r28846K607L89184
39649A465410j78326o55083k87998K76634J63635l64365m49764l337K62249J613
39639B30668k38506J45370Q53558R62261J39102q10937q82319r0270O53573P06837
39629A669337K06085m70387j052706j162031n34379L34686N48423P2821j91853
39620e80004J00982K06170k57245m58972J91589Q43927N98146J43033N93431J418877
39610B799934J172019q6186p91051k93007L36291J76918l14968m17805k36235
39601B345910j26018n2821m0114l34810o80251l78319M42200O31999k63359j069663
39591D74754o11744N28854Q78609J57816n20320k95079M95767R92446P61057J5111
$$ plain form
39659 747546 1253523 1812099 2199911 2736015 3278759 3073849 2002465 1073619 1076226 1465410
39649 1465410 1287084 632001 344003 620637 784272 419907 -29857 -33194 229055 230668
39639 230668 -7838 137532 991090 1953351 2092453 1281516 399197 308927 962500 1669337
39629 1669337 1875422 1405035 352329 -809702 -1344081 -1009395 -460972 -388151 -580004
39620 -580004 -479022 -272852 -530097 -989069 -797480 46447 644593 787626 1381057 2799934
39610 2799934 3971953 3885767 3094716 2801709 3138000 3314918 2999950 2582145 2345910
39601 2345910 2219892 2167071 2126957 1792147 1111896 733577 1175777 1807776 1544417 474754
39591 474754 -136990 391864 1270473 1428289 907969 612890 1108657 2101103 2862160 2877271
39581B877271o45551o95266j90610K51770K05330m6314J3883M42328R55588J408374
39571D576803J684017J413831M54023m62998k76047J009872K045825J622974O6587
39562A2134887j268438j642532j524448j557251j571659j043081j41990L27877
39554C713365M9950l32708j23880M66015O36474M3896q15205j176206p35982J08486
39544A834205O18731M24154q5759k69136p1761L0540j07830j07384J39036J81319
39534B586115j59710l94936k31114q9196k12596p4189N68722Q47798L6028j049763
39524A827159j098027k57299K49832J05729P3692L63045L36605l5498P7668Q02793
39514B445699J114660M82287k79235m33466m31069q02542r84827k56902Q72079
$$ plain form
39581 2877271 2231720 1536454 1345844 1597614 1802944 1756630 1770513 2212841 3168429 4576803
39571 4576803 6260820 7674651 8128674 7665676 7389629 8399501 10445326 12068300 12134887
39562 12134887 10866449 9223917 7699469 6142218 4570559 3527478 3385488 3713365
39554 3713365 3763315 3430607 3306727 3772742 4409216 4453112 3637907 2461701 1725719 1834205
39544 1834205 2452936 2877090 2791331 2522195 2450434 2480974 2373144 2265760 2404796 2586115
39534 2586115 2426405 2031469 1800355 1711159 1498563 1424374 1993096 2840894 2876922 1827159
39524 1827159 729132 471833 721665 827394 901086 1264131 1600736 1565238 1642906 2445699
39514 2445699 3560359 4042646 3763411 3329945 2898876 2096334 1111507 854605 1726684
39505A726684J231838N62810l13197o55960m68818j41382M0782O0622J28169M26454
39495B598002Q42765J121802J195343J059838N60155j90202m72709J68018R40473
39486G823485O81740l66927q06752j96745L44610n433n99671o07376k99999k39257
39476E727675j61481L91633J034437J014965K67732o48808j207249j066857j94896
39467E157151P42960Q17984P6324m48400l20166k60758o08913m74679O47431J579406
39457F908340J024498m06342j050053m96467K42363M66859M31092M04042J96496
39448G720828l15232r38726j414930j439848p48006L20408Q07008L00839l83785
39439C908556l48684J18301J62444k69947n10864k33666K99840P16821O83948
$$ plain form
39505 1726684 2958522 3521332 3208135 2552175 2083357 1941975 1982757 2043379 2171548 2598002
39495 2598002 3440767 4562569 5757912 6817750 7377905 7187703 6714994 6883012 7823485
39486 7823485 8505225 8138298 7331546 7134801 7479411 7473978 6874307 6266931 5966932 5727675
39476 5727675 5566194 5957827 6992264 8007229 8274961 7626153 6418904 5352047 5157151
39467 5157151 5900111 6718095 6794419 6346019 6025853 5765095 5156182 4681503 5328934 6908340
39457 6908340 7932838 7526496 6476443 5979976 6222339 6689198 7120290 7524332 7720828
39448 7720828 7405596 6466870 5051940 3612092 2864086 3184494 3991502 4292341 3908556
39439 3908556 3559872 3678173 3840617 3570670 3059806 2826140 3125980 3842801 4526749
39430D526749L0251p89158r58300m87461l12712p00974o70251K11290P23412j02364
39420A470482j143310p82928N58110J180970P54650M29795O63435O95536J74702
39411D001442k49905j40899J50383K69945K48957J03326j13818l3659M60952P37671
39401E434395L01331l00245l04100J46614N97369J201838K000514K172974J243044
39392A2493734J71710m683L27014M92609R55073K089751K901118K786665L160335
39383B5373326N196658P416206P951081P711882Q492298R479401R025505Q510060
39375H9156417J0558288J4629644J8996711K6401903M2105669O4975942Q4611305
39368C51435879Q8393938O8638321K5126282l1830431q0312751r8500103q3854484
$$ plain form
39430 4526749 4557000 3767842 2809542 2322081 2009369 1308395 638144 849434 1572846 1470482
39420 1470482 327172 -455756 102354 1283324 2037974 2467769 3131204 3826740 4001442
39411 4001442 3751537 3610638 3761021 4030966 4279923 4383249 4269431 4235772 4696724 5434395
39401 5434395 5735726 5435481 5131381 5277995 5875364 7077202 9077716 11250690 12493734
39392 12493734 12665444 12660761 12987775 13480384 14435457 16525208 19426326 22212991 25373326
39383 25373326 30569984 37986190 45937271 53649153 62141451 71620852 80646357 89156417
39375 89156417 99714705 114344349 133341060 159742963 201848632 266824574 351435879
39368 351435879 439829817 508468138 533594420 501763989 421451238 322951135 239096651
39361B39096651n6012448l6025614k7311274k1080780j3475670q647761q493195
39354F8049909r108650p893408o775277o971602o425032m152559k327041k289049
39346B2107291k463522j713686j171358j427513j293855n81630q34436k093415
39338A0527876k180636n04453O13969j41477r55115l10030M55329p3035p87770
39329F644658l44154L40522k258o62799n75201l43250o62785n96598N16461J208810
39319E523406J30473j427761j498823n25873j88335l96810Q1062R30880P52644
39310C380863l12890p81717l78842j93028m02525j6350R41865J047269j77000
39301C107645j221602o83717Q22450J610878R56479m12362j280686j003607q752
$$ plain form
39361 239096651 183084203 147058589 119747315 98666535 85190865 76543104 68049909
39354 68049909 58941259 51047851 44272574 37300972 30875940 26723381 24396340 22107291
39346 22107291 19643769 17930083 16758725 15331212 14037357 13455727 12621291 10527876
39338 10527876 8347240 7842787 8456756 8315279 7360164 7050134 7505463 7432428 6644658
39329 6644658 6300504 6641026 6638768 5975969 5400768 5057518 4394733 3798135 4314596 5523406
39319 5523406 5653879 4226118 2727295 2201422 2013087 1616277 1697339 2628219 3380863
39310 3380863 3067973 2286256 1907414 1714386 1311861 1295511 2237376 3284645 3107645
39301 3107645 1886043 1202326 2024776 3635654 4592133 4179771 2899085 1895478 1886726
39292A886726N67458Q8285p77321q83580q8175O78561P26681L19210J1889q3248
39282B446486j24179p8578J95363N51195N45020l8058p56140r02298m15098M532
39272A428245l0675N6407P78111J459525J124707J41612k24183K40686N23502
39263E497937J98959m7984K5777k84967j041631j143512k33710L88936j52205
39254C207600p40579j41201P79746L74061j068485j673743p18788N41587P66156
39245A326354K2784p11072o75100R7348P86119N66469k42164l79872N34205J250369
39235B575440P11626l15162m83314J08503L81236P4201k47403m22837n89448l55963
39225A436879N04721R93175N9433j461671j712067m93085N37688L89072j89234
$$ plain form
39292 1886726 2454184 2542469 1765148 881568 793393 1471954 2198635 2517845 2529734 2446486
39282 2446486 2322307 2243729 2439092 2990287 3535307 3497249 2741109 1838811 1423713 1428245
39272 1428245 1397570 1453977 2232088 3691613 4816320 4957932 4733749 4974435 5497937
39263 5497937 5696896 5648912 5674689 5389722 4348091 3204579 2970869 3359805 3207600
39254 3207600 2467021 2325820 3105566 3479627 2411142 737399 18611 560198 1326354
39245 1326354 1349138 638066 -37034 60314 846433 1412902 1170738 790866 1325071 2575440
39235 2575440 3287066 2971904 2488590 2597093 2978329 3052530 2805127 2382290 1792842 1436879
39225 1436879 1941600 2934775 2994208 1532537 -179530 -672615 -134927 254145 64911
39216F4911l86756m43493n64848k11258P60625J401403R21252j92484r50246j031252
39206f32146o55616R393P60801J204355J136470P31056J93769l29947n23763j96062
39196A698310K20208J53057j90926j77886J01672o137m58518n23027j22633J2076
39186G06196k54526j65991M30347N75719j82694q58755n41862J68314J92848l60165
39176b90569n61367j39504L35968M04620J00019l32024n30121j66647N25461P99025
39166A44861M18056J08672M54879R20189O57836j76797o83818m68980P8360N15794
39156A969052O80686M75088l5833m16325l20266o3554j99412o14724o31410l2488
39146H10814N69186N65837J34705j03369L3431J04365k24961n81491l42552L81175
$$ plain form
39216 64911 -321845 -765338 -1330186 -1541444 -780819 620584 1541836 1349352 399106 -632146
39206 -632146 -1287762 -1278369 -517568 686787 1823257 2554313 2748082 2418135 1894372 1698310
39196 1698310 1918518 2071575 1880649 1702763 1804435 1798298 1339780 816753 694120 706196
39186 706196 451670 285679 716026 1291745 1109051 250296 -291566 -123252 69596 -290569
39176 -290569 -851936 -991440 -655472 -250852 -150833 -482857 -1012978 -1179625 -654164 144861
39166 144861 562917 671589 1126468 2046657 2704493 2527696 1843878 1374898 1453258 1969052
39156 1969052 2649738 3124826 3088993 2672668 2352402 2288848 2089436 1474712 843302 810814
39146 810814 1380000 1945837 2080542 1977173 2010604 2114969 1890008 1308517 965965 1347140
39136A347140P12746J82919n53827o32091j60129J61774K26990M41529O64062
39127B391113K96256m80002o41645J33492Q25984N21056k93180n21031J5575M96785
39117B744403K43573n22252r14640k83626Q72187J127164j23862j477476j140599
39108E24872M60982J145941J80519p12146j75044P29241M66671m96776p22479
39099A401781j58372J93696J35274J31091k5291o97059j071630j46389J260620
39090A023721J350331J10569o57528k26222J24226m36628q56224k16384M83509
39081F99370n6763j194896j233838N6006J185925J034619P9261n25418l06318
39072b62052K84815N32382J84856l29276m16692m2916K88886K81043J68745K06705
$$ plain form
39136 1347140 2059886 2242805 1688978 1056887 896758 1058532 1285522 1727051 2391113
39127 2391113 2687369 2207367 1565722 1699214 2525198 3046254 2753074 2232043 2247618 2744403
39117 2744403 2987976 2465724 1551084 1267458 2139645 3266809 3142947 1665471 524872
39108 524872 985854 2131795 2312314 1600168 1425124 2154365 2621036 2124260 1401781
39099 1401781 1243409 1437105 1572379 1703470 1678179 981120 -90510 -236899 1023721
39090 1023721 2374052 2484621 1827093 1600871 1725097 1288469 432245 215861 699370
39081 699370 642607 -552289 -1786127 -1730121 -544196 490423 569684 44266 -262052
39072 -262052 22763 555145 740001 410725 -5967 -48883 240003 521046 689791 896496
39062H96496K81075K36976J62194Q0863k34062q12341j172157q27538N3879P79623
39052e54992Q36603L22374k32716l99544k66832k60600m76711m74088N89M54042
39042a051875L23247j09361j68876P6174j4343m28720m30267J59425N92946M27240
39032f24410J70742K51012K65853j08592l10606J98255Q71273P97312K9180o28811
39022I11208p90776o45226k64058L89676R38630Q84849L71729j3863r3703j06338
39012A582128m8997K16781L34356j80782r28469r22352q4520N08210K34870j43535
39002E67690K40265R68261J024145L00654m48520p83408q06864m59603M23725
38993A026345J338751J357716M15305m64547n69329l49268m15805m93104r9677
$$ plain form
39062 896496 1177571 1414547 1576741 1657604 1423542 611201 -560956 -1388494 -1334615 -554992
39052 -554992 281611 603985 371269 -28275 -295107 -555707 -1032418 -1506506 -1505917 -1051875
39042 -1051875 -728628 -837989 -1006865 -930691 -945034 -1373754 -1804021 -1644596 -1051650 -624410
39032 -624410 -453668 -202656 63197 -45395 -356001 -157746 713527 1510839 1540019 911208
39022 911208 120432 -524794 -788852 -399176 539454 1424303 1796032 1782169 1688466 1582128
39012 1582128 1533131 1749912 2084268 1903486 975017 52665 -31855 476355 711225 567690
39002 567690 807955 1776216 2800361 3101015 2652495 1869087 1062223 602620 1026345
38993 1026345 2365096 3722812 4138117 3673570 3104241 2754973 2339168 1846064 1746387
38984A746387L69452J92315m13096n63689r6632L08846L69799N11940P84077N54445
38974C763844k80147p84409l15540M67302O16428J80757k38057m74836n43900
38965B391442j53598N78523P21598K4803j553J865577L967556L280189l58901
38956A2315636l585523l719826j794372l71334o9801J60315N52780K99490n80697
38947C206668r18585j59756P87406Q44596P2007o69960q01216m45587p8170N0512
38937A887915J86123O64342J238632J248082O33648J97298M52816Q47655P27909
38928H084420M71773Q47588J712877K310369K585850L200760M276220N025030
38920B8514887M684334L067030K90110l098062n704646o128678m613666k985121
$$ plain form
38984 1746387 2115839 2308154 1895058 1331369 1234737 1543583 1913382 2425322 3209399 3763844
38974 3763844 3483697 2699288 2383748 2851050 3467478 3648235 3410178 2935342 2391442
38965 2391442 2237844 2816367 3537965 3562768 3561215 5426792 9394348 12674537 12315636
38956 12315636 8730113 5010287 3215915 2844581 2774780 2935095 3487875 3787365 3206668
38947 3206668 2288083 2128327 2915733 3760329 3832336 3162376 2361160 1915573 1837403 1887915
38937 1887915 2074038 2738380 3977012 5225094 5858742 6056040 6508856 7356511 8084420
38928 8084420 8556193 9403781 11116658 13427027 16012877 19213637 23489857 28514887
38920 28514887 33199221 36266251 36556361 33458299 27753653 21624975 17011309 14026188
38912A4026188k486355k470423j754417m55971L23763J28997m17240o29133m74097
38903E791312k62506j82883k66534m58424o13882o29099n83825n71494m47486
38894A775179p780N74655P84458L90439j58722k21231K02151M17536n3718q08243
38884B894724j115593r19041p69849q12779n09928L71492J136338J035611L07042
38875A618017k36747l11170k24627j19542J41451M61666N67162N24095N65945
38866B986250M85053r2431q48763r85279m11489M5731j59682o07138o92034l97323
38856f77105L6384N24322Q33987N36004k66864p56861m52825J02829K16443K6403
38846A22717J2345Q7224o3448j74805K09322P95546Q38835K77942k25503l64102
$$ plain form
38912 14026188 11539833 9069410 7314993 6859022 7182785 7311782 6894542 6265409 5791312
38903 5791312 5528806 5345923 5079389 4620965 4007083 3377984 2794159 2222665 1775179
38894 1775179 1767399 2342054 3126512 3516951 3358229 3136998 3339149 3756685 3702967 2894724
38884 2894724 1779131 860090 90241 -722538 -1232466 -860974 275364 1310975 1618017
38875 1618017 1381270 1070100 845473 725931 867382 1329048 1896210 2420305 2986250
38866 2986250 3471303 3378872 2530109 1544830 1133341 1179072 1019390 412252 -279782 -677105
38856 -677105 -640721 -116399 717588 1253592 986728 229867 -222958 -120129 96314 122717
38846 122717 135062 222286 158838 -15967 193355 988901 1827736 2105678 1880175 1516073
38836A516073n07122q37421r33614n09637L5761J90241K7243k6798J77803M45243
38826d22228N81502N19059K38157j80978n00859n15641k61944P7963M09450P17336
38816F61817Q80731O99989J79292l64840o14070n77715m49006k46767Q6222K80185
38806E35838m7452o04519m87192M89512J160651N35136n57208n08779O05627J059821
38796B181435J75134n77286Q0317J196379J086072j85399j191966j291921r55400
38787E17365m61431K33894O15471J11955o19987m18624L85123L23391o72778r06634
38777h92255L12619J328381O40078p91755j139270l97273J24049J41683M82168
38768a91575J215267J398051P09367p4713m23135o62651j002927j034287n45180
$$ plain form
38836 1516073 1008951 171530 -762084 -1271721 -1235960 -1045719 -1018476 -1045274 -867471 -422228
38826 -422228 159274 678333 916490 735512 234653 -280988 -542932 -464969 -55519 661817
38816 661817 1542548 2242537 2421829 2056989 1442919 865204 416198 169431 255653 535838
38806 535838 488386 -116133 -603325 -113813 1046838 1581974 1024766 515987 1121614 2181435
38796 2181435 2356569 1779283 1859600 3055979 4142051 3956652 2764686 1472765 517365
38787 517365 55934 289828 905299 1017254 397267 -21357 363766 687157 14379 -892255
38777 -892255 -579636 748745 1388823 597068 -542202 -939475 -815426 -673743 -191575
38768 -191575 1023692 2421743 3131110 3056397 2633262 1970611 967684 -66603 -611783
38759f11783M9799M05772N91079N52892J11368l10158N9450R95923J213818J88811
38749C246971r36003r85767l78718j95369m19852k70843K30095L10780r0407j49041
38739C61846M25047Q63610N55803r2172m12661l63888k30795o4098J09003K8631
38729A180326l52508n72760k71368K51852N11160N10210M74426K66167l29748
38720A667757r42954q87110r9292P05111Q92455N29212P4107j88610k85553l62373
38710A102750m64777m39009j32293K36339J85066l22466o27649k40205L78787
38701c23457M49050J9685j92345N5934L25865L78504M19123L86875r4850q24435
38691E99949r91339m14559Q5894K6362N805M49040O12568j52716j000626p26089
$$ plain form
38759 -611783 -561984 -156212 434867 987759 1099127 788969 848419 1844342 3058160 3246971
38749 3246971 2310968 1325201 946483 751114 331262 60419 290514 601294 510887 361846
38739 361846 786893 1650503 2206306 2114134 1701473 1337585 1106790 1042692 1151695 1180326
38729 1180326 827818 255058 -16310 235542 746702 1256912 1731338 1997505 1667757
38720 1667757 724803 -162307 -261599 443512 1335967 1865179 1939286 1750676 1465123 1102750
38710 1102750 637973 198964 66671 303010 488076 165610 -462039 -702244 -323457
38701 -323457 125593 145278 -47067 8867 334732 713236 1132359 1519234 1424384 599949
38691 599949 -391390 -805949 -720055 -693693 -687888 -238848 373720 221004 -779622 -1505711
38681a505711K81715O43295K15436J47935P05395O86896m76796j512375j083886
38672a898096K87796J090939Q47212K50116j74048m67930n60751k07309L49861
38663d82210M65803J0424m08489l37808r5974k20671o33934o92036P59J028231
38653a365905J499600R69184m7230o02463l25172K90354N45695J97335n05556
38644F55842j031065q00580K41442J173390Q82372l92560j053957k28987R15830
38635C61727Q15352k02793n13870K33235O35634j48470j052360q11814J13105
38626e70254L94263j16090l96977l421L87671K39719n8839J20K44148K80754J78872
38615E79966J85715J74360j02935m71317n42702l16927j24891q0302k7472M4750
$$ plain form
38681 -1505711 -1223996 -580701 -365265 -217330 488065 1174961 698165 -814210 -1898096
38672 -1898096 -1610300 -519361 327851 577967 403919 -64011 -624762 -832071 -482210
38663 -482210 -16407 -5983 -414472 -752280 -848254 -1068925 -1702859 -2394895 -2394136 -1365905
38653 -1365905 133695 1102879 1055649 453186 128014 418368 964063 1161398 655842
38644 655842 -375223 -1175803 -934361 239029 1121401 728841 -325116 -554103 361727
38635 361727 1177079 974286 460416 693651 1329285 1180815 128455 -683359 -570254
38626 -570254 -175991 -292081 -689058 -692479 -304808 -65089 -123928 -123808 120340 401094 579966
38615 579966 765681 940041 837106 365789 -176913 -493840 -618731 -699033 -726505 -681755
38605f81755J1593J4200L38335Q13893Q59572L17651k37478k84705j2643R8982
38595A237645p8400m25016q56261j101435o96256K66539Q59273M68109k07478
38586e33280j07600O12490R36317O47173M51250M73407l4137j139223j668381
38577c61984q81883L19243O68323J94071k24041k56179j85230j01558R9205K79215
38567d50818L08367L56860L98827M0212n53636m01047P47305J504196O94127o96049
38557A948344q94046l5508K60515l61932o37848r1362K29811j36388j81951N59253
38547F58888R25073J40269o85003m01906K11947j08840q19179m86383O70108J010635
38537A115609M2319r40153r30562m65497l83155n01624j75964N64104J062718
$$ plain form
38605 -681755 -670162 -655962 -317627 496266 1355838 1673489 1436011 1151306 1138663 1237645
38595 1237645 1159245 734229 -122032 -1223467 -1919723 -1653184 -793911 -325802 -533280
38586 -533280 -640880 -28390 907927 1555100 2006350 2479757 2445620 1306397 -361984
38577 -361984 -1243867 -924624 -256301 -62230 -286271 -542450 -727680 -829238 -730033 -450818
38567 -450818 -142451 214409 613236 653448 99812 -301235 446070 1950266 2644393 1948344
38557 1948344 1054298 1018790 1279305 917373 279525 188163 417974 281586 99635 658888
38547 658888 1583961 1724230 1039227 637321 849268 740428 -78751 -565134 104974 1115609
38537 1115609 1157928 217775 -712787 -1178284 -1561439 -2063063 -2239027 -1674923 -612205
38528f12205Q98462L12016j04044k6032K28383O6800n46814r33768n71944K51985
38518a037161Q96124J000007M35115o89454j568610j100888N62783J706102J173270
38509A377288k3790l20771M8446j84671q83016p14937L81500R11150K70678l42491
38499E19386k8136M83929L60859k262r8593l56561j007774j188550l83754L79854
38489a321602J33863k75300M06030J510899J346947j7955p62746j18602O28900
38480A530434L40126l73477m77287j60016j79596m39617k65467L47487O91374
38471A013961M21977k8760j58502j5057L5098j35269k95034k29971n9829l9251
38461E09363j16078J4214L27492L32673j93801p00893n55185K6070L01632J13723
$$ plain form
38528 -612205 286257 598273 494229 468197 696580 763380 216566 -717202 -1289146 -1037161
38518 -1037161 -141037 858970 1294085 604631 -963979 -2064867 -1502084 204018 1377288
38509 1377288 1353498 1032727 1081173 896502 13486 -701451 -319951 591199 861877 519386
38499 519386 491250 975179 1336038 1333776 1235183 878622 -129152 -1317702 -1701456 -1321602
38489 -1321602 -1187739 -1463039 -1057009 453890 1800837 1782882 1020136 901534 1530434
38480 1530434 1870560 1497083 1019796 859780 680184 240567 -24900 322587 1013961
38471 1013961 1435938 1407178 1248676 1233619 1268717 1133448 838414 608443 548614 509363
38461 509363 393285 407499 734991 1067664 873863 172970 -382215 -356145 -54513 59210
38451E9210K7609L54007O67895M95840p533l22614j82607K53029O04104N60562
38441B509502J71985j74589k69752l86791p29172q63459l02538N39331P39583
38432A234100J88852k95953k67397j69832l23686l20087J10172M82973M14084
38423A053226L01342M60948L57102m16171j061042n97056M75860P50953j5673
38414A309489o37112l71901J39330J52995o5834l312J32672k7938j30058L68329
38404H66660J111526J140442K25633p57215q95196k16533N50354Q56098P49227
38395C630996N70765M56523K43305j47071m05583j42404N45656J094921J115049
38386F962157P41257K92738p2022k14942O6447O65048R97418N95650k93946j032092
$$ plain form
38451 59210 86819 440826 1108721 1604561 1597028 1274414 1091807 1344836 1948940 2509502
38441 2509502 2681487 2506898 2237146 1850355 1121183 257724 -44814 494517 1234100
38432 1234100 1422952 1126999 859602 689770 366084 45997 156169 639142 1053226
38423 1053226 1354568 1815516 2172618 1756447 695405 98349 574209 1325162 1309489
38414 1309489 672377 300476 439806 592801 526967 523655 656327 628389 498331 866660
38404 866660 1978186 3118628 3344261 2587046 1691850 1475317 2025671 2881769 3630996
38395 3630996 4201761 4658284 4901589 4754518 4348935 4206531 4752187 5847108 6962157
38386 6962157 7703414 7996152 7924130 7709188 7775635 8440683 9438101 10033751 9739805 8707713
38376H707713j345849j412287j331813r73577l65674J56200L19470J89921j691
38367C942413j07591j06954j05421k93990o86298r26304o60844j13036R9221j66362
38357H74834l12264J09529O33619N01376j59086m11044J27298O15516J34310q95063
38347A219025j119344p7120J071226R93147j39495j003993q85361l57221j84336
38338d83472k94329j90794J87029N44221Q12007J087365J177653P49097j05165
38329C483612q70881j171505r94509m80335J10405L43339J8495m13476l36962
38320c11817J70145N11944N59913P50004J091584R05207n4570r32697q26380j5156
38310A848177M65261J36400n80309j035886q54319o0453P62077P47532k32739
$$ plain form
38376 8707713 7361864 5949577 4617764 3644187 3278513 3434713 3754183 3944104 3942413
38367 3942413 3834822 3727868 3622447 3328457 2642159 1715855 1055011 941975 1041196 874834
38357 874834 562570 672099 1305718 1807094 1648008 1236964 1364262 1979778 2114088 1219025
38347 1219025 99681 22561 1093787 2086934 1947439 943446 58085 -299136 -483472
38338 -483472 -777801 -968595 -781566 -237345 574662 1662027 2839680 3588777 3483612
38329 3483612 2612731 1441226 446717 -33618 76787 420126 438621 25145 -311817
38320 -311817 -141672 370272 930185 1680189 2771773 3676980 3622410 2689713 1863333 1848177
38310 1848177 2313438 2449838 1869529 833643 -20676 -81129 680948 1428480 1195741
38301A195741j129384r53971j49093J09956k56870j98195O01721J033852K88484
38292E42241p59909p83657P9422O03363M01430K87004O63063P45249o0242r41445
38282G76519p71994J03589K97307m80279q92467k7506J075256Q65600m33101j159893
38272f46969n84531L07955N20225L03155K37941J47460k93825o61517l78451K98743
38262g49814O59412M81684l4135p22131j170398o92172N39328J075966N2330j244176
38252a804106j052427K38863Q56248N70289P36271J440733J055843o77061j523977
38243a59324r9107J684475J336293n55783j450787o06094M43437N97829K77310
38234A468249p9506o69972j247898j011481K1553P97018P21294K80159l7072k92354
$$ plain form
38301 1195741 66357 -887614 -1036707 -926751 -1183621 -1381816 -780095 253757 542241
38292 542241 -217668 -1001325 -921903 -318540 82890 369894 1032957 1778206 1717964 776519
38282 776519 4525 108114 405421 -74858 -967325 -994831 80425 946025 512924 -646969
38272 -646969 -1231500 -923545 -403320 -100165 137776 285236 -8589 -670106 -1048557 -749814
38262 -749814 -90402 391282 357147 -364984 -1535382 -2227554 -1688226 -612260 -559930 -1804106
38252 -1804106 -2856533 -2617670 -1761422 -1191133 -454862 985871 2041714 1364653 -159324
38243 -159324 -258431 1426044 2762337 2206554 755767 149673 593110 1190939 1468249
38234 1468249 1388743 718771 -529127 -1540608 -1519055 -722037 -743 279416 242344 -50010
38224e0010l71564R5963P63725O88137j49762n71140L6140P72965O77870Q0608
38214A972932k62293m38500q39088j081192n38335M48573Q60414L60363l71289
38205A11585n86251j86051M34031Q01434O81534K81486K6234l1457k74542p98013
38195D59990j060448o17347J83895O57593O11176L21632q671l24799m72695l11758
38185e61432K9391K79362K76641j8498m67050o05802k6490Q89871J153991M08596
38175A358580n46574q46997n98921l44629j18209K88590O31167N61365L02510
38166F86882K11367J7775o41885j211642p46891N60903J363519Q70954k12260
38157H98722p53633n16663n6462J64015J09782p5383k81001m61672n84288n17641
$$ plain form
38224 -50010 -421574 -325611 438114 1126251 976489 405349 441489 1214454 1892324 1972932
38214 1972932 1710639 1272139 433051 -648141 -1186476 -737903 122511 482874 111585
38205 111585 -474666 -660717 -226686 574748 1256282 1537768 1564002 1532545 1258003 459990
38195 459990 -600458 -1217805 -1033910 -376317 234859 556491 547820 223021 -249674 -561432
38185 -561432 -532041 -252679 23962 5464 -461586 -1067388 -1093878 -204007 949984 1358580
38175 1358580 812006 -34991 -633912 -978541 -1096750 -808160 -176993 384372 686882
38166 686882 898249 916024 274139 -937503 -1684394 -1123491 240028 1110982 898722
38157 898722 145089 -371574 -428036 -264021 -154239 -229622 -510623 -972295 -1556583 -2074224
38147b074224r9501N20605Q32210N75946J86105K19151N55880O65036M74190L85592
38137B240990N08260M90210J46406k86136n69889o75906n77235k91490p0270q5155
38127H29785q2826J20037R7226m73813q82204k48160Q16821P47887n70770j376881
38117a022898o00237N25946M17516m80036o07461K17581P56465M52358P9249K28531
38107c2986M59518L07873Q7355J76524K87917J3144m35373n62260l34638j32213
38097a65139j40954j63945K6665L83588O36153N72932K79131M2432k7692j19560
38087A323611l11985l07569R7720N09317L91023q0672k01009J82103L93774l3757
38077A962556o33469p14989l46549j02048j33138j01448Q1052Q5352j53142j63979
$$ plain form
38147 -2074224 -2173725 -1653120 -820910 -244964 -58859 160292 716172 1381208 1855398 2240990
38137 2240990 2749250 3239460 3385866 3099730 2529841 1853935 1276700 985210 914940 829785
38127 829785 746959 866996 964222 490409 -391795 -639955 176866 924753 353983 -1022898
38117 -1022898 -1623135 -1097189 -679673 -1159709 -1767170 -1549589 -793124 -340766 -261517 -32986
38107 -32986 426532 734405 821760 998284 1286201 1299345 863972 301712 -32926 -165139
38097 -165139 -306093 -470038 -443373 -59785 576368 1149300 1428431 1470863 1443171 1323611
38087 1323611 1011626 704057 801777 1311094 1702117 1621445 1420436 1602539 1996313 1962556
38077 1962556 1329087 614098 267549 165501 32363 -69085 11967 97319 -55823 -219802
38067b19802L31269Q41329O94623k9391o36139p83664p83528q58562o61653J14971
38057a990547J037460J318559P64806m4855m19920p8036P94448J554221J358882
38048D295018K6395j394347j574519n25401M04402L23755j75053j51358L09084
38039A537976M91908K22428j10884k84483k73641P3598O59755P95459N8351q24389
38029B346078q76321l68196l14215o66468l88055N48797P91098j58320q16571
38020I7827O9209J377237J144068m93158j527210j011924j24830o0920l55090
38011h84791j9220P52524J005946N53848J04245O8092P5864k37434o07283n88430
38001B23361k51349m8870r2533M7222O28490J097501O29354o46589j497429j026130
$$ plain form
38067 -219802 111467 952796 1647419 1618028 981889 198225 -585303 -1443865 -2105518 -1990547
38057 -1990547 -953087 365472 1130278 1085423 665503 587467 1381915 2936136 4295018
38048 4295018 4321413 2927066 1352547 827146 1231548 1555303 1380250 1228892 1537976
38039 1537976 2029884 2252312 2141428 1856945 1583304 1656902 2316657 3112116 3170467 2346078
38029 2346078 1469757 1101561 787346 120878 -267177 281620 1072718 914398 97827
38020 97827 167036 1544273 2688341 2195183 667973 -343951 -468781 -529701 -884791
38011 -884791 -904011 -151487 854459 1408307 1512552 1580644 1656508 1419074 811791 223361
38001 223361 -27988 -76858 -169391 -122169 506321 1603822 2233176 1586587 89158 -936972
37991i36972J66846Q15291O46358M28879N05522K83266n35439j168351q42177
37982f36777J6292M37040K77538J30974K00567J41220j18453k48995k01237k15203
37972b17034j37622L97735J000121P17234m53430j217368p23160K19025M03370
37963a1129o1733k45613J7932J48985P3158K87176P64279Q88597N35300J92520
37953B589472q4451p46749j559765j516429m22259N44693N19759J46814K57482
37944b71433L96755j76845q59205n13649N41093Q83567K34590j54992M01881R56323
37934A438085N22034m06198p15276k37770L31706N09223L12359q1453l74598k40869
37924A057243J37635J00549m35184n69568K25322R58564L42804j184808j832475
$$ plain form
37991 -936972 -770126 45165 691523 1120402 1625924 1909190 1373751 205400 -636777
37982 -636777 -620485 -183445 94093 225067 425634 566854 448401 199406 -1831 -217034
37972 -217034 -354656 43079 1043200 1760434 1307004 89636 -633524 -414499 -11129
37963 -11129 -72862 -318475 -300543 -151558 -78400 208776 973055 1861652 2396952 2589472
37953 2589472 2505021 1758272 198507 -1317922 -1740181 -1195488 -675729 -528915 -271433
37944 -271433 125322 -51523 -910728 -1424377 -883284 283 234873 79881 481762 1438085
37934 1438085 1960119 1553921 838645 600875 932581 1441804 1754163 1672710 1298112 1057243
37924 1057243 1194878 1295427 860243 290675 515997 1474561 1817365 632557 -1199918
37915a199918q68025M48435O83890M1274k53019K69618Q83500P79562K5249o17223
37905A93343n28213J77462Q04206Q13130L37303j53323n12522q83180j109694
37896h61488p38784K33218J094597J198276O77435J16229j75427k55659k04264
37887A084133m6296J30827K54827L22878K14515k64806r07564j026945k74075
37878e12506P22234J006470M30052l20280o72534o25199l49659N3497L33175J93867
37868B59117j93491k65290J39695M98099L58229l7811j94258o5562L6746k8329
37858E07145j62266l07256m63229n30854l97135j05072K14848M54344M85267K57824
37848d6384N2703K85953Q59025J089457N77406k54208q18852j091594j207762
$$ plain form
37915 -1199918 -2067943 -1619508 -935618 -894344 -1147363 -877745 5755 785317 810566 193343
37905 193343 -334870 -157408 646798 1459928 1797231 1643908 1131386 248206 -861488
37896 -861488 -1600272 -1367054 -272457 925819 1603254 1719483 1544056 1288397 1084133
37887 1084133 1037837 1168664 1423491 1746369 1960884 1696078 788514 -238431 -512506
37878 -512506 209728 1216198 1646250 1325970 653436 28237 -321422 -267925 65250 259117
37868 259117 65626 -199664 -59969 438130 796359 758548 564290 498728 535474 507145
37858 507145 344879 37623 -425606 -956460 -1353595 -1458667 -1243819 -789475 -304208 -46384
37848 -46384 6319 292272 1151297 2240754 2818160 2563952 1745100 653506 -554256
37839e54256q80531L4699Q06987O10553j44274k76399L79383P49038K90855j75199
37829H40856O2846M00802J6149p01551q45490m81693l16773l16258R6178O55515
37819e89419M32864m54925o70101K86842J066214L95188r49474j256296l63696
37810b102803L13896P9703j39056M43772J040160N13397p24660j162546l09985
37801b048122O92524P52606J97565j5453K38392L21049M361k52730j84944j34339
37791d29091l59398n33996l10567O3582J42385j6727l2853J15577J20552L904
37781a236632K00006Q30017J321241J032463M2251r21537j229319q69150l13818
37772a144478k7341q9838k19343j20871K23086O12380Q54497Q22818M33111k06336
$$ plain form
37839 -554256 -1434787 -1400088 -593101 17452 -126822 -403221 -23838 725200 1016055 840856
37829 840856 903702 1304504 1320653 619102 -226388 -708081 -1024854 -1341112 -1244934 -589419
37819 -589419 -156555 -611480 -1281581 -994739 71475 466663 -482811 -1739107 -2102803
37810 -2102803 -1788907 -1709204 -1848260 -1404488 -364328 149069 -575591 -1738137 -2048122
37801 -2048122 -1355598 -602992 -405427 -420880 -182488 138561 142922 -109808 -294752 -429091
37791 -429091 -788489 -1322485 -1633052 -1569470 -1427085 -1443812 -1476665 -1361088 -1240536 -1236632
37781 -1236632 -1036626 -206609 1114632 2147095 2189346 1267809 38490 -830660 -1144478
37772 -1144478 -1171819 -1261657 -1481000 -1601871 -1378785 -766405 88092 910910 1344021 1137685
37762A137685o89961o58258k86680j38736m05585n72235q6699Q19839J304011
37753D23381Q92503K3009m98520l88892m9158P3875J1835L8847J31298j7575m55651
37742A84952p96499p55495n57844n09064m04592J55904R25346J051633K03123
37733e02536p87535q34845N4648Q16398O89045Q2416j10562K86878O16944L53664
37723F64515k45470n76921m31378l2104M00333P23939O64210N0484o78062p37736
37713a98190j5511O53975N82829J53016J31842M43566L43088l33221q76389p66065
37703A18940l10185K7225K87008O01328O68454K00673m30151n60578j14831L37135
37693H25018L22290j07917o03484p99983m54875L01935Q65990O90807l3263n71268
$$ plain form
37762 1137685 447724 -210534 -497214 -635950 -1041535 -1613770 -1700469 -880630 423381
37753 423381 1315884 1338893 840373 451481 402323 476198 488033 526880 658178 640603 184952
37742 184952 -611547 -1367042 -1924886 -2433950 -2838542 -2682638 -1757292 -705659 -502536
37733 -502536 -1290071 -2124916 -2070268 -1253870 -564825 -482409 -592971 -306093 310851 664515
37723 664515 419045 -157876 -589254 -621358 -221025 502914 1167124 1217608 539546 -198190
37713 -198190 -213701 440274 1023103 1176119 1307961 1751527 2094615 1761394 885005 118940
37703 118940 -191245 -164020 122988 724316 1392770 1593443 1163292 602714 487883 825018
37693 825018 1147308 1039391 435907 -364076 -818951 -517016 348974 1039781 1006518 435250
37683D35250n48414k83310j33126M1987M78227R23259Q82612L30609k13421l39625
37673A574048j73495o2433r4437j10672n2592o8876k64177m95451n09161k34057
37663d91303J35003L35241K50348q0053n48957r56582r65026l27665P06555J406911
37653e35528J232910M42129k05634l11547j13555Q5575L20490O01183O05889J56811
37643B278723l18689l28738j11064k73442p31738p31392n5219N24006L61696j06829
37633E07314p0173M31397O03016L8383p78254j109754p48807j38325J03909j84182
37623a345476n06859l10771K55311N67892M88376M63776N51453J91150o42789
37614b87937r82814k92801M89870L15504l01051j74320N40869O67773N6025k38878
$$ plain form
37683 435250 -113164 -396474 -529600 -487613 -9386 913873 1796485 2127094 1913673 1574048
37673 1574048 1400553 1338120 1243683 1133011 1080419 1011543 747366 251915 -257246 -491303
37663 -491303 -356300 -21059 229289 149236 -399721 -1356303 -2321329 -2648994 -1942439 -535528
37653 -535528 697382 1139511 933877 622330 508775 594350 914840 1516023 2121912 2278723
37643 2278723 1960034 1631296 1520232 1246790 515052 -216340 -271559 252447 614143 507314
37633 507314 437141 868538 1471554 1509937 731683 -378071 -1126878 -1265203 -1161294 -1345476
37623 -1345476 -1852335 -2163106 -1907795 -1339903 -851527 -387751 163702 354852 -287937
37614 -287937 -1270751 -1563552 -1073682 -758178 -1059229 -1233549 -692680 -24907 31118 -207760
37604b07760J51172L88799R0137j9974L59773L79505l66431q35643j67567P47923
37594E19934N11969p24119j594450j400067o18098P2429L32332N7932m17848l36269
37584c596255N02753J150638P18953k37040m83464Q0871M38018J28913j74276
37575a470889J06536N96514O38808J72976l39400m53585q1406M04101M61087O0273
37565I5015j73057J34124M56836J95778k82360j98726L63735O21391L42337K5109
37555A580182r8730l07543n92299n30808j18357J13631J0106K1963K84495K78294
37545F40934k21921n97065k81586L42739M84034K3146m09848k70688L18742P79325
37535H07812P23174L76637K53880L79272J90878n39956j158001r78857k82187
$$ plain form
37604 -207760 -56588 332211 422348 402374 762147 1141652 775221 -60422 -227989 519934
37594 519934 1031903 307784 -1286666 -2686733 -3304831 -3232402 -2900070 -2842138 -3259986 -3596255
37584 -3596255 -3093502 -1942864 -1223911 -1460951 -1944415 -1863544 -1425526 -1296613 -1470889
37575 -1470889 -1364353 -767839 -129031 43945 -295455 -749040 -830446 -426345 34742 95015
37565 95015 -78042 56082 512918 708696 426336 227610 591345 1212736 1555073 1580182
37555 1580182 1481452 1173909 581610 50802 -67555 46076 56182 78145 362640 640934
37545 640934 419013 -178052 -459638 -116899 367135 390281 -19567 -290255 28487 807812
37535 807812 1530986 1907623 2161503 2540775 2731653 2191697 1033696 54839 -227348
37526b27348J57635J58597N4802q7664l46133l58177J80629O66619K76725o20917
37516a45232q42108j47417M98955M88664K19965L5790k77049o28929m54949J78154
37506a074156M03725m1008l22331P0363M88433L00222j25901k70201l24083n10702
37496a405639m52784O4749N32663N83620N93847Q09878P84248L24884K7811J49625
37486B012902j2119p90109j270825p13881J80960M79714M63052P00208P12517
37477A762419m3263p65286m50291K54740k453r77496j171350k27076O55019O66543
37467b98494K66850L1136m2073N4791M32120P01929L32591l85091p09636o32327
37457b48204o31753n30628J26081P87537M56338n28619p85373m7257N10316L03759
$$ plain form
37526 -227348 -69713 88884 143686 56022 -290111 -648288 -467659 198960 475685 -145232
37516 -145232 -987340 -1134757 -635802 -147138 72827 108617 -168432 -797361 -1252310 -1074156
37506 -1074156 -670431 -711439 -1033770 -963407 -474974 -174752 -300653 -570854 -894937 -1405639
37496 -1405639 -1858423 -1793674 -1261011 -677391 -83544 726334 1510582 1835466 1863277 2012902
37486 2012902 2000783 1210674 -60151 -774032 -593072 -113358 349694 1049902 1762419
37477 1762419 1719156 953870 503579 758319 755866 -221630 -1392980 -1620056 -965037 -298494
37467 -298494 -31644 -508 -42581 12210 444330 1146259 1478850 1093759 384123 -248204
37457 -248204 -879957 -1410585 -1284504 -496967 -40629 -569248 -1354621 -1401878 -891562 -587803
37447e87803J18636M60256O77266L27292Q587J24206P2585n75005j183996j065762
37437a623738m24785K70362Q77832J081864M45217n13154n36427M49298R59052
37428I85521K46860m64374p1683N57745K18978m39003q6439Q46549Q12994k40674
37418B366474p97297k39764L32885L4572n43767n33709j21307k0725l43572n83068
37408d49278l38198L05558Q86079R26552L84867k93138p25664r38566r27531l75019
37398a544338O75691J346807Q82951k17978q13421o25584l08116j87108Q0065
37389g11031N46133O64885K27574k20209k65330k08921l50346l82063n0330J69543
37379e80095k31052q01372o30705K73511Q92453O27273J16971K16165O92044N95509
$$ plain form
37447 -587803 -469167 -8911 668355 995647 1004234 1128440 1201025 626020 -557976 -1623738
37437 -1623738 -2048523 -1778161 -900329 181535 626752 113598 -422829 26469 985521
37428 985521 1232381 768007 696324 1254069 1473047 1034044 947605 1794154 2607148 2366474
37418 2366474 1569177 1329413 1662298 1696870 1153103 619394 498087 477362 133790 -449278
37408 -449278 -787476 -481918 404161 1330713 1715580 1422442 696778 -241788 -1169319 -1544338
37398 -1544338 -868647 478160 1361111 1143133 329712 -295872 -603988 -791096 -711031
37389 -711031 -164898 499987 727561 507352 242022 33101 -317245 -699308 -749638 -580095
37379 -580095 -811147 -1612519 -2243224 -1969713 -1077260 -449987 -333016 -116851 575193 1170702
37369A170702k84949j065322r63130k19200M58769Q04568Q86883N75806k19309
37360A144818j007823j083987m14875L37658O29559M30082l8415m39566l75789
37351h18338J29616M11333M7280l46650j6277N93449M94937j02624p8360N98892
37341I13258P18991l2897m44122J01898N26524K7745m34185R5790P26553K23777
37331B423332p78092q25905q0100J55242k09781p9529O49231Q15172L6387o47810
37321A458147n26233j66504j72294k32554O8802M84830O15156M16191n4005o55365
37311A236171q46135k01469O92608P94662J02906m08149l66968l53231n51664
37302I8731l82658J77639K56785l61181o24473Q3232Q11651N58163j26044j58337
$$ plain form
37369 1170702 885753 -179569 -1142699 -1361899 -903130 -98562 788321 1364127 1144818
37360 1144818 136995 -946992 -1361867 -1024209 -394650 35432 -2983 -442549 -818338
37351 -818338 -688722 -277389 -230109 -576759 -593036 413 495350 392726 314366 913258
37341 913258 1632249 1599352 1155230 1257128 1783652 1811397 1377212 1473002 2199555 2423332
37331 2423332 1645240 819335 739235 894477 684696 605167 1254398 2069570 2105957 1458147
37321 1458147 931914 765410 593116 360562 429364 914194 1529350 1945541 1891536 1236171
37311 1236171 390036 188567 881175 1675837 1778743 1370594 1003626 650395 98731
37302 98731 -283927 -106288 150497 -210684 -835157 -751925 59726 617889 491845 333508
37292C33508K74269J95879l90176n06662J61651P64827N63255j36199n74179m87686
37282A98487j84342j4103k0385r869J45221L12785K81508Q4764n2498p7196j75926
37271D88446m61837q12437r96488p74030m1119Q29560J056752L31867n99160p97145
37261a775591l38129R490O0694K77765O65073O27050Q6242k07009K10958Q71589
37251D88132J111591P61236m8901j001638j413142q09872J93920N22056K07599
37242A0981K31923P04976O05133k98716p84488j39462O51248N86555J62333J31548
37232A862031O6354n37654r02876k40218N72733K37899p38887p91164J76280P38156
37222D42654L05510j03788L71216J249049J588975J058322p1003j176550j510891
$$ plain form
37292 333508 607777 803656 413480 -93182 68469 833296 1396551 1260352 686173 198487
37282 198487 14145 42 -20343 -30212 115009 427794 709302 794066 741568 664372 488446
37271 488446 26609 -785828 -1782316 -2556346 -2597465 -1767905 -711153 -379286 -978446 -1775591
37261 -1775591 -2113720 -2104230 -2043536 -1765771 -1100698 -473648 -387406 -594415 -383457 488132
37251 488132 1599723 2360959 2312058 1310420 -102722 -912594 -718674 -196618 10981
37242 10981 242904 947880 1553013 1254297 469809 330347 981595 1568150 1730483 1862031
37232 1862031 1928385 1390731 487855 247637 820370 1058269 319382 -471782 -295502 442654
37222 442654 748164 644376 1015592 2264641 3853616 4911938 4840935 3664385 2153494
37213B153494r14323j76425k918j6694L67963O66841J21858p25404p07995J4778
37203G81175K44878j44342p6140O35987Q16027j5954p58849n80065j79117l78079
37193C45521p41328n32759K9302M01100O54538Q88234N87840m48845j295260j013455
37183a125112l1866N16047L60877J31908K09524L81723M01175K03644k05625n56265
37173B86030l34564M78474J070949P53296j15035o78607o66831l77975k9428K28212
37163F14521M4013o51654j164603p70612K05394P10116L08780l67435n22693o3029
37153a657202M86940N92038J85043k98606m18409k62619k04350j69012K75138
37144a471039R71088J076371L06184m70728m55169m2453m705j91697M5879O06310
$$ plain form
37213 2153494 1239171 1062746 1059828 1043134 1411097 2077938 2199796 1474392 766397 781175
37203 781175 1026053 881711 805571 1441558 2257585 2241631 1482782 902717 723600 345521
37193 345521 -395807 -928566 -899264 -498164 156374 1044608 1632448 1183603 -111657 -1125112
37183 -1125112 -1156978 -640931 -280054 -148146 61378 443101 844276 1047920 842295 286030
37173 286030 -48534 429940 1500889 2254185 2139150 1460543 793712 415737 386309 614521
37163 614521 658534 6880 -1157723 -1928335 -1722941 -1012825 -704045 -1071480 -1594173 -1657202
37153 -1657202 -1170262 -578224 -393181 -691787 -1110196 -1372815 -1577165 -1746177 -1471039
37144 -1471039 -499951 576420 882604 411876 -43293 -85746 -90451 -282148 -236269 370041
37134C70041Q06032N40786L27093L13009J31669l05574o66486q12293q30648n67318
37124f93689R1185N93490K80424m65227n75155J26613O79598N00670J32834J41539
37114H12282K48714Q8910n0859J01084J38434k80003o33545l03349L05744K73193
37104G00605m30385q74905m92726K43415N90615M22138J32852N8331K25160M34410
37094A009510L94047p2525p65492j139182p91003L4993N93265M52141N6429J57583
37084g0234O88049P32675q6838q00639l58077P12826R12631m5020p88124l20980
37074E76269O01652P85295L35960J47774L11957J48557m65251q63448o76793k75841
37064F26131o2097o4419k88500p13841q66802k08960Q56985J194433M78422k60236
$$ plain form
37134 370041 1176073 1716859 2043952 2356961 2488630 2183056 1516570 704277 -126371 -693689
37124 -693689 -602504 -9014 271410 -193817 -768972 -642359 37239 537909 670743 812282
37114 812282 1060996 1149906 1099047 1200131 1338565 1058562 425017 121668 427412 700605
37104 700605 270220 -604685 -1097411 -853996 -263381 158757 291609 349940 575100 1009510
37094 1009510 1403557 1331032 565540 -573642 -1364645 -1329652 -736387 -284246 -227817 -70234
37084 -70234 617815 1350490 1263652 463013 104936 817762 1730393 1685373 897249 576269
37074 576269 1177921 1963216 2299176 2446950 2758907 2907464 2442213 1578765 901972 626131
37064 626131 564034 499615 211115 -502726 -1369528 -1578488 -721503 472930 951352 691116
37054F91116j09136M54614M19030k53751p80356q16725o92521n51952j24201N60745
37044a203137R49429P11069K07532k8556Q4229K77976L40939K27532K3013m1248
37034A548778K19868N89902N36800j51060r94092j277501p85127K1658M54090
37025A63316J78477n04458r13083o58288p1620K13002O9012q296L76036R86866
37015a69036J250970Q31727j28884j048591j192538l65989O03838O15777k87183
37006A10091q63177l63058M37631M97340R1895J73944O19936L76451o61692j213643
36996g94282m87066N97931P76406J89531j34541L7465M8591k94086l66232J14598
36986c11685N06388K43321k72505l35589o884J28866j0946M9514M06432M99541
$$ plain form
37054 691116 581980 1036594 1455624 1201873 421517 -395208 -1087729 -1639681 -1763882 -1203137
37044 -1203137 -253708 457361 664893 636337 720566 998542 1339481 1567013 1590026 1548778
37034 1548778 1768646 2358548 2895348 2744288 1750196 472695 -312432 -290774 163316
37025 163316 341793 -162665 -1075748 -1734036 -1805656 -1592654 -1523642 -1531938 -1155902 -169036
37015 -169036 1081934 1913661 1784777 736186 -456352 -822341 -218503 397274 110091
37006 110091 -753086 -1116144 -678513 -181173 -89278 84666 704602 1081053 419361 -794282
36996 -794282 -1281348 -683417 92989 282520 147979 185444 234035 -60051 -426283 -311685
36986 -311685 194703 438024 165519 -170070 -176954 -48088 -59034 -9520 396912 896453
36976H96453L139n90043o59013k92897J679P0100P0145l3418l09715m08664J5225
36965a237009N45885M90421Q1058J95320P38911N23774p21746j493655o46896
36956a523937O99215P39401l19618p40064r282O34039M29001J04964K67027L67459
36946F48205m735j92302K58750N51594q2258r60490r22423o6476N69321N84331
36936C83517M35242M07167L33776J66716J7449k11457n65068o54354k05247L04787
36926D12528K65566j11871k01380r491M14j43670m6936J56844m5736n73470p96312
36915a093514n27474j56753J32644M25463M58592p1393o10955k48219P73402J170668
36905B52461N10244j80549j26285O4025l11547p01930k52047O56617R12796L19842
$$ plain form
36976 896453 899592 309549 -349464 -642361 -640682 -570582 -500437 -533855 -843570 -1252234 -1237009
36965 -1237009 -691124 -200703 -119645 75675 814586 1338360 616614 -877041 -1523937
36956 -1523937 -824722 -85321 -404939 -1145003 -1154285 -520246 -91245 13719 280746 648205
36946 648205 643470 451168 709918 1261512 1179254 218764 -703659 -770135 -200814 383517
36936 383517 818759 1225926 1559702 1726418 1743867 1532410 967342 312988 107741 412528
36926 412528 678094 566223 364843 355352 355766 212096 165160 322004 276268 -297202 -1093514
36915 -1093514 -1620988 -1777741 -1645097 -1219634 -761042 -832435 -1443390 -1691609 -918207 252461
36905 252461 762705 582156 455871 519896 208349 -493581 -745628 -89011 823785 1143627
36895A143627k66674k71338n956M4711j55207l88392n06496m24393r1071M32356
36885d88833R59942J209254Q94493P7832n86260m26965L09649O44452J86312l54951
36875B424925l18157o8722k61601p29771q53390o13947m71249m49737j69101L19541
36865a191209N16407L25198K20427M42172O34759M72000J34948m6319l4630J4341
36855A488094j1207j55699l38208k91332J21227N23176L60443l08987p63296n03328
36845A20883J60183N81443N26026K24018p2731l18107n43205o74056n09953N3462
36835d52037P04439Q17574J73090n68544n50874J47121N87661K88575j40893j5735
36825I90377L45155J72390m72157p53541l66801K2674q6873j90683L30170R78628
$$ plain form
36895 1143627 876953 605615 599659 644370 489163 100771 -405725 -830118 -921189 -488833
36885 -488833 471109 1680363 2574856 2652688 2066428 1639463 1949112 2593564 2779876 2424925
36875 2424925 2106768 2038046 1776445 1046674 193284 -420663 -891912 -1341649 -1510750 -1191209
36865 -1191209 -674802 -349604 -129177 312995 947754 1419754 1554702 1508383 1473753 1488094
36855 1488094 1476887 1321188 982980 691648 812875 1336051 1696494 1387507 624211 120883
36845 120883 281066 862509 1388535 1612553 1539822 1221715 678510 4454 -505499 -452037
36835 -452037 252402 1069976 1243066 674522 123648 270769 858430 1147005 1006112 990377
36825 990377 1335532 1507922 1035765 282224 -84577 -61903 -148776 -339459 -9289 969339
36815I69339O89882m73184j118539l86868P62347Q27798j68266q08418l25664
36806c1573M85721O51242L71205L61032N10054J05036q43217j387856q98482J22372
36796e54466P31966N93348N4608m33807o25429m40026q135K94324J45580l43202
36786e85239p11121o34810k15567K17745M48498M66947L54661J89402K2271j38871
36776e86084l02671l93842k51821J43236N03445M99401K04958L6170J71177L04962
36766C28931J46956j16348j23058J29332L68633M73295M57833K19952k63815o23243
36756I98468m61590L3042L39845L86307M74271M66166j61574j237889j677004
36747h39958q43969M56395R49560M34882k35131m09500k24773l9438J24618M27309
$$ plain form
36815 969339 1659221 1186037 67498 -319370 442977 1270775 1102509 294091 -31573
36806 -31573 454148 1105390 1476595 1837627 2347681 2452717 1609500 221644 -676838 -554466
36796 -554466 177500 770848 825456 391649 -233780 -673806 -681941 -387617 -242037 -585239
36786 -585239 -1296360 -1931170 -2146737 -1928992 -1480494 -1013547 -658886 -469484 -447213 -586084
36776 -586084 -888755 -1282597 -1534418 -1391182 -887737 -388336 -183378 -147208 23969 328931
36766 328931 475887 359539 236481 365813 734446 1207741 1665574 1885526 1621711 998468
36756 998468 536878 569920 909765 1296072 1770343 2236509 2074935 837046 -839958
36747 -839958 -1683927 -1227532 -277972 156910 -78221 -487721 -712494 -751932 -627314 -200005
36737b00005P98298Q57217K78085o96643j244470q07082J12169M84105J05059
36728c13267k19544J2872K70938l8564n89520p03079l22796J66904N75517P70867
36718c89672M61601k20895m84656J9337M27230q5292q07540m01266R86745J769319
36708A274911J095174j71000q54892q28879n92124l60333j01234O2429l9435l41212
36698h56595n65774m16071J48334O52974M81444j80659l25339M34844J096758
36689D69916P33763k1134p2610K73197M035n80457l16433N83564O73431k29783
36679A517489o74347r9594K74306k24886n11235J07142M81482k91524j038640
36670d59807m23793P03029O83145l02044q09747n42560l25407k74990J63531P07899
$$ plain form
36737 -200005 598293 1455510 1733595 1036952 -207518 -1014600 -902431 -418326 -313267
36728 -313267 -532811 -519939 -249001 -287565 -877085 -1580164 -1902960 -1736056 -1160539 -389672
36718 -389672 71929 -148966 -633622 -614285 -187055 -272347 -1079887 -1481153 -494408 1274911
36708 1274911 2370085 2199085 1344193 515314 -76810 -437143 -538377 -475948 -515383 -856595
36698 -856595 -1422369 -1838440 -1690106 -1037132 -555688 -736347 -1061686 -626842 469916
36689 469916 1203679 1182545 1109935 1383132 1387167 806710 490277 1073841 1747272 1517489
36679 1517489 843142 743548 1017854 792968 281733 388875 870357 578833 -459807
36670 -459807 -883600 -180571 502574 200530 -609217 -1151777 -1477184 -1752174 -1588643 -880744
36660h80744N23685j54335l03050Q3975K3749o33263r08301l50268L59123O16876
36650a622553N24683K25113k44611m40658n678M32899R5579m37750l7406Q45850
36640f64532O84113m17046n77842P56534J659341O74434r40302j271407m91053
36631e87760J9498K6332J88266L34037j97282r47237p46956L96375J254584J203616
36621I43473Q02736M94826Q45p15891j019950o22061j53824j94493m09890k28914
36611a103143J59727J50845k29176l10781J68313N95393L49100k65946m20122
36602i05790P3083N61246N70000L58611J84346k43909r65790j124951r9040J188532
36592d03662J264881K09826n05552k58106N4822j80178l13627J36814M73975J24190
$$ plain form
36660 -880744 -357059 -511394 -814444 -730469 -706720 -1339983 -2248284 -2598552 -2239429 -1622553
36650 -1622553 -1097870 -872757 -1117368 -1558026 -1563704 -1130805 -1035226 -1472976 -1510382 -664532
36640 -664532 19581 -397465 -975307 -218773 1440568 2115002 1174700 -96707 -587760
36631 -587760 -568262 -541930 -353664 -19627 -216909 -1164146 -1911102 -1514727 -260143 943473
36621 943473 1746209 2241035 2241880 1525989 506039 -116022 -269846 -464339 -874229 -1103143
36611 -1103143 -943416 -792571 -1021747 -1332528 -1164215 -568822 -219722 -485668 -905790
36602 -905790 -832707 -271461 298539 657150 841496 597587 -368203 -1493154 -1592194 -403662
36592 -403662 861219 1071045 565493 307387 362209 182031 -131596 5218 479193 603383
36582F03383k42388Q1096N33838K90039l18637n22114m59063o20169o75827j31132
36572a460974M74509L46067j20940k3094M16676L38738o4959O4720M86314J94853
36562F51910n80587n38427L92768P76983J15946k80366L97291J022201M61603
36553B419322n52742p57796l76072m09724p76353n71910K75185Q58103N99837
36544G07850k07642r71198j204240o74836K22673O15377K34014j44866R6833M42114
36534h83921K14755j81860J3063N52768O73073M94946O78218R35001K71247j203704
36524A563586k009227j233706K65503J070789Q16558J27453l79776m93623k41607
36515e14050J85052N04514N58191L43558r0884n12457m66037J57468O94500M61266
$$ plain form
36582 603383 360995 442091 975929 1265968 947331 425217 -33846 -654015 -1329842 -1460974
36572 -1460974 -986465 -640398 -761338 -784432 -367756 -29018 -93977 -29257 457057 651910
36562 651910 71323 -467104 -74336 702647 818593 538227 935518 1957719 2419322
36553 2419322 1866580 1108784 732712 322988 -453365 -1025275 -750090 108013 707850
36544 707850 500208 -470990 -1675230 -2350066 -2127393 -1512016 -1278002 -1422868 -1326035 -883921
36534 -883921 -669166 -851026 -837963 -285195 387878 882824 1561042 2496043 2767290 1563586
36524 1563586 -445641 -1679347 -1413844 -343055 473503 600956 221180 -272443 -514050
36515 -514050 -328998 175516 733707 1077265 986381 473924 7887 165355 859855 1321121
$$ [...]
##END NTUPLES=NMR SPECTRUM
##END=
