##TITLE=31Pdec_IBTB 2705
 CDCl3, 24 sc
 28.5.2019
##JCAMPDX= 6.0         $$ Bruker NMR JCAMP-DX V2.0
##DATA TYPE= NMR SPECTRUM
##DATA CLASS= NTUPLES
##ORIGIN= UXNMR, Bruker Analytische Messtechnik GmbH
##OWNER= root
$$ XWIN-NMR		Version 3.5
$$ Tue May 28 14:35:28 2019 Russian Standard Time (UT+4h)  she@DPX200
##.OBSERVE FREQUENCY= 81.013821
##.OBSERVE NUCLEUS= ^31P
##.ACQUISITION MODE= SIMULTANEOUS
##.ACQUISITION SCHEME= undefined
##.AVERAGES= 24
##.DIGITISER RES= 17
##SPECTROMETER/DATA SYSTEM= spect
##.PULSE SEQUENCE= zgpg30
##.SOLVENT NAME= DMSO
##.SHIFT REFERENCE= (INTERNAL, DMSO, 0, 182.463)
##AUDIT TRAIL= $$ (NUMBER, WHEN, WHO, WHERE, WHAT)
$$ ##TITLE= Audit trail, XWIN-NMR		Version 3.5
$$ ##JCAMPDX= 5.01
$$ ##ORIGIN= Bruker BioSpin GmbH
$$ ##OWNER= she
$$ F:/spectra/data/she/nmr/P31/1/pdata/1/auditp.txt
$$ ##AUDIT TRAIL=  $$ (NUMBER, WHEN, WHO, WHERE, WHAT)
(   1,<2019-05-28 14:34:37.42 +0400>,<she>,<DPX200>,
      <created by zg, POWCHK disabled, PULCHK disabled
       configuration hash MD5:
       00 E9 B6 7A A2 85 ED C7 34 08 36 98 17 FE 4E 26
       data hash MD5: 32K
       A8 60 8C 7D 55 2C 87 73 76 B1 F7 34 6D 26 4A 84>)
(   2,<2019-05-28 14:34:39.65 +0400>,<she>,<DPX200>,
      <Start of raw data processing
       efp BC_mod = 2 LB = 1 FT_mod = 6 PKNL = 1 PHC0 = -1790.94 PHC1 = 19.39899 SI = 64K 
       data hash MD5: 64K
       94 71 B5 0A BA B4 D2 B3 E6 8E 3A AA A4 F3 10 1B>)
(   3,<2019-05-28 14:34:53.50 +0400>,<she>,<DPX200>,
      <pk PHC0 = 4.875005 PHC1 = 0 
       data hash MD5: 64K
       07 11 20 F8 91 EF 7C 87 C7 86 8A B3 80 7E F8 0B>)
$$ ##END=
$$ 
$$ hash MD5
$$ 1E 6C 04 2A B6 49 AB 6A B8 5C 2C 6D 63 3A 46 31
##$RELAX= 
##$RELAX= 
##$RELAX= 
##$RELAX= 
##$RELAX= 
##$RELAX= 
##$RELAX= 
##$RELAX= 
$$ Bruker specific parameters
$$ --------------------------
##$DU= <F:/spectra>
##$EXPNO= 1
##$NAME= <P31>
##$PROCNO= 1
##$TYPE= <nmr>
##$USER= <she>
##$AMP= (0..31)
100 100 100 100 100 100 100 100 100 100 100 100 100 100 100 100 100 100 
100 100 100 100 100 100 100 100 100 100 100 100 100 100 
##$AQSEQ= 0
##$AQ_mod= 1
##$AUNM= <au_zg>
##$AUTOPOS= <>
##$BF1= 81.014009
##$BF2= 200.13
##$BF3= 200.13
##$BF4= 200.13
##$BF5= 200.13
##$BF6= 200.13
##$BF7= 200.13
##$BF8= 200.13
##$BYTORDA= 1
##$CFDGTYP= 0
##$CFRGTYP= 5
##$CHEMSTR= <none>
##$CNST= (0..31)
1 1 145 1 1 1 1 1 1 1 1 1 1 1 1 1 1 1 1 1 1 1 1 1 1 1 1 1 1 1 1 1 
##$CPDPRG= <waltz16>
##$CPDPRG1= <>
##$CPDPRG2= <waltz16>
##$CPDPRG3= <>
##$CPDPRG4= <mlev>
##$CPDPRG5= <mlev>
##$CPDPRG6= <mlev>
##$CPDPRG7= <mlev>
##$CPDPRG8= <mlev>
##$CPDPRGB= <>
##$CPDPRGT= <>
##$D= (0..31)
0 1 0 0 0 0 0 0 0 0 0 0.03 2e-05 3e-06 0 0 0 0 0 0 0 0 0 0 0 0 0 0 0 0 
0 0 
##$DATE= 1559039676
##$DBL= (0..7)
120 120 120 11 120 120 24 19 
##$DBP= (0..7)
150 150 150 150 150 150 150 150 
##$DBP07= 0
##$DBPNAM0= <>
##$DBPNAM1= <>
##$DBPNAM2= <>
##$DBPNAM3= <>
##$DBPNAM4= <>
##$DBPNAM5= <>
##$DBPNAM6= <>
##$DBPNAM7= <>
##$DBPOAL= (0..7)
0.5 0.5 0.5 0.5 0.5 0.5 0.5 0.5 
##$DBPOFFS= (0..7)
0 0 0 0 0 0 0 0 
$$ [...]
##$SUBNAM2= <"">
##$SUBNAM3= <"">
##$SUBNAM4= <"">
##$SUBNAM5= <"">
##$SUBNAM6= <"">
##$SUBNAM7= <"">
##$SUBNAM8= <"">
##$SUBNAM9= <"">
##$SW= 369.568048894756
##$SWIBOX= (0..15)
0 1 3 0 0 0 0 0 0 0 0 0 0 0 0 0 
##$SW_h= 29940.119760479
##$TD= 32768
##$TD0= 1
##$TE= 0
##$TE2= 300
##$TE3= 300
##$TEG= 300
##$TL= (0..7)
0 120 53 12 22 120 120 120 
##$TP= (0..7)
150 150 150 150 150 150 150 150 
##$TP07= 0
##$TPNAME0= <>
##$TPNAME1= <>
##$TPNAME2= <>
##$TPNAME3= <>
##$TPNAME4= <>
##$TPNAME5= <>
##$TPNAME6= <>
##$TPNAME7= <>
##$TPOAL= (0..7)
0.5 0.5 0.5 0.5 0.5 0.5 0.5 0.5 
##$TPOFFS= (0..7)
0 0 0 0 0 0 0 0 
##$TUNHIN= 0
##$TUNHOUT= 0
##$TUNXOUT= 0
##$USERA1= <user>
##$USERA2= <user>
##$USERA3= <user>
##$USERA4= <user>
##$USERA5= <user>
##$V9= 5
##$VALIST= <valist>
##$VCLIST= <CCCCCCCCCCCCCCC>
##$VD= 0
##$VDLIST= <DDDDDDDDDDDDDDD>
##$VPLIST= <PPPPPPPPPPPPPPP>
##$VTLIST= <TTTTTTTTTTTTTTT>
##$WBST= 1024
##$WBSW= 4
##$XGAIN= (0..3)
0 0 0 0 
##$XL= 0
##$YL= 0
##$YMAX_a= 15782
##$YMIN_a= -17759
##$ZGOPTNS= <>
##$ZL1= 120
##$ZL2= 120
##$ZL3= 120
##$ZL4= 120
##$ABSF1= 0
##$ABSF2= 0
##$ABSG= 0
##$ABSL= 0
##$ALPHA= 0
##$AQORDER= 0
##$ASSFAC= 0
##$ASSFACI= 0
##$ASSFACX= 0
##$ASSWID= 0
##$AUNMP= <proc_1d>
##$AZFE= 0.1
##$AZFW= 0.5
##$BCFW= 0
##$BC_mod= 2
##$BYTORDP= 0
##$COROFFS= 0
##$CY= -3
##$DATMOD= 1
##$DC= 0
##$DFILT= <>
##$DTYPP= 0
##$F1P= 0
##$F2P= 0
##$FCOR= 1
##$FTSIZE= 65536
##$FT_mod= 6
##$GAMMA= 0
##$GB= 0
##$INTBC= 1
##$INTSCL= 5.30512e-09
##$ISEN= 30
##$LB= 1
##$LEV0= 0
##$LPBIN= 0
##$MAXI= 10000
##$MC2= 0
##$MEAN= 0
##$ME_mod= 0
##$MI= 50
##$NCOEF= 0
##$NC_proc= -5
##$NLEV= 6
##$NOISF1= 182.463
##$NOISF2= 159.3651
##$NSP= 0
##$NTH_PI= 0
##$NZP= 0
##$OFFSET= 182.463
##$PC= 4
##$PHC0= -1786.065
##$PHC1= 19.39899
##$PH_mod= 1
##$PKNL= yes
##$PPARMOD= 0
##$PSCAL= 0
##$PSIGN= 0
##$REVERSE= no
##$SF= 81.0140089999434
##$SI= 65536
##$SIGF1= 159.3651
##$SIGF2= -187.1042
##$SINO= 113.3802
##$SIOLD= 16384
##$SREGLST= <1H.CDCl3>
##$SSB= 0
##$STSI= 65536
##$STSR= 0
##$SW_p= 29940.119760479
##$SYMM= 0
##$S_DEV= 0
##$TDeff= 32768
##$TDoff= 0
##$TI= <>
##$TILT= no
##$TM1= 0
##$TM2= 0
##$TOPLEV= 0
##$USERP1= <user>
##$USERP2= <user>
##$USERP3= <user>
##$USERP4= <user>
##$USERP5= <user>
##$WDW= 1
##$XDIM= 65536
##$YMAX_p= 483686021
##$YMIN_p= -11393505
$$ End of Bruker specific parameters
$$ ---------------------------------
##NTUPLES= NMR SPECTRUM
##VAR_NAME=  FREQUENCY,     SPECTRUM/REAL,   SPECTRUM/IMAG
##SYMBOL=    X,             R,               I
##VAR_TYPE=  INDEPENDENT,   DEPENDENT,       DEPENDENT
##VAR_FORM=  AFFN,          ASDF,            ASDF
##VAR_DIM=   65536,         65536,           65536
##UNITS=     HZ,            ARBITRARY UNITS, ARBITRARY UNITS
##FACTOR=    0.456856943014862, 1,           1
##FIRST=     14782.0589164792, 0,            0
##LAST=      -15158.0608439998, 0,           0
##MIN=       -15158.0608439998, -11393505,   0
##MAX=       14782.0589164792, 483686021,    0
$$ Real data points
##PAGE= N=1
##DATA TABLE= (X++(R..R)), XYDATA
$$ [...]
42259h35461r40757p27996K62707J295673J489478O54858l98078o48904m0639
42250A10881N46271N44726K74451R2363j83424n79910n83211p8895J66944k58548
42240E1648n43946J9643O51766K45762p14871q24516J6784N32746J48861l17178
42230g33301k06350R2491J48349J83437L23007K04687j92880k81248J13905L61832
42220A3929J24046o3024J76069L42820K3787k80288m0041K98829L2576n99723
42210B8980p55081k05473M69218O90309L78453j30055l21580K5686M08149J46270
42200G34876m73759m12220M53083Q97285K15366n81618m11782P5930l10023j115645
42190i28507q85731L84377J144408O52972j34915l13571k15258l74978n62813
$$ y = [-835461, -1776218, -2504214, -2241507, -945834, 543644, 1198502, 800424, 151520, 110881, 657152, 1201878, 1476329, 1568692, 1385268, 805358, 222147, 143252, 310196, 51648, -492298, -472655, 179111, 424873, -289998, -1114514, -1097730, -564984, -416123, -733301, -939651, -847160, -698811, -515374, -192367, 12320, -180560, -461808, -347903, 13929, 137975, 74951, 251020, 593840, 617627, 337339, 297298, 596127, 628703, 28980, -726101, -931574, -462356, 227953, 606406, 476351, 154771, 180457, 588606, 734876, 261117, -151103, 301980, 1199265, 1414631, 833013, 421231, 497161, 187138, -928507, -1814238, -1429861, -285453, 367519, 232604, -80967, -296225, -671203, -1234016]
42181a234016m62064k97362k08779R8488N63783N41061r1799m90497j10228M55124
42171a236289N26416L33177K34312j23780r49147j431061q08640L03635P42921
42162b408456M44339J82419J45642m3973k39281M1287N04111M01841j03342j40427
42152a215840K91031K51209m44592p90772k52940L92592M48299L49195N92668
42143c79150O77680M0557p66321q07510j06866N97446R21160Q50655K48708p25067
42133E51292j157219l87009P85115R34433l4575p90438m98407J64287K28955k02219
42123d05785l74415r4317J28838l4687k56832p0907M12002N66220N3087o74766
42113g51562r01962n16848J8985M23075P46774Q32019L99395j67028m2329O42566
$$ y = [-1234016, -1696080, -1993442, -2202221, -2103733, -1539950, -998889, -1090688, -1581185, -1691413, -1236289, -709873, -376696, -142384, -266164, -1215311, -2646372, -3455012, -3151377, -2408456, -1964117, -1781698, -1636056, -1680029, -1919310, -1878023, -1373912, -972071, -1075413, -1215840, -924809, -673600, -1118192, -1908964, -2161904, -1769312, -1321013, -971818, -379150, 298530, 339087, -427234, -1234744, -1341610, -744164, 176996, 1027651, 1276359, 551292, -605927, -992936, -207821, 726612, 692037, -98401, -596808, -432521, -203566, -405785, -780200, -874517, -745679, -780366, -1037198, -1108105, -696103, -129883, -76796, -751562, -1653524, -2170372, -2151387, -1728312, -981538, -149519, 249876, 82848, 40519, 683085]
42103F83085O40235m96782j381634p21747O29134R17504J27559k38232L14681
42094D73803P12106L36415r9843r0711j63230n64470n85196K1702K93199l25926
42084G849q41649k98899N71841N73904N419m2742L13085M1346q15566j034612
42074a520024j80308P05147O89160P8588m28154p16153q85563p42622k48964J16523
42064c132370P631j91180R4437P74468J186877Q77066K5680p55591r13813m18428
42054b445223J91950M20034M19200O55060J023833Q56419m9009r37620r67941
42045h33297j89210O66124J030140Q22440K60599k65463l86544k00276k78740
42036F25773q30749j147611m61735Q09025J381426P39835k33126n06008j47823
$$ y = [683085, 1323320, 826538, -555096, -1276843, -647709, 269795, 397354, 159122, 473803, 1185909, 1522324, 1422481, 1331770, 1168540, 604070, 18874, 40576, 333775, 7849, -833800, -1132699, -560858, 13046, 18465, -24277, 288808, 330154, -485412, -1520024, -1700332, -995185, -306025, -227437, -655591, -1371744, -2257307, -2999929, -3248893, -3132370, -3124739, -3315919, -3221482, -2447014, -1260137, -383071, -357391, -1112982, -2026795, -2445223, -2253273, -1833239, -1414039, -758979, 264854, 1121273, 1072264, 134644, -833297, -1022507, -356383, 673757, 1496197, 1756796, 1491333, 1104789, 904513, 625773, -204976, -1352587, -1814322, -1005297, 376129, 1115964, 882838, 376830, 229007]
42027B29007R0442r0840m00674n88216n85749k57322L54144P10163M16304L9564
42017h3177M22235J194430J043292k43792j165020o15997M41476M52508m21255
42008A024700p68959k09468K44568J302l25561j70893J39990J85072R5353K7778
41998B43882j44205k96839q5034K25563o4180p60700p54723J81552P84263K38480
41988d31941m55156q6759Q25982R68294L00445j85443k37080m22748p12355m21089
41978h57850L89168P33911J89033m76191m64745N9589M47282L93009N3856j95914
41968B71148m1593L72869M62870K9757k84605M2137M68568K43611k56820j44193
41958A163749L63663K47721m94375p68002k77067k3494m70779o64686M1145O80114
$$ y = [229007, 319449, 228609, -172065, -760281, -1346030, -1603352, -1249208, -539045, -122741, -83177, 339058, 1533488, 2576780, 2332988, 1167968, 551971, 993447, 1445955, 1024700, 255741, 46273, 290841, 292143, -33418, -204311, -64321, 120751, 216104, 243882, 99677, -197162, -282196, -56633, -120813, -881513, -1636236, -1454684, -670421, -431941, -887097, -973856, -147874, 820420, 1120865, 935422, 698342, 275594, -436761, -857850, -468682, 265229, 454262, -21929, -486674, -427085, 20197, 413206, 467062, 271148, 229555, 602424, 1065294, 1095051, 810446, 852583, 1321151, 1564762, 1307942, 1163749, 1527412, 1775133, 1280758, 512756, 235689, 212195, -258584, -923270, -882125, -202011]
41948b02011J58300r45875j263723o31218K0954L17129O82476J070150P44778
41939d9040l44851j035165m43511O75865Q77185K9342n15072J07220R97838Q38512
41929A138323j08066m03857L08886P33759n876r53887q47057m4983K37490j10420
41919e5688k61369j02532k45320n68732k52736O43846J037870M99792j92210m35544
41909F7377m78156m22295J07211Q59973Q48091r1122q51747p50406m02289l17367
41899a430730k4809O19803P19168l7173m46534K49326Q38726R1962r86410o77871
41889a084542O11896J061973M15247J10654N79734N56727n32480j391105q66622
41880e38518K84359O14283P837m62409j64599M10031M44962j72629o79748l08512
$$ y = [-202011, -43711, -989586, -2253309, -2884527, -2863573, -2546444, -1863968, -793818, -49040, -393891, -1429056, -1872567, -1196702, -319517, -290175, -805247, -698027, 299811, 1138323, 1030257, 626400, 935286, 1669045, 1663169, 709282, -137775, -182758, 54732, -55688, -317057, -419589, -664909, -1233641, -1486377, -842531, 195339, 695131, 502921, 67377, -410779, -833074, -725863, 134110, 982201, 891079, 39332, -711074, -1113363, -1430730, -1455539, -835736, -116568, -153741, -600275, -350949, 487777, 579739, -406671, -1084542, -472646, 589327, 1004574, 1115228, 1694962, 2251689, 1719209, 328104, -538518, -254159, 360124, 367961, -94448, -259047, 150984, 595946, 423317, -256431, -564943]
41870e64943O45207R98375K27714o80413n28400M29101R39216N16069j68457m45607
41860A367862k71113J83342O40172N17442m33012j347733j101490M9963O89273
41851B94706J93705n62639o71994l34652j64667k35913k70862j20864K63579P63946
41841h45655Q74507K58041m26086j50512Q69993J221118K77714q90759j118119
41832G0242o43900l17359j92947J73945O48527O84170K64941q9989j03632L8709
41822E32707Q6513p7159m22549o38113l27354L38273N72341j4348p66582q38972
41812a555243l34875k5593j81090k90211R5872P31644R93860N91702j04014m06246
41802d84194p5158L27378J22968n16270p58022k93452K81757M59226N02795P28280
$$ y = [-564943, 80264, 1078639, 1306353, 625940, 97540, 526641, 1465857, 1981926, 1813469, 1367862, 1096749, 1280091, 1920263, 2437705, 2004693, 656960, -444530, -394567, 294706, 488411, -74228, -746222, -1080874, -1245541, -1481454, -1752316, -1873180, -1609601, -845655, 28852, 286893, -139193, -289705, 580288, 1801406, 2079120, 1188361, 70242, -573658, -891017, -1083964, -910019, -261492, 422678, 687619, 597630, 493998, 532707, 619220, 542061, 119512, -518601, -845955, -507682, 64659, 50311, -716271, -1555243, -1890118, -1915711, -2096801, -2387012, -2291140, -1559496, -565636, 26066, -77948, -484194, -559352, -231974, -109006, -625276, -1383298, -1676750, -1394993, -935767, -432972, 295308]
41792B95308P49478J03219p98286j077371n73631L4507K25352J52026J16889P2945
41782f99564j32474l70753l64968p6810K40767L79349M54778P47480J238869J450234
41772B866908R31953j30282j013216j189550p93209l31733j13415l6500J37440
41763C28396L69003K93182k63414q35909q01715l14107j50090m39200l36326N40845
41753a609335J206980P13921k73064m61468M5488R2461m58491n64596M7030L64847
41743h96227q8111m20122J2622N07547L44258K6361K59149O84832O33855L13745
41733A377909K45844K06138k61615q08853p22933l6512N99903Q10353O06901L5919
41723B053054o58975r53917o88431l23963j27314K13212O74462N25890l90224
$$ y = [295308, 1044786, 1148005, 349719, -727652, -1301283, -1266776, -1041424, -889398, -772509, -699564, -832038, -1202791, -1567759, -1644569, -1403802, -1024453, -569675, 177805, 1416674, 2866908, 3798861, 3668579, 2655363, 1465813, 672604, 340871, 227456, 190956, 328396, 697399, 990581, 727167, -108742, -910457, -1224564, -1374654, -1813854, -2150180, -1609335, -402355, 311566, 38502, -422966, -377478, -285017, -743508, -1308104, -1261074, -896227, -984338, -1404460, -1391838, -884291, -540033, -513672, -254523, 430309, 1064164, 1377909, 1623753, 1829891, 1568276, 759423, 36490, -22, 599881, 1410234, 2017135, 2053054, 1394079, 440162, -248269, -572232, -699546, -486334, 188128, 714018, 323794]
41714C23794r57757l40805O21645O89319J08970k9912L24588L40068j00434l44601
41704F34875k73937l59545n66701m18028l4169L7349r4618J13226M70891K70652
41694b20005m21494q20436o65445k99525K90032J250537J857672J158631l63734
41685A766233j181295q65527m24826l93012j53622N06629P67759K79010j44558
41676A56791R495J14460k60300m62007N02N09334M77112L35002N20003N29222
41666A929614q5503p31043p25127l82287k55676j45873K21440L76507m9937m34664
41656b82549j25829L97195L39142p8487j23252J75120K57225N0535j56477l63469
41646H9154n66894m17618L9635N0544n44967o47461L25355J046594K09943j066983
$$ y = [323794, -633963, -974768, -353123, 336196, 445166, 415254, 739842, 1079910, 979476, 634875, 360938, 1393, -565308, -983336, -1017505, -980156, -1074774, -961548, -490657, -220005, -641499, -1461935, -2127380, -2426905, -2136873, -886336, 971336, 2129967, 1766233, 584938, -280589, -705415, -1098427, -1252049, -745420, 22339, 301349, 156791, 166286, 280746, 20446, -441561, -441059, 68275, 545387, 880389, 1400392, 1929614, 1844111, 1113068, 387941, 5654, -250022, -395895, -174455, 202052, 152115, -282549, -408378, -11183, 327959, 249472, 126220, 301340, 558565, 609100, 452623, 89154, -477740, -895358, -855723, -805179, -1350146, -1997607, -1672252, -625658, -415715, -1482698]
41636a482698p22162R10081J440759R2537j179182p38825N28707R72346N15932
41627C37495R5313o1244l45623o65018n32941L7595M97621M71901Q7380k28849
41617c06370j12688L03861L71744k08144p00014k60604O45708P92513R7362k76219
41607C47149J06612L01165k00239m76562J31880P04432K91241l75724j53971M31309
41597A107292M2935j056592j222352j0926J100063R12253L8272l33660q3805J68266
41587F61746K25576L19219L90528J20992m18991o69203k35629N49909Q62563K69607
41577B076317o56815r18485l89963m1388n01945j004338n02512O26437J034238
41568b78454L87415k36452o9133L48187K80748p4758j67029j0717R1924J32805
$$ y = [-1482698, -2204860, -1294779, 145980, 238517, -940665, -1679490, -1150783, -178437, 337495, 432808, 371564, 25941, -639077, -1172018, -1134423, -636802, -164901, -77521, -306370, -419058, -115197, 256547, 48403, -651611, -912215, -266507, 526006, 623368, 347149, 453761, 754926, 554687, 78125, 210005, 914437, 1205678, 829954, 675983, 1107292, 1150227, 93635, -1128717, -1139643, -39580, 872673, 910945, 577285, 493480, 661746, 887322, 1206541, 1597069, 1718061, 1299070, 629867, 394238, 944147, 1806710, 2076317, 1419502, 501017, 111054, 69666, -432279, -1436617, -1939129, -1312692, -278454, 108961, -127491, -196624, 151563, 432311, 357553, 190524, 179807, 271731, 404536]
41558D04536J50450j9121k58663r0162M17576M38654k66393o66940l1921O60927
41548G38943J17957j100911j281659j34693Q72548P94561K98650J49973L7854
41539D93223m53596q79737p06404j58548L69191R18367J352098J025046j50173
41530A809467j100659r20141j19868L02019L39641N26223O40096Q5100p90543
41521G71335r91369l88836J70758K58190K93755M98571M60899K1725l02932j47879
41511F44217J58456K04766N6616o5242j34329j29371J4609J22520n9858l42586
41501D69798k71373J14814L01347J26542n2920q0986j67529k43092M7817N20828
41491G65246M63643k15893o72570l56689K00722K88400j6707k65459l45923k82241
$$ y = [404536, 554986, 535865, 277202, 187040, 604616, 1043270, 776877, 109937, 78016, 738943, 856900, -244011, -1525670, -1660363, -787815, 6746, 305396, 455369, 493223, 39627, -840110, -1546514, -1705062, -1335871, -417504, 934594, 1959640, 1809467, 708808, -211333, -331201, -29182, 310459, 836682, 1476778, 1561878, 771335, -220034, -608870, -438112, -179922, 113833, 612404, 1073303, 1095028, 792096, 644217, 802673, 1007439, 1064055, 998813, 864484, 735113, 749722, 872242, 812384, 469798, 198425, 313239, 614586, 741128, 688208, 607222, 439693, 196601, 244418, 765246, 1228889, 1012996, 340426, -16263, 184459, 472859, 456152, 190693, -155230, -437471]
41481d37471K5223L69935K16371l88577n87240M6391P71209Q17497M86087L55242
41471A674667J84219m27918r64868o90472M3242K99227J2152j76783k43282p06216
41461i96032j332377j173602n8124J047387J404929J251652R32349L05337n44596
41452H36923r06263l81803L93101N54495R7007l40105m12164l03443k24104r3231
41442g79587K72795Q22646J157651Q64709Q5633m63382l22360R8634J20077k50557
41432A606259m70312l43009j45613k9675O3349J1345k93981m82206j63789K67640
41422B0008J29299l46796k94448K77570L94068k22499n89600p8099N47375M50554
41412B87432P7201K28753N95501L42960l58665n60885o7447L43867K19973j0583
$$ y = [-437471, -412248, -42313, 174058, -214519, -801759, -755368, 15841, 833338, 1319425, 1674667, 1858886, 1430968, 466100, -224372, -181130, 118097, 130249, -46534, -289816, -996032, -2328409, -3502011, -3560135, -2512748, -1107819, 143833, 1076182, 1381519, 836923, -69340, -451143, -58042, 496453, 593460, 253355, -158809, -462252, -686356, -779587, -506792, 315854, 1473505, 2338214, 2423847, 1960465, 1638105, 1736739, 1856816, 1606259, 1135947, 792938, 647325, 617650, 680999, 692344, 398363, -83843, -247632, 20008, 149307, -197489, -491937, -214367, 179701, -42798, -632398, -710497, -163122, 287432, 364633, 593386, 1188887, 1531847, 1173182, 612297, 544850, 888717, 1108690, 1098107]
41402A098107N5864J50430r2488n06346p01946o15441m15414j21893L44916Q20685
41392A6474R01869M25445j87769l19456N4807K56865j65443p16736o29022j0018
41382c72984L56237K46899J90747L23374L5679q10885j271454o62311K36105K50267
41372a478326m34686o28562L0929O74679O45727L39029L11249L78759J13109k88239
41362c36332k17414M17385R33363O36138l47400j145844j056217k51578N27554
41353h40345Q08348O29295J32518n47497r87876p36679q9110O1655m83118p61244
41343b814053j8948J083841J363617P21231M0398j78920k08486k77455k23013
41334e11788K3249K73431M34464M98466K98709j80531m65536j98825J77927Q9744
$$ y = [1098107, 1153971, 1304401, 1211913, 705567, 3621, -611820, -1027234, -1149127, -804211, 16474, 918343, 1343788, 1156019, 836563, 891370, 1148235, 982792, 266056, -362966, -372984, -16747, 230152, 420899, 744273, 779952, -30933, -1302387, -1964698, -1728593, -1478326, -1913012, -2541574, -2510645, -1835966, -1190239, -851210, -539961, -161202, -48093, -336332, -553746, -136361, 797002, 1433140, 1085740, -60104, -1116321, -1367899, -840345, -31997, 597298, 729816, 182319, -805557, -1542236, -1631346, -1569691, -2052809, -2814053, -2833001, -1749160, -385543, 335688, 376086, 197166, -11320, -288775, -511788, -488539, -215108, 219356, 717822, 1016531, 836000, 370464, 171639, 349566, 439310]
41324D39310j26684K11234P57037N01412m78110q98344j97777O16437N51617l0043
41314A346089l06275k58507k54601j71117K04038M83137K06163l86035p69787
41305I3105q57100p01323q6317Q74033J330753P36471k28962o15759n23804n06272
41295d85175k96294N75094J348022Q01042o30109j149990k87037L73606k30322
41286A8837r34683l27465Q88368J002307m4560p21904l26329K04624J9021m46485
41276f68269m61292j91390k30576n49643n63922J0703Q11730J222199Q88262n426
41266B62376q38899j083983p81194l37944M5695M21362O73065N69979K76428K45542
41256e47573M50657L11825l34836p84617m09705M35592R47480Q93076N75848J69462
$$ y = [439310, 312626, 523860, 1280897, 1782309, 1304199, 405855, 208078, 824515, 1376132, 1346089, 1039814, 781307, 526706, 355589, 559627, 1042764, 1248927, 862892, 93105, -763995, -1465318, -1551635, -677602, 653151, 1389622, 1160660, 544901, 21097, -485175, -781469, -206375, 1141647, 1942689, 1312580, 162590, -124447, 249159, 18837, -915846, -1243311, -354943, 647364, 602804, -119100, -445429, -240805, -221784, -668269, -1129561, -1320951, -1551527, -2101170, -2665092, -2654389, -1842659, -620460, 267802, 262376, -576523, -1660506, -2441700, -2779644, -2733949, -2312587, -1639522, -1069543, -793115, -547573, -96916, 214909, -119927, -904544, -1314249, -878657, 68823, 961899, 1537747, 1707209]
41246A707209l07702o34461o09373m30419l36805j66422J71887K07593l38116
41237g36609p26218j51713P63756O80598l13471o92051J05364P56823K11208o54638
41227g56951n64835J48880L54290M3746K9019L11134K33614p0463J33977O51293
41217E13704M73819m28442q35895j73820N84716M83424l0850j9425M75148O69257
41207A711636K46312l53291n72197k43633K97288M22148j22690p24470o15735
41198D5368m4093O1719l56859l21217M83584R97128M29608m43105n33416r6204
41188B22513o6194m44208n04215j27291K09731M16705O52605N43010k64817j006961
41178c69122n88795N75055Q90152n2487q27001l60734N25454N26189k60317p95656
$$ y = [1707209, 1399507, 765046, 155673, -274746, -611551, -777973, -606086, -398493, -736609, -1462827, -1614540, -850784, -170186, -483657, -1175708, -1070344, -313521, -102313, -756951, -1321786, -1172906, -818616, -774870, -745851, -434717, -201103, -271566, -137589, 513704, 987523, 559081, -276814, -450634, 134082, 617506, 586656, 567231, 1042379, 1711636, 1957948, 1604657, 1032460, 788827, 1086115, 1508263, 1385573, 661103, 45368, 1275, 62994, -293865, -615082, -131498, 865630, 1295238, 852133, 318717, 222513, 156319, -287889, -792104, -919395, -709664, -292959, 359646, 902656, 637839, -369122, -957917, -382862, 507290, 454803, -372198, -732932, -207478, 318711, 58394, -737262]
41168g37262o96880l95755j90050l8603m588j15567k534N89242J097521P08832
41158B14356l84683j007450m57966O02775R97569M08547m03938n92290j38397
41149g61477K79255J80830j81649k85622r0065K3037m9531J2683L05517M21832
41139a45190Q4819l72298m86718k57236P2996M32078P28551O59436K11023l2902
41129H94559L05946O33698J80164o77887q20630j08515L13554k50826r60005p02423
41119a192365K65177P69395M00202j27090j71573P6590J69694Q0216J0640k6224
41109B54662r9874j21707k6349P496j74199l54045k01882J79451L32140J24030
41099h0277j4481K62964O34661N04345j83591q83512j130116r01186l31210M50991
$$ y = [-737262, -1434142, -1829897, -2019947, -2058550, -2063138, -2178705, -2181239, -1591997, -494476, 214356, -170327, -1177777, -1635743, -1032968, -35399, 373148, -30790, -623080, -761477, -482222, -301392, -483041, -768663, -858728, -835691, -885222, -872539, -567022, -145190, -60371, -432669, -919387, -1176623, -1103627, -671549, 57002, 716438, 927461, 894559, 1200505, 1834203, 2014367, 1336480, 515850, 407335, 720889, 470063, -489942, -1192365, -927188, -157793, 242409, 115319, -56254, 20336, 190030, 270246, 280886, 254662, 154788, 33081, 6732, 14228, -159971, -514016, -715898, -536447, -204307, -80277, -94758, 168206, 802867, 1307212, 1123621, 240109, -890007, -1791193, -2122403, -1671412]
41089a671412J071096J017445L35725k05334o8902K98735J96237k06858k06486
41080E60246J73360J80512l05450l94580L87054J158827R03934j0580m29338j33151
41070B090834L2539l60642p40221o20199l46806l26829k66481K16396P59048P13789
41060A151428J23767m07020o11550o77029n87551q4187O28018Q43659L33024k27172
41050D85387k23971k0090l13366r13019r01071r784Q67813Q21805O7767m60721
41040e99250l29592O9660K76279L29350M52099N34537K44070m15137r02107o51735
41030i91826K33436R67452R06895K98899n7592J09968J93629l75679j229807j485316
41020a429941q57119P4608N99177M74965r1893o10541n28179J98069P99953N42249
$$ y = [-1671412, -600316, 417129, 752854, 547520, 478618, 777353, 973590, 766732, 560246, 733606, 914118, 608668, 214088, 601142, 1759969, 2663903, 2653323, 2223985, 2090834, 2123373, 1762731, 1022510, 402311, 55505, -271324, -537805, -321409, 437639, 1151428, 1275195, 868175, 256625, -420404, -1007955, -1092142, -464124, 379535, 712559, 485387, 261416, 241326, -72040, -985059, -1886130, -1895914, -1028101, -206296, -138529, -599250, -928842, -859182, -582903, -253553, 198546, 733083, 977153, 562016, -340091, -991826, -758390, 209062, 1115957, 1414856, 1357264, 1467232, 1660861, 1285182, 55375, -1429941, -2287060, -2212452, -1613275, -1138310, -1230203, -1840744, -2368923, -2170854, -1370901, -828652]
41010h28652j72210k62766M16446Q29460L97826j23848O575K88757r256m65477
41000G6855k84148J92936J05911k36291J58820R53727O91246p05908j401069l53041
40990h00962J008693R18070k14336p73722m35730j49712k46432j63213J66344
40981f91000J34771k81388l82064j6265J79218R486L7700L95642M47619N8803
40971a07478J7558N73541P08713k44041j264513j068637j07985J79650l39725
40962a652917m30284L34048Q19488K19891n72654l49778N21179O77680j42873
40953e76220p13365j48116Q02924Q09435k36758j153717j043068k70071K79652
40944b249304L61256L61670M69813M52310K25904P8392J18295j7115n36934r28407
$$ y = [-828652, -1000862, -1263628, -847182, -17722, 380104, 256256, 262831, 551588, 542332, 76855, -207293, -14357, 91554, -144737, 14083, 967810, 1659056, 953148, -447921, -800962, 207731, 1125801, 911465, 137743, -297987, -447699, -694131, -857344, -691000, -556229, -837617, -1219681, -1235946, -1056728, -1047242, -1009542, -613900, -166281, -107478, -89920, 483621, 1192334, 948293, -316220, -1384857, -1492842, -1313192, -1652917, -2083201, -1749153, -929665, -709774, -1282428, -1632206, -1111027, -433347, -576220, -1289585, -1437701, -634777, 174658, -62100, -1215817, -2258885, -2528956, -2249304, -1888048, -1526378, -1056565, -604255, -378351, -299959, -181664, -198779, -735713, -1664120]
40934a664120n26164M68869J061817O55143k42181p04577m75905o4047O0233k5867
40924a456799q933J66101L00624K73637J58079O4534M9849J63467M03484O00004
40914G14047N16988J39750k80336n23510n77715m58412r9491M01524O64932M46167
40904I43944L1641j07520J2746o9383n09386q22261n15926J75988M92554N4185
40894c13418o58603q71337m66024j11127l07685n79312o2616J142706J823351
40885d04065J132682l01119j200507j132859n99329k0931N63041R41896P52573
40876b68618J60323k21092k48162l68112o33345m21913M38313J038240N42546
40867A8180n50519j015839m57481L93584P50136N33047J25231j28596j19474J3382
$$ y = [-1664120, -2190284, -1721415, -659598, -4455, -246636, -951213, -1427118, -1491165, -1430932, -1456799, -1465732, -1299631, -999007, -725370, -567291, -502757, -452908, -289441, 114043, 714047, 1231035, 1370785, 1090449, 566939, -10776, -469188, -568679, -167155, 497777, 943944, 975585, 868065, 880811, 811428, 302042, -520219, -1036145, -860157, -367603, -313418, -972021, -1843358, -2309382, -2420509, -2728194, -3307506, -3370122, -2227416, -404065, 728617, 427498, -773009, -1905868, -2505197, -2526128, -1963087, -1021191, -268618, -108295, -329387, -577549, -945661, -1579006, -2000919, -1562606, -524366, 18180, -532339, -1548178, -2005659, -1612075, -861939, -328892, -203661, -332257, -451731, -438349]
40857d38349K9699j17492k42333k55283k66841k60058n0658K46533J96529k18586
40847a376839l79583K9958M22471K24180j33057J05467P32748Q41760J80406n82045
40837F5466q61135o69796j95600L62978N76987K01482j93362J47936Q62873P56376
40827A054205l99458j346721j058176p0123M87040M00815K01399J14001J0860
40818f06158n256K17488L48380l2107o15667o20408J18392Q67674R06637L13331
40808H92306k67683l71225j23447m190j88117k04969M16944J186889R73932l86811
40798A923629j508720j147197P3836N45873n9576n43409j90457K06389j97548
40789h97180q70889p78207j3557M11450J24168k03773j7623L84653N27751N05088
$$ y = [-438349, -408650, -526142, -768475, -1023758, -1290599, -1550657, -1601315, -1354782, -1158253, -1376839, -1756422, -1726464, -1303993, -1079813, -1212870, -1107403, -374655, 467105, 647511, 65466, -795669, -1465465, -1661065, -1298087, -721100, -519618, -712980, -565044, 297829, 1054205, 654747, -691974, -1750150, -1820273, -1333233, -932418, -731019, -617018, -606158, -611414, -393926, -45546, -77653, -693320, -1313728, -1195336, -327662, 578975, 892306, 624623, 253398, 129951, 125761, -62356, -267325, 149619, 1336508, 2310440, 1923629, 414909, -732288, -658452, -112579, -172155, -715564, -906021, -699632, -897180, -1768069, -2546276, -2559833, -2148383, -2024215, -2227988, -2245611, -1860958, -1333207, -828119]
40779h28119O17123P10241M15859j33607l47703K0449N13182N68186J99531j39448
40769A595694j85724q1672k8159j5277L1965P0278M9445N6234J67189K44990Q3391
40758A988354k62564m95402m76693m21001n58991p47197o20697j12399L78490
40749a328100M19354L5360l24952k59640K23481P67493J003517Q25646L91552
40740A753711q5919m75429o44740m16754J67300O22935M17577l21133q54171p70896
40730f07519m74629m16021l14538K61503Q91387P16810j99775q00137m85752J55027
40720a273644L62235J53355j49415n30089q29654m63705O12730J312806P56671
40711d8710k75647l01365P47446J496826J121794K08756m64134q53306j036670
$$ y = [-828119, -210996, 499245, 915104, 781497, 433794, 454243, 967425, 1535611, 1735142, 1595694, 1409970, 1328298, 1300139, 1284862, 1316827, 1387105, 1436550, 1492784, 1659973, 1904963, 1988354, 1725790, 1230388, 753695, 332694, -226297, -973494, -1594191, -1706590, -1328100, -908746, -873386, -1198338, -1457978, -1234497, -467004, 536513, 1362159, 1753711, 1667792, 1192363, 547623, 130869, 298169, 921104, 1338681, 1017548, 163377, -607519, -1082148, -1498169, -1812707, -1551204, -659817, 56993, -142782, -942919, -1428671, -1273644, -911409, -758054, -907469, -1437558, -2267212, -2730917, -2118187, -805381, -48710, -324357, -625722, 121724, 1618550, 2740344, 2949100, 2484966, 1631660, 594990]
40702E94990p39793j0529M69155L09367k4274o5150q0772m03001o69211l83532
40692a002750K58639P17454Q42931P05272J82962o22746j003461m36868N12575
40683A54008Q11148K80683l64570o12678n66596l77010k0140L11684K66753q3951
40673b00669k60542q7919Q6015j5140k45610l87745m19110l24768n8426K08108
40663a705806K04162J7506J094J30764l8753n81636q84357m65943L03375P21039
40653b298555O72663N65976N59122L95978p41k71244j32498J89803K90758J40288
40643A11550L1031O8706K3439k48515m93698l68434O5634L71994K59268r2552
40633b71577k65271o5911K77989L58645M8207k96919k28329J93904M52416L05763
$$ y = [594990, -144803, -155332, 313823, 623190, 598916, 533766, 452994, 49993, -619218, -1002750, -744111, -26657, 816274, 1521546, 1704508, 1081762, 78301, -358567, 154008, 965156, 1245839, 881269, 268591, -298005, -675015, -695155, -383471, -116718, -200669, -461211, -549130, -463115, -478255, -723865, -1111610, -1530720, -1855488, -1913914, -1705806, -1501644, -1484138, -1483044, -1352280, -1391033, -1972669, -2857026, -3322969, -3019594, -2298555, -1625892, -1059916, -500794, -104816, -105557, -376801, -509299, -319496, -28738, 111550, 142581, 211287, 234726, -13789, -507487, -875921, -810287, -438293, -179025, -271577, -536848, -602759, -324770, 33875, 82082, -214837, -443166, -249262, 203154, 508917]
40623E08917R3507Q9772K8905k87165m09872L1056M46826P6064o14470m79324
40613e15784L87160O24033k15252q83347m97757L5844k80162o80844N3387J342382
40603f30340J558663N58627k58001k69170k89002p17272p01855K37623J111225
40594F00498Q32121k56456j021320j001066n31020J0441M15966N09650L10896
40585a30290N4678k01456n73182q25597n06456J66515L18699k89474p58813l72645
40575c118021L19549M20376M6782k8865L57171O77440O23738L70429J09911m9871
40565b71361R8527N65673Q53989N02806j97297n45250l32217O6369K92206J99994
40555A233439k97476r94103j217527n53355L89359O23391J31539j55026K30650
$$ y = [508917, 602424, 692196, 721101, 433936, 24064, 55120, 501946, 578010, -36460, -515784, -128624, 495409, 280157, -603190, -1100947, -1065103, -1345265, -2026109, -1972722, -630340, 928323, 1486950, 1228949, 959779, 670777, -46495, -748350, -510727, 600498, 1432619, 1176163, 154843, -846223, -1377243, -1366802, -950836, -441186, -130290, -75612, -277068, -850250, -1675847, -2182303, -2015788, -1697089, -1986563, -2745376, -3118021, -2798472, -2378096, -2331314, -2360179, -2003008, -1325568, -701830, -331401, -221490, -271361, -172834, 392839, 1246828, 1749634, 1552337, 1007087, 674870, 741239, 1033445, 1233439, 935963, -58140, -1275667, -1829022, -1439663, -816272, -684733, -839759, -609109]
40546f09109O57283M09463l16960q06957p46578l59465N7985L61868M90522M64273
40536c97675L97548L63771L16430K11169R7307K9395r060l9876j4550J54760M62961
40525A572180O54172L05704o43997j468699j226955K6668J081938R93401J95573
40516A489985k99181l18656l83052n03292j45666O15611R33604M66248n0659N4219
40506A859161M06276K80960l17556q55971j062670r24782l38002N59256J036876
40497F43548N15767m93891r07502m53307J38825L07349K60649K86550K37029L0708
40487E65725j2512J95798J27408n25973j091067p01952M11883J164111J030195
40478A163616M85610J7455m87720j106641j371667r07347r3829M08517M57858
$$ y = [-609109, 48174, 457637, 140677, -666280, -1412858, -1772323, -1714338, -1352470, -861948, -397675, -127, 363644, 680074, 891243, 988550, 1017945, 1008885, 969009, 954459, 1109219, 1572180, 2226352, 2532056, 1888059, 419360, -807595, -780927, 301011, 1294412, 1489985, 1190804, 872148, 489096, -14196, -159862, 455749, 1389353, 1855601, 1804942, 1859161, 2265437, 2546397, 2228841, 1372870, 310200, -614582, -952584, -393328, 643548, 1159315, 665424, -242078, -695385, -556560, -249211, 11438, 297988, 535017, 565725, 553213, 749011, 876419, 350446, -740621, -1442573, -1030690, 133421, 1163616, 1649226, 1666681, 1178961, 72320, -1299347, -2206694, -2300523, -1892006, -1434148]
40469a434148L28674J75167O8084K02069N14863M54162k13074o99921j73847P74456
40459c515P10543n06690j317104o33845O27517R41105K45268l32746k45167O0316
40449d54318K16661L54229M28755Q7266n75240q85447n10052Q1079L18073J63271
40439g75723j72492n56876o80820r4875J011480J574036Q37094n16814j074423
40430d49413m15419M93690O49440J48565k31860r6897K80323M50012K13658k91322
40420G50777o56376m80160J43484N45946K28982m02211m83626J12167N39934J54256
40410D53173n77399p45681k09737L93848O16361N64585L82880P210m47643n99150
40400a61553l15700O8682K25958J67048J0251j61925j20556L33502Q62202Q18047
$$ y = [-1434148, -1105474, -930307, -862223, -660154, -145291, 308871, 95797, -604124, -777971, -3515, 707028, 200338, -1116766, -1750611, -1123094, -181989, 63279, -269467, -514634, -454318, -237657, 116572, 545327, 632593, 57353, -828094, -1338146, -1257067, -938994, -775723, -948215, -1505091, -2185911, -2280786, -1269306, 304730, 1141824, 625010, -449413, -864832, -371142, 278298, 426863, 195003, 98106, 378429, 828441, 1042099, 750777, 94401, -385759, -242275, 303671, 532653, 130442, -353184, -241017, 298917, 453173, -124226, -869907, -1079644, -685796, -69435, 495150, 878030, 885240, 437597, -161553, -477253, -408571, -182613, -15565, -5314, -167239, -287795, 45707, 907909, 1725956]
40390A725956J99117k33345r5613L9635l37663p77040o49212k12798q8588j60667
40380e90218P2719M09655K30587l08001m28687o8196J6742l72923m80044O9246
40370a449120N51474L46613k7408J69866O26414M85138k73877q12688o45102j29135
40360a157825K45973M30239N28799M38037N0562l97620m57723L108M92696L07084
40350D83330n85857j258045p96012M87343J309907R84571J72907j74921l8883
40341E84340q29j91013k54574j20595p7198j18061J04700N58682O75379J71726
40331A332557m65536o41148m01824j61841k9670J14633J14837k77645p38611n37865
40321a692113L92735J125475R16735K80780K52895Q42122J030293L55511l59271
$$ y = [1725956, 1925073, 1691728, 1596115, 1635750, 1298087, 521047, -128165, -340963, -429551, -590218, -517499, -107844, 122743, -185258, -613945, -682141, -665399, -1038322, -1518366, -1449120, -897646, -551033, -578441, -408575, 217839, 702977, 429100, -383588, -1028690, -1157825, -911852, -481613, 47186, 485223, 535785, 138165, -319558, -316450, 176246, 483330, -102527, -1360572, -2156584, -1669241, -359334, 625237, 798144, 623223, 584340, 583511, 392498, 137924, 17329, -59869, -177930, -73230, 485452, 1160831, 1332557, 867021, 225873, -175951, -337792, -367462, -252829, -137992, -415637, -1154248, -1692113, -1299378, -173903, 742832, 1023612, 1276507, 2118629, 3148922, 3504433, 3145162]
40312C145162k41612L81837N82836J70981k86579m71621n61511n88408l32365
40303A798720O7891Q8555l91460q35043q05144m99080l02985k62586k46761k36282
40293a624175j92461O817K66128K59518m8800k31095q153L07739K82597j7506
40283i99391j82200j1410L40356N74160M22676j31384o56317o05793l1746L88393
40273h92656K35813j40944k44604r5003O6863K65036N13667M85515K0028l90571
40263a76856k60696K2856k69290r53376j022229r6536R50826J123731M99012p9678
40253b62236r7026K60420N74317O11045L34210j54153o14314q05448p02524m68031
40243a323740j75338K62394P50121Q15313J50900o79545o53818L12802R79038
$$ y = [3145162, 2903550, 3285387, 3868223, 4039204, 3752625, 3281004, 2719493, 2131085, 1798720, 1866611, 1955166, 1563706, 728663, -76481, -575561, -878546, -1141132, -1387893, -1624175, -1816636, -1809819, -1543691, -1284173, -1332973, -1564068, -1572221, -1264482, -981885, -999391, -1181591, -1193001, -852645, -278485, 144191, 12807, -643510, -1249303, -1281049, -892656, -656843, -797787, -1042391, -1137394, -1070531, -805495, -291828, 193687, 213715, -176856, -437552, -414696, -683986, -1637362, -2659591, -2756127, -1805301, -681570, -182558, -262236, -359262, -98842, 475475, 1086520, 1420730, 1266577, 652263, -153185, -855709, -1323740, -1499078, -1236684, -486563, 328750, 479650, -199895, -853713, -540911, 438127]
40234D38127L82072o83692p18499K47987O93315l3894p38475l34514M78336M72348
40224B03111j62548l68803n5216k1947l86738m42131k2731K54406K17573L94583
40214c90441P93120O15664l48882j107990q48786o0129L73324M13991M88281N33447
40204D61599K40237k15076m40678m89935n88168n43258j07906L75442L96276J00132
40194h11335j0747K1888k22818o25212o05181j24904K08909J61818J87563N00020
40184a319999O22370K52299j23584J2092M07071N47308M69512M59677L75524k0026
40174A682244l64892j28422M18480M74155o4927m59579l31647j84933m25774o50088
40164c5383m01303N251J9440k60024l50180j56417J09514M32148P93718Q08588
$$ y = [438127, 820199, 136507, -581992, -334005, 359310, 325416, -413059, -747573, -269237, 203111, 40563, -328240, -383456, -405403, -792141, -1234272, -1257003, -1002597, -785024, -390441, 402679, 1018343, 669461, -438529, -1287315, -1347444, -974120, -560129, -71848, 461599, 701836, 486760, 46082, -443853, -1032021, -1575279, -1683185, -1307743, -911467, -811335, -822082, -800194, -1023012, -1648224, -2253405, -2378309, -2169400, -2007582, -1820019, -1319999, -697629, -445330, -568914, -556822, -149751, 397557, 867069, 1326746, 1702270, 1682244, 1317352, 1188930, 1607410, 2081565, 2016638, 1557059, 1225412, 1040479, 614705, -35383, -436686, -431435, -411995, -672019, -1022199, -1178616, -1069102, -636954, 156764, 965352]
40154I65352K45504l65107l73286O013J40642J09425L82551O04346j9681j054041
40144F41718r95796M12341J419178O66929q31065j218180l47301M79582O22909
40135H50315N17155L44397k10999q74975q12237k4173M24145j5831n49453l17626
40125f69282L09422L68226l00013r19840p90046K9127Q87948J120322N63966l15373
40115B84457q75201q57940m13622K08917O98975O85136J80980j78091R6130N34314
40105C64055L42615l14351m95794O2096N78683M66914M5020k49476m60134n58696
40095b19068k03312M37558N11228j94123n89933J75796J229079J086333j84185
40086B049373j065190p06637J65546N65025M61453L10535J64238j70853n30542
$$ y = [965352, 1210856, 845749, 472463, 478476, 619118, 728543, 1111094, 1715440, 1695759, 641718, -354078, 58263, 1477441, 2144370, 1313305, 95125, -252176, 227406, 850315, 1367470, 1711867, 1500868, 625893, -186344, -210517, 213628, 197797, -351656, -669282, -359860, 8366, -291647, -1211487, -2001533, -1972406, -1084458, 35864, 599830, 284457, -590744, -1448684, -1862306, -1653389, -954414, -269278, -88298, -266389, -170259, 364055, 706670, 392319, -103475, -41379, 537304, 1004218, 1049238, 799762, 339628, -219068, -422380, 15178, 526406, 332283, -257650, -81854, 1147225, 2233558, 2049373, 984183, 277546, 443092, 1008117, 1469570, 1780105, 1944343, 1773490, 1242948]
40077A242948n29464j75035P6095q1279m03907m42650j57950M0247p4711j49267
40067f54973K30771Q20585R61282M83607j36853n36232p70730p59277j59776Q32801
40057C11205J270140O15698m08996p65478m21870p1067K5588J10361J69820q492
40047H26909j75690J00174N34272L80711l30851o66493j08461P47113J064825
40038B372509O65944j67396j053800j400484p17371N20562J049585L70795n53119
40029A087225p03573l46360k19769j63830L50493Q80327N29678m00508o73423
40020C40260j07135J26774m32279o57177J73372Q83896J86459j068519j025105
40011a579454L42572J223602O90766k21828m02597p7154J82590M46985O78657
$$ y = [1242948, 713484, 538449, 614544, 533265, 129358, -313292, -471242, -430995, -505706, -654973, -424202, 396383, 1357665, 1841272, 1704419, 1168187, 397457, -361820, -521596, 311205, 1581345, 2197043, 1788047, 1022569, 600699, 529632, 555220, 665581, 835401, 826909, 651219, 751393, 1285665, 1666376, 1335525, 669032, 560571, 1307684, 2372509, 3038453, 2871057, 1817257, 416773, -300598, 219964, 1269549, 1640344, 1087225, 383652, 37292, -182477, -346307, 4186, 884513, 1414191, 1013683, 340260, 233125, 359899, -72380, -729557, -556185, 327711, 514170, -554349, -1579454, -1236882, -13280, 677486, 455658, 53061, -24093, 158497, 605482, 1284139]
40002A284139K75193p04372j011410j6395R87169N84834n43677p13094J59990
39993C02377P35945N96383N43087O70821J22272r38598j060742R4326Q75729J57798
39983B099398q75149p20478O5849M2443o23050o05762K12169O12944J62379j54331
39973B16412L24454Q69084N45392m33019j094151r34017l34239N683j48543k97308
39963a280252J60350R82003J210778M86151l71378n39734l02637l08970l80368
39954c44057J9617O20555P04105L36359J99554L75869L23504m8055k87488l05694
39944A594269l66639k64387M09538J213619J226029N18885P9550J74266R0759
39935D675889l04643k28988L57564K97921p78943j481006p43478L73253L11579
$$ y = [1284139, 1559332, 854960, -156450, -172845, 814324, 1399158, 855481, 142387, 302377, 1038322, 1634705, 2177792, 2848613, 2970885, 2032287, 971545, 1065871, 1941600, 2099398, 1224249, 503771, 569620, 612063, -10987, -616749, -404580, 208364, 370743, 216412, 540866, 1409950, 1955342, 1522323, 428172, -505845, -840084, -834401, -982944, -1280252, -1119902, -137899, 1072879, 1559030, 1187652, 647918, 345281, 36311, -344057, -324440, 296115, 1000220, 1336579, 1536133, 1912002, 2235506, 2187451, 1899963, 1594269, 1227630, 963243, 1372781, 2586400, 3812429, 4331314, 4410864, 4585130, 4675889, 4371246, 4142258, 4499822, 4797743, 4018800, 2537794, 1794316, 2167569, 2479148]
39926B479148n53712o32024L61260J138125Q43124l9959p38684r68421o30217
39917A258640J82716P55994L17268p70322j247774o24217K01961K65023k78013
39908F1276o58268n60493k17516J09848K95235K51867J5806k25285l51997l81155
39898a660682k55952J34536O19209P56157L80020j03241j78407J73135M97406
39889C62181M17140N8120n9628L98721J069275J143190L21625o97347j006998
39880B006279n87099j86789k40212m48948m71454m33851n28674o00192m55252
39871a946192k23632r0641K3373K09270K89765J29708l8343M4364K36182K80486
39861a085660K58745L13114J79820m03254r82182q02074L7310N95605M51840K70792
$$ y = [2479148, 1925436, 1293412, 1654672, 2792797, 3635921, 3595962, 2857278, 1888857, 1258640, 1441356, 2197350, 2514618, 1744296, 496522, -127695, 74266, 339289, 61276, -596992, -1157485, -1375001, -1265153, -969918, -718051, -702245, -927530, -1279527, -1660682, -1916634, -1782098, -1162889, -406732, -26712, -129953, -308360, -135225, 362181, 779321, 837441, 777813, 1176534, 2245809, 3388999, 3710624, 3013277, 2006279, 1419180, 1232391, 992179, 543231, 71777, -362074, -890748, -1490940, -1946192, -2169824, -2260465, -2237092, -2027822, -1738057, -1608349, -1646692, -1602328, -1366146, -1085660, -826915, -513801, -333981, -737235, -1719417, -2521491, -2484181, -1888576, -1436736, -1165944]
39851a165944O23165J017769P67782J84480L4312K19881m452o76277j020628p48655
39841g68567m38000l88045j13124N89879J039681P72696L83622M80562N77144
39832B135848j1423q10407q58539k97271m5954j36209K64309J133395J324969
39823B698718M13552m90694m35809k0904k32403q04216p91215j68491K39200J06796
39813E14534j28012k12609l44828m71551j92494M49014Q04963N29417O4081q5725
39803I26790n2787k07228m55427m10644n8168K16623K37229K62082M75675N86334
39793A520479K29967l85356o37324l45437n6144k12055m17988m0610O81977Q25401
39783A162910J35122n22778l98334Q9725R4133l43880m67382r6925O6319m19935
$$ y = [-1165944, -542779, 474990, 1242772, 1427252, 1461564, 1681445, 1676993, 1000716, -19912, -768567, -1206567, -1594612, -1707736, -1117857, -78176, 694520, 1078142, 1558704, 2135848, 2124425, 1314018, 455479, 158208, 112254, -23955, 240354, 1373749, 2698718, 3112270, 2621576, 2185767, 2164863, 1932460, 1128244, 337029, 168538, 407738, 514534, 386522, 173913, -170915, -642466, -834960, -385946, 419017, 948434, 1012515, 926790, 874003, 666775, 211348, -199296, -257464, -40841, 196388, 458470, 934145, 1520479, 1750446, 1365090, 727766, 382329, 326185, 114130, -303858, -344468, 337509, 1162910, 1298032, 775254, 376920, 466645, 560778, 216898, -250484, -347409, -281090, -701025]
39773g01025r75687p81920Q0370P65337P83588N02655M42374M91603J82958m29833
39763C60420o55727p6171Q08093J159967P92868J98399k24108m79637n89987m54788
39753H39329k03618j72364l37515k54068J97418M90305K29284k00128k16139Q8503
39743D61007J89994j2988j65943j31193r5896m3272K64116O57626N29083k56832
39733A395702r07983o52230J53783M52622m3509m61829q1077N78643N64039j744
39723I96417q4022N95340J024971M65252l27410k18170O11846J107747J083430
39714E255401J307595J886181J829266O07780r25930j739084j860767j789202
39706D571240j471014o99229O2912J69512k05077l44381p3131J47172O6960q4514
$$ y = [-701025, -1676712, -2458632, -2378262, -1612925, -829337, -326682, 115692, 607295, 790253, 360420, -295307, -371478, 436615, 1596582, 2389450, 2587849, 2363741, 1884104, 1294117, 839329, 635711, 463347, 125832, -128236, 69182, 559487, 788771, 588643, 372504, 461007, 651001, 638013, 472070, 340877, 244981, 201709, 465825, 1123451, 1652534, 1395702, 487719, -164511, -10728, 441894, 398385, -63444, -144521, 434122, 998161, 996417, 912395, 1507735, 2532706, 2997958, 2670548, 2452378, 3064224, 4171971, 5255401, 6562996, 8449177, 10278443, 10886223, 9960293, 8221209, 6360442, 4571240, 3100226, 2400997, 2463909, 2633421, 2428344, 2083963, 2010832, 2158004, 2224964, 2140450]
39696B140450j42472k27012l93890n30532o03750o16374l78994K39000Q58312
39687C44738Q55108J76689m74981m42287J37723N62143M35423J08548J37525M41307
39677B281936L78358k07716n43730l0560O73220M93335m15010r00510o22270m10897
39667F96156o29930n08999L30662R51266N47056k54419n00598l71035m82644o20976
39657h43461l28265J1803r3506j34794M57733R22194K19371j007996j160767j24518
39647b082206O51412M62247J09610K20810L86018L05376L55542N79278M13366
39638A401453j31490k62107J70533K70941l50068q25803m47543K76894O00400
39629G03210N26746K41240l49580q77872m80784P21364J282823M97480l44610
$$ y = [2140450, 1997978, 1770966, 1377076, 846544, 242794, -373580, -752574, -513574, 344738, 1199846, 1376535, 901554, 459267, 596990, 1159133, 1594556, 1703104, 1840629, 2281936, 2660294, 2452578, 1908848, 1878288, 2551508, 3044843, 2629833, 1729323, 1107053, 696156, 66226, -442773, -112111, 839155, 1386211, 1131792, 631194, 260159, -222485, -843461, -1171726, -1159923, -1253429, -1388223, -930490, -8296, 211075, -796921, -1957688, -2082206, -1430794, -968547, -858937, -638127, -252109, 53267, 408809, 988087, 1401453, 1269963, 1007856, 1178389, 1449330, 1099262, 273459, -174084, 102810, 703210, 1229956, 1471196, 1121616, 243744, -237040, 484324, 1767147, 2264627, 1920017]
39620A920017Q7755J015365P90711m63041j069105l56629N22992M36742l30267
39611B554540q49842p99671n01557k76238j46420L4762L05456M16323J12992l43596
39601E06749l65427O3346K41416j59003n22225l33118p4444l06657n05117J36970
39591a317510J158246J272294K68592o67829o63377j32187K29735M16873N85234
39582A150071M34168j63700n46753j04898O39976O55264m9060l89930J29898O23024
39572B378060J82750o61196o89035J64300P19790L57050j21606J19892O00912
39563C050917L81038l34678m80418J89650P33924M64122j22860k09974J87079
39554C858800M05206J20160k83950k50164K72621P41693O46808J76985O319L88809
$$ y = [1920017, 2007772, 3023137, 3813848, 3350807, 2281702, 1925073, 2448065, 2884807, 2554540, 1704698, 905027, 403470, 127232, -19188, 15574, 321030, 737353, 850345, 506749, 141322, 204668, 446084, 287081, -235144, -568262, -642706, -949363, -1454480, -1317510, -159264, 1113030, 1381622, 713793, 50416, -81771, 147964, 564837, 1150071, 1584239, 1420539, 873786, 768888, 1408864, 2064128, 2015068, 1625138, 1755036, 2378060, 2560810, 1899614, 1210579, 1374879, 2094669, 2451719, 2330113, 2450005, 3050917, 3431955, 3097277, 2616859, 2806509, 3540433, 4004555, 3881695, 3671721, 3858800, 4264006, 4384166, 4100216, 3850052, 4122673, 4864366, 5511174, 5688159, 5694478, 6083287]
39544F083287R03430J215577J439519J437963O09726r75790k077208j845967j141794
39535E648743j175476j571521j175840j88831J82539j39081j32406K57554K8157
39526A733838p35201o52503N00130J127125M07021l62094q5228K81490l79103
39517A835475j177435o51543P59767J441952J078969P32005Q46821P23405n4357
39508E535059q49885q37689K314Q18093N97040p48877j935642j594014q1989R07015
39498A811425O58635J38938J14649P8147l25455l45169M45300J123329Q51042
39489D550841R5907n12449j169116j743306j214008M59581J455019N83745p83453
39480A722761r03071k87153k90634n20261J25447R80737O08590m75100m92441
$$ y = [6083287, 6986717, 8202294, 9641813, 11079776, 11689502, 10713712, 8636504, 6790537, 5648743, 4473267, 2901746, 1725906, 1537075, 1719614, 1580533, 1448127, 1705681, 1733838, 998637, 346134, 846264, 1973389, 2380410, 2018316, 1933088, 2214578, 1835475, 658040, 6497, 766264, 2208216, 3287185, 4019190, 4866011, 5589416, 5535059, 4685174, 3847485, 3849799, 4667892, 5264932, 4516055, 2580413, 986399, 904410, 1811425, 2470060, 2608998, 2723647, 2801794, 2476339, 2131170, 2576470, 3699799, 4550841, 4646748, 4134299, 2965183, 1221877, 7869, 467450, 1922469, 2506214, 1722761, 819690, 532537, 241903, -278358, -152911, 827826, 1436416, 961316, 468875]
39471D68875N91765J054207K53879o14297o41892k39055N6791K26689J64681k41738
39461A079905n17014k34450R3892j24050m01621o7572M33748M27720L16189O09738
39451A616485O62462q8593o98459j94539O38063O77340M18248O60592O69344k64132
39441D096811r20995j37722Q35567M54928k69884K06746Q42379J6695j050170
39432D074355l43583J093264J036520K34659P75511J904485J655824J010317J962286
39423A3403638L245599K839618K654087N208623P918893O988111M548642M783013
39415E1590224N887579M547097M906862J2004151K0206992K3599866L4813955
39408A57556726P0313501J11588659J07814111L6413024n7320198j05115909r0196286
$$ y = [468875, 1060640, 2114847, 2368726, 1754429, 1112537, 873482, 930273, 1156962, 1321643, 1079905, 562891, 328441, 422333, 298283, -103338, -170910, 262838, 690558, 1006747, 1616485, 2278947, 2190354, 1491895, 1297356, 1935419, 2612759, 3031007, 3691599, 4360943, 4096811, 3175816, 3038094, 3873661, 4328589, 4058705, 4265451, 5107830, 5124525, 4074355, 3730772, 4824036, 5860556, 6095215, 6870726, 8775211, 10431035, 11441352, 13403638, 16649237, 19488855, 22142942, 27351565, 35270458, 42258569, 46807211, 51590224, 57477803, 62024900, 66931762, 78935913, 99142905, 122742771, 157556726, 227870227, 339458886, 447272997, 483686021, 426365823, 321249914, 231053628]
39401B31053628n3543229l3673812k9066105k2348402j2520952q513284r361363
39394F2026481p899789m763114n166025p699781p226529m509145l790733m386572
39386A6584793k784356j23483j56522k054447j946943J23700P89723n04501j318563
39377H609401j024756j037057j269986o06813J56007l57043j060170k82212P80740
39368C908111J04945j200320p22134Q70526J081085J6916k18833M51178L71876
39359D663350l89369m66537k77696j155320k151545j282964O56302J103456N8230
39350G57907j83040P23865Q38078k28989p28556j99154n8620m86205n0179J129418
39340A514525J127435k74939r84007k25356K89055l19514o35483J17044N67905
$$ y = [231053628, 177510399, 143836587, 114770482, 92422080, 79901128, 71387844, 62026481, 54126692, 49363578, 44197553, 36497772, 29271243, 24762098, 20971365, 16584793, 13800437, 13676954, 13520432, 11465985, 9519042, 9642742, 10432465, 9927964, 8609401, 7584645, 6547588, 5277602, 4670789, 4826796, 4469753, 3409583, 3127371, 3908111, 4013056, 2812736, 2090602, 2961128, 4042213, 4059129, 3840296, 4291474, 4663350, 4273981, 3807444, 3529748, 2374428, 222883, -1060081, -403779, 699677, 757907, 574867, 1298732, 2136810, 1907821, 1179265, 980111, 921491, 435286, 385107, 1514525, 2641960, 2367021, 1383014, 1157658, 1446713, 1127199, 491716, 608760, 1176665]
39331A176665q4821n20490J42105O93643K18819j78979L99741Q67134K63635l34718
39321B642734J77703Q09406K66125o68533n61993J09090p6599q57704p47011L28192
39311A421410Q29016O7754p81859m91129N99164J263150R71952K84424n8451k8378
39301D077053j41833n00018m81756K22168P84964K72689q17278j098330l02313
39292B015346L96257K06296k83403k87316N4470K28720J40574j25373n55498q11829
39282I78244l69114N51460R61229M28436l23052n26724l11887j11729P1805K85700
39272A634368K10359k87316p13543n73890l9482L67115L65524j8009n36979p32080
39262c23933l34068K65535M54340K62281J65040J69801p6044l72404j57086L89687
$$ y = [1176665, 1091844, 571354, 713459, 1407102, 1625921, 1446942, 1846683, 2713817, 2977452, 2642734, 2820437, 3629843, 3895968, 3227435, 2665442, 2774532, 2697933, 1840229, 1093218, 1421410, 2250426, 2318180, 1536321, 1045192, 1644356, 2907506, 3879458, 4163882, 4105431, 4077053, 3935220, 3435202, 2953446, 3175614, 3960578, 4233267, 3415989, 2317659, 2015346, 2411603, 2617899, 2334496, 2047180, 2101650, 2330370, 2470944, 2345571, 1790073, 978244, 609130, 1160590, 2121819, 2550255, 2227203, 1700479, 1388592, 1276863, 1348668, 1634368, 1844727, 1557411, 843868, 269978, 230496, 597611, 963135, 945126, 408147, -323933, -658001, -392466, 61874, 324155, 489195, 658996, 582952, 210548, 53462, 443149]
39252D43149M95274J12829n2482O6453k05807p56496n26889N68058J046699O1225
39242A252013j121959r37332K47172R01714N24854j29552m29430l53522m915M10896
39232C59939M47509K6805k16527R7158L11307k66937j110029j157683l79360L14415
39222a573403M66758M19269L76127O9742n09222p87150k92698P16832J474610
39213C60865J387940N57212k72943m55192j73733j07847l84957m60096j22546
39204C28703J57426J54359K91376O70728O21330j18175o50750k23933M98802M81245
39194B211111m3627j36633J58051l558o37384q22490k67100K29306J18828j41404
39184F65100k8739K45166K81146R4476k24329p61373j260578j016300J36447J225414
$$ y = [443149, 938423, 1051252, 998770, 1065223, 859416, 102920, -423969, 144089, 1190788, 1252013, 130054, -807278, -560106, 341608, 866462, 736910, 307480, -46042, -50957, 359939, 807448, 834253, 617726, 714884, 1026191, 759254, -350775, -1508458, -1887818, -1573403, -1106645, -687376, -311249, -241507, -750729, -1537879, -1830577, -1113745, 360865, 1748805, 2306017, 2033074, 1577882, 1404149, 1296302, 911345, 451249, 328703, 486129, 640488, 931864, 1602592, 2223922, 2105747, 1454997, 1231064, 1729866, 2211111, 2167484, 2030851, 2188902, 2185344, 1547960, 725470, 458370, 687676, 806504, 665100, 636361, 881527, 1162673, 1257149, 1032820, 271447, -989131, -2005431, -1868984, -643570]
39174f43570J195671K71505l80755k06144K04013K04905L5800K42873O44968N64909
39164B134175k2975l30936L0839L74326j8786p12027p16488K4170N72748L49266
39154A684312k34203n43034m19568k0170L89941M01402j30366o23016m29264R3311
39144A69345P3872l48969j55968P40648J149271N27061j04144Q5208L74460q2577
39134B428207o54750l41588M29603N22617k1180k16293J50800L71864J48735j46250
39124B671765l94406p82008j016448n60300L53283Q65390O40566Q6908m25197
39115A439553p68669p13002k24397J30872o7093k86338P7682M77874O5032o37859
39105e06345l71588O96751J031641J25825o93873l17631O31117R49835M32250
$$ y = [-643570, 552101, 823606, 442851, 236707, 440720, 645625, 681425, 924298, 1569266, 2134175, 2111200, 1780264, 1811103, 2185429, 2166643, 1454616, 738128, 762298, 1335046, 1684312, 1450109, 907075, 487507, 467337, 857278, 1258680, 1128314, 505298, 76034, 169345, 243217, -105752, -261720, 478928, 1628199, 2155260, 2051116, 2136324, 2510784, 2428207, 1773457, 1431869, 1861472, 2384089, 2362909, 2146616, 2297416, 2669280, 2818015, 2671765, 2277359, 1495351, 478903, -81397, 271886, 1137276, 1777842, 1864750, 1439553, 670884, -42118, -266515, -135643, -202736, -489074, -411392, 66482, 131514, -506345, -877933, -181182, 850459, 976284, 282411, -35220, 595897, 1545732, 1977982]
39096A977982l37899q63905q50949k31151M76061N55035J32855J6528L15998K70549
39086A461104k75060m44120R6267L79048k42603q52487l89421N89070P40940m5617
39076A017121o34143l46681L19322N86717K33175m35619q85919p08067p2330L52835
39066e73589K48889N8156J88763K97950p2707n62670m02785M13577J015912P39440
39056A350936j09451o47151l70040K94876M05291l61637j129647q26187L34430
39047a058580J059559P28047Q4205r5777r6910m24372o81627j67822Q53850J337283
39037A537856P59481l47601j080775r98643m06301k7612j86930l16649K51567
39028h15607J092828J129748L37639j07574K72643M97911o4055m89989K6554N69676
$$ y = [1977982, 1640083, 776178, -74771, -305922, 170139, 725174, 858029, 874557, 1190555, 1461104, 1186044, 741924, 838191, 1217239, 974636, 122149, -267272, 321798, 1062738, 1017121, 382978, 36297, 355619, 942336, 1175511, 739892, -146027, -854094, -926424, -573589, -324700, -266544, -77781, 220169, 147462, -415208, -817993, -404416, 611496, 1350936, 1241485, 594334, 224294, 519170, 924461, 562824, -566823, -1393010, -1058580, 979, 729026, 813231, 717454, 620544, 196172, -485455, -653277, 200573, 1537856, 2297337, 1949736, 868961, -129682, -535983, -563595, -750525, -1067174, -815607, 277221, 1406969, 1744608, 1637034, 1909677, 2407588, 2343533, 1853544, 1880098, 2449774]
39018B449774K4628q28058m90561O74619R55856O5198n36913j22774L65599J99728
39008B757096l6824J83184L61982P6365k41374l14110o03059j169480j156708
38999a42928k37736N61130M18879K0350K39197N55009P2280p20967o69570J29480
38989B25124O00796N30836O24225Q80842N10309l82727n99280J96237P62773K61645
38979C610780l58645J9131P67940N42672m96728r63611m47573M4414q4906j99464
38969B434010J43642L07361n9661N9555J497933K999109K424367k16585k401968
38960G187763k175585m04263P24415M92248o0931n8401K04156J89672O9492K96633
38950F465199P63512R14812N72802K44753M71517J108738J620203K077851L226515
$$ y = [2449774, 2474402, 1646344, 1155783, 1830402, 2786258, 2851456, 2314543, 2191769, 2557368, 2757096, 2720272, 2903456, 3265438, 3341803, 3100429, 2786319, 2183260, 1013780, -142928, -380664, 180466, 599345, 619695, 858892, 1413901, 1486181, 765214, 95644, 225124, 825920, 1356756, 1980981, 2861823, 3372132, 2989405, 2390125, 2586362, 3349135, 3610780, 3252135, 3271266, 4039206, 4581878, 4085150, 3121539, 2673966, 2718380, 2633474, 2434010, 2577652, 2885013, 2825352, 2884907, 4382840, 7381949, 9806316, 9589731, 7187763, 5012178, 4607915, 5332330, 5824578, 5763647, 5705246, 5909402, 6099074, 6168566, 6465199, 7228711, 8143523, 8716325, 8961078, 9432595, 10541333, 12161536, 14239387, 17465902]
38941A7465902M993982N515921K901912j901058n347656n141751k796045j375353
38933A4315854j685386k145085j746471j209976j149045r77025l22049L309n49733
38924D534393j025368l60375P93880R06194k45078j411204j668930j255187o56331
38915c88006M5183O88178P99850K66907l38454m58426j63977J58205L11320K53141
38905A173921k7445l18673k36936K11598M34240n751o78371p61406j47007L87324
38895C1494K30560k35636j92306M35250Q21972L85370l32878l30819M87965J123892
38885B424864P39698l35426j090212r80130l07935K84125M04185J77219J40313
38876A456701O31532J120023O09989r18876k038535j536950j13772N29319L5742
$$ y = [17465902, 22459884, 27975805, 30877717, 28976659, 23629003, 18487252, 15691207, 14315854, 12630468, 10485383, 8738912, 7528936, 6379891, 5402866, 5080817, 5084126, 4534393, 3509025, 3148650, 3942530, 4848724, 4603646, 3192442, 1523512, 268325, -388006, -342823, 345355, 1145205, 1412112, 1073658, 615232, 451255, 609460, 920780, 1173921, 1146476, 827803, 590867, 802465, 1236705, 1230954, 552583, -208823, -355830, 31494, 262054, 26418, -165888, 269362, 1091334, 1476704, 1143826, 813007, 1300972, 2424864, 3164562, 2829136, 1738924, 758794, 450859, 734984, 1139169, 1316388, 1456701, 2088233, 3208256, 3818245, 2899369, 860834, -676116, -789888, -260569, -224827]
38867b24827l46647R8062N19835J47701l17137K4436N71369J35181r82713j267066
38857a641806k43608Q85810J051514N45964O9532l17277o79665o21330k440M89040
38847d64266K99353n8854J28837N33183L64351k12745l29147J11864L07617q3618
38837E96575n04899n65600n20415m27019J30127J023751J290259N08582l88563
38828A142798m56611j27699l36737r05269r16870l19047O2135J4669K37036R30002
38818f75593J200848L99947p63633j088071l57204O09875J022463P19058j2561
38809A055129o84491p94323k23458N16459P32208L01383k06871k13019J95659
38800F78676L81652j7369n01389k36177P44248J293724N31369q80862j501777
$$ y = [-224827, -571474, -473412, 46423, 194124, -123013, -98577, 472792, 607973, -374740, -1641806, -1885414, -999604, 51910, 597874, 667406, 350129, -329536, -950866, -953306, -464266, -164913, -223767, -94930, 438253, 802604, 589859, 260712, 372576, 680193, 596575, 91676, -473924, -994339, -1421358, -1291231, -267480, 1022779, 1531361, 1142798, 686187, 558488, 221751, -683518, -1600388, -1919435, -1857300, -1842631, -1605595, -675593, 525255, 925202, 161569, -926502, -1283706, -673831, 348632, 1067690, 1055129, 370638, -423685, -647143, -130684, 601524, 902907, 696036, 483017, 678676, 1060328, 1042959, 541570, 305393, 1049641, 2343365, 2874734, 1993872, 492095]
38791D92095r78289l03022j55974j0141O49572J184439P60498j84003m77376P0495
38781A048294N31702L74136P4248M7626l3084m22068o57531l55756J7827r7676
38771E27718l41894k1112O03296N90018j40405n32591K9630P55355O35352q4192
38761B021175m18306k04062j65577m98404m44142L50471R53334L87387p93371
38752A188505j108929j78570Q06111Q01221K10643k1415J32776M6045k87117k41131
38742A348139K13669K83217l36182q19625m89353L8561j37915o24123l34591N41592
38732c16611N89646n25737j228582l51533R20096P57582m52208o43016P31929
38723e18434J808844J070693n33063j134079m89961J58780Q3867k65692l16954
$$ y = [492095, -486194, -789216, -945190, -955331, -305759, 878680, 1639178, 1455175, 977799, 1048294, 1579996, 1954132, 2028380, 2076006, 2042922, 1620854, 963323, 607567, 625394, 527718, 185824, 164712, 768008, 1358026, 1217621, 685030, 714660, 1470015, 2105367, 2021175, 1602869, 1398807, 1233230, 734826, 290684, 641155, 1594489, 1981876, 1188505, 79576, -98994, 707117, 1508338, 1718981, 1697566, 1830342, 1876387, 1589270, 1348139, 1561808, 1845025, 1508843, 689218, 199865, 238426, 100511, -523612, -858203, -316611, 273035, -252702, -1481284, -1832817, -912721, -155139, -607347, -1250363, -518434, 1290410, 2361103, 1828040, 693961, 204000, 362780, 446647, 180955, -135999]
38714a35999p3403K18355L65738J99970k09944m34149k55433r1876k81872l39877
38704a038490K79526J020760Q60540l8289m55614K178L43222j13179o43069l93632
38694a76047K31097L50319M1544j042K40575K10616m4118J40895P89701R44796
38684B728336j7431j355682j765221r20429K33299O50623K78722j26174j2129
38675c06086M34805P29148O83832L66021k04102q91728j191957o78901L12799
38666g46169R60442R23164N35341O8057n07165r13506n64003M44257J073726O41307
38656A915451k39762o12920m83403m34564m59559j16167M17510M39868r4629l81796
38646d9971J5735M83284K56160n06309r79148p27429j14765K70463L07297L39662
$$ y = [-135999, -209402, 8953, 374691, 574661, 364717, -69432, -324865, -416741, -698613, -1038490, -758964, 261796, 1122336, 1084047, 628433, 630611, 973833, 860654, 217585, -176047, 55050, 405369, 446913, 445871, 686446, 897062, 852944, 993839, 1783540, 2728336, 2710905, 1355223, -409998, -1330427, -1097128, -446505, -167783, -293957, -306086, 128719, 857867, 1541699, 1907720, 1703618, 811890, -380067, -1058968, -746169, 214273, 1137437, 1672778, 1740835, 1233670, 320164, -243839, 200418, 1274144, 1915451, 1675689, 1062769, 579366, 144802, -314757, -430924, -13414, 426454, 331825, -49971, -34236, 449048, 705208, 198899, -780249, -1507678, -1622443, -1351980, -1044683, -705021]
38636g05021N68955O84323L10732l20654n59443k20089J84230K30413J06286R8791
38626C78523Q7769p8968j82173l8079J04204k209j70101j69909r5145L1499M24621
38615B90032Q80299P06539r0927m15687K86638R05006L00250p85511q91382k14037
38605I71220r8559n86944m36189M65339P56475M1329l26712L83064R72045L86234
38595B527302n44184o57463l36603m66420p06162k93050L52862L48179j1655J80284
38585C93090P25305O27270j72740p27367o07260k79638n3345K20964M28893K20592
38575G75764k20637l61419k37743l10913n01257l02711J99561L82819J50022N251
38565d21263O1635p2092l62071k76803K15569M95915L22849J50030K25287K11037
$$ y = [-705021, -136066, 548257, 858989, 538335, -21108, -241197, -56967, 173446, 279732, 378523, 466292, 387324, 205151, 167072, 271276, 269067, 98966, -70943, -166088, -134589, 290032, 1170331, 1876870, 1785943, 1370256, 1656894, 2561900, 2862150, 2076639, 1185257, 971220, 872661, 285717, -150472, 314867, 1071342, 1112671, 785959, 1169023, 2141068, 2527302, 1983118, 1325655, 989052, 522632, -183530, -476580, -123718, 224461, 212806, 393090, 1118395, 1745665, 1572925, 845558, 238298, -41340, -94685, 126279, 555172, 775764, 555127, 193708, -44035, -354948, -856205, -1158916, -959355, -576536, -426514, -421263, -359628, -431720, -793791, -1070594, -855025, -359110, -36261, 113769, 339056, 550093]
38555E50093p2636k95721k16014M7059L93632O76670L68982p34357j588984r31962
38545a803238O66886J216477J32552q75948m51157M15334J58993q80784j220660
38536b641545n82885O0962K71068M55992O44692L63668k36859l77525P5720M17531
38526a549181L71443M85856R37076R77466J67786o74262n44755K43010M81403
38517H95842j81581p51536l56684M50515M39544n16428j164986n96070M66213
38508a315171P26526J67453j32118J68782K35528k98125n07928K84162J214543
38499E43652J137950L88699J12054M03855M16067Q964p4752L22284M55884Q1077
38489C795734l3546N65073J212807J222455R00222Q25351Q49059N39402R8644
$$ y = [550093, 477457, 181736, -34278, 12781, 406413, 1083083, 1452065, 717708, -871276, -1803238, -1136352, 80125, 212677, -663271, -1114428, -699094, -540101, -1420885, -2641545, -3224430, -3163468, -2892400, -2436408, -1791716, -1428048, -1664907, -2042432, -1966712, -1549181, -1177738, -691882, 245194, 1222660, 1390446, 716184, 171429, 414439, 895842, 714261, -37275, -393959, 56556, 496100, -20328, -1185314, -1781384, -1315171, -588645, -421192, -553310, -384528, -149000, -447125, -955053, -670891, 543652, 1681602, 2070301, 2182355, 2586210, 3002277, 3011241, 2936489, 3258773, 3714657, 3795734, 3762188, 4327261, 5540068, 6762523, 7662745, 8488096, 9337155, 9876557, 9975201]
38480I975201J13284O93335J428534J953048K099486J774426J146209P22284P98168
38471B0703975J012924Q35344L00205j21948k19536k12788l30918n66701q20152
38462B0580405j023657j132019j151465j155826j209212j340155j548326j664888
38454A0354857j347042n81449n5600m28977j236010j280746l30766M44858J89443
38445E728568l80548k14290L43575J72955p19941j186668p58393k51285k99823
38436B434150m11048k8881L73225M7992p46513j050651n38552J69607M68590M13754
38426A131673L01446J29190k19420n38027m38436O1988L96373J11644m60184n32560
38416e6313P4928N90000K86045m84429p22384j03327O81379R31516P17007M36158
$$ y = [9975201, 10088485, 10781820, 12210354, 14163402, 16262888, 18037314, 19183523, 19905807, 20703975, 21716899, 22552243, 22852448, 22730500, 22510964, 22298176, 21967258, 21400557, 20580405, 19556748, 18424729, 17273264, 16117438, 14908226, 13568071, 12019745, 10354857, 9007815, 8426366, 8370766, 7941789, 6705779, 5425033, 5094267, 5539125, 5728568, 5348020, 5133730, 5477305, 5650260, 4930319, 3743651, 2985258, 2733973, 2434150, 2023102, 1994221, 2367446, 2415438, 1668925, 618274, 79722, 249329, 717919, 1131673, 1433119, 1562309, 1342889, 804862, 366426, 428414, 824787, 936431, 476247, -56313, 18615, 608615, 894660, 410231, -312153, -415480, 265899, 1197415, 1914422, 2350580]
38406B350580J24610l57487p71823o73415j05052K92880L253p38400j168184p96615
38396a839653P2118O50955N21577R2825O2176M92001P28443L29103k72496l24076
38386E12973K33323O95224N01034j48480o69195p80675o18948l78321j16447J51736
38376f17776M13596P14517J031860J077446N18813m62384j127152r77658l88470
38367A82792r1427k04149k34690L3234K46630J67371M5300N7176n0094l80449
38357b28306m93987q9146L80107L30049j02392l97206m10260j78356M86047J362006
38347F58556J376949Q514j307578p46504J022990J382491l89493j796572p40850
38338e31497J330339J616611J9550j101307n85457L31277M73816K93335M14683
$$ y = [2350580, 2475190, 2117703, 1345880, 672465, 567413, 860293, 863546, 125146, -1043038, -1839653, -1767535, -1116580, -595003, -502178, -440002, 51999, 780442, 1109545, 837049, 512973, 746296, 1441520, 1942554, 1794074, 1124879, 344204, -274744, -653065, -769512, -617776, -204180, 510337, 1542197, 2619643, 3138456, 2676072, 1548920, 571262, 182792, 91365, -112784, -347474, -314240, -67610, 99761, 145061, 202237, 152143, -228306, -722293, -811439, -431332, -101283, -203675, -600881, -1011141, -1189497, -703450, 658556, 2035505, 2044019, 736441, -10063, 1012927, 2395418, 2005925, 209353, -531497, 798842, 2415453, 2435003, 1333696, 748239, 1079516, 1553332, 1846667, 2261350]
38329B261350L65616k93432q38625m52612M03178O66411J68744l85770n16163
38320A378697k98233O6696L54936K55033k20455m99342j55307L98775M54160R947
38310A744907l26247k63739p2770J6502R8301K36281K74530R6779k12788m81711
38300A110045n22269k25914J68718J31241m71958r75062o71265K01403P71845
38291d83216P10641M69078L68115J63291k89328n91531m07338l6721K8560k01164
38281b69613l41261k16234K0248J75615J60507n743j35333p726K76144L34350
38271i046O8108j49807p8824L460j35348j70594K15019O39861N59587K12268K36394
38260A391078N00923K55705m83921p31556p9986N21580J89125n40619o49699k57290
$$ y = [2261350, 2626966, 2333534, 1494909, 1042297, 1445475, 2111886, 2280630, 1894860, 1378697, 1080464, 1147160, 1502096, 1757129, 1536674, 1037332, 882025, 1280800, 1734960, 1744907, 1418660, 1154921, 1082151, 1098653, 1196954, 1433235, 1707765, 1804544, 1591756, 1110045, 587776, 361862, 530580, 661821, 189863, -785199, -1456464, -1255061, -483216, 227425, 696503, 1064618, 1227909, 938581, 347050, -60288, -97009, -68449, -269613, -610874, -827108, -806860, -631245, -470738, -476481, -611814, -619540, -343396, -9046, 59062, -90745, -169569, -166109, -301457, -472051, -257032, 382829, 942416, 1154684, 1391078, 1892001, 2147706, 1663785, 932229, 852243, 1373823, 1562948, 1022329, 372630, 115340]
38250A15340k01133m27240q6907Q04087J122301L96240l73700k79670J31354o2436
38240A138236n29932k71829O25556J049169N89767N1396L9349J22202j41314l11647
38230B360953M2293K95061l90839j512598j598375k36310J184533J183217k528
38221A325407q81246o02906K48929O57945L60808j44481l63444k61217r8715o2565
38211A78515r0659k0223J03577M434l60117m86507Q2618Q81198Q75251l9604n99447
38200E29036J45210J298053J223345j27889j157867r28025k90460k96805o52361
38191b57763n41850m1036L04849N97725J141330J376765N31487q65064j382314
38182H64129o81052N6238p1354n34570m53357J14475N33377N39435K81644o3399
$$ y = [115340, -85793, -513033, -599940, 204147, 1326448, 1722688, 1348988, 1069318, 1200672, 1138236, 608304, 336475, 962031, 2011200, 2600967, 2652363, 2691712, 2813914, 2672600, 2360953, 2403246, 2698307, 2307468, 794870, -803505, -1039815, 144718, 1327935, 1325407, 444161, -158745, 90184, 748129, 1108937, 964456, 601012, 339795, 241080, 178515, 87856, 67633, 171210, 175644, -184473, -670980, -588362, 292836, 1168087, 1128483, 529036, 674246, 1972299, 3195644, 3067755, 1909888, 981863, 691403, 394598, -257763, -799613, -840649, -535800, 61925, 1203255, 2580020, 3111507, 2246443, 864129, 183077, 239315, 167961, -366609, -819966, -705491, -172114, 367321, 648965, 585566]
38172E85566k84121j93345J0710o8377l02409j49094L37630M32931k0354k36494
38162A12643J74402M90683J76596j26891J72242L79187k93473j098699p73370
38153g86680L37058P53269K41523O8220P49633J172620M87897n14686p19790l10582
38143A478482j85723n07000p16372n41267k23503M493J31433K27055L83590N50351
38133F01539L33342n46728j488672j425269l07471O08799M43516j38392j24264
38124b043600K61020J62203k61242k2861R76920J602797J094036O6919n16171
38115A320021o12777p45910r18793o26138J96682Q95246R30715N60695L85825
38106A385566M65286L04362k86055p69617n81525P4496N06378M06492J3994m27399
$$ y = [585566, 301445, 108100, 118810, 50433, -251976, -401070, -63440, 369491, 349137, 112643, 287045, 777728, 954324, 827433, 999675, 1378862, 1085389, -13310, -786680, -449622, 303647, 545170, 613390, 1363023, 2535643, 3023540, 2508854, 1789064, 1478482, 1292759, 785759, 69387, -471880, -695383, -690890, -559457, -332402, 51188, 601539, 934881, 388153, -1100519, -2525788, -2833259, -2224460, -1780944, -1919336, -2043600, -1782580, -1620377, -1881619, -1904480, -927560, 675237, 1769273, 1836192, 1320021, 707244, -38666, -957459, -1583597, -1386915, -491669, 439046, 999741, 1385566, 1850852, 2155214, 1869159, 1099542, 518017, 592513, 1098891, 1505383, 1519377, 1091978]
38096A091978q19641q82432l48077L84389M74101j71936n73598j6889Q32817Q08242
38086G78954j09417p49621l19519O02802Q30930j4121j087666j273069m35448
38077a776175M39632M66355o0522j99424K73530P08299P03581N31293L25941j73859
38067A238651p37255n49574L86059Q00072k7048r74106p14649K14174L43715l61885
38057c81846o38428r7860L55198K77741K97699P32587J016547Q59366O81912N32336
38047C635252j26144j117290j392663p28758k25406m36514m35906L48959Q39154
38038C60684J05626q23153n11086N24867P22618M7807j67797L84483N90472o9734
38028A164787p58285p98040n28995k98745J22529P00768Q52066M38097L8610j25531
$$ y = [1091978, 272337, -610095, -958172, -573783, -99682, -271618, -845216, -862105, -29288, 778954, 669537, -80084, -399603, 203199, 1034129, 1020008, -67658, -1340727, -1776175, -1336543, -870188, -930710, -1130134, -856604, -148305, 555276, 1086569, 1412510, 1238651, 501396, -48178, 337881, 1137953, 1110905, 136799, -577850, -363676, -19961, -381846, -1020274, -1118134, -762936, -485195, -187496, 545091, 1561638, 2421004, 3102916, 3635252, 3509108, 2391818, 999155, 270397, 44991, -391523, -827429, -478470, 360684, 466310, -356843, -867929, -343062, 379556, 427363, 259566, 644049, 1234521, 1164787, 406502, -391538, -920533, -1219278, -1096749, -395981, 456085, 894182, 932792, 807261]
38018H07261m88773r93914q19655J71204Q36978L79988m06274l81351K66551N20338
38008a07647P7580n13301p82318o09253j5778O03632N47870j92416n93644k9247
37998a614522O47879M21890j90767k3163O99907P07251j40420n97928r1838M73438
37988B91727L45824j3209m7527l6630k31466j95821K16949K79940l40597p19754
37978d50564r8936O98464M67639m48168p43097k08908J74687K2100K7930N52770
37968f083R66962P58607L02328J07246R0290q183j45114k52405m18875n38349
37958H56424l45429L539J3865k90134k95976J51830M04319R0347k22313J3048
37948C79520L90493K47499k48283m32672j95689M20o5935j49474n287L61797P75445
$$ y = [807261, 318488, -675426, -1495081, -1323877, -486899, -106911, -513185, -894536, -627985, -107647, -30067, -543368, -1325686, -1934939, -1950717, -1347085, -799215, -991631, -1585275, -1614522, -966643, -544753, -735520, -758683, -58776, 648475, 508055, -89873, -181711, 291727, 637551, 624342, 576815, 540185, 308719, 112898, 329847, 609787, 269190, -450564, -549500, 148964, 616603, 168435, -574662, -783570, -608883, -586783, -558853, -6083, 960879, 1719486, 2021814, 2129060, 2219350, 2211167, 2066053, 1813648, 1394773, 856424, 510995, 514534, 528399, 238265, -57711, 94119, 498438, 588785, 366472, 379520, 770013, 1017512, 769229, 336557, 140868, 141288, 75353, -74121, -79408, 282389, 1057834]
37937A057834R00225M32149m17938r61189q58053n08687l20654j44068J44301
37928f76080J57175k69346m84553M2627P39317P59616L02635J05648P9975l59837
37918C97177r14990p09062P2657K53135m17824p87328j87197N01362L63322j07457
37908a536205R009M99926M65045j98255o92579m63708K52444Q73518R80193N63394
37898G52782R5700J10641N00912O12395J99696k41492k97636j56088l8929J55581
37888A693562L05022l2925p15767q84512l08941O5487l55170p31919k17540N01268
37878f81435L60660j78328Q3559Q99857Q66245k30667j004896o21518J36155L75161
37868D793L45538N66491P73604M71380j76211n96989m71066J40591P96838P37739
$$ y = [1057834, 1958059, 2390208, 1972270, 1011081, 153028, -355659, -676313, -820381, -676080, -518905, -788251, -1272804, -1230177, -490860, 268756, 571391, 677039, 757014, 397177, -517813, -1226875, -1154218, -901083, -1318907, -2106235, -2293432, -1792070, -1428748, -1536205, -1527196, -1027270, -562225, -760480, -1453059, -1916767, -1664323, -790805, 189388, 752782, 848482, 959123, 1460035, 2072430, 2272126, 2030634, 1732998, 1576910, 1537981, 1693562, 1998584, 1965659, 1249892, 365380, 56439, 121926, -233244, -965163, -1182703, -681435, -320775, -499103, -415544, 484313, 1350558, 1119891, 114995, -506523, -370368, 4793, 350331, 916822, 1690426, 2161806, 1985595, 1388606, 917540, 1058131, 1854969, 2592708]
37858B592708l14275j367107j105619K30234R74148L27842o19814o53659m7812
37849A6646L08662L48228M59592N10884K11327j53454k12956k05177m19326n34437
37839C29989k78376j02822l65620n13495k8203M81563K28519l20988k07275L22110
37829d54598K56555l49703m80960p83J30641l69200n91787p4002M19644K96580
37819a217613R1253L59499O92913N58265J87129q2900m70207j016532j066250
37810a964443l17827M00624L25770N773L35423R72553Q76139J9942o05821n06408
37800d58275j08550K11912M67153M54586j08881p48253n71251L23133P70525K15887
37790D47986m86044m17884J27349L44269J57890L4561P2012J9093j26005j81801
$$ y = [2592708, 2278433, 911326, -194293, 35941, 1010089, 1337931, 718117, 64458, 16646, 325308, 673536, 1133128, 1644012, 1855339, 1701885, 1488929, 1283752, 864426, 329989, 51613, -51209, -416829, -930324, -958527, -476964, -248445, -569433, -776708, -454598, -198043, -547746, -1028706, -1029489, -898848, -1268048, -1859835, -1933837, -1514193, -1217613, -1126360, -766861, -73948, 484317, 671446, 588546, 118339, -898193, -1964443, -2282270, -1881646, -1555876, -1550103, -1214680, -242127, 634012, 653954, 48133, -458275, -566825, -354913, 112240, 566826, 457945, -290308, -861559, -538426, 232099, 447986, -38058, -455942, -328593, 15676, 173566, 208127, 280139, 299232, 173227, -8574]
37780h574j94642k36053p5052L85216O52899K91140k35969j31412M49909N53852
37770A451314o1810m84339p1023N10945L05349m73426q21375m81573j99772m14463
37760g40173n63837q8542N52504N31040n4761l21629J2330K09207k32154o63089
37750a359104k73839N31146O44613m4078m58809r440N21984K70726l58832l99250
37740i34883J91994O41130O25198N04634M24528J23840k99764l42104l3970q4967
37730H15636p22697j160242p22269J51345O09010N51076M47119M26400K67079
37721F62457L1154R252J34146M9484k64753m31166k31347J61855M45157L63173
37711I29412j77889q05913p89599L8357P78368N63199j08681l2605P90930R81242
$$ y = [-8574, -203216, -439269, -514321, -129105, 523794, 814934, 578965, 447553, 897462, 1451314, 1389504, 905165, 834142, 1345087, 1650436, 1177010, 355635, -125938, -325710, -740173, -1304010, -1392552, -840048, -309008, -363769, -685398, -673068, -463861, -696015, -1359104, -1632943, -1101797, -457184, -501262, -960071, -969511, -447527, -176801, -535633, -934883, -742889, -101759, 523439, 1028073, 1452601, 1576441, 1276677, 934573, 900603, 815636, 92939, -1067303, -1789572, -1638227, -1029217, -478141, -31022, 395378, 662457, 693611, 702863, 837009, 886493, 621740, 190574, -40773, 121082, 566239, 929412, 751523, -54390, -843989, -805632, -27264, 535935, 427254, 394649, 1185579, 2166821]
37701B166821j77662j517907j491071k16421P87954N96500j86774m69449j3877
37692e21886N15387N20609J28776j65777k65259n15258r46257r57958j63905Q20578
37682a550950J043219M74417n8010q3569J00910K21261L95161N57804L39690k01593
37672A238340m83939l35676k58659m37200l47336K01288N41231K57302p7886J6893
37662C14358M9465l66540n04129K36348R00915K35554j167272j528040m55454
37653b284795O64835Q30588M71115J83958r2104k73579J15774Q63730R75499K26926
37643A681947l66668k24568r3514n01124o07277K93520J220528Q31929m41303
37634A793470j021438n07974L6575n0919k56820r9905Q6263m9950k13705m5753
$$ y = [2166821, 1989159, 471252, -1019819, -1236240, -448286, 148214, -38560, -508009, -521886, -6499, 514110, 642886, 477109, 211850, -303408, -1249665, -2207623, -2371528, -1550950, -507731, -33314, -91324, -174893, -73983, 147278, 542439, 1100243, 1439933, 1238340, 754401, 418725, 160066, -277134, -624470, -423182, 118049, 375351, 297465, 314358, 363823, -2717, -506846, -270498, 630417, 865971, -301301, -1829341, -2284795, -1619960, -789372, -318257, -134299, -226403, -499982, -384208, 479522, 1455021, 1681947, 1315279, 1090711, 997197, 496073, -111204, 182316, 1402844, 2234773, 1793470, 772032, 264058, 300633, 249714, -7106, -107011, -20748, -70698, -284403, -330156]
37624c30156K68178L71556K78411K29637L06506L69874J84801l80285j043262
37615B55260j177687n80189O3752L8824k87792J8913Q84842J108377J23613r92338
37605e44425r08522J60590Q31711M51568j95722j53490M16686N97392J8756o88956
37595a4412p49800j71146M00016N29747L61018J64510o9936m02527o04125l72606
37585i29261K01758O36643N35987k1025n25073m72898R4452N29954L15711k15610
37575A50638l36535o0837j20144o21081o17860L86613J346064J031860r1188n07159
37565E60371J29125O72272L82757j49278k88608l45755o67648p58537j50665N77034
37555c8932N64885m758k36636R2599L30549O1943l40622l97767j58686O1226J55615
$$ y = [-330156, -61978, 309578, 587989, 817626, 1124132, 1494006, 1678807, 1298522, 255260, -922427, -1502616, -1438864, -1400040, -1687832, -1668919, -784077, 324300, 447913, -544425, -1452947, -1292357, -460646, -9078, -204800, -358290, 58396, 655788, 674544, -14412, -764212, -935358, -535342, -5595, 355423, 519933, 449997, 47470, -556655, -929261, -727503, -90860, 445127, 424102, -100971, -573869, -479417, 50537, 366248, 150638, -185897, -246734, -366878, -987959, -1605819, -1219206, 126858, 1158718, 1067530, 560371, 689496, 1361768, 1744525, 1595247, 1306639, 960884, 293236, -465301, -615966, -38932, 525953, 521195, 284559, 377158, 707707, 769650, 429028, 31261, -127425, -66199, 89416]
37544H9416J85119J21523j02174l70608m19546j52263J70521J99713l9151j61202
37534d78652N537J65132J07657J28164M21717M58444k61543j069997p80528M61273
37524h42796J112554L99146n72367n32757J66100M30508J97167J26695J61920
37515F46170k34392p13600l39945P16921J121768K96444p49104r21037l63648
37506e40423K04813N39760O56097L82343j85113m30782q6001K34755J0551k86107
37496D99893m1421L20906m182p32508p79773M6139P14696N22137M402q9595R5294
37485E55988K7777k08997j39525J96681K46658k07543p33579q37798m90783Q413
37475a582708L94984N64240N42250M32761L04691J45663J1691P9837L35916L74823
$$ y = [89416, 274535, 396058, 293884, -76724, -496270, -648533, -478012, -278299, -317450, -478652, -473115, -307983, -200326, -72162, 349555, 807999, 546456, -523541, -1304069, -842796, 269758, 668904, 96537, -436220, -270120, 160388, 357555, 484250, 646170, 411778, -301822, -641767, 75154, 1196922, 1493366, 744262, -176775, -540423, -335610, 204150, 860247, 1242590, 1057477, 626695, 540694, 775449, 786000, 499893, 458472, 779378, 775196, 42688, -737085, -690946, 23750, 545887, 550289, 460694, 555988, 583765, 374768, 235243, 431924, 678582, 471039, -262540, -1100338, -1591121, -1582708, -1187724, -623484, -81234, 351527, 656218, 801881, 813572, 893409, 1229325, 1604148]
37465A604148j03994o71820n54299K49178P87446M20774k58454l03069J95548
37456A365458L33299j52626n02770j59488L99469M49001N1826k11015j48639m5866
37446A378649n7753l9584P6467J37491K1104k10961l85685l18112J8478L19681
37436I39775K09635j97098l62239j29862L6046q9630m5613L75933M47881l79701
37426H05127j268536j007845J15839P22373M53432K74080N60004M40282m38826
37417F55930j002266m94006J68501n9425n47759j32756P65848P78332q9907m30340
37407c87848K73146Q63000L75597n91323r37114n10447R7414M83765N89144M41430
37397F96764K09347J42383J98053J21817j678J62593M47319K24286n44168j014205
$$ y = [1604148, 1500154, 828334, 274035, 523213, 1310659, 1731433, 1472979, 1169910, 1365458, 1698757, 1546131, 1043361, 883873, 1283342, 1732343, 1784169, 1573154, 1424515, 1378649, 1320896, 1281312, 1357779, 1495270, 1516374, 1305413, 919728, 601616, 620094, 939775, 1149410, 952312, 590073, 460211, 496257, 406627, 361014, 736947, 1184828, 805127, -463409, -1471254, -1355415, -633042, -179610, 94470, 654474, 1094756, 655930, -346336, -840342, -671841, -731266, -1279025, -1411781, -645933, 132399, 42492, -387848, -114702, 748298, 1123895, 532572, -404542, -914989, -817575, -333810, 255334, 696764, 906111, 1048494, 1246547, 1368364, 1366686, 1529279, 1976598, 2200884, 1656716, 642511]
37387F42511o09519J86550O15295N91563L86516j0652n93583q95817n11090K58953
37377F0727Q02242R13120O75279R3952o13637q47793m02092K3375k15813o71384
37367a82024n37034j2818L5389m76131p84619n65540k32491M4902N21817R47953
37357a240596O21484k80156n55683K84287J169692J047647L46778J2227n1805
37348A353875m81251j012914p88156J50881Q20823P47613M59548M28438M32455
37339B111312K08540m6721j43135k29771l67230l36690j53281j92061m71509m01237
37329b1783K91211R06290O61052j23738m29074J1472L95062R6748m25034l58699
37319A003507K49151N64208J48291m53740m81500P7892O21006P61661N87392K12035
$$ y = [642511, 32992, 219542, 834837, 1426400, 1812916, 1802264, 1208681, 312864, -198226, 60727, 862969, 1776089, 2451368, 2545320, 1931683, 1083890, 681798, 705173, 489360, -182024, -719058, -731876, -696487, -1172618, -1957237, -2522777, -2755268, -2710366, -2188549, -1240596, -619112, -899268, -1454951, -1170664, -972, 1046675, 1393453, 1405680, 1353875, 872624, -140290, -928446, -777565, 43258, 790871, 1250419, 1678857, 2111312, 2319852, 2273131, 2129996, 1900225, 1532995, 1196305, 1043024, 850963, 379454, -21783, 269428, 1175718, 1836770, 1713032, 1283958, 1295430, 1690492, 1787240, 1362206, 1003507, 1252658, 1816866, 1965157, 1511417, 1029917, 1107809, 1728815, 2490476, 3077868, 3289903]
37309C289903l53795q05721o45002R703K89756k39160p74628l69395N54369O96279
37299A652309k30294j078408r13214j68002K30906J13852q9219j40720m1591K54534
37289d09847O11402N83834O1133l41720j16354K70985J8021p51258j090318n28793
37279a692915L82300Q59110O91598K20205n5469J66230O58622P74252K35977l86922
37269A852988m38392j13638j7770r1823J67234N70112L38244n53082j144699q99779
37259c30605l93470k02751n9974L25557N18681J88351r9600J95086N23678J05067
37249G70020o51356o82291N1514N54314L89517J65441K80456K40945l61551j021939
37239b64930r92649k41508O74074J250640J242209O72280k5433k59173O3660N11927
$$ y = [3289903, 2936108, 2130387, 1485385, 1495088, 1784844, 1545684, 771056, 401661, 956030, 1652309, 1422015, 343607, -569607, -737609, -506703, -392851, -482070, -622790, -664381, -409847, 201555, 785389, 846522, 504802, 388448, 659433, 677454, -73804, -1164122, -1692915, -1310615, -451505, 240093, 460298, 404829, 571059, 1229681, 2003933, 2239910, 1852988, 1414596, 1300958, 1283188, 1191365, 1358599, 1928711, 2266955, 1713873, 569174, -330605, -724075, -926826, -986800, -661243, -142562, 45789, -53811, 141275, 664953, 770020, 118664, -563627, -512113, 42201, 431718, 597159, 877615, 1118560, 757009, -264930, -1257579, -1499087, -825013, 425627, 1667836, 2340116, 2314683, 2055510, 2119170, 2631097]
37229B631097R10363J531516K187393J881658J07408j993148k682909j707876
37221B865502m75620j35958l65421l45539p9892n4967j67110Q6558N11187K75333
37211B114073o95246j246748n09756P37223J029571J94090n80747n65104l09553
37202A67803l84184l83687J24172N42250J26004o39006o50500Q2921M56190o20
37192e58657n02587l44675J40479L57695L22771K54425K1044m14846n68599o2227
37182a355177P17695J111871J000250O93276L79873J06621n4657k11703o29215
37173A758834j132941j042940j81445N81721M00953l84698q13241n92803j35984
37164a542544K74350N60630M59593p6887l85276R5815P76581O70588k7898k63055
$$ y = [2631097, 3541460, 5072976, 7260369, 9142027, 9249435, 7256287, 4573378, 2865502, 2389882, 2253924, 1888503, 1542964, 1463072, 1408105, 1240995, 1327553, 1838740, 2114073, 1418827, 172079, -337677, 399546, 1429117, 1623207, 1042460, 477356, 167803, -216381, -600068, -475896, 66354, 192358, -446648, -1097148, -1014227, -558037, -558657, -1061244, -1405919, -1265440, -907745, -584974, -330549, -309505, -724351, -1292950, -1355177, -637482, 474389, 1474639, 2167915, 2547788, 2654409, 2599752, 2388049, 1758834, 625893, -417047, -598492, -16771, 384182, -516, -813757, -1406560, -1542544, -1268194, -707564, -247971, -324858, -710134, -614319, 162262, 832850, 804952, 541897]
37154E41897Q7121M5111o59114r59207j45674R66919J255079P45222J61675j75759
37144A863270k89595q7989L16847M38105J82379J40180N12741N38361k42072r63866
37134B408361o83536N2193N9031n68499o78233O1107P78135Q50210N61288K46421
37124C086478j24582l79527j98764R1163k22214j001421j298025q32027l49071
37115a227990k25475Q0348P15526Q43065J29658l58504K21199R66007N68987n68682
37105A144139r55989k98830K71612J30835q8459J18744K60716j25588n48018l18501
37095d09339L79586P97407O17210J42394k65495n18658o67098p06499n33477o4419
37085a228388N19488P54868L80171k33538m60544k05146L7054r0712l74145l86187
$$ y = [541897, 629018, 674129, 15015, -944192, -1089866, -122947, 1132132, 1877354, 2039029, 1863270, 1573675, 1485686, 1802533, 2240638, 2423017, 2563197, 3075938, 3614299, 3372227, 2408361, 1724825, 1777018, 1836049, 1267550, 589317, 650424, 1428559, 2278769, 2840057, 3086478, 2961896, 2582369, 2383605, 2474768, 2252554, 1251133, -46892, -878919, -1227990, -1453465, -1373117, -657591, 185474, 315132, -43372, 177827, 1143834, 1712821, 1144139, 188150, -110680, 160932, 291767, 203308, 322052, 582768, 457180, -90838, -409339, -29753, 767654, 1384864, 1527258, 1261763, 743105, 76007, -630492, -1163969, -1228388, -708900, 45968, 426139, 192601, -267943, -473089, -436035, -526747, -900892, -1287079]
37075a287079K1623O16846R18167N15241l92833r10621l96111N77360Q20031J15222
37065E97846m97927k43134L14631J71546o66393j205150o85921O15841J653166
37056E4505J479760J50616j115644j104352p4173N41623J22062l08603J95316
37047e8890Q66571M00497q25816j108405O1970J198221R40393j50611o34553k17414
37037D71963J65205j06628o02285o63360k99151p384m4979j83943j35999J8855
37027a387706q91j66002j13810K24910L49863p3431n07841j82040O83247J017676
37017a56025L98402l26563k67089L01322M98992J22966k92099l95965l08570j04968
37007e29597K88609O27728M26442k74574p48159n10600K0268J98706J20933L54518
$$ y = [-1287079, -1265456, -648610, 269557, 784798, 391965, -518656, -914767, -337407, 482624, 597846, 99919, -143215, 171416, 342962, -323431, -1528581, -2214502, -1598661, 54505, 1534265, 1684881, 569237, -535115, -609288, -67665, 54397, -254206, -58890, 807681, 1208178, 382362, -726043, -664073, 534148, 1474541, 1323930, 689377, 471963, 637168, 530540, -71745, -735105, -1034256, -1041640, -1086619, -1270562, -1406561, -1387706, -1388597, -1554599, -1668409, -1443499, -1093636, -1167067, -1674908, -1856948, -1173701, -156025, 242377, -84186, -351275, -49953, 449039, 572005, 279906, -116059, -424629, -529597, -240988, 386740, 813182, 538608, -209551, -720151, -699883, -501177, -380244, -25726]
36997b5726Q58468Q59921J260r57216j032929k97939K81121J64705j83166j42761
36987d74262J98247L63330K71795K62874N23001Q60916R48099N30040l95929j321815
36977A766296j442252n76018L73228M28930j83093m36224n1970J97593j51092
36968g4602m86734j35861N86543R12302O80020K69713j14157m76497o26382l55586
36958A78759R6657K67683J04705k7243R0744L03304L66080K00657o0962j39545
36948A380839Q9067K64470r1965p20628p28171O5972N72104p7706j068747r28599
36938a243364K98743J031603L43267q77957j267700o16076K87081P65384O96712
36929e82307K87908j06042j64488R5738L52117L96789K79493N4110k29051l01841
$$ y = [-25726, 832742, 1692663, 1693923, 736707, -296222, -594161, -313040, -148335, -331501, -474262, -276015, 87315, 359110, 621984, 1144985, 2005901, 2954000, 3484040, 3088111, 1766296, 324044, -251974, 121254, 550184, 367091, -69133, -121103, 76490, -74602, -561336, -697197, -110654, 801648, 1481668, 1751381, 1637224, 1160727, 534345, 178759, 275416, 543099, 647804, 620561, 711305, 1014609, 1380689, 1581346, 1520384, 1380839, 1469906, 1734376, 1642411, 921783, 193612, 259584, 831688, 753982, -314765, -1243364, -944621, 86982, 430249, -447708, -1715408, -2331484, -2044403, -1279019, -582307, -294399, -400441, -564929, -469191, -117074, 279715, 559208, 613318, 384267, 82426]
36919H2426N1570M78832L81273j70567m61665j97125J43951K09092K44433L36199
36909A098419L8849o70790q85194l7202R51239P85457l10396q76876k96521M51247
36899B48232L22010l74829n58007J35464R37572Q81627j18423j132305j172044
36890h30703l05981M20164L24423o4532P1912N07177L32995n09672j000229n23946
36880a578392K81075N85655N09337N61881N82266J22147m64158l45433L59543
36871F13921N05848l65057j147273o89813M90230R42353L40274k75838k43637
36862A71008r1239k94549l62530J30952N39877J50972m79908l36388L41182M05294
36852A74671k86186o20633m3017O27345N82003J26224j15685j17367L337M39017
$$ y = [82426, 133996, 612828, 994101, 823534, 361869, 164744, 308695, 517787, 762220, 1098419, 1137268, 466478, -418716, -455918, 495321, 1280778, 970382, 93506, -203015, 248232, 570242, 195413, -362594, -227130, 710442, 1592069, 1473646, 341341, -830703, -1136684, -716520, -392097, -456629, -384717, 122460, 455455, -54217, -1054446, -1578392, -1297317, -711662, -202325, 359556, 941822, 1063969, 599811, 254378, 613921, 1119769, 754712, -392561, -1082374, -592144, 350209, 690483, 414645, 171008, 79769, -214780, -577310, -446358, 93519, 244491, -235417, -571805, -230623, 174671, -111515, -732148, -775165, -147820, 434183, 560407, 444722, 327355, 330692, 769709]
36842G69709J042527J075237L22720l25453j57497K81844K07937j12800n5417
36833C048807J31580q8021l52268m1884L87828N1505p23069p98401j30044J50390
36823A636423l91977r00911p18713k13264J71103N05902O91301L29465l21534
36814G87795l80703K32668N13440K204m23727j8836O45517P21030L54930J16046
36804B550364n065k04666k42942k0415n4899n93230r66028o15260p751K88309
36794A28417N70507J074268J018344j32845j240170q63430M35312P99980j39932
36785A650451q92895n73303m8690j93214n34098l74953j8370J8546L7314M55768
36775d73444P96204L75595m22214n26614K88114J042097Q30026p5853o32497k74592
$$ y = [769709, 1812236, 2887473, 3210193, 2884740, 2727243, 3009087, 3217024, 3104224, 3048807, 3180387, 3092366, 2740098, 2698214, 3086042, 3137547, 2414478, 1616077, 1486033, 1636423, 1244446, 343535, -375178, -588442, -417339, 88563, 779864, 1109329, 787795, 407092, 639760, 1153200, 1155404, 731677, 712841, 1358358, 2079388, 2434318, 2550364, 2545299, 2340633, 2097691, 2077276, 2022377, 1429147, 463119, -152141, -159892, 128417, 698924, 1773192, 2791536, 2658691, 1418521, 555091, 990403, 1790383, 1650451, 757556, 184253, 135563, -57651, -591749, -966702, -985072, -966526, -929212, -473444, 322760, 698355, 276141, -250473, 37641, 1079738, 1909764, 1833911, 1201414, 926822]
36765I26822M95814P85738L96002o1716j48495j94298n49370p64410k53291N29264
36755A162060N10087m05356j102031q38877j69252J11665J06780L13836O35077
36746C23989N92961J37488l85703p91338j036505r01211k39100N89385J000444
36737g09590Q30240L69891q2706l73368l85491j71014n8439k64906n02777l21914
36727a670074K33948O52386O01217K53923l4642j34108j85581l77968o72503p26075
36717b059477k46703N20346R23838O71091J79373m4310o4070k40482n61430o61770
36707a583594l92277K975K47382L04469L25969M96676Q15683R17651L87887n42266
36697I80555r95767n19504K09941K53226l42621p88708p71026o14451l57464L47392
$$ y = [926822, 1422636, 2208374, 2604376, 2542660, 2394165, 2199867, 1650497, 886087, 632796, 1162060, 1672147, 1266791, 164760, -674117, -843369, -731704, -624924, -311088, 323989, 916950, 1054438, 668735, -122603, -1159108, -2060319, -2299419, -1710034, -709590, 120650, 490541, 407835, 34467, -351024, -522038, -580477, -845383, -1348160, -1670074, -1436126, -783740, -182523, 71400, 36758, -97350, -282931, -660899, -1333402, -2059477, -2306180, -1785834, -861996, -190905, -11532, -55842, -119912, -360394, -921824, -1583594, -1975871, -1972896, -1725514, -1421045, -1095076, -598400, 217283, 1134934, 1522821, 980555, -15212, -534716, -324775, -71549, -414170, -1202878, -1973904, -2588355, -2945819, -2598427]
36687b598427J221428J257792J76597q34962n98412M23917Q52251L70819l0421
36678B40582K53853N56370J11816o81672q14320o8700P46076Q23964J49505o91902
36668F25572j084752p55203N3770O77994N93622J7065k83578Q8431O46502O30242
36658A209665m4069p07061p56150k95661J00506Q4030j36494j07296L11743P31041
36648C90254O11440j10863q50888r42819l70023K13355K46180j02627k30192M7511
36638a098672K45073l7234l94308q5136Q16635J291232O84224l10972n23379J16028
36628G03491N68212K28820l01597k57431J82180L40610J07654p0677N28P3702
36618A575492k8279k20144m34067o54206p02294l93848J03980M32068N23070N68256
$$ y = [-2598427, -1376999, -119207, 57390, -777572, -1375984, -952067, -99816, 271003, 240582, 494435, 1050805, 1162621, 480949, -333371, -402071, 344005, 1167969, 1317474, 625572, -459180, -1214383, -1160613, -482619, 111003, 128068, -155510, -67079, 579423, 1209665, 1165596, 458535, -297615, -593276, -492770, -408740, -545234, -652530, -340787, 390254, 1001694, 890831, 39943, -902876, -1272899, -1059544, -813364, -915991, -1146183, -1098672, -853599, -890833, -1285141, -1370277, -553642, 737590, 1421814, 1110842, 587463, 703491, 1271703, 1500523, 1198926, 941495, 1123675, 1464285, 1571939, 1501262, 1501790, 1575492, 1547213, 1327069, 893002, 238796, -463498, -857346, -753366, -321298, 201772, 770028]
36608G70028N58445K74253k41426n81466m39226N9963M95804M54746j47033q14838
36598C89250q24103j54137K96555n8392m68392J40940J394147J733260N29110
36589B978238j058820j628998j094150l00151J50891J93886j227j28920N7224
36580h32027L41838K65877p6249l9307N57213J073278R82350M84433q2635o72338
36570B002433j056717q13674k16760j73140p26847p05751L71101J195975O03346
36561D79966m47264k72041R04930J360122N28107m03558n14680k35049j89974
36552A210559k80838k80563l03990l55356k40310q9300j88536l17481j22282K4937
36542i43160l80170p34205n6700J101869J114316j20040p84018L3370Q74354K99269
$$ y = [770028, 1328473, 1602726, 1361300, 779834, 340608, 400571, 896375, 1351121, 1204088, 389250, -434853, -588990, -292435, -350827, -819219, -678279, 715868, 2449128, 2978238, 1919418, 290420, -803730, -1103881, -952990, -759104, -760331, -889251, -832027, -490189, -224312, -300561, -339868, 217345, 1290623, 2272973, 2757406, 2674771, 2002433, 945716, 132042, -84718, -257858, -984705, -1690456, -1319355, -123380, 479966, 32702, -239339, 665591, 2025713, 2553820, 2150262, 1635582, 1400533, 1210559, 929721, 649158, 345168, -10188, -250498, -339798, -528334, -845815, -968097, -943160, -1323330, -2057535, -2114235, -1012366, 101950, -18090, -802108, -768738, 105616, 404885]
36532D04885q28059q25549K19796Q77534O04279P4433k29412m15058m62321k61003
$$ y = [404885, -423174, -1248723, -1028927, -151393, 452886, 527319, 297907, -117151, -579472, -840475]
$$ [...]
##END NTUPLES=NMR SPECTRUM
##END=
