##TITLE=31Pdec_IBPM1709
 CDCl3, 24 sc
 18.9.2019
##JCAMPDX= 6.0         $$ Bruker NMR JCAMP-DX V2.0
##DATA TYPE= NMR SPECTRUM
##DATA CLASS= NTUPLES
##ORIGIN= UXNMR, Bruker Analytische Messtechnik GmbH
##OWNER= root
$$ XWIN-NMR		Version 3.5
$$ Wed Sep 18 13:51:11 2019 Russian Standard Time (UT+4h)  she@DPX200
##.OBSERVE FREQUENCY= 81.013821
##.OBSERVE NUCLEUS= ^31P
##.ACQUISITION MODE= SIMULTANEOUS
##.ACQUISITION SCHEME= undefined
##.AVERAGES= 24
##.DIGITISER RES= 17
##SPECTROMETER/DATA SYSTEM= spect
##.PULSE SEQUENCE= zgpg30
##.SOLVENT NAME= CDCl3
##.SHIFT REFERENCE= (INTERNAL, CDCl3, 0, 182.463)
##AUDIT TRAIL= $$ (NUMBER, WHEN, WHO, WHERE, WHAT)
$$ ##TITLE= Audit trail, XWIN-NMR		Version 3.5
$$ ##JCAMPDX= 5.01
$$ ##ORIGIN= Bruker BioSpin GmbH
$$ ##OWNER= she
$$ F:/spectra/data/she/nmr/P31/1/pdata/1/auditp.txt
$$ ##AUDIT TRAIL=  $$ (NUMBER, WHEN, WHO, WHERE, WHAT)
(   1,<2019-09-18 13:50:16.00 +0400>,<she>,<DPX200>,
      <created by zg, POWCHK disabled, PULCHK disabled
       configuration hash MD5:
       00 E9 B6 7A A2 85 ED C7 34 08 36 98 17 FE 4E 26
       data hash MD5: 32K
       FE 60 88 9F 89 AE 14 A5 44 06 DB ED D3 39 E8 FF>)
(   2,<2019-09-18 13:50:18.42 +0400>,<she>,<DPX200>,
      <Start of raw data processing
       efp BC_mod = 2 LB = 1 FT_mod = 6 PKNL = 1 PHC0 = -393.6988 PHC1 = 107.2003 SI = 64K 
       data hash MD5: 64K
       AF D2 1F 6C 10 DD 5D A7 F1 0D 06 E7 B8 2C C8 E9>)
(   3,<2019-09-18 13:50:29.34 +0400>,<she>,<DPX200>,
      <pk PHC0 = -0.613618 PHC1 = -3.4 
       data hash MD5: 64K
       7E 6A FD 8D 48 F7 D7 64 D6 12 CA 48 F6 B0 6D FD>)
(   4,<2019-09-18 13:50:32.50 +0400>,<she>,<DPX200>,
      <abs ABSG = 5 
       data hash MD5: 64K
       D2 19 9C E7 78 81 B5 EB 7C AB C2 08 0B 96 38 DE>)
$$ ##END=
$$ 
$$ hash MD5
$$ 4E 69 49 D7 A2 F8 62 5E 6C 43 15 40 87 9A A1 83
##$RELAX= 
##$RELAX= 
##$RELAX= 
##$RELAX= 
##$RELAX= 
##$RELAX= 
##$RELAX= 
##$RELAX= 
$$ Bruker specific parameters
$$ --------------------------
##$DU= <F:/spectra>
##$EXPNO= 1
##$NAME= <P31>
##$PROCNO= 1
##$TYPE= <nmr>
##$USER= <she>
##$AMP= (0..31)
100 100 100 100 100 100 100 100 100 100 100 100 100 100 100 100 100 100 
100 100 100 100 100 100 100 100 100 100 100 100 100 100 
##$AQSEQ= 0
##$AQ_mod= 1
##$AUNM= <au_zg>
##$AUTOPOS= <>
##$BF1= 81.014009
##$BF2= 200.13
##$BF3= 200.13
##$BF4= 200.13
##$BF5= 200.13
##$BF6= 200.13
##$BF7= 200.13
##$BF8= 200.13
##$BYTORDA= 1
##$CFDGTYP= 0
##$CFRGTYP= 5
##$CHEMSTR= <none>
##$CNST= (0..31)
1 1 145 1 1 1 1 1 1 1 1 1 1 1 1 1 1 1 1 1 1 1 1 1 1 1 1 1 1 1 1 1 
##$CPDPRG= <waltz16>
##$CPDPRG1= <>
##$CPDPRG2= <waltz16>
##$CPDPRG3= <>
##$CPDPRG4= <mlev>
##$CPDPRG5= <mlev>
##$CPDPRG6= <mlev>
##$CPDPRG7= <mlev>
##$CPDPRG8= <mlev>
##$CPDPRGB= <>
##$CPDPRGT= <>
##$D= (0..31)
0 1 0 0 0 0 0 0 0 0 0 0.03 2e-05 3e-06 0 0 0 0 0 0 0 0 0 0 0 0 0 0 0 0 
0 0 
##$DATE= 1568800215
##$DBL= (0..7)
120 120 120 11 120 120 24 19 
##$DBP= (0..7)
150 150 150 150 150 150 150 150 
##$DBP07= 0
##$DBPNAM0= <>
##$DBPNAM1= <>
##$DBPNAM2= <>
$$ [...]
##$SUBNAM3= <"">
##$SUBNAM4= <"">
##$SUBNAM5= <"">
##$SUBNAM6= <"">
##$SUBNAM7= <"">
##$SUBNAM8= <"">
##$SUBNAM9= <"">
##$SW= 369.568048894756
##$SWIBOX= (0..15)
0 1 3 0 0 0 0 0 0 0 0 0 0 0 0 0 
##$SW_h= 29940.119760479
##$TD= 32768
##$TD0= 1
##$TE= 0
##$TE2= 300
##$TE3= 300
##$TEG= 300
##$TL= (0..7)
0 120 53 12 22 120 120 120 
##$TP= (0..7)
150 150 150 150 150 150 150 150 
##$TP07= 0
##$TPNAME0= <>
##$TPNAME1= <>
##$TPNAME2= <>
##$TPNAME3= <>
##$TPNAME4= <>
##$TPNAME5= <>
##$TPNAME6= <>
##$TPNAME7= <>
##$TPOAL= (0..7)
0.5 0.5 0.5 0.5 0.5 0.5 0.5 0.5 
##$TPOFFS= (0..7)
0 0 0 0 0 0 0 0 
##$TUNHIN= 0
##$TUNHOUT= 0
##$TUNXOUT= 0
##$USERA1= <user>
##$USERA2= <user>
##$USERA3= <user>
##$USERA4= <user>
##$USERA5= <user>
##$V9= 5
##$VALIST= <valist>
##$VCLIST= <CCCCCCCCCCCCCCC>
##$VD= 0
##$VDLIST= <DDDDDDDDDDDDDDD>
##$VPLIST= <PPPPPPPPPPPPPPP>
##$VTLIST= <TTTTTTTTTTTTTTT>
##$WBST= 1024
##$WBSW= 4
##$XGAIN= (0..3)
0 0 0 0 
##$XL= 0
##$YL= 0
##$YMAX_a= 48527
##$YMIN_a= -64319
##$ZGOPTNS= <>
##$ZL1= 120
##$ZL2= 120
##$ZL3= 120
##$ZL4= 120
##$ABSF1= 182.463
##$ABSF2= -187.1042
##$ABSG= 5
##$ABSL= 3
##$ALPHA= 0
##$AQORDER= 0
##$ASSFAC= 0
##$ASSFACI= 0
##$ASSFACX= 0
##$ASSWID= 0
##$AUNMP= <proc_1d>
##$AZFE= 0.1
##$AZFW= 0.5
##$BCFW= 0
##$BC_mod= 2
##$BYTORDP= 0
##$COROFFS= 0
##$CY= -3
##$DATMOD= 1
##$DC= 0
##$DFILT= <>
##$DTYPP= 0
##$F1P= 0
##$F2P= 0
##$FCOR= 1
##$FTSIZE= 65536
##$FT_mod= 6
##$GAMMA= 0
##$GB= 0
##$INTBC= 1
##$INTSCL= 5.30512e-09
##$ISEN= 30
##$LB= 1
##$LEV0= 0
##$LPBIN= 0
##$MAXI= 10000
##$MC2= 0
##$MEAN= 0
##$ME_mod= 0
##$MI= 50
##$NCOEF= 0
##$NC_proc= -4
##$NLEV= 6
##$NOISF1= 182.463
##$NOISF2= 159.3651
##$NSP= 0
##$NTH_PI= 0
##$NZP= 0
##$OFFSET= 182.463
##$PC= 4
##$PHC0= -394.3124
##$PHC1= 103.8003
##$PH_mod= 1
##$PKNL= yes
##$PPARMOD= 0
##$PSCAL= 0
##$PSIGN= 0
##$REVERSE= no
##$SF= 81.0140089999434
##$SI= 65536
##$SIGF1= 159.3651
##$SIGF2= -187.1042
##$SINO= 113.3802
##$SIOLD= 16384
##$SREGLST= <1H.CDCl3>
##$SSB= 0
##$STSI= 65536
##$STSR= 0
##$SW_p= 29940.119760479
##$SYMM= 0
##$S_DEV= 0
##$TDeff= 32768
##$TDoff= 0
##$TI= <>
##$TILT= no
##$TM1= 0
##$TM2= 0
##$TOPLEV= 0
##$USERP1= <user>
##$USERP2= <user>
##$USERP3= <user>
##$USERP4= <user>
##$USERP5= <user>
##$WDW= 1
##$XDIM= 65536
##$YMAX_p= 378182978
##$YMIN_p= -3601732
$$ End of Bruker specific parameters
$$ ---------------------------------
##NTUPLES= NMR SPECTRUM
##VAR_NAME=  FREQUENCY,     SPECTRUM/REAL,   SPECTRUM/IMAG
##SYMBOL=    X,             R,               I
##VAR_TYPE=  INDEPENDENT,   DEPENDENT,       DEPENDENT
##VAR_FORM=  AFFN,          ASDF,            ASDF
##VAR_DIM=   65536,         65536,           65536
##UNITS=     HZ,            ARBITRARY UNITS, ARBITRARY UNITS
##FACTOR=    0.456856943014862, 1,           1
##FIRST=     14782.0589164792, 0,            0
##LAST=      -15158.0608439998, 0,           0
##MIN=       -15158.0608439998, -3601732,    0
##MAX=       14782.0589164792, 378182978,    0
$$ Real data points
##PAGE= N=1
##DATA TABLE= (X++(R..R)), XYDATA
$$ [...]
47499 848929 352062 147932 58024 -66328 -34220 311729 702215 758593 504097 214086
47489 214086 -60454 -417329 -696249 -633596 -385671 -381621 -588349 -462636 152105 594365
47479 594365 237566 -583661 -960209 -532544 209174 660789 706701 548200 316409 42290
47469 42290 -206164 -357205 -438235 -539257 -702235 -876143 -933089 -735366 -282689 187650
47459 187650 359150 163819 -123111 -194819 -62987 3417 -139671 -331310 -364626 -301247
47449 -301247 -378088 -640591 -848255 -795534 -570499 -393030 -329718 -312516 -330154 -409650 -462042
47438 -462042 -349788 -108365 71625 86117 -23345 -233703 -548811 -823826 -823699 -545672
47428 -545672 -272166 -191758 -163984 7037 250136 344216 222555 9460 -138099 -113319
47418 -113319 85371 280343 253472 58886 -5745 134129 151271 -186934 -607868 -717365
47408 -717365 -571243 -503711 -555006 -484015 -263523 -135188 -178522 -220537 -193655 -197826 -180635
47397 -180635 20036 237855 45069 -559820 -965643 -724186 -149509 177360 195711 282271
47387 282271 597026 915522 1028610 965147 827304 666380 536086 482542 473511 452704
47377 452704 422518 387533 312353 222741 209720 233870 108807 -183344 -367393 -249408 -8451
47366 -8451 102035 129558 233732 327853 235778 54981 20429 117869 173373 226468 443638
47355 443638 720463 749112 474202 143790 -71602 -174276 -105127 192587 493176 489333
47345 489333 285714 261486 419477 360328 -13462 -289398 -203534 -2 75306 129174
47335 129174 214573 102518 -204546 -264035 77886 270358 -95369 -507283 -270488 352170
47325 352170 514863 94750 -190527 62008 447657 526656 383673 201833 -96708 -481430
47315 -481430 -596027 -258380 195860 371321 301123 219210 148132 -14094 -236229 -419487
47305 -419487 -530556 -525415 -373809 -256062 -419020 -721447 -710508 -321799 -65277 -263759
47295 -263759 -576056 -628927 -634936 -879455 -1028929 -612276 87423 348199 94584 -60487
47285 -60487 140799 257192 5238 -242426 -137009 51682 -61880 -330356 -387468 -284718
47275 -284718 -341655 -563773 -650518 -472536 -163965 177883 535335 776580 769393 669954
47265 669954 760080 970616 893425 353806 -315393 -699982 -771401 -778224 -861127 -957352 -977254
47254 -977254 -904633 -752427 -523029 -213918 150046 449061 480021 179653 -171511 -173585
47244 -173585 189301 469356 307609 -118927 -376884 -329495 -169638 -33338 104225 177305
47234 177305 12211 -339630 -517485 -260060 273153 719541 889991 797046 490595 74659
47224 74659 -223561 -227747 -29491 128572 147561 100279 24759 -111250 -244214 -205520 71218
47213 71218 461350 794082 973208 952337 725618 370022 -2700 -328141 -530281 -463284
47203 -463284 -100066 280280 342839 126397 -45469 -86364 -234513 -529178 -595710 -198619
47193 -198619 313618 439977 170234 -136339 -310598 -421213 -402577 -83422 418009 727012
47183 727012 701550 551999 418253 188539 -139024 -268616 -6297 398461 546258 364436
47173 364436 95421 -60979 -108051 -136574 -195176 -235558 -134331 137977 362600 277655
47163 277655 -10040 -66250 280420 641878 592423 279693 205223 500033 755068 600841
47153 600841 178229 -94390 -67776 -26162 -318423 -899831 -1318320 -1216551 -780407 -522366
47143 -522366 -627221 -752464 -564599 -206375 -30821 -96253 -202969 -275725 -388816 -478193
47133 -478193 -344277 40535 467679 750474 850132 775826 588227 478908 595338 783464
47123 783464 747670 468497 207018 98771 38112 -18049 24806 96070 -50562 -390835
47113 -390835 -519603 -197188 311522 687360 1019570 1477933 1794586 1522770 715204 -55852
47103 -55852 -352992 -241828 -21410 113070 123187 109874 261023 575589 667078 162043
47093 162043 -667507 -1028623 -527275 324610 738083 555402 266154 269841 442830 443537
47083 443537 184758 -125578 -294821 -360049 -490322 -749634 -1018671 -1150930 -1131884 -1021305
47073 -1021305 -798943 -391427 140488 560797 668016 490548 230867 53269 -47628
47064 -47628 -193004 -440351 -651910 -601387 -264188 84341 175834 82974 83946 236726 301505
47053 301505 112990 -186274 -375605 -441858 -516291 -654834 -783775 -752941 -384381 352326
47043 352326 1106539 1305071 758229 -36096 -419953 -287115 -18810 165112 420509 832718
47033 832718 1150640 1157296 1028764 1066315 1234275 1232830 954204 600438 341548 105690
47023 105690 -194970 -425790 -394912 -177871 -102441 -390175 -913781 -1331166 -1380753 -1035322
47013 -1035322 -477657 7528 206444 150220 85992 191003 345695 272859 -137245 -736719
47003 -736719 -1299542 -1649037 -1652805 -1308890 -883766 -752679 -980952 -1218615 -1137225 -828363
46993 -828363 -622674 -643996 -717745 -625564 -279405 265963 787999 971290 726893 386662
46983 386662 356550 606724 735786 525263 180530 6558 100233 398761 755032 891346
46973 891346 576077 -13756 -379632 -320394 -192843 -346089 -590811 -556945 -348451 -414368
46963 -414368 -846145 -1216755 -1156343 -748197 -286253 44131 136528 -83286 -491514 -766463
46953 -766463 -730418 -527186 -320012 -18090 486140 979992 1114441 864842 550942 404084
46943 404084 354972 287256 253849 310915 321966 120067 -217120 -436354 -431485 -328101 -222383
46932 -222383 -17842 348783 637390 477374 -151052 -775078 -895300 -517089 -78774 121702
46922 121702 256754 651795 1267762 1665070 1490708 886559 351395 246713 492037 714284
46912 714284 627710 265101 -95850 -189547 22612 343479 536413 535581 454694 417648 453802
46901 453802 556680 715261 817579 671729 284434 2336 134420 481931 536990 181590
46891 181590 -138769 -69340 166174 185695 52266 73221 192655 54044 -368375 -657664
46881 -657664 -553722 -267562 -69911 52022 138003 29528 -301009 -484432 -175195 436770
46871 436770 870213 979672 1001571 1067345 1042845 852547 616246 395385 105419 -216355
46861 -216355 -332091 -150671 57540 -24223 -360338 -627461 -575687 -204865 310177 724276
46851 724276 818592 541848 66479 -352868 -562390 -548477 -392692 -249069 -277385 -499423
46841 -499423 -749585 -824600 -660793 -357417 -96602 -51671 -264455 -562828 -701398 -641451
46831 -641451 -588263 -695808 -867208 -937040 -909454 -880890 -848503 -758643 -653270 -600198 -559424
46820 -559424 -490492 -492861 -616393 -622774 -239277 360795 668450 512221 290706 370209 572783
46809 572783 535086 308231 218127 271957 136992 -279952 -636968 -669943 -569742 -649382
46799 -649382 -893694 -1075389 -1113751 -1045106 -793891 -303385 173568 272638 46986 -42129
46789 -42129 206536 392373 78501 -536368 -830246 -534066 18014 386014 458771 333931
46779 333931 63238 -304148 -607348 -701832 -628877 -530263 -466407 -424662 -418975 -449256 -424678
46768 -424678 -262484 -29066 131366 176513 173102 168067 158590 142304 90256 -59596 -248978
46757 -248978 -233779 125225 569445 696550 502425 386259 560763 765647 711582 515810
46747 515810 465407 584053 713442 838000 1003300 1040489 744283 291972 115123 303229
46737 303229 467786 293539 -86097 -390802 -560129 -627691 -510972 -190328 105355 169997
46727 169997 132719 230311 392924 352437 87176 -145161 -190846 -127600 -19758 151906
46717 151906 296068 272807 223890 496337 1072219 1394966 1026042 251457 -244196 -153300
46707 -153300 267120 635161 755413 564429 109810 -358167 -526529 -345993 -67488 76654
46697 76654 72172 -402 -94064 -155746 -131619 -63043 -25421 48375 291801 613663 707330
46686 707330 446515 75084 -101727 -25011 208985 502095 666853 453932 -90611 -516523
46676 -516523 -498359 -276622 -249515 -323275 -106385 354963 554550 292343 -30799 -48768
46666 -48768 86046 96146 47965 97045 97671 -140341 -442383 -516696 -429517 -420906 -396473 -73035
46654 -73035 430972 645850 437151 183016 164249 219752 158560 62174 -53788 -427267
46644 -427267 -1048767 -1359286 -902190 -17089 580320 711991 734464 777337 592486 188187
46634 188187 30 206413 372968 107666 -305311 -309522 136000 565111 661798 539638
46624 539638 416465 346405 309674 306992 293590 208015 133377 279021 724819 1277908 1636853
46613 1636853 1641009 1349919 949909 601131 332698 86919 -127374 -199264 -82969 89797
46603 89797 153078 85756 -41955 -207744 -406278 -567049 -632148 -632589 -571339 -368692 -92188
46592 -92188 -59996 -428816 -812280 -686601 -136329 220693 100581 -103600 -10023 173814
46582 173814 82294 -162218 -169110 68594 201496 117255 59241 125168 64376 -269984 -580910
46571 -580910 -470547 36591 504697 545906 143401 -421090 -842938 -1006466 -999582 -959865
46561 -959865 -931911 -884451 -806011 -712670 -589429 -390071 -81418 335529 780568 1041509
46551 1041509 901953 423903 -30013 -197563 -204683 -279828 -354079 -229566 -15550 -12530
46541 -12530 -187982 -197446 -15575 -93148 -642873 -1164320 -1061798 -482616 -116823 -288097
46531 -288097 -662871 -837783 -806362 -749044 -702013 -614054 -505973 -398942 -244438 -68898
46521 -68898 -28262 -154553 -203422 18135 270409 113993 -457917 -905845 -806372 -406626
46511 -406626 -278883 -551889 -803724 -730140 -569815 -663900 -858873 -702667 -157100 263468
46501 263468 165112 -211790 -352263 -144061 59243 -22926 -245191 -268745 10106 351872
46491 351872 438870 194354 -158950 -351034 -353560 -364342 -510280 -672070 -661523 -478710
46481 -478710 -302084 -290316 -482461 -816360 -1118670 -1134059 -740279 -165215 149432 -14968
46471 -14968 -416341 -617154 -453391 -175909 -124320 -322124 -461013 -283524 109321 393947
46461 393947 383231 136948 -204098 -499293 -552547 -236729 250127 504372 433721 412470
46451 412470 715353 1033342 864739 238317 -310434 -426456 -241825 3133 261661 494738
46441 494738 534269 349584 213181 368013 681755 839135 759289 614991 518517 409121
46431 409121 250634 158287 257584 494622 644359 509467 121980 -258812 -393284 -301628
46421 -301628 -194085 -178285 -153416 -23048 119382 107081 -80235 -305207 -438469 -464307
46411 -464307 -445154 -434532 -432040 -424498 -461789 -614202 -799699 -762746 -364786 179923 527448
46400 527448 596045 535665 391966 103095 -186010 -179293 97252 238381 60400 -83405
46390 -83405 143463 496330 499594 154298 -100223 -23750 215915 442723 704903 1037908
46380 1037908 1292230 1319822 1153119 926250 753228 703162 760318 812944 804677 839870 985440
46369 985440 1069192 911418 687994 773214 1216975 1650947 1748346 1523292 1140892 705488
46359 705488 312729 57259 -105743 -290553 -424016 -315927 -31148 132722 138280 305977
46349 305977 725050 951406 618654 38302 -222381 -149935 -208631 -551275 -794663 -638908
46339 -638908 -278945 -29448 120690 337013 553152 540388 276036 -2540 -125521 -202667
46329 -202667 -443849 -860070 -1223144 -1304522 -1102985 -827745 -690435 -729096 -797743 -695522
46319 -695522 -352656 50475 199478 -21224 -353880 -464491 -389738 -489254 -907588 -1306684
46309 -1306684 -1280159 -864523 -443756 -255332 -213329 -183821 -204906 -361247 -580635 -664570
46299 -664570 -501028 -205900 -32908 -112936 -293123 -305745 -101451 89930 60974 -134282
46289 -134282 -298243 -311788 -160306 108550 329022 267429 -95237 -429034 -385097 -5050
46279 -5050 346650 394582 157700 -167338 -356407 -265397 26664 227699 143507 -93669
46269 -93669 -268977 -427176 -711979 -957084 -785144 -154282 500008 774383 709273 583454
46259 583454 521878 459663 338262 184750 74576 90891 233804 337933 205639 -133743
46249 -133743 -417650 -436832 -215358 90606 319242 333653 121421 -109249 -132304 -43796
46239 -43796 -192632 -714180 -1338669 -1727895 -1791048 -1600013 -1229731 -791392 -413420 -90044
46229 -90044 250442 481154 370516 27112 -103369 138895 369818 273773 101347 198001
46219 198001 371861 217322 -137496 -153343 279592 616631 383753 -222274 -593686 -355367
46209 -355367 316654 853700 773633 157252 -413548 -541137 -472454 -642065 -976277 -1038249
46199 -1038249 -717439 -316467 -22921 213899 297935 30498 -370280 -352808 165357 592755
46189 592755 514783 238886 155237 65844 -352975 -815753 -763909 -243159 131240 29987
46179 29987 -269755 -428070 -451087 -466990 -464907 -394568 -274327 -109372 92447 190217 23873
46168 23873 -300014 -458983 -298735 40237 404117 779962 1087227 1070500 582851 -151600
46158 -151600 -706204 -834267 -632637 -402481 -381224 -534569 -601009 -406858 -85346 128251
46148 128251 225271 345557 445255 337300 87422 56726 420840 899728 1123702 1051069
46138 1051069 857749 637327 435670 393071 565957 711096 536987 141013 -67662 95968
46128 95968 362409 369990 65604 -335420 -627816 -748883 -746246 -725012 -766795 -817316 -697290
46117 -697290 -298397 247093 637772 648688 321469 -44982 -111392 198567 578361 608277
46107 608277 202430 -285559 -463621 -317675 -126143 -53550 -14985 77410 166308 239164
46097 239164 455490 886397 1248176 1136501 509686 -256219 -781151 -941800 -740490 -228599
46087 -228599 318744 453297 34920 -517346 -710572 -577794 -531408 -746565 -1015176 -1150625
46077 -1150625 -1177243 -1091865 -790741 -340476 -17308 62681 87053 180790 168312 -114223
46067 -114223 -511419 -758754 -790651 -653344 -356824 -42361 -28500 -375732 -640788 -441297
46057 -441297 -67635 -83476 -448866 -565763 -190044 241327 313846 165992 101311 114404
46047 114404 94988 126969 234271 134421 -352768 -860414 -856465 -362502 95226 202873
46037 202873 160179 257389 494367 701856 772555 671046 416655 141314 4788 3194
46027 3194 9664 7576 86825 193896 126853 -141630 -357856 -316959 -108357 86047 244317
46016 244317 399073 455763 326128 144305 147242 371176 612392 666749 504316 247925
46006 247925 71906 75475 183539 238075 231157 309155 465802 433227 62838 -369884 -510037
45995 -510037 -443919 -549340 -880731 -1063886 -841903 -378752 79958 505283 873572 981983
45985 981983 734241 366120 114749 -117886 -471432 -722128 -580387 -255219 -235486 -514239
45975 -514239 -544672 -105628 295294 182334 -161085 -180049 38378 -73825 -567917 -758475
45965 -758475 -187043 681522 1064446 836518 491476 317841 100572 -322945 -657604 -555432
45955 -555432 -181934 -75761 -496245 -1128445 -1451577 -1253649 -752301 -317999 -132223 -78464
45945 -78464 45781 217918 186231 -151106 -497650 -488254 -202694 -85943 -325149 -589171
45935 -589171 -516265 -193672 64522 189689 310168 387470 265934 41906 13360 207647
45925 207647 296702 94961 -169590 -238705 -178769 -136279 -22518 250084 432245 218947
45915 218947 -233120 -453534 -312289 -151204 -199146 -236404 -27201 232697 195892 -93579
45905 -93579 -253816 -95592 194660 420457 644821 960780 1191266 1047180 549707 96354
45895 96354 27322 240028 355984 225394 111471 316073 742370 970015 745579 265521
45885 265521 -77803 -134089 -80998 -114314 -189693 -143892 16258 102769 47339 46773 269950
45874 269950 534140 498734 165855 -68108 52657 299930 330585 200045 243136 541725
45864 541725 799840 761070 512323 305561 250638 262713 199009 -7306 -272924 -420448
45854 -420448 -386573 -325131 -383817 -458132 -354375 -126393 7581 58828 261811 609747
45844 609747 728766 393805 -97503 -299268 -172181 -17425 4919 22079 160856 353367
45834 353367 475220 541152 691310 988855 1239104 1100541 511001 -73873 -118514 318171
45824 318171 650374 567168 400311 521750 761435 745908 518985 428404 565587 689684
45814 689684 611225 351302 31259 -136050 70844 504354 584988 15954 -656786 -688858
45804 -688858 -173344 137666 -43953 -242606 -87145 166526 160037 -86414 -443833 -910894
45794 -910894 -1327200 -1330274 -881497 -407386 -166243 66499 416284 539791 221102 -146395
45784 -146395 -130403 101458 175320 135670 164860 69866 -360111 -801188 -817119 -570651 -490989
45773 -490989 -498537 -266895 -33947 -324964 -938942 -1072296 -544842 -81444 -162249 -365575
45763 -365575 -183271 195595 332984 220098 80976 -57388 -216890 -283464 -289819 -471469
45753 -471469 -754779 -681956 -193049 69127 -290499 -706191 -504869 -952 17800 -431853
45743 -431853 -619039 -333690 -156282 -411358 -655842 -475139 -129154 -40596 -142139 -123424
45733 -123424 48062 228993 418792 593362 461346 -180811 -952777 -1168392 -663609 -34296
45723 -34296 83552 -245529 -432258 -181988 112706 -98064 -765156 -1255460 -1123177 -610851
45713 -610851 -251993 -197154 -175831 -618 180595 139764 -134742 -427778 -457025 -82342
45703 -82342 501496 856777 768933 530221 530742 676795 556023 150842 -30504 331330
45693 331330 882057 1062409 804334 480494 322695 201504 -35512 -264168 -231737 94477
45683 94477 438135 500549 285779 51627 -52468 -131641 -258518 -266250 -35989 210045
45673 210045 215819 147326 348082 708000 735044 298416 -167705 -331626 -365417 -461440 -416442
45662 -416442 -48962 350777 422820 328650 490789 898579 1112882 912262 561890 425761
45652 425761 584964 849419 954227 784175 547549 601396 956364 1181295 1026891 855286
45642 855286 1086321 1486416 1507281 1161251 979016 1133582 1205768 917701 539367 371381
45632 371381 320351 238689 238100 363275 355333 96562 -54504 212088 563046 429839 -113122
45621 -113122 -358992 101716 851469 1202721 1030948 827536 995932 1309821 1208474 573747
45611 573747 -33667 -78806 222957 241019 -105251 -208208 284770 888151 960021 580187
45601 580187 309581 324311 297607 73053 -31413 300669 936292 1462967 1602316 1356530
45591 1356530 908516 477648 184611 951 -137539 -208819 -163794 -35645 109292 257128
45581 257128 381300 388770 262564 162977 227790 336165 224197 -194283 -712490 -976432
45571 -976432 -716885 -5426 652370 716986 241312 -168294 -180152 -167304 -513129 -881674
45561 -881674 -684448 -8723 514126 634754 664027 763994 713258 480803 413577 631815
45551 631815 761861 522285 117145 -190470 -432096 -605935 -490400 -121305 26302 -241060
45541 -241060 -369060 170688 982537 1207952 682063 56286 -137369 -4368 117517 79407
45531 79407 -149282 -564245 -992532 -1151908 -971714 -689036 -578217 -706961 -928911 -998059
45521 -998059 -778711 -454421 -358056 -458451 -299446 291938 762237 518722 -195122 -637801
45511 -637801 -624228 -638474 -920349 -1083711 -810612 -374033 -186720 -233362 -246716 -156934
45501 -156934 -94882 -142427 -272208 -384803 -316238 -3235 314023 307570 26795 -143307
45491 -143307 -41586 90014 71805 49900 135906 154204 -31606 -265031 -400253 -549474
45481 -549474 -770758 -800858 -406392 205680 606083 617520 368092 53451 -166572 -223992
45471 -223992 -256440 -456684 -699160 -621137 -213982 58660 -41706 -144147 90949 383506
45461 383506 334724 130854 192690 407151 323835 -39773 -204337 4833 255807 285859
45451 285859 169525 -27257 -369393 -734287 -806122 -520057 -172175 2036 57983 117736
45441 117736 220412 397477 592153 562125 221436 -17805 293515 901516 1109696 780315
45431 780315 474893 505985 504363 174472 -136313 -4453 413999 684639 659106 391972
45421 391972 -99209 -604844 -646881 -85026 514622 576251 306720 306668 612674 668760 171940
45410 171940 -544536 -998738 -1061308 -929275 -868503 -993499 -1117835 -902397 -335520 92748
45400 92748 -55470 -595722 -984881 -995513 -806297 -569165 -280891 -37749 -38060 -276107
45390 -276107 -493940 -479708 -250034 19442 102829 -106337 -376899 -309132 67025 171631
45380 171631 -308170 -824001 -702639 -193950 -107972 -536393 -710026 -217546 388278 479831
45370 479831 203552 45475 67703 43213 -22842 17841 86269 13161 -118534 -117748 -21365
45359 -21365 30718 100787 299369 453598 291628 -92769 -307429 -217864 -131183 -329215
45349 -329215 -651660 -702238 -358025 83553 273829 224233 241139 461762 636094 502251
45339 502251 200055 42389 -7025 -242543 -600970 -583044 36913 806136 1157183 1068654
45329 1068654 877560 715003 488451 234908 107197 81144 -9789 -179041 -260347 -126720
45319 -126720 238163 761198 1184070 1144054 623955 125467 56792 141415 -132640 -629872
45309 -629872 -690274 -133019 446088 537578 343032 265747 262277 112081 -28014 148496
45299 148496 484625 481500 36680 -369745 -348039 -122232 -167165 -523889 -732519 -411187
45289 -411187 291368 878979 1033072 856031 634038 498188 392311 278216 224508 291253
45279 291253 447407 632686 800510 868509 745410 481527 290527 309126 395071 293387
45269 293387 -6378 -208621 -60675 327560 610155 617945 526096 574945 742761 813737
45259 813737 700599 526082 381415 195865 -75259 -305449 -370865 -335831 -319967 -300806
45249 -300806 -209824 -103421 -45079 58846 257568 302353 -66776 -606338 -728874 -279473
45239 -279473 200824 175561 -224534 -484299 -400874 -198633 -118219 -212594 -461751 -769435
45229 -769435 -860207 -480089 229583 770073 773893 325519 -203923 -473014 -334001 90269
45219 90269 436909 417627 181810 170103 523259 865512 816800 482415 208437 60431
45209 60431 -132434 -338783 -323829 -100977 -1490 -165180 -303303 -182539 -41106 -207111
45199 -207111 -526881 -573933 -319292 -149656 -206085 -180779 56118 81747 -466741 -1213900
45189 -1213900 -1438007 -1009247 -487687 -310499 -337696 -303586 -271848 -377499 -444851 -213394
45179 -213394 233068 595072 807190 1024598 1210409 1107092 693831 341616 340350 517453
45169 517453 528721 323440 71649 -205101 -591618 -908504 -750833 -28708 791931 1178204
45159 1178204 1087871 848668 642005 391192 123574 123837 568354 1172413 1408316 1076690
45149 1076690 538865 320322 534208 797099 748550 530861 583488 1006479 1387271 1344397
45139 1344397 976642 589456 245824 -110077 -323676 -258103 -204963 -541686 -1009292 -927699
45129 -927699 -242899 276509 164177 -63648 176498 522130 262803 -432295 -700861 -276118
45119 -276118 192477 159650 -178694 -437890 -609436 -804926 -937573 -954097 -993423 -1070759
45109 -1070759 -973356 -684561 -518060 -599163 -624344 -403980 -214163 -276941 -318862 -62165
45099 -62165 233845 211726 72035 244440 639357 798327 638757 478029 406685 223139
45089 223139 -19077 13530 324307 485104 291191 40903 -8650 -13104 -154983 -297456
45079 -297456 -271966 -157416 -30735 214179 536096 590052 238313 -89124 55491 455732
45069 455732 537555 221562 5276 205470 553778 658929 521103 392168 361550 310126
45059 310126 162656 -16379 -151465 -225039 -199138 -2280 316885 506542 338940 -62550
45049 -62550 -286037 -119156 172959 224359 90306 129431 418834 614623 468765 176863
45039 176863 38910 17723 -133063 -453262 -718948 -731452 -500535 -203593 -74496 -223304
45029 -223304 -446098 -356191 136707 622820 664000 339565 89830 118261 219089 157467
45019 157467 -50446 -257122 -354313 -282271 -52952 202257 358076 458740 593650 663930
45009 663930 510803 250720 185303 331977 357922 98477 -170787 -177124 -80548 -171368 -344180
44998 -344180 -234783 189084 526579 483104 225616 78005 77257 17462 -173836 -310754
44988 -310754 -225521 -25905 39196 -66351 -90027 160251 510215 621241 438158 225749
44978 225749 162753 159531 150003 252757 442500 370520 -136389 -623391 -520351 -14938 116439
44967 116439 -389813 -897057 -797415 -308239 28616 182344 431642 653798 484100 70876
44957 70876 -24178 242774 234453 -350170 -899406 -749992 -161104 95534 -177430 -478097
44947 -478097 -425552 -181833 -68308 -192720 -484133 -745211 -680997 -234023 152033 28301
44937 28301 -330992 -228787 361415 626504 88840 -663473 -852385 -577893 -423758 -419005
44927 -419005 -139926 352855 481491 105832 -203777 -57828 190352 73978 -300940 -569655
44917 -569655 -699583 -835138 -849435 -526697 -43955 170844 26155 -151032 -128717 -50990
44907 -50990 -153651 -452724 -787967 -982683 -902774 -531890 -62579 211447 155192 -121219
44897 -121219 -415156 -567447 -494129 -243769 -15441 33478 -12031 22965 81477 -57005
44887 -57005 -344059 -362879 172469 982448 1469254 1326417 783748 322946 259003 529335
44877 529335 779904 693126 294207 -119652 -368761 -562270 -806917 -940667 -755544 -368915
44867 -368915 -134468 -207468 -395458 -435860 -238115 153411 635132 1023051 1124978 930721
44857 930721 637314 437184 368144 374594 378096 269997 4613 -252579 -261257 -77130 -72362
44846 -72362 -422711 -771161 -653055 -135923 261949 265036 136912 192395 303974 136488
44836 136488 -269931 -452066 -108587 486336 814144 743908 610507 653570 640642 238210
44826 238210 -422897 -861956 -880373 -732289 -606384 -331830 178965 565464 490760 230767
44816 230767 299506 597081 495849 -154737 -682528 -528127 -56784 -7582 -430677 -664840
44806 -664840 -262593 513733 1129483 1327408 1161150 807272 493120 383299 390002 254967
44796 254967 -82409 -374265 -422895 -348602 -341724 -340280 -191555 -9401 -81467 -431637 -729672
44785 -729672 -684983 -320592 191106 716508 1063616 960378 393099 -181449 -263283 97929
44775 97929 418513 465446 483622 668812 800417 643159 404081 424248 594173 488419
44765 488419 36308 -343684 -341422 -132369 -27546 -56274 -89475 -126896 -215636 -242075 -59578
44754 -59578 234118 344833 109750 -322739 -623654 -558608 -208918 55866 -62732 -448263
44744 -448263 -739967 -832966 -936773 -1080688 -932909 -342559 265083 383236 93563 -125941
44734 -125941 -93822 -24631 -47344 -60433 -46391 -114787 -197953 -90531 155970 265687 232866
44723 232866 360509 676851 767265 430204 81233 157419 456773 484108 214628 57611
44713 57611 180907 322759 265946 91665 -105387 -384062 -683619 -687971 -216350 405004
44703 405004 618927 271836 -205328 -293151 61622 469864 591778 447879 230357 5248
44693 5248 -235605 -362600 -218406 61916 111404 -188609 -508955 -499021 -237459 -82783
44683 -82783 -199967 -421514 -513290 -418815 -265374 -234598 -402248 -648318 -779812 -768925
44673 -768925 -766125 -853505 -942419 -970828 -1016372 -1118391 -1173774 -1122974 -1051215 -991495 -848028
44662 -848028 -649919 -618136 -794295 -890166 -748772 -637744 -749480 -735908 -214188 509555
44652 509555 786846 564874 376881 434616 381460 53841 -160495 8970 238181 148819
44642 148819 -113911 -210288 -137241 -51330 98791 343977 393149 34226 -376776 -336795
44632 -336795 8706 13659 -526351 -1083661 -1168856 -945371 -840034 -878417 -736184 -291655
44622 -291655 190738 422485 403950 304894 197828 56159 -58918 -16875 123377 75500
44612 75500 -282479 -630146 -569026 -175156 114013 123118 84473 131579 78625 -136446 -217835
44601 -217835 2352 215662 111765 -132323 -226812 -314485 -657570 -1033461 -1013503 -701960
44591 -701960 -589904 -707409 -548420 63496 621290 645444 255881 -174872 -469388 -518539
44581 -518539 -201021 248854 249318 -350411 -892397 -769663 -322912 -331498 -843525 -1135691
44571 -1135691 -785954 -192182 82319 -16970 -213292 -358847 -450874 -435199 -261034 -29372
44561 -29372 88851 39277 -83713 -126684 23095 326040 565744 560314 412072 402838 613645
44550 613645 806133 735458 427533 67403 -247162 -531577 -788026 -956746 -953860 -725549
44540 -725549 -339130 -30618 -28611 -270900 -424817 -278629 161 100927 -38928 -205889
44530 -205889 -192815 38550 432110 905508 1313967 1472914 1297424 888642 451248 135659
44520 135659 -48165 -186860 -327725 -388774 -262653 -29832 38275 -214156 -602026 -824842
44510 -824842 -864135 -963635 -1211900 -1381316 -1287464 -1086988 -1012548 -971052 -689402 -201531
44500 -201531 128936 133743 92965 304261 636611 741608 546762 271843 39507 -243270
44490 -243270 -604205 -859314 -835388 -578512 -270137 -52672 29841 41877 128416 353654
44480 353654 573726 616336 552406 579354 661675 578329 361555 336959 585493 718544 432734
44469 432734 -21722 -239223 -256836 -371315 -560285 -530801 -248144 34154 252575 587525
44459 587525 974741 1013418 552042 9586 -134132 80069 254613 187640 9028 -136035
44449 -136035 -302787 -616398 -1033147 -1304895 -1238778 -984642 -893765 -993811 -860822 -276791
44439 -276791 260425 151025 -361344 -479365 -63549 173218 -141532 -433203 -197335 101978
44429 101978 -163507 -631651 -465154 267521 646009 298742 -126186 -62196 196904 176712
44419 176712 31284 172765 531346 715374 656658 606608 619414 486611 171002 -67399
44409 -67399 -45021 118299 227933 251741 227547 119345 -79361 -212712 -118208 113705
44399 113705 219794 139497 115452 297698 445661 272479 -50723 -94212 151916 230235
44389 230235 -33160 -182085 180495 742125 914076 627892 270791 67512 10132 209821
44379 209821 749184 1257611 1210489 675578 223392 53288 -209701 -727924 -1077439 -927056
44369 -927056 -558293 -375050 -341169 -252307 -166784 -197229 -220870 -162750 -248851 -610653 -935330
44358 -935330 -879353 -552129 -236340 56610 353055 377175 -50663 -535702 -572001 -297066
44348 -297066 -231550 -408625 -359924 73854 510758 664247 679954 720948 688941 519460
44338 519460 367134 339942 360533 387865 467729 503775 316970 -3063 -157643 -116899 -162903
44327 -162903 -366376 -426586 -193314 30654 -75590 -415830 -674258 -687889 -464170 -92312
44317 -92312 216376 258915 127809 93684 134381 -50891 -457121 -653399 -445551 -195048
44307 -195048 -196965 -213415 -10165 99800 -232147 -690787 -707580 -348182 -179087 -368118
44297 -368118 -532253 -461307 -382599 -411081 -307414 12082 213148 64910 -171705 -182531
44287 -182531 -100990 -219718 -438823 -397288 -62618 167377 -24701 -524145 -999250 -1258567
44277 -1258567 -1293307 -1115890 -718217 -178026 290835 443532 169242 -416283 -1003606 -1245199
44267 -1245199 -991312 -452833 -71584 -112467 -389362 -497603 -300476 -33411 84769 124561
44257 124561 214204 248749 65175 -207142 -249549 -3428 238088 254989 193351 302193
44247 302193 556679 741995 815928 949113 1188739 1311902 1147534 887421 865456 1078446
44237 1078446 1153801 831154 265272 -239771 -585668 -812168 -874301 -732148 -543244 -506266
44227 -506266 -579099 -588965 -537578 -517415 -409489 -26427 456458 610917 367567 135652
44217 135652 201582 399269 535735 724362 1032810 1172816 876346 307537 -199001 -540268
44207 -540268 -696498 -502063 51604 549885 609232 392108 282932 296881 256264 290311
44197 290311 586272 821444 495776 -216879 -600925 -421236 -164335 -146959 -66791 298037
44187 298037 581594 427376 84510 -48299 -69799 -281981 -563704 -560797 -317568 -216974
44177 -216974 -360770 -449484 -286437 -30731 111811 156747 208394 264246 246533 120763
44167 120763 -59932 -177536 -150361 -61704 -98315 -289957 -434516 -382676 -251865 -221124
44157 -221124 -265795 -270119 -251711 -249627 -115100 307907 844774 1109579 977475 709407 589601
44146 589601 664274 859398 1087808 1147176 789792 101248 -387629 -240780 311431 609963
44136 609963 376782 18815 29629 336057 458985 188630 -166244 -199103 135881 529184
44126 529184 624749 299879 -207550 -445375 -208077 151215 114558 -298294 -576994 -532376
44116 -532376 -568333 -884737 -942093 -245036 728008 1048555 594990 94283 -8484 16461
44106 16461 -66244 -42192 175864 245712 29084 -58229 266681 635058 623723 383520 201978
44095 201978 -75898 -611841 -975197 -661937 51506 450298 398963 341265 409331 276344
44085 276344 -78550 -198092 70185 263405 67712 -150447 46836 444753 493174 110292
44075 110292 -225570 -102800 379398 776503 766135 471011 341315 629562 1032111 1058165
44065 1058165 720152 542014 812060 1170867 1137592 772671 552488 743128 1139253 1341204
44055 1341204 1118133 582324 149054 215896 712939 1063736 790514 118662 -221524 172703
44045 172703 905209 1236735 918105 422947 331404 632369 801980 516318 24551 -281111
44035 -281111 -398389 -572882 -816822 -917753 -861620 -880436 -1033169 -1068671 -811717 -397160
44025 -397160 8970 436834 879465 1096479 909762 518546 248434 94834 -210219 -711032
44015 -711032 -1063890 -921561 -338218 260963 447197 144943 -290467 -379926 400 478656
44005 478656 620426 438447 306689 394461 426994 119180 -359948 -587677 -456473 -258150
43995 -258150 -178771 -23994 373420 738885 671498 243543 -78937 -87552 -25707 -82575 -103964
43984 -103964 24547 95898 -48673 -201107 -161553 -135979 -371709 -641947 -545167 -154082
43974 -154082 106122 123606 156182 277869 294951 249346 477163 1023376 1455331 1432739
43964 1432739 1064906 561771 -21339 -494347 -466729 105661 692237 848708 766548 804945
43954 804945 824864 472993 -96627 -324670 -29706 365256 439744 242217 51480 -27049
43944 -27049 -60939 -67873 21330 207483 343473 277427 75893 6887 200157 418160 349415
43933 349415 53835 -146958 -173967 -225044 -278834 -16925 570557 938840 680597 129649
43923 129649 -112450 1060 35453 -195971 -417522 -360757 -65780 313753 704008 1042542
43913 1042542 1216043 1125044 734536 117978 -485980 -809836 -844672 -802016 -709831 -354489
43903 -354489 218706 548799 408579 211810 347050 492640 171682 -323846 -292497 235158
43893 235158 504175 225887 -28615 150811 337886 31919 -487636 -601878 -275597 -9808
43883 -9808 -69806 -219957 -149549 188538 635070 972783 1051606 934215 843762 845826 731235
43872 731235 367593 -18637 -131351 -19041 56754 46725 113879 263366 282026 85746
43862 85746 -139415 -232618 -266545 -332337 -329727 -187000 -141748 -489621 -1052332 -1231292 -760620
43851 -760620 -129585 43524 -140322 -69196 376936 559078 -1883 -904213 -1406253 -1339536
43841 -1339536 -1064730 -780659 -387557 64430 297611 229977 93509 65894 99851 156002
43831 156002 291280 464539 541352 532877 564384 609949 554079 486464 573801 651123 371929
43820 371929 -177626 -472216 -289069 -11111 -961 -111480 -77590 16067 -6812 -23347
43810 -23347 154450 398343 462399 378018 343875 381473 379408 339623 332834 344289 367231 475151
43798 475151 598568 450371 -65529 -568879 -617609 -260315 93589 213939 192286 169631
43788 169631 185068 210478 141811 -118966 -420469 -425236 -125345 -13899 -429002 -987192
43778 -987192 -1064001 -633195 -185263 38890 233043 490385 592478 432048 244431 264986
43768 264986 433750 557737 554490 462924 381446 405680 481196 403554 164166 144189 644670
43757 644670 1334540 1558236 1165352 644973 425180 443312 474751 475102 442511 284014 5717
43746 5717 -216467 -291207 -307365 -298254 -182838 -21261 -19155 -159621 -143005 159623 501210
43735 501210 676946 834569 1145368 1447263 1477099 1241824 921823 614628 409215 490236
43725 490236 877972 1235877 1237656 1006687 912681 1041030 1151633 1078181 863267 543706
43715 543706 124452 -215907 -217799 48976 136714 -228431 -722094 -784713 -353047 7690
43705 7690 -218223 -857642 -1266804 -1117325 -712625 -460790 -322141 -26749 374196 563173
43695 563173 501535 495566 644416 638837 305012 -24325 13929 240449 190884 -216401 -607717
43684 -607717 -659587 -382452 30099 350639 361665 30943 -352081 -434982 -183585 178254
43674 178254 519997 843083 1060962 1073221 1028056 1143362 1241781 876503 45230 -637046
43664 -637046 -717131 -490823 -492284 -713343 -756348 -554159 -436738 -539484 -651706 -724652
43654 -724652 -1027038 -1564109 -1781173 -1239909 -318703 203256 124457 -70037 -36025 11152
43644 11152 -141881 -212147 142167 692828 901396 685952 482842 533277 538225 176113
43634 176113 -389498 -772969 -893855 -943692 -967427 -803102 -427021 -78036 44261 16340
43624 16340 32813 151236 288416 353616 271848 -33220 -526032 -946818 -958964 -476105
43614 -476105 209436 662985 654926 299212 -68260 -140616 115985 402974 368442 23170
43604 23170 -237467 -144246 67660 22016 -183537 -95652 357458 691769 612499 497368
43594 497368 779282 1210504 1260037 1024973 1115021 1639788 1954522 1611612 1006499 736819
43584 736819 762727 641838 294108 47683 70729 207043 334213 493737 647567 647363
43574 647363 509931 440241 502307 511770 343609 127302 26184 -54 -95735 -296460 -498575
43563 -498575 -533534 -233089 429063 1190620 1644637 1631365 1377193 1172928 1057163 918208
43553 918208 738984 550214 253005 -262100 -822570 -1038308 -759494 -310264 -124445 -237291
43543 -237291 -295458 -44515 360701 585734 521257 337797 203535 99760 -60949 -254811
43533 -254811 -367107 -347511 -283338 -324557 -547993 -866142 -1068682 -1007543 -752918 -509401
43523 -509401 -379473 -306528 -264162 -341888 -536000 -603377 -330684 104964 280632 78085
43513 78085 -128141 33625 418543 566119 347956 152535 340185 722892 791440 388818
43503 388818 -60851 -43193 482070 1097361 1397242 1321390 1072923 836735 615330 308483
43493 308483 -65660 -282817 -145467 211691 420619 341918 230262 317294 460838 440877
43483 440877 392199 590406 927558 1017497 808896 656639 709208 686012 456183 383538
43473 383538 746252 1162152 1042806 437984 -14276 78182 466424 717102 722951 648189
43463 648189 595614 483694 203235 -154757 -276274 28236 439476 364279 -286127 -843363
43453 -843363 -689838 -61483 329905 253823 60548 -35191 -184356 -389946 -353734 -23754
43443 -23754 216615 168388 162243 449945 677766 417323 -98929 -299807 -145523 -110697
43433 -110697 -340472 -407475 -61483 295422 218759 -46588 106154 721272 1145683 903247
43423 903247 334656 128858 452214 864682 997388 930490 838826 651585 309202 68396
43413 68396 194213 503709 597569 476826 520467 828994 1024234 852090 593152 618617
43403 618617 839089 899801 716733 509753 433540 456158 513009 530375 376423 30091
43393 30091 -268175 -257659 25398 379604 749861 1115404 1205611 752065 17054 -377691
43383 -377691 -261211 -128803 -356402 -623699 -450496 42111 358834 410036 557092 926847
43373 926847 1181592 1078535 832780 724785 692700 567432 426195 401201 350158 74015
43363 74015 -264280 -313026 -70777 132501 201817 401727 795148 989026 716769 336932
43353 336932 384048 837230 1209665 1209104 912009 405277 -256371 -739317 -617374 -49188
43343 -49188 203657 -268608 -943009 -1105041 -821434 -672424 -748196 -555964 54890 511751
43333 511751 329564 -180576 -400052 -256253 -124067 -94097 97203 415015 381510 -173391
43323 -173391 -656696 -407607 388987 907799 716478 204138 -38425 118048 425778 677289
43313 677289 809131 800566 709322 688977 777858 778954 535963 225697 170149 424193 740934
43302 740934 887334 808381 549529 237876 96764 239553 453950 422655 165931 20117
43292 20117 141070 291173 213944 -20794 -188561 -234176 -260444 -325410 -393671 -392795 -223054
43281 -223054 161625 577672 667313 294442 -212787 -387098 -141142 191683 310315 278664
43271 278664 357775 618110 831052 745596 375332 -70159 -457732 -741963 -718446 -100430
43261 -100430 942432 1617215 1288402 306581 -365943 -313592 7800 122386 151320 359258
43251 359258 595247 578504 398266 316324 308365 197675 63421 116725 291397 351228 347778
43240 347778 599065 1192137 1797010 2015783 1729530 1138782 642460 578018 860346 987219
43230 987219 636395 111494 -84133 64093 197084 228981 386565 636732 602463 165772
43220 165772 -291565 -409691 -232468 71511 459202 785946 737732 284580 -119716 -93606
43210 -93606 187107 347129 369647 452623 567630 586538 676592 1099472 1665309 1839419
43200 1839419 1452157 914055 614492 465239 229221 -7028 13599 252428 368320 166018
43190 166018 -181791 -415866 -506810 -559251 -521703 -216174 307446 659704 535570 138913
43180 138913 -52411 87118 219804 116862 19251 218387 543281 590929 314259 15145
43170 15145 -177995 -411269 -641977 -524725 10119 425511 187389 -490459 -880437 -625896
43160 -625896 -29359 508774 925372 1254032 1333545 1037655 577262 277679 163592 30667
43150 30667 -143323 -151119 67797 279238 282011 175428 168807 282950 399855 507764 718421
43139 718421 1056061 1370151 1501053 1456422 1364182 1279026 1121923 868164 713932 876350
43129 876350 1206056 1240658 807601 347229 352162 670703 779469 650662 793676 1326230
43119 1326230 1599484 1116303 353798 132820 444420 520277 14194 -489104 -312713 416060
43109 416060 992543 998359 651430 403348 435062 580243 606019 457997 227028 -7694
43099 -7694 -169487 -93048 312363 787172 909725 675368 555417 778734 938688 667328
43089 667328 324314 470478 901283 871167 229844 -339313 -323034 10513 228332 377071
43079 377071 654700 902498 854383 589163 353350 173884 -14803 -93275 40837 194387
43069 194387 161849 118846 360156 774096 975586 903323 882432 1063371 1169128 923924
43059 923924 451138 75285 -89618 -177837 -286648 -315846 -119689 254299 566625 671829
43049 671829 728526 985621 1385554 1588377 1450610 1254424 1306920 1495591 1455383 1069588
43039 1069588 590814 312810 303586 439350 546642 518242 415847 456955 797712 1322323
43029 1322323 1713324 1731366 1408719 1015047 848460 980688 1172139 1104553 711081 213060
43019 213060 -125642 -167442 85169 432297 506643 163386 -174493 75792 842325 1386964
43009 1386964 1242138 741698 406897 254599 66788 -56604 103083 391211 474563 362734
42999 362734 282526 180278 -162883 -597959 -689779 -356339 -1948 38232 -173672 -423712
42989 -423712 -556350 -422478 4974 416950 426650 87216 -192992 -257312 -313647 -417093
42979 -417093 -334877 -60926 39129 -158044 -233475 133307 618457 741259 583727 580969
42969 580969 800145 886488 644845 265217 -28894 -211735 -294139 -224981 -40776 102609
42959 102609 141553 197615 383753 627705 744835 608432 225032 -268660 -645185 -698780
42949 -698780 -390758 111140 552448 773852 812876 829209 892921 861811 546348 4279
42939 4279 -427837 -452291 -101718 320921 530202 458425 254039 144279 247557 470057
42929 470057 624759 673363 776854 1055588 1372405 1450353 1193329 805195 555358 478863
42919 478863 386993 181512 53158 260985 764250 1221424 1358936 1189997 860926 494671
42909 494671 257625 329937 636292 817622 683435 499910 580250 779655 714724 336588
42899 336588 -78770 -410015 -750545 -1021130 -958067 -555763 -136054 113129 299152 437546
42889 437546 327718 -4934 -155440 96046 401501 334286 -15749 -257356 -269592 -209952
42879 -209952 -135938 8662 133613 82137 -72497 -126313 -125093 -340604 -827112 -1266991
42869 -1266991 -1347893 -1101158 -774040 -515813 -304016 -106595 -763 -82065 -262549 -254315
42859 -254315 107080 554218 621734 247480 -108892 -92025 70973 -18003 -261798 -204803
42849 -204803 242692 644159 685489 614740 830607 1298292 1645731 1692868 1592887 1481500
42839 1481500 1274866 912889 582026 501687 597403 605603 478731 454567 670398 943574
42829 943574 1069334 1117125 1220102 1259562 1049977 715917 549527 547873 447818 212616
42819 212616 89909 128145 67217 -131788 -87933 387583 868112 882906 614767 578965
42809 578965 802479 825300 471188 137006 226199 676503 1189873 1615265 1911741 1968957
42799 1968957 1708438 1274229 943864 861234 937321 984821 893301 698017 520245 432541
42789 432541 370412 189956 -178181 -624237 -900672 -814779 -457250 -211756 -409217 -945023
42779 -945023 -1359737 -1337526 -992867 -617171 -314231 -1312 377554 798515 1224263 1575234
42769 1575234 1703310 1533353 1185516 843233 551493 261446 27822 21356 315458 730001
42759 730001 941583 789032 480499 403895 647805 841501 650211 285183 214394 460386
42749 460386 609936 529971 558431 817484 883344 498657 136872 340394 832076 887140
42739 887140 416438 59612 217526 577845 724846 716831 822965 1052474 1217622 1244014
42729 1244014 1188163 1072070 863966 559666 211473 -68159 -153010 -68725 -60773 -317207
42719 -317207 -655530 -698746 -359120 79701 372511 538436 610026 450348 21430 -355145
42709 -355145 -263090 318352 966622 1269977 1210795 1082699 1154878 1500958 2058416 2676635
42699 2676635 3097110 3096714 2775005 2514488 2468338 2287707 1655678 902380 633114 825058
42689 825058 855861 494494 234520 395013 520225 127461 -460839 -603856 -295123 -28840
42679 -28840 26289 107490 277151 366595 426363 671793 998204 1056525 808118 542064 367760
42668 367760 157524 -46198 -69085 -31395 -207958 -445935 -275540 319522 785605 784027
42658 784027 584386 525396 583464 662565 828948 1023996 975394 644661 393092 478801
42648 478801 730107 903678 1008523 1088264 1048901 912065 903152 1093129 1269062 1312920
42638 1312920 1364601 1467740 1430233 1189952 936971 738635 466246 218431 315069 699081
42628 699081 904300 850406 1041398 1624093 1915957 1406661 652671 513898 939414 1220731
42618 1220731 1126141 1028567 1081024 1012825 744912 579195 691677 915077 1081960 1185812
42608 1185812 1196943 1093927 1040071 1146421 1143273 743681 272804 388989 1112603 1673971
42598 1673971 1519020 997685 781227 983203 1207976 1210408 1118107 1087658 1069828 962006
42588 962006 800985 733512 877133 1224558 1606020 1739991 1437607 843035 394454 406152
42578 406152 706900 853817 708537 570030 667910 835371 883283 956405 1162665 1166430
42568 1166430 674546 116173 199365 855324 1302849 1211898 1085096 1305384 1544136 1459138
42558 1459138 1303717 1377362 1444143 1215501 928390 914347 1021570 992200 994170 1210711
42548 1210711 1302964 917775 398322 327620 646299 907683 1145343 1700313 2328008 2322244
42538 2322244 1589368 857127 666787 802627 892530 950076 1053262 1019827 749995 525329
42528 525329 653663 1058285 1432187 1585962 1494207 1221417 949166 890253 1055178 1249380
42518 1249380 1360683 1488898 1746461 2088671 2387155 2552895 2570765 2492446 2359038 2087983
42508 2087983 1573956 972708 663751 784350 1036373 1130658 1140401 1187254 1121743 873562
42498 873562 810709 1286214 2020391 2392118 2222221 1861428 1639531 1650002 1944925 2468468
42488 2468468 2849498 2704194 2151052 1673869 1513634 1537768 1642919 1905804 2329684 2740324
42478 2740324 2942159 2807223 2336968 1804103 1596172 1709870 1716734 1478936 1471863 2018964
42468 2018964 2660081 2776821 2423300 1990374 1501474 906292 628700 1007403 1520263
42459 1520263 1433593 986466 1035470 1697461 2294010 2572025 3000558 3780794 4482079 4850023
42449 4850023 5193043 5773196 6468160 7129936 7665004 7821740 7619990 7839371 9133767
42440 9133767 10692670 10840876 9122737 6795650 5089722 4050412 3367701 3162275 3370372
42431 3370372 3341218 2746732 2160409 2146946 2450840 2607907 2674695 2809623 2782364 2460564
42421 2460564 2207069 2275712 2357102 2183616 2008200 2023815 1915006 1494421 1198862 1400925
42411 1400925 1751675 1762006 1568809 1583440 1801175 1987552 2190977 2575194 3017703 3267793
42401 3267793 3266355 3060382 2703679 2421916 2506263 2884959 3176600 3238778 3224616 3112129
42391 3112129 2755126 2396651 2469540 2866949 3109782 3225407 3664949 4350376 4694800 4627867
42381 4627867 4687984 5033651 5309403 5524397 6030703 6595279 6609708 6267988 6350601 6804316
42371 6804316 6820004 6355365 6195817 6478862 6658795 6921222 7936934 9211857 9587629
42362 9587629 9429357 10203741 11805823 12699937 12883919 13996352 16150683 17712673 18770495
42353 18770495 21440320 25926280 30036403 33711273 39859674 49287562 59532555 70505451
42345 70505451 85769424 106282647 130657967 165408219 223503232 300962493 362305914
42338 362305914 366446055 309313611 228886465 165412978 128014252 103464165 82797381
42331 82797381 67427678 57512401 48508483 38801299 31432432 27466060 24160999 20246619
42323 20246619 17519041 16526532 15306858 13142706 11613278 11222637 10459780 8850281
42315 8850281 7810573 7839913 7681323 6848777 6393856 6628713 6526317 5915318 5971476 6975473
42305 6975473 7736798 7795007 8123008 9031880 9348617 8421055 7210337 6641086 6380498
42296 6380498 5940160 5604941 5591032 5469532 5007163 4562452 4259943 3767549 3159140 2984954
42286 2984954 3275740 3469621 3452315 3654900 4054298 4132221 3863844 3672951 3438019 2728299
42276 2728299 2007212 2277910 3397921 4063779 3717543 3194738 3165713 3214559 2943897 2823437
42266 2823437 3313655 4069356 4616616 5094749 5823493 6730143 7585300 8291692 8700066
42257 8700066 8638202 8267211 7949506 7761360 7609155 7664760 8077251 8452289 8317929 7914854
42247 7914854 7792694 7847901 7557408 6938896 6434772 6060772 5539013 5055183 4994230 5159978
42237 5159978 5158748 5259026 5885031 6584407 6617640 6319117 6689280 7795927 8756204 9181645
42227 9181645 9462503 9724274 9720665 9740535 10451991 11834954 13334906 14971289 17179236
42218 17179236 19722157 21986220 24214937 27151850 30495677 32942113 33704027 32849816
42210 32849816 30429894 26667905 22782140 20061650 18193206 15967213 13448380 11801101
42202 11801101 11130711 10368439 9350618 9094298 9754604 10171290 9838147 9581622 9867866
42193 9867866 10108702 10071551 10377752 11209394 12033865 12871198 14357160 16542029 19235134
42184 19235134 23205641 28874351 34054610 35698107 34205297 33378622 35612428 39709684
42176 39709684 43823029 47464102 49727329 48745074 44484558 39502224 35549134 31907159
42168 31907159 28177135 25798244 25357172 25252682 24577236 24528713 25592250 26450867 27139363
42159 27139363 29798838 34671624 39160935 42653752 48001000 56278244 65191933 75113461
42151 75113461 90601788 112961067 139461175 174944945 232632908 310312623 373064381
42144 373064381 378182978 319977379 236735759 170059661 129702103 102403145 79586972
42137 79586972 63415482 54177901 46688573 38634067 32623338 29341090 25843319 21212838
42129 21212838 17911996 16736378 15408205 12963214 11208598 10983861 10720588 9553173
42121 9553173 8600015 8388833 7902965 6866559 6363198 6590617 6400604 5561617 5198194
42112 5198194 5544139 5462143 4628386 4066723 4077071 3717777 2825505 2500715 3009568 3173670
42102 3173670 2524856 2200925 2909651 3725075 3797152 3722363 4267505 5060530 5513062 5931245
42092 5931245 6771895 7662198 7966990 7668055 7123249 6593707 6386317 6775051 7496682
42083 7496682 8026181 8492905 9498734 10948593 12072594 12801472 14062588 16421221 19463910
42074 19463910 22807091 26521970 30042805 31834161 30992031 28393596 25528144 22849831
42066 22849831 19940574 16659695 13397868 10608080 8659314 7785734 7712602 7684595 7240725
42057 7240725 6606258 6067372 5476174 4730895 4221804 4321628 4809325 5241584 5598909 6156553
42047 6156553 6922949 7542533 7647287 7145915 6318128 5682686 5556900 5725880 5758068 5538852
42037 5538852 5186677 4657060 3935504 3451413 3645485 4161142 4137100 3349757 2419137 1838761
42027 1838761 1506431 1308037 1388330 1610987 1485917 955324 605205 765972 1008579 872060
42017 872060 513757 284454 202155 209469 450441 936589 1389782 1717696 2207462 3031505
42007 3031505 4058033 5285845 6780372 7957977 7786639 6187138 4471649 3777032
41999 3777032 3732086 3351690 2599075 2199892 2357530 2572859 2532398 2364101 2102780 1614807
41989 1614807 1046345 756181 786920 872800 933526 1120439 1434644 1731639 2056457 2578092
41979 2578092 3236021 3787553 4109816 4143712 3728358 2890678 2117058 1867045 1934716 1768331
41969 1768331 1331301 1127283 1385041 1747559 1868320 1853368 1941787 2115021 2225833 2267675
41959 2267675 2355259 2599876 3064776 3658525 4040844 3855999 3137818 2314721 1755034 1455003
41949 1455003 1217237 982623 893175 1079711 1430886 1602510 1346465 836938 506986 507475
41939 507475 546652 385101 225025 367453 698299 838589 698291 562084 648071 854315
41929 854315 974512 959225 901399 871234 807482 576522 204883 -3909 193984 539406
41919 539406 514844 137547 77004 704705 1444791 1513648 992137 621515 717373 881263
41909 881263 775888 627808 818225 1380491 2064972 2624041 2943179 3131779 3502939 4196125
41899 4196125 4839568 4911583 4426461 3885701 3531197 3098660 2439412 1919976 1919736 2277051
41889 2277051 2563465 2674495 2831704 3163022 3594284 4079721 4670528 5355566 5996917
41880 5996917 6401858 6360118 5716495 4582156 3423954 2762474 2740263 3052836 3285401
41871 3285401 3255540 3064740 2902420 2829037 2763925 2699312 2832729 3339847 4064101 4655923
41861 4655923 5037373 5446782 5925542 6138121 6042145 6451968 8336939 11444965 14077166
41852 14077166 14553300 12744532 9986319 7705262 6405194 5804097 5472579 5164063 4810189
41843 4810189 4508427 4537497 5241960 6764855 8759468 10319253 10417226 8759965 6243052
41834 6243052 4260561 3422724 3166508 2709716 2035984 1672125 1805139 2065357 2092580
41825 2092580 1929681 1850168 2076797 2637007 3233940 3355796 2844564 2258102 2256221 2691606
41815 2691606 2804531 2325056 1802262 1699080 1769618 1643341 1475567 1573697 1810489 1915808
41805 1915808 2038412 2506306 3257825 4002541 4737969 5561225 6106614 5791676 4677987
41796 4677987 3558295 3033099 2912441 2705386 2337410 2123957 2244584 2496396 2536672
41787 2536672 2270620 1985032 2039255 2378609 2506771 2087173 1401880 986709 974378 1108423
41777 1108423 1282937 1661247 2239270 2672217 2680197 2381147 2089948 1957323 1904450 1786438
41767 1786438 1546201 1270847 1091815 984531 767565 387557 45956 -98370 -155460 -232959
41757 -232959 -165577 193473 605507 708716 493542 189395 -124139 -399211 -338915 236105
41747 236105 878096 958263 577726 435531 788558 1188200 1323324 1418955 1587916 1488243
41737 1488243 985965 550546 555755 697858 561054 297035 250856 321714 233379 112229
41727 112229 242543 489232 499452 299079 187159 189033 104398 -22472 35632 239585
41717 239585 349166 362104 441516 480924 227055 -178638 -267272 88937 500976 629503
41707 629503 541267 437293 413735 573115 983104 1406909 1439180 1046825 641441 494737
41697 494737 442436 318476 288242 495573 712125 656341 432250 347919 465576 608148
41687 608148 673175 673354 574420 351285 132532 60652 76071 50494 38924 137170 164445
41676 164445 -167875 -727262 -949287 -545862 30766 106609 -363854 -767064 -628605 -130850
41666 -130850 271693 461624 618284 746071 626081 265122 27600 126748 255348 12938
41656 12938 -458179 -605460 -209945 322224 490633 265064 -11724 -75901 94299 444238
41646 444238 943768 1497184 1890013 1927202 1636434 1286937 1122550 1058833 777006 220268
41636 220268 -168156 48445 637242 881203 485840 -44567 -107878 243905 535246 570048
41626 570048 492359 303071 -176665 -814548 -1110330 -831014 -347209 -94885 -17299 153571
41616 153571 355403 375488 401372 860007 1681981 2238939 2204918 2046897 2356352 3041105
41606 3041105 3588315 3911680 4460865 5515343 6777842 7742250 8140322 7925038 7121822
41597 7121822 5893974 4572349 3443747 2604320 2085981 1942040 2080629 2194439 2058535
41588 2058535 1816997 1807547 2144050 2596628 2844095 2741642 2385608 2020145 1857746 1912400
41578 1912400 2015027 2005557 1843640 1529923 1069814 596531 373947 506966 719673 594087
41568 594087 37925 -593103 -856850 -646251 -240486 29586 139867 342617 739919 1009249
41558 1009249 748340 51530 -522070 -618402 -462876 -430822 -506532 -411672 -93215 205860
41548 205860 297640 227106 118080 46290 77655 264537 549961 755595 702285 358372
41538 358372 -67971 -213239 102145 595545 779876 550506 284063 288281 459343 614310
41528 614310 789153 953673 807277 239824 -311128 -404082 -239982 -284816 -485126 -437022
41518 -437022 -170117 -94199 -207338 -72010 318414 367126 -175645 -739891 -784395 -557522
41508 -557522 -559577 -713951 -601707 -191962 198558 466774 742229 968070 927198 653666
41498 653666 442033 448465 566587 661934 675014 558719 363312 296686 446684 559416
41488 559416 388407 145646 242563 642669 875056 728086 542241 682255 1035526 1223279
41478 1223279 1092847 815428 630388 639672 773518 863355 797577 627564 454084 252516
41468 252516 -45169 -330366 -393904 -259555 -220633 -426858 -610753 -409148 110231 422055
41458 422055 106780 -614705 -1007845 -577913 329104 859056 662749 341668 636856 1374477
41448 1374477 1657973 1103255 380399 294495 746686 1016520 810541 507573 417937 346132
41438 346132 71912 -173063 -54032 299563 457619 299847 89804 -19096 -150979 -311753
41428 -311753 -232194 179267 555789 544248 321803 308536 539707 690205 610849 452507
41418 452507 315918 184713 191890 510087 922790 971434 665933 576961 994089 1446279
41408 1446279 1381021 923659 583928 551763 701162 981506 1320791 1380497 937019 366029
41398 366029 236386 518274 698067 594588 503108 545271 477111 242127 134744 222333
41388 222333 146502 -229524 -470462 -218010 223938 364237 267628 373378 764630 1062222
41378 1062222 990608 691963 457075 392190 388933 275929 -6297 -306162 -394014 -243808
41368 -243808 -63852 11308 100703 366526 789518 1233514 1552197 1577426 1256791 888019
41358 888019 889600 1174328 1121385 450884 -239385 -225422 331958 630828 332254 -117523
41348 -117523 -256215 -170708 -152195 -207913 -152464 69968 355502 573771 612487 445606
41338 445606 250398 297497 622063 931801 930378 631153 290136 130286 193367 382451
41328 382451 580703 732630 801110 676626 273109 -234930 -474560 -327388 -126257 -190277
41318 -190277 -366141 -313050 -42665 197411 408401 734505 962206 685756 27546 -364418
41308 -364418 -201919 87279 111712 75334 228642 275752 -149523 -769277 -990421 -745962
41298 -745962 -475360 -389941 -279985 -13279 269492 500863 802335 1171706 1404158 1399169
41288 1399169 1253932 1039976 806809 786669 1190068 1755433 1933914 1627449 1313145 1301191
41278 1301191 1351426 1250542 1246068 1511835 1639863 1208757 551223 348500 618049 728741
41268 728741 402765 77604 133556 330375 298016 137766 157180 315016 346288 274353
41258 274353 386757 722991 934137 743755 317855 46255 77426 194435 123184 -125639
41248 -125639 -275494 -139938 124988 220707 105589 25467 132174 277603 285632 234693
41238 234693 300337 462780 572302 602339 618973 564420 308978 -85458 -366070 -381224
41228 -381224 -202559 49886 316595 509853 512462 329024 92524 -106213 -241836 -228076
41218 -228076 -8814 201205 62551 -395547 -720675 -632505 -367418 -208484 -11319 426919
41208 426919 795116 585292 -97115 -567950 -483659 -241411 -272015 -377648 -118483 439048
41198 439048 782082 654465 328618 158893 160925 132933 -12614 -183137 -271294 -256154
41188 -256154 -162092 -9953 162968 280984 284254 214182 200218 328164 552531 767278
41178 767278 908236 939046 823141 615336 506594 632399 890592 1115611 1364726 1777384
41168 1777384 2164107 2077170 1436712 800260 773313 1341174 2014195 2456812 2693019 2822164
41158 2822164 2870453 2903419 2977330 2937629 2537566 1841264 1273486 1145697 1311355 1416321
41148 1416321 1334838 1199667 1100484 937494 593433 149296 -142102 -114395 111799 267014
41138 267014 284241 369722 629364 807597 631664 293364 252174 558298 736388 473410
41128 473410 86814 57461 343572 493075 328049 170290 347617 751896 1029188 1047764
41118 1047764 984862 971932 847300 413474 -133759 -295641 84560 502192 397817 -63395
41108 -63395 -201339 227068 735258 859931 729767 645226 550282 308987 132189 239409
41098 239409 360717 109192 -330999 -460749 -303076 -355342 -697854 -810270 -429096 37063
41088 37063 201584 220025 281714 163903 -226523 -374604 153228 886142 996113 476597
41078 476597 84335 170695 286516 67753 -150408 91532 678652 1158878 1347546 1356925
41068 1356925 1263556 1072577 871461 754912 686703 616611 614795 720481 785942 645851
41058 645851 332435 -15839 -310663 -436763 -233030 213379 455343 200508 -185576 -80275
41048 -80275 513364 901883 635218 122838 59208 497530 843796 692596 340102 372445
41038 372445 935384 1566051 1706646 1271714 667184 313933 267962 340778 440737 605023
41028 605023 745045 629324 231153 -124385 -165248 -78616 -246289 -637950 -790986 -464487
41018 -464487 -518 167435 118376 241242 551439 591707 81778 -641334 -1002510 -819320
41008 -819320 -395975 -134751 -202424 -445359 -483011 -30597 699573 1089645 841027 423903
40998 423903 466122 844109 859913 314313 -153420 3717 478208 637687 418562 227707
40988 227707 226297 240054 258318 493778 931209 1266456 1346928 1267327 995583 388196 -292169
40977 -292169 -406157 195876 765895 545708 -231326 -695623 -513434 -185031 -194964 -374578
40967 -374578 -293407 70506 338879 278946 114517 274088 904890 1665395 2023022 1765667
40957 1765667 1158199 589904 221965 56468 124152 369332 508664 319961 13674 5172
40947 5172 333745 637073 725918 810318 1040440 1200907 1085021 853874 739963 657449
40937 657449 434187 211266 221135 309651 115855 -307638 -497493 -271643 2120 -5327
40927 -5327 -107339 24984 318440 473472 493679 652988 987776 1184625 1036536 721496
40917 721496 504659 382385 179748 -142691 -437463 -541763 -382525 -1824 390588 481608
40907 481608 155431 -302313 -490066 -386964 -358075 -600788 -816041 -613274 -77925 328521
40897 328521 377474 294108 321698 353592 181977 -91336 -161780 29287 207247 142728 -98669
40886 -98669 -342708 -535973 -666958 -626865 -336434 66453 342458 423633 415804 358818 185798
40875 185798 -36781 -38100 338362 863952 1140073 1037682 784819 655014 719635 893350
40865 893350 1047968 1041217 802448 476746 339115 454526 556960 406361 137050 60055
40855 60055 219239 388061 461330 563076 730081 785714 650681 510263 495030 447165
40845 447165 244335 119673 320422 608693 516622 56217 -256767 -148546 71672 72813
40835 72813 -21821 -2544 -31301 -293451 -445270 39403 1002586 1605258 1343011 648191
40825 648191 256900 313449 410621 279028 46020 -123156 -272096 -456906 -570179 -519298
40815 -519298 -426161 -478240 -649238 -729755 -633728 -524523 -565120 -656611 -570128 -303579 -119471
40804 -119471 -153212 -155670 194908 819149 1300467 1404959 1294050 1171124 988634 672096
40794 672096 407547 437585 674514 779724 607157 352213 264050 403026 670146 865553
40784 865553 729371 191194 -372458 -423834 56776 450253 260799 -248341 -461228 -249251
40774 -249251 -27640 -54693 -99497 103350 430110 601639 587057 527667 421242 161208
40764 161208 -159102 -247571 8278 330467 333184 -44575 -469530 -557425 -228348 283381
40754 283381 711960 976290 1105553 1057190 744329 243194 -168728 -275414 -165384 -127418
40744 -127418 -315867 -569777 -566366 -150994 455608 793497 587461 52338 -315721 -282012
40734 -282012 -91741 -88725 -266090 -341899 -176293 81416 229394 212710 83929 -57611
40724 -57611 -60397 156529 400527 309602 -197722 -710106 -741554 -296575 161343 282056
40714 282056 177553 157635 305421 456571 498612 510264 593037 696731 671389 424192
40704 424192 -10326 -480375 -758049 -677192 -330941 -55327 -91675 -320663 -463903 -467454
40694 -467454 -469771 -442548 -192827 194942 278937 -130919 -572907 -498721 -49430 156797
40684 156797 -71237 -282850 -134647 120128 107935 -94388 -191518 -188789 -281327 -366804 -92256
40673 -92256 574113 1144679 1128147 569896 -40738 -296906 -204677 -38922 30006 111322
40663 111322 387480 798015 1049656 962414 673467 422013 255755 70057 -157959 -329427
40653 -329427 -391351 -427785 -576534 -893663 -1256933 -1387475 -1077920 -455344 97950 339935
40643 339935 343796 242728 46356 -161099 -132616 169136 352791 86614 -385928 -603519
40633 -603519 -590628 -717676 -942520 -782183 -143727 391277 372155 78359 -30591 -24431
40623 -24431 -195566 -371328 -108158 542929 1001294 914973 512642 128300 -201932 -510539
40613 -510539 -648327 -535236 -405714 -498014 -639867 -447160 106913 599203 677433 452536
40603 452536 280671 335731 534742 744741 868828 796142 491837 159662 109389 373822
40593 373822 617959 536307 201834 -91208 -175853 -54795 235256 572094 683138 410845
40583 410845 -3755 -169552 -55547 20192 -95501 -200240 -115010 58775 175288 249100
40573 249100 275115 118965 -209184 -395743 -173497 308923 652417 622709 269025 -205778
40563 -205778 -534475 -504929 -169537 177637 353689 469657 660387 836435 843939 666903
40553 666903 343457 -64085 -274235 90150 914220 1455095 1159268 369470 -148784 -136904
40543 -136904 114401 401400 747772 1020509 947334 544858 118535 -155494 -281483 -176824
40533 -176824 186104 446980 195984 -356635 -583171 -339349 -105048 -167252 -278541 -269078
40523 -269078 -346912 -536279 -454057 3119 346500 290698 286828 744312 1250675 1202154 784965
40512 784965 606298 646248 367755 -250460 -584733 -343059 26491 103743 85854 309039
40502 309039 626160 629128 251103 -156607 -242927 25622 386468 520334 341747 97625
40492 97625 116978 478392 984019 1362459 1389174 974333 345929 -6315 150801 453734
40482 453734 434694 224515 340993 826146 1107037 836960 394667 289980 463196 516854
40472 516854 360494 224099 169143 -15882 -417831 -802845 -919401 -811137 -713305 -740932
40462 -740932 -789837 -702604 -418331 58389 704122 1361269 1663457 1325871 568654 5029
40452 5029 -36937 151377 190464 184411 401893 619753 323008 -449419 -982091 -760883 -62549
40441 -62549 512287 710150 599575 245353 -252779 -631770 -702575 -580062 -449831 -292199
40431 -292199 -78860 -24644 -317822 -748689 -940552 -852417 -738914 -712335 -691422 -708798
40421 -708798 -873506 -1033430 -884170 -482736 -256308 -373870 -498526 -351695 -133391 -101785
40411 -101785 -100086 99945 262520 -7791 -561675 -826153 -622534 -348508 -247984 -30455
40401 -30455 524890 1060668 1145874 945783 901398 958695 668366 283 -487687 -403603
40391 -403603 2496 284730 341149 296236 174907 -39741 -245346 -339221 -324095 -166340
40381 -166340 193165 544122 465787 -75743 -531261 -484478 -225967 -222115 -356334 -228182
40371 -228182 54848 21080 -354712 -647355 -767944 -1057746 -1486631 -1473813 -808519 -131846
40361 -131846 -77047 -404035 -449320 -70726 331234 466520 368651 148438 -27165 143186
40351 143186 748820 1306755 1172303 344502 -471362 -666096 -326453 33700 116496 94236
40341 94236 316509 841430 1287484 1232946 755307 384362 448210 694549 704783 444828
40331 444828 187662 97594 148842 283023 373180 184606 -332504 -834360 -964575 -830037
40321 -830037 -782366 -833813 -661605 -158488 390509 710037 784833 660993 316744 -162145
40311 -162145 -524670 -584339 -358435 22588 360099 399498 72932 -287202 -273479 60144
40301 60144 310329 368845 536099 890874 1007539 570992 -90994 -435270 -403870 -329316
40291 -329316 -321516 -159106 250811 670837 855288 813620 676475 511598 372259 361006
40281 361006 514130 711312 804080 774095 674404 473980 95484 -383573 -701034 -665160
40271 -665160 -359449 2800 349799 729836 1077492 1232191 1235932 1378745 1807563 2265642
40261 2265642 2390504 2147797 1825788 1735752 2056291 2773858 3541495 3770803 3183117 2196958
40251 2196958 1482563 1198395 968506 549443 145381 26383 182643 454574 712757
40242 712757 809118 629386 314195 173119 253120 233726 -112019 -579655 -811387 -724844
40232 -724844 -521774 -429434 -548135 -798682 -926178 -716769 -290298 -16632 -92823 -381981
40222 -381981 -672648 -843441 -768283 -407148 -65508 -172256 -641677 -849313 -461960 106219
40212 106219 351031 380155 553112 773000 658177 217345 -168638 -344644 -482038 -627091
40202 -627091 -611742 -431027 -289529 -232998 -126081 -25363 -138036 -328611 -152190 410141
40192 410141 709826 277916 -439433 -646966 -298224 -114023 -513631 -1028473 -994635 -467602
40182 -467602 -87924 -193875 -465478 -488743 -310931 -220373 -221946 -58031 324857 642976
40172 642976 644692 375774 35392 -200689 -160236 257734 856259 1182283 955538 346609
40162 346609 -232775 -466380 -256056 237271 623417 640478 543921 788897 1253736 1282160
40152 1282160 731449 404214 952784 1826114 1967431 1273264 636791 656850 1035624 1304734
40142 1304734 1451197 1607969 1688855 1617764 1504845 1352985 963538 358060 -75250 -109336
40132 -109336 -18782 -124471 -309474 -301305 -178385 -235203 -491119 -672553 -630419 -494824
40122 -494824 -403897 -293493 -35177 308328 449435 146150 -483877 -1017485 -1173825 -1078047
40112 -1078047 -945418 -704688 -215232 313146 516661 413606 310291 217322 -119318 -561647
40102 -561647 -558429 1489 481503 383447 41469 6736 184656 124399 -141932 -142657 280977
40091 280977 783980 1040162 1024617 789258 348480 -169612 -556343 -744291 -794714 -719404
40081 -719404 -531645 -381662 -394581 -455917 -383975 -196842 22348 350037 820345 1186330
40071 1186330 1233175 1146492 1162618 1044143 428974 -411495 -779671 -550460 -352099 -606250
40061 -606250 -975769 -1011313 -792679 -578216 -305244 114293 382542 208500 -130614 -121578
40051 -121578 224310 407570 179177 -187016 -361086 -292921 -20728 471774 1045204 1347489
40041 1347489 1187971 800009 542155 455714 307323 10983 -191568 -23883 470300 967325
40031 967325 1232635 1343923 1492767 1653618 1600085 1255962 858423 667261 641967 574376
40021 574376 472940 603420 1109291 1765075 2213644 2351077 2368042 2470342 2671271 2830869
40011 2830869 2782222 2421227 1808932 1237171 1052768 1284608 1526669 1353413 818894 365596
40001 365596 238419 216659 19562 -255100 -313416 -144129 -41760 -171800 -360565 -376126
39991 -376126 -220619 -42845 91904 214866 315755 311607 143209 -144798 -396510 -412456
39981 -412456 -110721 326465 548354 375277 10048 -186900 -127030 -82275 -289138 -581495
39971 -581495 -585791 -261829 -19244 -166534 -454478 -444306 -207772 -251621 -687084 -927457
39961 -927457 -498159 204539 401571 -5934 -349889 -152858 297563 453886 192303 -217277
39951 -217277 -512613 -548507 -232400 343860 809952 823344 451576 59205 -161708 -353512
39941 -353512 -665686 -957697 -952081 -606343 -199404 -22105 -69228 -121228 -79921 -71112 -185755
39930 -185755 -306649 -324243 -357053 -541142 -721251 -637381 -376955 -320855 -586291 -830289
39920 -830289 -740186 -457393 -327334 -430510 -579041 -651997 -719730 -874017 -1075879 -1163581
39910 -1163581 -968222 -486762 45005 366580 486988 608252 757989 732800 455245 112653
39900 112653 -161534 -440483 -671775 -527774 118838 832461 1079498 880261 653075 568620
39890 568620 459365 283348 239998 383918 494157 427844 319559 336932 471072 627716
39880 627716 704292 557154 154705 -211812 -177389 167818 325495 85208 -171007 -60543
39870 -60543 235840 303220 123358 -177 9470 -53825 -211393 -178919 174171 558244 638889
39859 638889 457116 266230 115809 -134854 -453179 -581075 -423577 -244739 -296602 -413285
39849 -413285 -216899 328961 823408 914223 652530 292263 -30671 -276778 -366494 -274046
39839 -274046 -128113 -21327 162969 518846 825249 758132 354240 -9056 -108264 -89679
39829 -89679 -141068 -199946 -115115 69025 124969 -125555 -628476 -1077476 -1118115 -715090 -281926
39818 -281926 -264710 -615630 -878693 -774544 -448718 -127589 171230 480907 705312 756349
39808 756349 679928 517200 226694 -138236 -377486 -410260 -402037 -478454 -505742 -333930 -94716
39797 -94716 -65124 -339798 -769703 -1104362 -1103307 -689699 -115876 215041 215119 183057 298432
39786 298432 351797 180462 31102 156095 328380 162327 -274743 -581135 -601749 -478736
39776 -478736 -258805 90845 363868 312790 149555 332546 798832 939263 492670 -41741
39766 -41741 -133611 81200 150466 -6385 -117927 -15453 261429 616606 867598 767075
39756 767075 359894 133894 473746 1095242 1375115 1162901 895200 907625 1007967 853581
39746 853581 465184 164309 142774 278534 349718 310743 306645 432038 547302 433470
39736 433470 121035 -93484 -36566 96794 42638 -108715 -14012 419203 844014 858223
39726 858223 441507 -74934 -390550 -488944 -530636 -590813 -579630 -408305 -129942 149757
39716 149757 406851 620554 642317 339714 -144280 -487472 -578068 -609417 -745539 -914828
39706 -914828 -1004648 -1018739 -936752 -670000 -297016 -83973 -98603 -76900 112897 173181 -156527
39695 -156527 -606614 -718387 -462787 -129855 190860 558606 776651 585327 203473 117510
39685 117510 306953 252021 -191236 -527106 -441850 -291734 -424929 -555145 -281188 197435
39675 197435 427736 454446 635051 891349 766965 212574 -253648 -279898 -113576 -136929
39665 -136929 -352049 -539555 -638270 -730061 -829265 -887431 -897229 -861054 -759391 -638959 -612084
39654 -612084 -690978 -756663 -764829 -812525 -890916 -771582 -351876 21202 -140565 -826209 -1436874
39643 -1436874 -1432337 -899819 -362194 -156597 -177386 -172168 -78529 -2524 -7368 -33470 41145
39632 41145 339553 899277 1535824 1874143 1689128 1205778 892476 918403 966048 651433
39622 651433 3089 -575009 -739437 -522373 -259786 -260782 -518305 -742957 -723076 -580187
39612 -580187 -534131 -501012 -194156 358062 723818 651482 445773 512260 769451 840126
39602 840126 658486 496490 445667 292518 -2761 -72920 388033 1139088 1613686 1542270
39592 1542270 1172595 897405 815569 717950 441341 133753 94299 377198 685487 721176
39582 721176 526630 373915 414348 570443 692455 665460 421064 17760 -309546 -338995
39572 -338995 -108261 138150 218113 115682 -120110 -416672 -641324 -671818 -499586 -175169
39562 -175169 267253 711904 924150 812966 616294 586583 602130 385440 21770 -104751
39552 -104751 109235 342170 351485 269742 273574 273918 106456 -212347 -567053 -875205 -1042647
39541 -1042647 -1014771 -944982 -1047724 -1216973 -1110251 -704014 -386859 -344284 -271205 47035
39531 47035 287192 94148 -314564 -491930 -438945 -445853 -434972 -10993 829927 1504264
39521 1504264 1475776 807114 15422 -411926 -354381 -103000 -47877 -198425 -165492 216213
39511 216213 528202 362643 3785 24510 375361 466050 123509 -155377 -22692 246603
39501 246603 337229 408153 674091 913356 815271 509888 342535 359663 413949 561670
39491 561670 903967 1170959 958828 376598 -7666 38428 97935 -212615 -615128 -562078
39481 -562078 -47982 359446 275892 -49966 -149780 57943 274536 289421 198956 177555
39471 177555 245115 324901 375144 367653 244573 1235 -249321 -374362 -344436 -224577 -110275
39460 -110275 -92510 -186157 -267095 -204544 -84325 -139748 -410901 -663309 -723720 -682285 -652885
39449 -652885 -578433 -436914 -388921 -506494 -592380 -501165 -385346 -355143 -186828 275332
39439 275332 716896 802645 776680 1079342 1556217 1665465 1381514 1232019 1419258 1572263
39429 1572263 1481480 1414001 1490769 1384746 934483 495709 362706 363494 351125 548346 1015455
39418 1015455 1315906 1174772 967999 1050504 1105284 774348 464449 758028 1342273 1365963
39408 1365963 733176 223294 303907 586992 605090 437460 314723 180025 -33314 -121278
39398 -121278 69935 344621 434861 337945 193546 59865 -32753 -35483 -28111 -193640 -529036
39387 -529036 -803545 -904605 -975987 -1093922 -1076060 -795436 -464161 -393567 -613532 -901973
39377 -901973 -1074140 -1087216 -951180 -690610 -377730 -129664 -63315 -207766 -398128 -350827
39367 -350827 6520 370484 433695 333365 434967 701011 655912 103068 -466259 -440924
39357 -440924 125988 579347 461006 29165 -85051 360658 925941 1014148 586188 126341
39347 126341 -94569 -346863 -823970 -1096642 -656743 217411 705446 503589 85876 -122209
39337 -122209 -236502 -409132 -413146 -82044 268762 264398 24708 -74563 27546 102610 77453
39326 77453 118970 328106 576988 624905 308469 -261846 -651446 -479042 77160 434355
39316 434355 360960 212533 259492 246676 -45566 -243857 110775 787315 1139651 994325
39306 994325 742753 644905 569305 419326 312075 248308 41304 -295846 -461157 -311265
39296 -311265 -97255 -111395 -340570 -571648 -614587 -365130 90324 375124 137070 -424297
39286 -424297 -653949 -232610 406503 646400 402366 26344 -245910 -404467 -377572 -46952
39276 -46952 425857 630763 394170 -1743 -220662 -283260 -383089 -464883 -288204 116980
39266 116980 374090 248972 -44656 -210157 -303136 -525809 -774044 -780340 -641695 -753611
39256 -753611 -1139112 -1295303 -930725 -460998 -432151 -740892 -827879 -472338 15496 323215
39246 323215 468129 570120 611788 536321 407962 391679 622970 1043562 1321985 1119320
39236 1119320 558422 185560 254838 343884 23960 -379755 -213580 484498 993062 926201
39226 926201 631697 455451 228871 -221813 -593133 -563670 -372647 -486734 -909699 -1235215
39216 -1235215 -1244491 -1073699 -873517 -662173 -506520 -540674 -748197 -928701 -915284 -682569
39206 -682569 -270370 217044 551384 533280 262047 80686 155650 240820 953 -485561
39196 -485561 -718471 -338316 414114 936663 917075 570358 233751 -3922 -135155 7907
39186 7907 495448 950017 848289 180299 -513420 -791200 -692534 -449293 -177263 33236
39176 33236 60696 -39095 -46942 42070 -48800 -386206 -586325 -324800 186396 518239 571864
39165 571864 488651 252941 -208905 -673127 -795171 -618076 -519049 -615178 -586239 -208018
39155 -208018 240665 310405 -37357 -379416 -337867 -20278 111301 -183400 -566446 -487825
39145 -487825 117295 730055 909016 768046 628846 502716 233242 -68830 -136180 4757
39135 4757 81299 42317 103387 306740 409897 292729 125289 5902 -228679 -636198
39125 -636198 -905248 -729944 -269594 27718 -38259 -286249 -491792 -626204 -733628 -753977
39115 -753977 -579829 -236764 83962 209518 176789 180587 321949 490133 540365 491730
39105 491730 462628 502761 593449 707144 731722 468236 -86442 -558762 -563748 -201142 87808
39094 87808 120740 97555 109262 -65192 -500605 -834729 -735875 -412156 -314533 -476622 -502439
39083 -502439 -175848 245499 414837 326729 234261 290087 417786 480905 449645 376930 288655
39072 288655 178265 105634 198910 472014 701037 616801 229382 -150273 -237823 -36132
39062 -36132 237281 374678 308361 119020 -56563 -189528 -388532 -658274 -727998 -352730
39052 -352730 257210 604548 531058 348072 264442 89706 -269093 -422330 -19016 611131
39042 611131 813858 491457 167485 204267 412996 503360 487962 480829 447894 355596 289568
39031 289568 244747 65370 -212559 -237732 174459 665646 749955 448962 193741 199241
39021 199241 271637 201046 12855 -207353 -439368 -592688 -501853 -177154 139232 273322
39011 273322 287161 250295 68722 -292794 -618466 -697453 -637158 -682635 -816886 -801845 -580129
39000 -580129 -362145 -278137 -202783 -33590 74523 -69261 -361089 -485796 -309011 -50662
38990 -50662 -39167 -353044 -728846 -810771 -489176 16837 408421 570725 550184 393979
38980 393979 164828 25506 73761 110259 -152801 -593272 -693503 -214745 423301 679106
38970 679106 559815 435938 391332 199915 -107676 -146817 204967 492283 255863 -323177
38960 -323177 -649107 -456160 -48715 169661 153999 133032 236884 354306 331823 195651
38950 195651 97348 75828 -2420 -211151 -389323 -327993 -65915 154668 199041 151267 128280
38939 128280 154128 232778 367787 464868 382458 141435 -65861 -129456 -125228 -117694 -62184
38928 -62184 4028 -104058 -425679 -680104 -604577 -348897 -308391 -621087 -1030495 -1223000
38918 -1223000 -1127071 -879290 -637772 -448659 -218904 149998 540514 633209 274755 -254826
38908 -254826 -517023 -415735 -254026 -313580 -556602 -765464 -817920 -757769 -676376 -566183
38898 -566183 -281990 272834 858309 957015 335172 -540649 -915931 -580012 -32776 205728
38888 205728 158371 154105 324832 563866 772744 872313 699117 199171 -309812 -375724
38878 -375724 21155 386467 312179 -47290 -252937 -152907 48235 171509 218102 146437
38868 146437 -178946 -664358 -880817 -559018 -48787 38918 -376709 -740768 -618177 -224444
38858 -224444 -6479 25490 218237 658711 1000272 944790 624707 399682 458082 720983
38848 720983 978140 985870 557632 -253933 -1077180 -1463209 -1260862 -708650 -158248 213333
38838 213333 391524 352384 83286 -214740 -168996 325372 827204 792896 303129 39444
38828 39444 413827 1021070 1201926 906614 640452 678763 759618 599972 339520 299141
38818 299141 549046 899462 1145179 1159463 906066 542604 392214 605577 903389 849305
38808 849305 383615 -86825 -192843 -59544 -120268 -518231 -877125 -767585 -258044 219079
38798 219079 486455 773093 1157721 1253955 766072 61712 -257838 -182629 -173076 -306469
38788 -306469 -177718 258231 429903 64279 -241847 125842 826559 1052044 691312 351301
38778 351301 358442 415660 281037 161206 251822 382468 345516 210051 133355 198051 555810
38767 555810 1322098 2152819 2374076 1816929 1120782 875645 863998 585220 160934 125695
38757 125695 509714 760245 568492 214186 390 -143427 -313619 -321642 7874 517558
38747 517558 916377 1080486 1010654 734096 390809 167511 16881 -273298 -609805 -579742
38737 -579742 -139904 99947 -325023 -1000283 -1183637 -828435 -491443 -397363 -262021 -35788
38727 -35788 -109065 -557397 -794280 -347153 464291 1011796 1165769 1216262 1280265 1242380
38717 1242380 1115317 1022072 890360 540630 53076 -273528 -323522 -258779 -234836 -269908
38707 -269908 -357086 -457331 -427265 -209586 -35653 -154174 -415043 -446214 -209562 -15179
38697 -15179 25869 152441 459401 655903 511016 212055 58153 69353 118736 200372
38687 200372 328913 393463 354987 393235 610059 769679 605524 241214 30594 83083
38677 83083 206105 230878 141217 -54818 -335632 -586496 -712742 -778107 -854642 -851397 -717324
38666 -717324 -672520 -921444 -1223976 -1118811 -565228 9548 350368 667679 1143099 1511441
38656 1511441 1414682 942368 525514 402369 429854 368342 152032 -114449 -290447 -330594
38646 -330594 -353035 -522219 -787283 -831289 -425732 207487 556491 384025 11441 -51863
38636 -51863 295494 643998 595212 262240 104620 317431 615964 702500 693730 859455
38626 859455 1124335 1165648 945376 781563 841426 913961 820710 720464 776300 797117 528634
38615 528634 135819 53280 400250 831247 970103 749460 313462 -156101 -447906 -397243
38605 -397243 -98622 114502 47045 -111988 -59999 202567 408799 439954 488731 736131
38595 736131 1043665 1137274 1010358 929532 1032866 1152333 1136322 1117899 1246323 1336553
38585 1336553 1117328 754712 735316 1163445 1558902 1524155 1260352 1190146 1448936 2121121
38575 2121121 3596114 6031168 8550027 9685788 8867852 7006068 5360112 4273218
38567 4273218 3348217 2425532 1802841 1633391 1663574 1645437 1618424 1663262 1688695 1625633
38557 1625633 1610295 1802057 2156094 2510405 2799773 3090895 3500529 4141868 5024106 5909940
38547 5909940 6383226 6174224 5372036 4288305 3232677 2455970 2099115 2030927 1890717
38538 1890717 1498888 1123682 1130575 1461951 1727930 1774435 1861357 2223688 2735464 3137328
38528 3137328 3372216 3531166 3637346 3661083 3630300 3567075 3409060 3122793 2780747 2398069
38518 2398069 1853841 1171843 722601 853730 1381806 1755080 1727828 1578724 1610177 1745500
38508 1745500 1767907 1684876 1629830 1585539 1445894 1243849 1098193 1008587 914369 901465 1116525
38497 1116525 1464600 1607517 1340214 828149 399501 205873 150633 71024 -67406 -115428
38487 -115428 123779 632837 1073971 1071527 628596 143399 -26106 116314 364016 604112
38477 604112 807958 868914 685788 391758 288547 485188 744757 773813 559423 321964
38467 321964 210292 173310 128917 138663 327047 651243 849913 707028 351739 181647
38457 181647 415664 806739 920696 657079 337437 269012 397959 477569 427209 379579
38447 379579 455621 635979 814963 864231 685621 326202 11067 -65406 37977 115007
38437 115007 102074 103951 154365 164308 158135 340785 788347 1225459 1290218 952058 517642
38426 517642 262377 194733 177572 152176 182920 322409 481764 476709 236107 -82924 -281786
38415 -281786 -381464 -531008 -652303 -424932 228725 853086 910966 443434 28430 84443
38405 84443 436686 627216 471149 201381 170913 513035 1042794 1412867 1380803 987547
38395 987547 518353 292648 435624 780371 1012458 996156 926186 1025799 1146219 917001
38385 917001 330411 -143418 -190470 -83983 -193211 -337220 -48539 661590 1261116 1411892
38375 1411892 1309650 1251070 1247308 1193469 1101885 1021723 973595 1046156 1286857 1447315 1190847
38364 1190847 656649 415161 673410 943609 791288 498055 545121 759282 535946 -204419
38354 -204419 -829166 -821237 -371834 -27618 -68140 -367901 -623485 -565660 -116005 526142
38344 526142 1023957 1180903 1034784 737031 464044 375110 469280 518006 331451 58521
38334 58521 8093 202483 373172 415973 548115 908072 1279128 1388630 1263719 1089172
38324 1089172 898430 649033 472029 559366 832539 979508 851598 605760 398380 160726
38314 160726 -194694 -529076 -633057 -529534 -420687 -369934 -229403 104611 530922 862822
38304 862822 962856 772749 419261 287506 675427 1271591 1335881 637446 -132998 -237758
38294 -237758 145489 319038 143889 52658 97015 -202386 -874793 -1152279 -548158 324621
38284 324621 582922 288682 209440 634393 1075200 1061402 660349 167216 -255862 -522845
38274 -522845 -544364 -324169 56009 554147 1096455 1460021 1443052 1093155 595150 63375
38264 63375 -369196 -472378 -218082 37894 5253 -90442 133005 587850 863756 851954
38254 851954 782363 768210 783327 975710 1475640 1948581 1886325 1345221 867623 673005
38244 673005 506610 328910 497018 1065672 1499674 1372827 904331 561601 533331 772053
38234 772053 1129222 1284204 986293 516590 436199 757159 920618 728680 615596 754309
38224 754309 664860 144073 -154884 326006 1133291 1507378 1486053 1577528 1756437 1584648
38214 1584648 1084892 738474 726090 803822 835154 880621 870609 733973 748013 1239763
38204 1239763 2031320 2654189 2987016 3225510 3410184 3504201 3780871 4623315 6093766
38195 6093766 8126381 10769196 13574956 15141757 14240821 11379826 8405675 6526253
38187 6526253 5512936 4815656 4425295 4335254 4087236 3401745 2653746 2272195 2158366
38178 2158366 2039991 1898218 1723710 1363430 936954 884994 1250096 1426047 1020247 473665
38168 473665 385435 681947 947836 1173163 1601116 2091877 2192700 1758063 1119223 698666
38158 698666 679921 916007 1007700 695046 285032 366213 990362 1581922 1812536 1981857
38148 1981857 2232664 2061720 1168060 227966 112102 696910 1167113 1225605 1256191 1444251
38138 1444251 1505890 1304846 1074065 943641 811318 744372 949949 1246973 1130578 551580
38128 551580 130844 342172 889604 1173856 1048256 822882 770117 923539 1217032 1556310
38118 1556310 1797333 1822267 1629418 1289723 877808 495115 279329 312068 534933 787103
38108 787103 934622 988230 1084543 1291449 1468153 1456765 1390996 1587831 2077428 2493799
38098 2493799 2554381 2397651 2281359 2206357 2072602 1983525 2112103 2403426 2650106 2747019
38088 2747019 2692319 2504936 2330791 2434403 2870327 3353338 3648643 3851647 4069594 4130277
38078 4130277 3906108 3633903 3554238 3494805 3198752 2822116 2679939 2703306 2587632 2315335
38068 2315335 2108413 2019165 1980923 2095324 2438484 2742450 2702015 2443693 2279286 2189440
38058 2189440 1980622 1724930 1586937 1476378 1351516 1523525 2081992 2406168 1961106
38049 1961106 1208686 908997 899261 564768 196196 649234 1744613 2303853 1916430 1434136
38039 1434136 1471760 1658779 1728551 2095756 2854265 3392436 3570897 4126159 5307117 6300861
38029 6300861 6673971 7151871 8264806 9590513 11149411 13963283 18233041 22981890
38021 22981890 29098082 40165262 56878361 72013048 75349327 64469746 47526377
38014 47526377 34222464 26998430 22578947 18817130 16493771 15830477 15077239 13164752
38006 13164752 11273262 10738054 11042140 11020249 10905318 11834857 13866955 15920370 17861759
37997 17861759 21359629 27629466 34833034 39011283 37945737 33219949 28058325 24185637
37989 24185637 21646957 20518556 21067967 22788044 25317563 30228003 39350168 50346958
37981 50346958 56388389 52494179 41125320 29502497 22159233 18184245 15106474 12554911
37973 12554911 11263872 10811434 10113351 9112588 8527629 8475249 8505303 8628146 9243146
37964 9243146 10250566 11262461 12706474 15697025 20364613 24926586 26970503 25511325
37956 25511325 21575983 17047620 13283678 10691998 9097943 8144109 7414243 6526164
37948 6526164 5363205 4188308 3385876 3079102 3073055 3108936 3033258 2775211 2369580 2019140
37938 2019140 1935492 2078802 2244675 2423012 2798853 3318184 3597597 3512861 3594726 4457868
37928 4457868 5952212 7249135 7739510 7495943 6840528 5882267 4681389 3541149 2808650
37919 2808650 2502255 2366116 2209243 2011651 1809967 1690987 1800262 2117417 2305665
37910 2305665 2072626 1646330 1564598 1950423 2335343 2319514 2074967 1999513 2181399 2483013
37900 2483013 2891001 3417453 3808506 3746166 3317644 2966128 2965831 3208845 3499484 3775458
37890 3775458 4012119 4175183 4318423 4497338 4561793 4286331 3741382 3267329 3021256 2823593
37880 2823593 2536097 2300338 2256773 2280129 2172309 1936691 1723437 1670228 1888510 2395372
37870 2395372 2952389 3202419 3096258 2957091 2996754 3028771 2820281 2447498 2084960 1705584
37860 1705584 1249730 864041 695608 644681 585085 613296 782104 823823 526738 205277
37850 205277 336011 800977 970799 587824 133198 168841 657837 1136334 1313109 1276903
37840 1276903 1245109 1312479 1438623 1578448 1775028 2100029 2520152 2907524 3182376 3305511
37830 3305511 3127227 2493498 1597128 926931 670336 462824 6734 -369602 -174669
37821 -174669 456212 907911 887562 600399 230796 -196652 -439732 -125281 609721 1073406
37811 1073406 884024 492736 568745 1178593 1857573 2245093 2352939 2344391 2287551 2089397
37801 2089397 1602558 892457 369542 428819 951014 1429671 1607970 1668998 1764735 1765927
37791 1765927 1617832 1538053 1635310 1689798 1580253 1609372 2086091 2816478 3307714 3304289
37781 3304289 2888160 2249145 1609615 1209344 1127279 1228255 1399040 1628188 1765388 1542756
37771 1542756 1023597 674106 741416 918171 901095 874066 1064235 1234158 1107850 948491
37761 948491 1140734 1472336 1451360 1143324 1039917 1205686 1222469 957882 736135 708311
37751 708311 692301 718814 1085717 1715423 2090787 2043167 1997015 2184262 2235672 1869169
37741 1869169 1361633 937937 324233 -552614 -1011585 -479216 508645 938485 690922
37732 690922 496880 682998 820818 670631 621963 919958 1175675 1056481 879205 1020137
37722 1020137 1199044 937195 417309 235490 419078 359367 -185306 -625400 -375096 291478
37712 291478 627915 396800 20275 -137923 -179763 -299900 -407384 -325469 -97918 145198
37702 145198 438981 843856 1188232 1234375 1032851 823189 609884 162928 -504917 -996214
37692 -996214 -1023192 -765503 -531937 -331099 -67918 57527 -234402 -749260 -911612 -509791
37682 -509791 6779 141055 -53969 -228844 -306529 -436437 -543548 -364421 48981 269081
37672 269081 83732 -184296 -165062 28895 47105 -130188 -209870 -60473 185831 467214
37662 467214 864253 1293682 1471625 1295165 976012 683521 350447 -20230 -170638 50857
37652 50857 389734 510117 434904 416103 538110 700407 836980 899559 776066 488388
37642 488388 318175 454079 658687 579917 245710 -62140 -255931 -395718 -367716 -63111
37632 -63111 236846 161629 -111456 -63630 307036 428215 85033 -192016 53829 516825
37622 516825 620350 296061 -96017 -300913 -266783 9684 377258 484363 158887 -342548
37612 -342548 -707983 -956925 -1192805 -1238561 -861625 -179259 463027 857723 947215 710116
37602 710116 310923 102155 160150 82748 -403265 -922123 -955797 -591280 -261039 14703
37592 14703 514589 1083830 1205700 860656 680496 1046264 1542849 1574149 1135597 696894
37582 696894 573040 648085 583277 181647 -347368 -501533 -32903 694504 1126003 1177685
37572 1177685 1167104 1224144 1196612 1060497 937661 729017 255938 -214509 -176933 276186
37562 276186 457786 134093 -87989 231388 606810 390651 -221427 -555593 -459713 -304513
37552 -304513 -236188 -75355 153054 200201 104144 190847 502298 677569 504171 203065
37542 203065 41577 -20359 -163203 -422842 -679152 -768976 -591769 -266651 -128586 -334487
37532 -334487 -534227 -238569 491333 1047251 1013098 577726 127545 -217377 -469807 -496969
37522 -496969 -196629 197946 297666 27802 -293149 -356298 -176676 29422 135709 183896
37512 183896 245946 316440 346379 315203 246474 207442 318095 673891 1173444 1489002 1337474
37501 1337474 771783 114640 -346526 -492737 -322016 5733 148607 -80402 -352098
37492 -352098 -143321 506232 933218 699927 127534 -242020 -329886 -343798 -277577 -21984
37482 -21984 274963 413380 527481 814350 1030824 757666 91290 -418601 -505869 -401182
37472 -401182 -315326 -192077 -28900 15177 -80940 -198888 -409029 -842129 -1216211 -1057586
37462 -1057586 -496047 -212715 -386134 -366048 231512 769850 503809 -281358 -732837 -673591
37452 -673591 -639487 -853331 -913503 -549018 -73312 69961 -199392 -649483 -944131 -791246
37442 -791246 -235294 225226 191533 -30516 153230 661004 800068 380454 74212 363348
37432 363348 781196 703840 362008 387177 686329 558980 -124180 -620393 -377284 225372
37422 225372 525678 491546 546933 800670 944194 800550 520600 220763 -174026 -614298
37412 -614298 -790570 -519584 -49530 224630 200577 47632 -93336 -167308 -92627 135806
37402 135806 291111 145138 -150161 -197949 80245 301115 139265 -282480 -664322 -911238
37392 -911238 -1020677 -842355 -285766 352126 606469 388433 46379 -123284 -166972 -226266
37382 -226266 -258689 -157399 2106 7731 -217434 -472521 -434213 15511 594173 830192
37372 830192 556606 115932 -51154 64549 108357 -97687 -332429 -330785 -119105 119149
37362 119149 316458 490720 565357 415136 77514 -214252 -250342 -64167 79330 -59556
37352 -59556 -405959 -579309 -298423 233095 485371 183535 -396080 -764775 -729788 -486706
37342 -486706 -326509 -371392 -536991 -647389 -605366 -497744 -493173 -616490 -709586 -651857 -510075
37331 -510075 -403768 -334212 -241878 -135847 -56983 5801 51661 -18 -188901 -390478 -441168
37320 -441168 -332475 -163854 16778 171506 158428 -115465 -448964 -500215 -233556 18757
37310 18757 31141 -16893 117125 310369 250356 -74978 -359531 -438097 -462313 -527486 -404992
37299 -404992 130013 866425 1317912 1271524 942663 590887 247629 -83400 -214610 13788
37289 13788 447747 779116 925445 1023944 1088480 950989 602905 330290 356690 545659
37279 545659 640338 644259 737620 904057 898458 606455 233385 62543 154372 350969 480184
37268 480184 484806 409052 322018 251471 190153 163380 222472 324351 315760 151641 42535
37257 42535 211703 550331 716977 574474 300688 30712 -337992 -844185 -1212342 -1140163
37247 -1140163 -697182 -209616 149840 421916 589774 529781 250062 -61082 -276940 -420221
37237 -420221 -464907 -280674 119658 484040 620832 628882 670704 679654 505960 234626 97293
37226 97293 104483 23206 -250632 -535118 -651951 -650722 -620718 -492948 -238177 -104090 -356449
37215 -356449 -801845 -866268 -272500 562735 976840 778458 333862 27398 -123009 -291935
37205 -291935 -515892 -664558 -619066 -362683 17830 321871 331476 59065 -183965 -136318
37195 -136318 50324 -1898 -359423 -654059 -560284 -194162 71256 24104 -270482 -615902
37185 -615902 -796369 -672151 -331807 -65894 -49178 -144930 -157538 -129944 -183639 -212953 -44988
37174 -44988 167903 75946 -309100 -531597 -295289 156716 436913 497490 479752 345510
37164 345510 7018 -330000 -350736 -137868 -111836 -377165 -483193 -52957 610188 848676
37154 848676 457772 -150020 -554798 -749985 -845195 -708450 -231687 245242 209563 -316839
37144 -316839 -747691 -730711 -579175 -665178 -776201 -511441 -57696 -5497 -437994 -747926
37134 -747926 -468370 173778 683490 843028 639359 87908 -577022 -914725 -825187 -762298
37124 -762298 -1045900 -1297039 -1015087 -436181 -249268 -589344 -894952 -770688 -448224 -280273
37114 -280273 -253279 -199514 -130725 -147118 -260928 -456590 -717433 -916037 -905583 -759150
37104 -759150 -658415 -538494 -183394 289322 454660 223973 48860 269289 636566 740905
37094 740905 556826 269006 -91300 -467235 -550601 -189347 196898 92161 -351300 -515311
37084 -515311 -238984 -30558 -270235 -666895 -727218 -420946 -99315 31168 52977 41633
37074 41633 -90059 -384352 -652584 -653829 -425928 -277726 -380891 -522142 -433680 -239565
37064 -239565 -274841 -498763 -477027 -52651 368497 432445 356276 489052 689282 603132
37054 603132 332037 287969 486918 533793 309938 129593 119162 -12936 -372071 -546146
37044 -546146 -226810 213585 178326 -342807 -805962 -835841 -573818 -351197 -303753 -330421
37034 -330421 -245821 38268 375394 489820 329657 194821 339961 567130 458538 -31713
37024 -31713 -482112 -535007 -287285 -52755 65649 190055 355523 394429 182978 -117042
37014 -117042 -181482 108493 512056 709698 684242 700328 894485 1033340 789891 174634
37004 174634 -455081 -797359 -874373 -871463 -855869 -767274 -601559 -447215 -339378 -223610
36994 -223610 -120573 -191452 -517014 -898176 -1033269 -860902 -569810 -285498 55322 471519
36984 471519 780217 800297 590044 369497 293812 363733 434386 267161 -233458 -755115
36974 -755115 -809560 -395530 -139915 -495502 -1070429 -1166506 -788106 -583129 -819368 -1005602
36964 -1005602 -702070 -192191 -9675 -155382 -194421 53597 323197 373177 327140 453370
36954 453370 772758 987815 772576 121219 -584480 -889550 -659555 -131908 379924 729017
36944 729017 905106 916122 768912 509237 253163 176281 370473 644782 632951 264016
36934 264016 -43366 95006 459691 508045 126677 -266182 -324732 -90180 282754 680928
36924 680928 874719 657281 240233 75916 189357 163651 -102368 -198740 24807 127157
36914 127157 -128785 -277398 51512 418609 306287 72860 381263 985349 958987 73738
36904 73738 -839692 -998355 -492628 119368 479378 526106 390706 366970 641989 984407
36894 984407 1025581 820383 725311 771239 652949 344989 190613 303867 410373 390335
36884 390335 451756 625845 625153 378919 180259 115527 -84099 -391530 -309889 297844 805549
36873 805549 702151 329803 234791 303214 158198 -43330 50656 179343 -184340 -825956
36863 -825956 -947931 -368195 191980 182329 -82033 -71264 180080 311535 242663 149753
36853 149753 95144 20644 -49126 -62485 -77190 -135888 -132688 465 92575 -72164 -426680
36842 -426680 -671866 -620860 -345847 -16706 256883 425222 476450 457594 446476 478267
36832 478267 542121 633999 735602 744616 536596 151679 -174706 -265909 -221607 -249942 -329722
36821 -329722 -235172 77335 336092 332003 224414 272943 432494 467256 341323 199288
$$ [...]
##END NTUPLES=NMR SPECTRUM
##END=
