##TITLE=31Pdec_IBPA1911D
 CDCl3, 72 sc
 20.11.2019
##JCAMPDX= 6.0         $$ Bruker NMR JCAMP-DX V2.0
##DATA TYPE= NMR SPECTRUM
##DATA CLASS= NTUPLES
##ORIGIN= UXNMR, Bruker Analytische Messtechnik GmbH
##OWNER= root
$$ XWIN-NMR		Version 3.5
$$ Wed Nov 20 14:26:24 2019 Russian Standard Time (UT+4h)  she@DPX200
##.OBSERVE FREQUENCY= 81.013821
##.OBSERVE NUCLEUS= ^31P
##.ACQUISITION MODE= SIMULTANEOUS
##.ACQUISITION SCHEME= undefined
##.AVERAGES= 72
##.DIGITISER RES= 17
##SPECTROMETER/DATA SYSTEM= spect
##.PULSE SEQUENCE= zgpg30
##.SOLVENT NAME= THF
##.SHIFT REFERENCE= (INTERNAL, THF, 0, 182.463)
##AUDIT TRAIL= $$ (NUMBER, WHEN, WHO, WHERE, WHAT)
$$ ##TITLE= Audit trail, XWIN-NMR		Version 3.5
$$ ##JCAMPDX= 5.01
$$ ##ORIGIN= Bruker BioSpin GmbH
$$ ##OWNER= she
$$ F:/spectra/data/she/nmr/P31/1/pdata/1/auditp.txt
$$ ##AUDIT TRAIL=  $$ (NUMBER, WHEN, WHO, WHERE, WHAT)
(   1,<2019-11-20 14:25:23.56 +0400>,<she>,<DPX200>,
      <continue with go, POWCHK disabled, PULCHK disabled
       configuration hash MD5:
       00 E9 B6 7A A2 85 ED C7 34 08 36 98 17 FE 4E 26
       data hash MD5: 32K
       0E F5 32 1A EA ED 5D 1E C8 9F 9B 08 8A 4B 63 64>)
(   2,<2019-11-20 14:25:26.70 +0400>,<she>,<DPX200>,
      <Start of raw data processing
       efp BC_mod = 2 LB = 1 FT_mod = 6 PKNL = 1 PHC0 = -1286.27 PHC1 = 9.40098 SI = 64K 
       data hash MD5: 64K
       4E 64 B3 93 8C B1 7D 8D 86 DB 3C 36 95 1D CE CC>)
(   3,<2019-11-20 14:25:52.04 +0400>,<she>,<DPX200>,
      <pk PHC0 = -16.60953 PHC1 = 29.6 
       data hash MD5: 64K
       35 D1 F8 C5 10 60 A8 82 BD 5A B1 8E EF 44 83 9A>)
(   4,<2019-11-20 14:25:55.96 +0400>,<she>,<DPX200>,
      <abs ABSG = 5 
       data hash MD5: 64K
       84 D5 32 15 15 A5 13 9C 92 DE 4F 32 F8 D6 89 F0>)
$$ ##END=
$$ 
$$ hash MD5
$$ B4 5B C5 A7 06 FC 7A FF EA 5E 38 37 42 8F 88 D2
##$RELAX= 
##$RELAX= 
##$RELAX= 
##$RELAX= 
##$RELAX= 
##$RELAX= 
##$RELAX= 
##$RELAX= 
$$ Bruker specific parameters
$$ --------------------------
##$DU= <F:/spectra>
##$EXPNO= 1
##$NAME= <P31>
##$PROCNO= 1
##$TYPE= <nmr>
##$USER= <she>
##$AMP= (0..31)
100 100 100 100 100 100 100 100 100 100 100 100 100 100 100 100 100 100 
100 100 100 100 100 100 100 100 100 100 100 100 100 100 
##$AQSEQ= 0
##$AQ_mod= 1
##$AUNM= <au_zg>
##$AUTOPOS= <>
##$BF1= 81.014009
##$BF2= 200.13
##$BF3= 200.13
##$BF4= 200.13
##$BF5= 200.13
##$BF6= 200.13
##$BF7= 200.13
##$BF8= 200.13
##$BYTORDA= 1
##$CFDGTYP= 0
##$CFRGTYP= 5
##$CHEMSTR= <none>
##$CNST= (0..31)
1 1 145 1 1 1 1 1 1 1 1 1 1 1 1 1 1 1 1 1 1 1 1 1 1 1 1 1 1 1 1 1 
##$CPDPRG= <waltz16>
##$CPDPRG1= <>
##$CPDPRG2= <waltz16>
##$CPDPRG3= <>
##$CPDPRG4= <mlev>
##$CPDPRG5= <mlev>
##$CPDPRG6= <mlev>
##$CPDPRG7= <mlev>
##$CPDPRG8= <mlev>
##$CPDPRGB= <>
##$CPDPRGT= <>
##$D= (0..31)
0 1 0 0 0 0 0 0 0 0 0 0.03 2e-05 3e-06 0 0 0 0 0 0 0 0 0 0 0 0 0 0 0 0 
0 0 
##$DATE= 1574245425
##$DBL= (0..7)
120 120 120 11 120 120 24 19 
##$DBP= (0..7)
150 150 150 150 150 150 150 150 
##$DBP07= 0
##$DBPNAM0= <>
##$DBPNAM1= <>
##$DBPNAM2= <>
$$ [...]
##$SUBNAM3= <"">
##$SUBNAM4= <"">
##$SUBNAM5= <"">
##$SUBNAM6= <"">
##$SUBNAM7= <"">
##$SUBNAM8= <"">
##$SUBNAM9= <"">
##$SW= 369.568048894756
##$SWIBOX= (0..15)
0 1 3 0 0 0 0 0 0 0 0 0 0 0 0 0 
##$SW_h= 29940.119760479
##$TD= 32768
##$TD0= 1
##$TE= 0
##$TE2= 300
##$TE3= 300
##$TEG= 300
##$TL= (0..7)
0 120 53 12 22 120 120 120 
##$TP= (0..7)
150 150 150 150 150 150 150 150 
##$TP07= 0
##$TPNAME0= <>
##$TPNAME1= <>
##$TPNAME2= <>
##$TPNAME3= <>
##$TPNAME4= <>
##$TPNAME5= <>
##$TPNAME6= <>
##$TPNAME7= <>
##$TPOAL= (0..7)
0.5 0.5 0.5 0.5 0.5 0.5 0.5 0.5 
##$TPOFFS= (0..7)
0 0 0 0 0 0 0 0 
##$TUNHIN= 0
##$TUNHOUT= 0
##$TUNXOUT= 0
##$USERA1= <user>
##$USERA2= <user>
##$USERA3= <user>
##$USERA4= <user>
##$USERA5= <user>
##$V9= 5
##$VALIST= <valist>
##$VCLIST= <CCCCCCCCCCCCCCC>
##$VD= 0
##$VDLIST= <DDDDDDDDDDDDDDD>
##$VPLIST= <PPPPPPPPPPPPPPP>
##$VTLIST= <TTTTTTTTTTTTTTT>
##$WBST= 1024
##$WBSW= 4
##$XGAIN= (0..3)
0 0 0 0 
##$XL= 0
##$YL= 0
##$YMAX_a= 44922
##$YMIN_a= -40055
##$ZGOPTNS= <>
##$ZL1= 120
##$ZL2= 120
##$ZL3= 120
##$ZL4= 120
##$ABSF1= 182.463
##$ABSF2= -187.1042
##$ABSG= 5
##$ABSL= 3
##$ALPHA= 0
##$AQORDER= 0
##$ASSFAC= 0
##$ASSFACI= 0
##$ASSFACX= 0
##$ASSWID= 0
##$AUNMP= <proc_1d>
##$AZFE= 0.1
##$AZFW= 0.5
##$BCFW= 0
##$BC_mod= 2
##$BYTORDP= 0
##$COROFFS= 0
##$CY= -3
##$DATMOD= 1
##$DC= 0
##$DFILT= <>
##$DTYPP= 0
##$F1P= 0
##$F2P= 0
##$FCOR= 1
##$FTSIZE= 65536
##$FT_mod= 6
##$GAMMA= 0
##$GB= 0
##$INTBC= 1
##$INTSCL= 5.30512e-09
##$ISEN= 30
##$LB= 1
##$LEV0= 0
##$LPBIN= 0
##$MAXI= 10000
##$MC2= 0
##$MEAN= 0
##$ME_mod= 0
##$MI= 50
##$NCOEF= 0
##$NC_proc= -7
##$NLEV= 6
##$NOISF1= 182.463
##$NOISF2= 159.3651
##$NSP= 0
##$NTH_PI= 0
##$NZP= 0
##$OFFSET= 182.463
##$PC= 4
##$PHC0= -1302.88
##$PHC1= 39.00098
##$PH_mod= 1
##$PKNL= yes
##$PPARMOD= 0
##$PSCAL= 0
##$PSIGN= 0
##$REVERSE= no
##$SF= 81.0140089999434
##$SI= 65536
##$SIGF1= 159.3651
##$SIGF2= -187.1042
##$SINO= 113.3802
##$SIOLD= 16384
##$SREGLST= <1H.CDCl3>
##$SSB= 0
##$STSI= 65536
##$STSR= 0
##$SW_p= 29940.119760479
##$SYMM= 0
##$S_DEV= 0
##$TDeff= 32768
##$TDoff= 0
##$TI= <>
##$TILT= no
##$TM1= 0
##$TM2= 0
##$TOPLEV= 0
##$USERP1= <user>
##$USERP2= <user>
##$USERP3= <user>
##$USERP4= <user>
##$USERP5= <user>
##$WDW= 1
##$XDIM= 65536
##$YMAX_p= 284510046
##$YMIN_p= -75249275
$$ End of Bruker specific parameters
$$ ---------------------------------
##NTUPLES= NMR SPECTRUM
##VAR_NAME=  FREQUENCY,     SPECTRUM/REAL,   SPECTRUM/IMAG
##SYMBOL=    X,             R,               I
##VAR_TYPE=  INDEPENDENT,   DEPENDENT,       DEPENDENT
##VAR_FORM=  AFFN,          ASDF,            ASDF
##VAR_DIM=   65536,         65536,           65536
##UNITS=     HZ,            ARBITRARY UNITS, ARBITRARY UNITS
##FACTOR=    0.456856943014862, 1,           1
##FIRST=     14782.0589164792, 0,            0
##LAST=      -15158.0608439998, 0,           0
##MIN=       -15158.0608439998, -75249275,   0
##MAX=       14782.0589164792, 284510046,    0
$$ Real data points
##PAGE= N=1
##DATA TABLE= (X++(R..R)), XYDATA
$$ [...]
$$ plain form
45337 -9608561 -9835439 -8376919 -9482912 -13711894 -17375902 -17774435 -16358622 -14707864
45329 -14707864 -10678473 -2563007 5359976 6769818 1993057 -2637689 -4259190 -6678983
45321 -6678983 -12620887 -18122513 -17689925 -11213441 -2664879 5076143 11013761 14093024
45313 14093024 13751784 11271607 8459214 6142971 5166714 6632969 9412266 9915654
45305 9915654 6847888 4093332 5979371 11202889 14504067 13432492 10428296 8517605
45297 8517605 7910655 7584126 8160791 11793957 19506017 29277408 37480333 42913059 48650151
45288 48650151 58079556 69430183 76775982 76732059 71185434 62786040 51757571 39340355
45280 39340355 30300126 27913168 28853599 27193109 21875575 16251841 11828774 7433802
$$ packed form
45337i608561k26878J458520j105993m228982l664008l98533J415813J650758
45329a4707864M029391Q115466P922983J409842m776761m630746j621501k419793
45321f678983n941904n501626M32588O476484Q548562P741022N937618L079263
45313A4093024l41240k480177k812393k316243r76257J466255K779297N03388
45305I915654l067766k754556J886039N223518L301178j071575l004196j910691
45297H517605o06950l26529N76665L633166P712060R771391Q202925N432726N737092
45288D8650151R429405J1350627P345799m3923n546625q399394j1028469j2417216
45280C9340355r040229k386958R40431j660490n317534n623734m423067m394972
$$ plain form
45272 7433802 4072916 5133358 10377604 14301434 12890289 8701536 6646415 7384139
45264 7384139 7934821 7049046 6403148 6681523 5731908 2002781 -2223643 -3347556 -1679226
45255 -1679226 -1483393 -4724912 -7415100 -5171574 -576990 -71623 -3397422 -2316162
45247 -2316162 7057527 16434735 15763984 7598822 3552759 7917062 12921790 11226722
45239 11226722 5349549 1592662 1119750 1410707 1508400 1047026 -1904192 -7098286 -9567951
45230 -9567951 -5958226 -650046 -252634 -4319836 -7216624 -7241743 -7455772 -8582519 -8207088
45221 -8207088 -7117554 -9028974 -12696303 -11901701 -5879922 -1959018 -3623975 -3883078
45213 -3883078 2881853 9596835 6306969 -3542098 -7637340 -3560660 -1025436 -4249002
$$ packed form
45272G433802l360886J060442N244246L923830j411145m188753k055121P37724
45264G384139N50682q85775o45898K78375r49615l729127m226424j123913J668330
45255a679226J95833l241519k690188K243526M594584N05367l325799J081260
45247b316162R373689R377208o70751q165162m046063M364303N004728j695068
45239A1226722n877173l756887m72912K90957R7693m61374k951218n194094k469665
45230i567951L609725N308180L97412m067202k896788k5119k14029j126747L75431
45221h207088J089534j911420l667329P94602O021779L920904j664957k59103
45213c883078O764931O714982l289866r849067m095242M076680K535224l223566
$$ plain form
45205 -4249002 -4531912 4184730 12991884 10099668 -1681963 -9377636 -7878435 -3750768
45197 -3750768 -2652132 -2745017 -1708000 -1629577 -3808308 -5351788 -4596696 -4585602 -7431536
45188 -7431536 -9914552 -8777914 -6308027 -6024739 -6186640 -2823999 2957050 6085211
45180 6085211 4920940 2523042 860452 -1309047 -4224533 -5410524 -3713389 -1345831
45172 -1345831 -136473 1083181 3406571 5103037 4455640 3167245 4202265 7547035
45164 7547035 10544196 11493853 10682309 8640514 5762320 3262006 2148142 1234376 -1611571
45155 -1611571 -6041107 -9304261 -10101582 -9700157 -8326039 -3725855 4302440 10963199
45147 10963199 11998779 10308556 12115506 17160128 18644759 14223344 10628086 13492143
$$ packed form
45205d249002k82910Q716642Q807154k892216j1781631p695673J499201M127667
45197c750768J098636r2885J037017P8423k178731j543480P55092J1094k845934
45188g431536k483016J136638K469887K83288j61901L362641N781049L128161
45180F085211j164271k397898j662590k169499k915486j185991J697135K367558
45172a345831J209358J219654K323390J696466o47397j288395J035020L344770
45164G547035K997161R49657q11544k041795k878194k500314j113864r13766k845947
45155a611571m429536l263154p97321M01425J374118M600184Q028295O660759
45147A0963199J035580j690223J806950N044622J484631m421415l595258K864057
$$ plain form
45139 13492143 18099074 16196135 8187201 1531080 -699449 -1798101 -2708658 -64520
45131 -64520 5370265 6744813 1467964 -3703001 -2872660 63363 -1311297 -5308446 -6069397
45122 -6069397 -4036673 -4421298 -7436893 -8037135 -4714145 -1296669 99666 1148795
45114 1148795 1771282 -915608 -6580772 -10169473 -8150222 -1980934 5163330 10486219
45106 10486219 10716278 5100754 -599869 304199 5402966 6204995 2023536 1639407 8196968
45097 8196968 12448360 6935350 -1986890 -4065214 276683 4075439 6307049 10118582
45089 10118582 13103643 10428674 5449904 6172231 11422788 11180137 2074578 -7272497
45081 -7272497 -9020407 -5223538 -606724 5238081 13111237 18461119 16720365 10291721
$$ packed form
45139A3492143M606931j902939q008934o656121k230529j098652r10557K644138
45131f4520N434785J374548n276849n170965Q30341K936023j374660l997149p60951
45122f069397K032724l84625l015595o00242L322990L417476J396335J049129
45114A148795O22487k686890n665164l588701K019251O169288P144264N322889
45106A0486219K30059n615524n700623R04068N098767Q02029m181459l84129O557561
45097H196968M251392n513010q922240k078324M341897L798756K231610L811533
45089A0118582K985061k674969m978770P22327N250557k42651r105559r347075
45081g272497j747910L796869M616814N844805P873156N349882j740754o428644
$$ plain form
45073 10291721 5196196 4126689 6665747 12108564 17290867 15671397 4747435 -7811988
45065 -7811988 -11449884 -5423696 873306 20609 -5926658 -10610269 -11279945 -9397783
45057 -9397783 -6710707 -3801943 -1366916 -393676 -736706 -787770 642102 2434733 2018774
45048 2018774 -1501477 -5754643 -7372057 -5320232 -1270113 2420671 3988557 2833249
45040 2833249 674638 873582 4098326 5920937 2119432 -4529462 -7117876 -4241321
45032 -4241321 -1703739 -3316813 -5268916 -2562329 3471979 8060466 10028553 11641822
45024 11641822 13645110 14601354 13853498 11759514 8264473 4182391 2197111 3417678
45016 3417678 4797414 3583595 2474097 5932846 12475726 15405601 11276697 3460863
$$ packed form
45073A0291721n095525j069507K539058N442817N182303j619470j0923962j2559423
45065g811988l637896O026188O297002q52697n947267m683611o69676J882162
45057i397783K687076K908764K435027R73240l43030n1064J429872J792631m15959
45048B018774l520251m253166j617414K051825M050119L690784J567886j155308
45040B833249k158611J98944L224744J822611l801505o648894k588414K876555
45032d241321K537582j613074j952103K706587O034308M588487J968087J613269
45024A1641822K003288R56244p47856k093984l495041m082082j985280J220567
45016C417678J379736j213819j109498L458749O542880K929875m128904p815834
$$ plain form
45008 3460863 -3061296 -6590909 -7807747 -7681015 -7409593 -7583141 -6612320 -2592139 2910374
44999 2910374 5813867 4744582 2460957 1664372 2367114 3799888 5598244 6413363 4877668
44990 4877668 3004133 4907670 10454781 13755028 10303509 2579920 -4034538 -8136539
44982 -8136539 -11917198 -15804825 -17027217 -13390873 -6399818 -304791 1547999 34566
44974 34566 -377401 2868373 6375061 5268663 1052867 249830 4512556 7862078 6375864
44965 6375864 4693877 8239182 14181756 16523378 16271850 18813542 23180955 22437206
44957 22437206 15139532 8444922 7626987 9482038 9425511 8861065 10836448 13282409 12218356
44948 12218356 8766240 7539105 9581695 11777627 12498177 13265402 14783332 15512622
$$ packed form
45008C460863o522159l529613j216838J26732K71422j73548R70821M020181N502513
44999B910374K903493j069285k283625p96585P02742J432774J798356Q15119j535695
44990D877668j873535J903537N547111L300247l451519p723589o614458m102001
44982h136539l780659l887627j222392L636344O991055O095027J852790j513433
44974C4566m11967L245774L506688j106398m215796q03037M262726L349522j486214
44965F375864j681987L545305N942574K341622k51528K541692M367413p43749
44957B2437206p297674o694610q17935J855051n6527n64446J975383K445961j064053
44948A2218356l452116j227135K042590K195932P20550P67225J517930P29290
$$ plain form
44940 15512622 14969927 14806265 15264218 13686116 8541744 2676349 197941 1343183
44932 1343183 2568870 1162231 -2172780 -5194024 -6675469 -6484839 -4671083 -1844677
44924 -1844677 180046 -361073 -3041959 -5377848 -5515386 -4023435 -2667199 -2389897 -3115809
44915 -3115809 -4365403 -4916330 -3018494 1180774 4110750 2121287 -3377825 -6506153
44907 -6506153 -3755984 1607641 3505487 70976 -5029524 -7539192 -6984799 -5983165
44899 -5983165 -6553795 -7922835 -7861623 -5854240 -4219758 -5230957 -7592890 -7576428 -4120317
44890 -4120317 -831237 -1437591 -4733885 -6116630 -3442477 835241 3366193 3660342
44882 3660342 3438494 3832539 4518083 4940297 5136372 5203999 4726624 3302930 1483193
$$ packed form
44940A5512622n42695j63662M57953j578102n144372n865395k478408J145242
44932A343183J225687j406639l335011l021244j481445J90630J813756K826406
44924a844677K024723n41119k680886k335889j37538J491951J356236K77302p25912
44915c115809j249594n50927J897836M199268K929976j989463n499112l128328
44907f506153K750169N363625J897846l434511n100500k509668N54393J001634
44899e983165n70630j369040O1212K007383J634482j011199k361933J6462L456111
44890d120317L289080o06354l296294j382745K674153M277718K530952K94149
44882C660342k21848L94045O85544M22214J96075O7627m77375j423694j819737
$$ plain form
44873 1483193 516360 844788 1460110 1428159 1438744 2676050 4562344 5244997 4337719
44864 4337719 3346704 2999062 2162291 211477 -1609411 -2320524 -2509035 -1998992 1319910
44855 1319910 7946670 14113185 15546777 12347223 7370706 1826535 -3659640 -5493847
44847 -5493847 -239258 8551442 12217056 7597507 1294175 951082 6094971 10352636
44839 10352636 9468606 4205291 -1804280 -4030427 403794 8745154 13416142 10152409
44831 10152409 3232174 -717278 -1484448 -3481344 -7602257 -10596362 -11535008 -12747242
44823 -12747242 -14038657 -12285868 -8456715 -8866501 -16069199 -23567357 -23989142 -18748236
44815 -18748236 -14697636 -13914185 -12279313 -7056654 -481949 4635445 8369045 11357213
$$ packed form
44873A483193r66833L28428O15322l1951J0585J237306J886294O82653r07278
44864D337719r91015l47642q36771j950814j820888p11113j88511N10043L318902
44855A319910O626760O166515J433592l199554m976517n544171n486175j834207
44847e493847N254589Q790700L665614m619549o303332l43093N143889M257665
44839A0352636q84030n263315o009571k226147M434221Q341360M670988l263733
44831A0152409o920235l949452p67170j996896m120913k994105r38646j212234
44823a2747242j291415J752789L829153m09786p202698p498158m21785N240906
44815a8748236M050600P83451J634872N222659O574705N117394L733600K988168
$$ plain form
44807 11357213 12550754 11221672 8889804 7403162 6594682 5249511 3158184 979153
44799 979153 -899984 -2236405 -2506845 -1620829 -457843 -30030 -838117 -3448931 -8280716
44790 -8280716 -13703124 -15857774 -12584571 -7116316 -5511686 -9692406 -14701434 -14013567
44782 -14013567 -6556366 2636252 7940702 7975907 5351381 3229700 2749103 3024568 2870730
44773 2870730 2315299 2240018 2595379 2039507 392798 440011 4972208 11816168 14441715
44764 14441715 9231168 397865 -4549350 -3280494 -339468 -938334 -5514284 -10501109
44756 -10501109 -12075397 -8555430 -1405770 4913259 5863983 1111195 -5002323 -7994050
44748 -7994050 -7101895 -4240290 -1149730 1154193 1882944 1040897 -805265 -4288469 -10518593
$$ packed form
44807A1357213J193541j329082k331868j486642q08480j345171k091327k179031
44799I79153j879137j336421k70440Q86016J162986M27813q08087k610814m831785
44790h280716n422408k154650L273203N468255J604630m180720n009028O87867
44782a4013567P457201R192618N304450L5205k624526k121681m80597K75465j53838
44773B870730n55431p5281L55361n55872j646709M7213M532197O843960K625547
44764A4441715n210547q833303m947215J268856K941026n98866m575950m986825
44756a0501109j574288L519967P149660O319029R50724m752788o113518k991727
44748g994050Q92155K861605L090560K303923P28751q42047j846162l483204o230124
$$ plain form
44739 -10518593 -17138598 -18425602 -12706798 -6807962 -8173466 -14334380 -16328963 -12155063
44731 -12155063 -9393241 -12409422 -14745528 -9592110 -1710453 -1256342 -9054763 -16240667
44723 -16240667 -17413992 -15803618 -14582151 -11551131 -5770702 -2010804 -3263810 -4479198
44715 -4479198 -83210 6359688 7077533 2214818 -587493 1704653 3255095 -1202993
44707 -1202993 -8867156 -13566175 -13301753 -10280614 -7185180 -6029825 -7370345 -8272084
44699 -8272084 -4537378 2589604 5873066 1527104 -4689949 -5164764 -873412 1185274
44691 1185274 -1266763 -3563209 -1907192 2224881 5936456 8316139 9030175 7654284
44683 7654284 5599545 5324678 6744474 7383269 6273113 4380284 1482271 -3041580
$$ packed form
44739a0518593o620005j287004N718804N898836j365504o160914j994583M173900
44731a2155063K761822l016181k336106N153418P881657M54111p798421p185904
44723a6240667j173325J610374J221467L031020N780429L759898j253006j215388
44715d479198M395988O442898P17845m862715k802311K292146J550442m458088
44707a202993p664163m699019K64422L021139L095434J155355j340520r01739
44699h272084L734706P126982L283462m345962o217053m74815M291352K058686
44691A185274k452037k296446J656017M132073L711575K379683P14036j375891
44683G654284k054739k74867J419796O38795j110156j892829k898013m523851
$$ plain form
44675 -3041580 -6334645 -4298291 1287795 3473541 -118743 -3973330 -3823012 -2965650
44667 -2965650 -5087045 -6591776 -2423249 4570232 7258377 4998622 3741180 6228676
44659 6228676 8851114 8666548 7371356 6841742 5991233 4042094 2500874 1691197 -800326
44650 -800326 -5663103 -9010788 -6863619 -455298 5368300 7612181 7036522 5836609
44642 5836609 5329591 5443415 5343087 4879138 5655826 9582155 15877206 20686538 20533562
44633 20533562 15646013 9560369 5965775 5940053 7602788 8323511 7393007 6100732 5344955
44624 5344955 4573616 3320270 1785568 -657121 -4717635 -7667202 -4187416 6336569
44616 6336569 16450287 18270657 12152830 4261920 -1485726 -4558460 -4063544 -4243
$$ packed form
44675c041580l293065K036354N586086K185746l592284l854587J50318Q57362
44667b965650k121395j504731M168527O993481K688145k259755j257442K487496
44659F228676K622438j84566j295192n29614q50509j949139j541220q09677k491523
44650h00326m862777l347685K147169O408321N823598K243881n75659j199913
44642E836609n07018J13824j00328m63949P76688L926329O295051M809332j52976
44633B0533562m887549o085644l594594k5722J662735P20723r30504j292275p55777
44624E344955p71339j253346j534702k442689m060514k949567L479786J0523985
44616F336569J0113718J820370o117827p890910n747646l072734M94916M059301
$$ plain form
44608 -4243 3510864 2490024 -780811 -1705001 -1376798 -3272603 -4156369 2011002 11607114
44599 11607114 13914986 7757919 3768251 6406243 6391068 -2109015 -9093653 -4015291
44591 -4015291 6476738 8674618 2583559 -957116 813204 827158 -2603221 -3083943
44583 -3083943 496653 1098732 -3022629 -3839594 2892989 9764971 9008659 3272754 -816798
44574 -816798 -2644616 -4686465 -5460727 -2544290 854654 -1192093 -9138662 -16889687
44566 -16889687 -18011965 -10916926 150027 7816884 8014287 4766816 5227622 9672203
44558 9672203 11603962 8592849 5960106 6884407 6551395 1468360 -2371683 1824520
44550 1824520 9710251 10977395 3809682 -3943617 -6747222 -6662585 -6590086 -5754533 -3797725
$$ packed form
44608d243L515107j020840l270835r24190L28203j895805q83766O167371R596112
44599A1607114K307872o157067l989668K637992j5175q500083o984638N078362
44591d015291J0492029K197880o091059l540675J770320J3954l430379m80722
44583c083943L580596O02079m121361q16965O732583O871982p56312n735905m089552
44574h16798j827818k041849p74262K916437L398944k046747p946569p751025
44566a6889687j122278P095039J1066953P666857J97403l247471M60806M444581
44558I672203J931759l011113k632743R24301l33012n083035l840043M196203
44550A824520P885731J267144p167713p753299k803605Q4637P2499Q35553J956808
$$ plain form
44541 -3797725 -3381637 -5956447 -8951970 -9411110 -7380907 -4157641 -50972 4531959
44533 4531959 8030261 9022127 7018803 1839090 -5587987 -11756229 -12791156 -8999463
44525 -8999463 -4818298 -3226262 -2396697 781928 5725136 8612662 7219470 3681892
44517 3681892 1875474 2663454 3106456 1197155 -252322 2831269 9040516 12399838
44509 12399838 10934002 9732640 12905136 16999220 16616892 12781062 10264960 9320803
44501 9320803 6433420 1968708 235305 1646246 1424301 -2254849 -4931281 -3552741
44493 -3552741 -2249549 -6193647 -13055545 -15168774 -9122943 164432 5088611 3388593
44485 3388593 149184 1830032 8289081 12376912 9029601 2411233 442739 4140022
$$ packed form
44541c797725M16088k574810k995523m59140K030203L223266M106669M582931
44533D531959L498302R91866k003324n179713p427077o168242j034927L791693
44525h999463M181165J592036Q29565L178625M943208K887526j393192l537578
44517C681892j806418P87980M43002j909301j449477L083591O209247L359322
44509A2399838j465836j201362L172496M094084l82328l835830k516102r44157
44501I320803k887383m464712j733403J410941k21945l679150k676432J378540
44493c552741J303192l944098o861898k113229O045831R287375M924179j700018
44485C388593l239409J680848O459049M087831l347311o618368j968494L697283
$$ plain form
44477 4140022 7640678 8021123 8407635 10127807 8999852 3228785 -1205407 1295063
44469 1295063 6733561 6848858 1053032 -3613040 -3519397 -2686362 -4707215 -6247972 -2174430
44460 -2174430 5923295 10327589 6098981 -3069966 -8897117 -7416292 -2401317 197520
44452 197520 -782580 -2085617 -1564984 198718 3302065 8982800 15298262 16676531 10701952
44443 10701952 2248298 -2183379 -1660819 504276 2297946 3418270 2638935 -645634
44435 -645634 -3512921 -2405849 1905955 6185044 10444059 17103485 24732834 27688367
44427 27688367 23145809 14525556 6720243 1503209 -1078742 -381368 3635405 9108941
44419 9108941 13529823 14700939 10867701 3222258 -1898349 1795919 11548695 16483489
$$ packed form
44477D140022L500656L80445L86512J720172j127955n771067m434192K500470
44469A295063N438498J15297n795826m666072R3643Q33035k020853j540757M073542
44460b174430Q097725M404294m228608r168947n827151J480825N014975K598837
44452A97520r80100j303037N20633J763702L103347N680735O315462J378269n974579
44443A0701952q453654m431677N22560K165095J793670J120324p79335l284569
44435f45634k867287J107072M311804M279089M259015O659426P629349K955533
44427B7688367m542558q620253p805313n217034k581951O97374M016773N473536
44419I108941M420882J171116l833238p645443n120607L694268R752776M934794
$$ plain form
44411 16483489 10359179 -680370 -6442984 -4780794 -918370 1790136 4302067 6444570
44403 6444570 5399410 672627 -4183125 -6416484 -6942009 -6837795 -4634175 518798
44395 518798 5775100 7518851 5785371 3446486 2267579 1948595 2005924 2285250 2093416
44386 2093416 799444 -945060 -2055454 -2423314 -1954334 534027 4963701 7658263
44378 7658263 5005099 -552670 -2274205 1988461 6815440 7287451 5648461 6080923
44370 6080923 6700576 2535596 -5464264 -10802461 -10697001 -8793925 -7683903 -5112817
44362 -5112817 -252760 2257895 -1146232 -6967077 -9984596 -10742342 -12284286 -12742707
44354 -12742707 -8008918 -314782 3156969 941692 -23979 5337463 12816977 15232698
$$ packed form
44411A6483489o124310j1039549n762614J662190L862424K708506K511931K142503
44403F444570j045160m726783m855752k233359n25525J04214K203620N152973
44395E18798N256302J743751j733480k338885j178907l18984N7329K79326j91834
44386B093416j293972j744504j110394l67860M68980K488361M429674K694562
44378G658263k653164n557769j721535M262666M826979M72011j638990M32462
44370F080923O19653m164980p999860n338197J05460J903076J110022K571086
44362e112817M860057K510655l404127n820845l017519p57746j541944m58421
44354a2742707M733789P694136L471751k215277r65671N361442P479514K415721
$$ plain form
44346 15232698 12148510 9119326 9404740 10469700 8460950 3360160 -1153229 -1981358
44338 -1981358 46356 1717922 2333869 5099979 11739109 17660658 16332535 8147981
44330 8147981 857641 281647 4189028 6613986 4643212 -745499 -6867426 -9855645
44322 -9855645 -6397995 1745706 7417458 5609107 -494398 -4140360 -3765411 -3331111
44314 -3331111 -5095981 -6479453 -4806640 -1767450 -1302680 -4437098 -7583988 -6065640
44306 -6065640 601982 7204262 7810182 2316887 -3876432 -6937113 -8263195 -9822321
44298 -9822321 -9738129 -5865406 -756997 1422396 1292600 2933668 6927488 9475838 8687614
44289 8687614 7174715 7227967 7494093 6383862 5436958 6761989 9338786 10382330 9221188
$$ packed form
44346A5232698l084188l029184K85414J064960k008750n100790m513389q28129
44338a981358K027714J671566O15947K766110O639130N921549j328123q184554
44330H147981p290340n75994L907381K424958j970774n388711o121927k988219
44322i855645L457650Q143701N671752j808351o103505l645962L74949M34300
44314c331111j764870j383472J672813L039190M64770l134418l146890J518348
44306f065640O667622O602280O05920n493295o193319l060681j326082j559126
44298i822321Q4192L872723N108409K179393j29796J641068L993820K548350p88224
44289H687614j512899N3252K66126j110231r46904J325031K576797J043544j161142
$$ plain form
44280 9221188 7799079 7771787 8451444 7693218 4442892 295085 -2096689 -2433667 -3076159
44271 -3076159 -4837805 -4715542 -483332 4299059 3787310 -2275390 -8218987 -9968357
44263 -9968357 -8772522 -7074170 -5364385 -4552221 -6672693 -10556320 -10920034 -5282023
44255 -5282023 1347889 2364689 -2247631 -7205031 -9200107 -8825266 -6703019 -2237647
44247 -2237647 3640101 8085303 9588550 9394073 9231663 9382832 9163795 7898287 5491076
44238 5491076 3070069 2341082 3196169 3283566 1574642 759329 3679462 8582435 10734571
44229 10734571 8192031 3397393 -473567 -2158021 -1694713 112328 1629689 2114183
44221 2114183 3209815 6366900 9455153 8990439 5283606 1836213 -269256 -3163613
$$ packed form
44280I221188j422109k7292O79657p58226l250326m147807k391774l36978o42492
44271c076159j761646J22263M232210M782391n11749o062700n943597j749370
44263i968357J195835J698352J709785Q12164k120472l883627l63714N638011
44255e282023O629912J016800m612320m957400j995076L74841K122247M465372
44247b237647N877748M445202J503247j94477j62410J51169k19037j265508k407211
44238E491076k421007p28987Q55087Q7397j708924q15313K920133M902973K152136
44229A0734571k542540m794638l870960j684454M63308J807041J517361M84494
44221B114183J095632L157085L088253m64714l706833l447393k105469k894357
$$ plain form
44213 -3163613 -6620687 -6326791 -114699 7676666 11027717 8847172 4068315 -1309465
44205 -1309465 -6912473 -11391117 -12703472 -10724840 -7264145 -3985262 -2097179 -2873949
44197 -2873949 -5977630 -8036650 -5499747 1276111 8707675 14013778 16371215 15203982
44189 15203982 10701528 5889303 4566486 6340470 6977973 4910837 3854938 6536018
44181 6536018 8965397 4966216 -4839708 -12602521 -12175314 -5372038 1533471 4710236
44173 4710236 4554274 3036928 2092371 3680510 8404111 13414252 13934156 8397128 980900
44164 980900 -2451401 -418050 3544572 5945100 7055060 8744050 10382868 9272001
44156 9272001 5184856 2134141 3848428 8547389 10604817 7708232 3997922 4517856
$$ packed form
44213c163613l457074K93896O212092P791365L351051k180545m778857n377780
44205a309465n603008m478644j312355J978632L460695L278883J888083p76770
44197b873949l103681k059020K536903O775858P431564N306103K357437j167233
44189A5203982m502454m812225j322817J773984O37503k067136j055899K681080
44181F536018K429379l999181r805924p762813M27207O803276O905509L176765
44173D710236j55962j517346r44557J588139M723601N010141N19904n537028p416228
44164I80900l432301K033351L962622K400528J109960J688990J638818j110867
44156I272001m087145l050715J714287M698961K057428k896585l710310N19934
$$ plain form
44148 4517856 8388254 10187319 7405165 3288927 1671879 2180239 2464892 2534942 3889288
44139 3889288 5842207 6048195 4353825 3178448 3872407 5285210 6216747 6593480 5705509
44130 5705509 2344335 -1989794 -3026292 843176 5343661 5262889 1091888 -2174249
44122 -2174249 -1944504 -574248 -960726 -2633901 -3439507 -2970543 -2450062 -2086967 -450013
44113 -450013 3081004 6393489 6496759 3383606 635487 1102203 3220377 3621281 2485065
44104 2485065 3189575 6489781 8766945 7608662 5586224 5956918 7880689 9221997
44096 9221997 10853168 13477251 12810740 4324483 -7863825 -13706199 -10294963 -5947383
44088 -5947383 -8382968 -14555709 -16693913 -13884363 -11796159 -13293115 -15238673 -14145838
$$ packed form
44148D517856L870398J799065k782154m116238j617048N08360K84653P0050J354346
44139C889288J952919K05988j694370j175377O93959J412803R31537L76733q87971
44130E705509l361174m334129j036498L869468M500485q0772m171001l266137
44122b174249K29745J370256l86478j673175q05606M68964N20481L63095J636954
44113d50013L531017L312485J03270l113153k748119M66716K118174M00904j136216
44104B485065P04510L300206K277164j158283k022438L70694J923771J341308
44096I221997J631171K624083o66511q486257j2188308n842374L411236M347580
44088e947383k435585o172741k138204K809550K088204j496956j945558J092835
$$ plain form
44080 -14145838 -10063889 -4544367 1045096 4458612 3596230 -203763 -2993533 -3507495
44072 -3507495 -4618896 -8044286 -10644084 -8430854 -2160673 3636185 5800881 4355473
44064 4355473 517944 -4118742 -6943147 -6127909 -3839324 -4923875 -10734068 -16101711
44056 -16101711 -14575337 -5906073 3523160 7459606 5402142 1658074 632837 3568583
44048 3568583 8394602 11718535 11646275 9226545 6614041 4149757 993373 -1394685
44040 -1394685 474613 6604766 11255007 9508036 4088200 1583857 3185424 4153659
44032 4153659 2275127 944442 2123098 2083000 -2152827 -6907946 -7194163 -4294143 -2552533
44023 -2552533 -1486601 2371055 7219555 6897696 739318 -4332931 -3838418 -1783808
$$ packed form
44080a4145838M081949N519522N589463L413516q62382l799993k789770n13962
44072c507495j111401l425390k599798K213230O270181N796858K164696j445408
44064D355473l837529m636686k824405Q15238K288585j084551n810193n367643
44056a6101711J526374Q669264R429233L936446k057464l744068j025237K935746
44048C568583M826019L323933p2260k419730k612504k464284l156384k388058
44040a394685J869298O130153M650241j746971n419836k504343J601567R68235
44032D153659j878532j330685J178656m0098m235827m755119k86217K900020J741610
44023b552533J065932L857656M848500l21859o158378n072249M94513K054610
$$ plain form
44015 -1783808 -3210928 -5983710 -4849864 -3207 3875682 5174400 6539811 8898290
44007 8898290 9222320 5569241 937537 31552 3622502 7578181 7273278 2615555 -1574174
43998 -1574174 -1025836 2349080 2409952 -2949145 -8337856 -7638553 -1435023 5241393 9785257
43989 9785257 12349159 11527537 5661184 -1694803 -3710089 602943 4428131 2719970
43981 2719970 -1202815 -1997017 -522287 -806121 -2198398 -547543 4186960 7321881
43973 7321881 6621476 5072467 5522808 6857144 6965977 5805483 3832352 825480 -1762466
43964 -1762466 -589145 4794140 9641462 9516828 6101762 4470400 6223448 8610027
43956 8610027 9261163 8190684 5634100 1699955 -1473130 -823772 3178329 6174298
$$ packed form
44015a783808j427120k772782J133846M846657L878889J298718J365411K358479
44007H898290L24030l653079m631704r05985L590950L955679l04903m657723m189729
43998a574174N48338L374916O0872n359097n388711O99303O203530O676416M543864
43989I785257K563902q21622n866353p355987k015286M313032L825188j708161
43981B719970l922785p94202J474730k83834j392277J650855M734503L134921
43973G321881p00405j549009M50341J334336J08833j160494j973131l006872k587946
43964a762466J173321N383285M847322j24634l415066j631362J753048K386579
43956H610027O51136j070479k556584l934145l173085O49358M002101K995969
$$ plain form
43948 6174298 5482265 3332137 2751395 2839020 809720 -3059410 -5693966 -5781829 -5119010
43939 -5119010 -5254392 -5386794 -4376142 -2685614 -1028111 1278078 4802781 7674874
43931 7674874 6805357 1790130 -3850600 -6209519 -4924679 -2568422 -820368 982770
43923 982770 3236272 4051492 1551586 -2812555 -5298621 -4184380 -1330951 776976
43915 776976 1876654 3181032 5106507 6510358 5471016 830984 -5858849 -10256245
43907 -10256245 -9087815 -4125118 61946 2320330 5385821 9326817 9229881 2541406
43899 2541406 -5390475 -7779599 -5442463 -3946622 -3970889 -1236055 4533284 7981617
43891 7981617 7006125 6351264 9288801 12029323 10797439 8875653 10856382 14317142
$$ packed form
43948F174298o92033k150128n80742Q7625k029300l869130k634556q7863O62819
43939e119010j35382j32402J010652J690528J657503K306189L524703K872093
43931G674874q69517n015227n640730k358919J284840K356257J748054J803138
43923I82770K253502Q15220k499906m364141k486066J114241K853429K107927
43915G76976J099678J304378J925475J403851j039342m640032o689833m397396
43907a0256245J168430M962697M187064K258384L065491L940996r6936o688475
43899B541406p931881k389124K337136J495841k4267K734834N769339L448333
43891G981617r75492o54861K937537K740522j231884j921786J980729L460760
$$ plain form
43883 14317142 14053781 11480954 11844085 13262884 7471403 -6520930 -17490176 -15441026
43875 -15441026 -4461430 3563838 4497166 4666000 9255236 14764946 14972880 9468265
43867 9468265 2736225 -2307765 -5678841 -6418258 -2070497 6537547 13516154 13757148
43859 13757148 8851860 4584562 3883006 5205733 6772456 8358616 8819358 6258631
43851 6258631 2081841 710340 2974667 3862026 110718 -3910705 -2597839 1753183
43843 1753183 2151363 -2397192 -5970393 -5478418 -4640482 -6550847 -8535422 -7690869 -6315508
43834 -6315508 -7396939 -8583313 -5762765 -295111 2517616 1181534 -696590 -1009960
43826 -1009960 -2402877 -7277741 -13041821 -15028362 -12507490 -9243260 -8373735 -8796574
$$ packed form
43883A4317142k63361k572827L63131J418799n791481j3992333j0969246K049150
43875a5441026J0979596Q025268R33328J68834M589236N509710K07934n504615
43867I468265o732040n043990l371076p39417M347761Q608044O978607K40994
43859A3757148m905288m267298p01556J322727J566723J586160M60742k560727
43851F258631m176790j371501K264327Q87359l751308m021423J312866M351022
43843A753183L98180m548555l573201M91975Q37936j910365j984575Q44553J375361
43834f315508j081431j186374K820548N467654K812727j336082j878124l13370
43826a009960j392917m874864n764080j986541K520872L264230Q69525m22839
$$ plain form
43818 -8796574 -7469401 -4097558 -1803314 -2858390 -5418021 -5984423 -4071356 -2234709
43810 -2234709 -1783629 -1038577 1595834 5263551 8379713 10412816 10657176 7740800 2502893
43801 2502893 -707262 1569663 7192373 10566123 8933655 4527822 1154787 677377
43793 677377 2285238 3239858 948935 -3662208 -5659905 -1559615 5253575 7720717
43785 7720717 4042480 88454 1439690 6018757 7456362 4162890 1455661 4116976
43777 4116976 9800695 12197301 9378032 5658677 4656515 4236283 1222754 -1961380
43769 -1961380 -555426 3817909 4249970 -319290 -1949533 4454473 12416713 13134954
43761 13134954 8547646 7305795 10802036 12365114 9550954 7513089 8487035 7409310
$$ packed form
43818h796574J327173L371843K294244j055076k559631n66402J913067J836647
43810b234709M51080P45052K634411L667717L116162K033103K44360k916376n237907
43801B502893l210155K276925N622710L373750j632468m405833l373035m77410
43793F77377J607861R54620k290923m611143j997697M100290O813190K467142
43785G720717l678237l954026J351236M579067J437605l293472k707229K661315
43777D116976N683719K396606k819269l719355j002162m20232l013529l184134
43769a961380J405954M373335M32061m569260j630243O404006P962240P18241
43761A3134954m587308j241851L496241J563078k814160k037865R73946j077725
$$ plain form
43753 7409310 2005100 -1297768 2491884 7821835 6839029 1429797 -972414 225424
43745 225424 -601942 -4279514 -5735779 -4156800 -5116056 -9973526 -11243979 -3281479 8385683
43736 8385683 13941217 11416338 6352462 2394391 -1357100 -4690010 -4683959 -1431453 -229315
43727 -229315 -4854639 -11777030 -14579071 -12328495 -9752204 -9703868 -9809298 -7984485 -7230079
43718 -7230079 -11222014 -17357810 -19039918 -14823170 -10471282 -10393799 -11734217 -10166500
43710 -10166500 -7356115 -7499444 -9084582 -6595135 -85559 3632189 1283817 -1323484
43702 -1323484 2198122 9261063 12098679 8355305 2751954 -483593 -1642718 -1881456
43694 -1881456 -499573 2314534 3703579 1817751 -824801 -325360 3196825 5570612
$$ packed form
43753G409310n404210l302868L789652N329951r82806n409232k402211J197838
43745B25424q27366l677572j456265J578979r59256m857470j270453P962500J1667162
43736H385683N555534k524879n063876l958071l751491l332910O051L252506J202138
43727b29315m625324o922391k802041K250576K576291M8336j05430J824813P54406
43718g230079l991935o135796j682108M216748M351888P7483j340418J567717
43710a0166500K810385j43329j585138K489447O509576L717748k348372k607301
43702a323484L521606P062941K837616l743374n603351l235547j159125k38738
43694a881456J381883K814107J389045j885828k642552M99441L522185K373787
$$ plain form
43686 5570612 3944592 351168 -926753 1380196 4168234 4096413 1911977 1187947 3087756
43677 3087756 4657971 3356381 1017775 966256 2697620 2633794 -196858 -2583378 -1911699
43668 -1911699 433755 1743602 1632520 1472393 2105463 3520149 5030916 4663392 526419
43659 526419 -5917490 -10441376 -11383734 -11268060 -11072619 -7133246 2024856 9574964 7547710
43650 7547710 -1525402 -6940504 -3732441 2497157 5565488 6237886 7040352 6591151 3916758
43641 3916758 2915885 6801858 12002615 13141548 10733885 8274338 5041889 -1338282
43633 -1338282 -7528221 -7509777 -2484225 -182340 -3578360 -7436259 -7519710 -5952916 -4703085
43624 -4703085 -864823 6967650 13273900 12158598 5800972 1287294 1421468 3074295
$$ packed form
43686E570612j626020l593424j277921K306949K788038p1821k184436p24030J899809
43677C087756J570215j301590k338606n1519J731364o3826k830652k386520O71679
43668a911699K345454J309847j11082j60127O33070J414686J510767l67524m136973
43659E26419o443909m523886r42358J15674J95441L939373R158102P550108k027254
43650G547710r073112n415102L208063O229598L068331O72398Q02466m49201k674393
43641C916758j000873L885973N200757J138933k407663k459547l232449o380171
43633a338282o189939J8444N025552K301885l396020l857899q3451J566794J249831
43624d703085L838262P832473O306250j115302o357626m513678J34174J652827
$$ plain form
43616 3074295 2782748 81380 -3356826 -4894889 -2830543 665564 1081757 -1700988
43608 -1700988 -1909458 3618656 9717229 10468121 8424827 9904085 14136492 14697118 10287799
43599 10287799 6035631 3922204 40862 -6838552 -11627814 -11073636 -8896030 -8657961
43591 -8657961 -7312405 -1002232 7126057 10549693 8143719 4407707 2947057 4242046
43583 4242046 8170908 13986457 18424690 17994078 13223460 7700901 3493339 541545
43575 541545 -285269 2637200 8279117 13061520 15038527 15376957 15352890 14736293 13864687
43566 13864687 14327076 15902942 15064064 8849987 -611478 -7381969 -7639045 -3292885
43558 -3292885 644586 1648559 1705616 3439356 5468679 3736066 -2335370 -7533294
$$ packed form
43616C074295k91547k701368l438206j538063K064346L496107M16193k782745
43608a700988k08470N528114O098573P50892k043294J479258M232407N60626m409319
43599A0287799m252168k113427l881342o879414m789262N54178K177606K38069
43591h657961J345556O310173Q128289L423636k405974l736012j460650J294989
43583D242046L928862N815549M438233m30612m770618n522559m207562k951794
43575E41545q26814K922469N641917M782403J977007L38430k4067o16597q71606
43566A3864687M62389J575866q38878o214077r461465o770491k57076M346160
43558c292885L937471J003973N7057J733740K029323j732613o071436n197924
$$ plain form
43550 -7533294 -6575894 -743433 3347716 1084527 -5746214 -11563431 -12452352 -9096210
43542 -9096210 -5364800 -4021191 -3703092 -1197083 3310698 5772757 4180406 1706339
43534 1706339 1271975 174802 -5350896 -12280217 -13329510 -7278508 -974027 425025
43526 425025 -217185 1815924 5427217 6437199 4668947 3477818 3845565 3544370 1835957
43517 1835957 1001184 2577470 5092862 6466417 6512733 6317017 6830204 8557268 10991460
43508 10991460 12006083 9697482 5576531 4076804 7510044 12714321 14245870 10317603
43500 10317603 4184492 -85048 -1645996 -2199273 -2612784 -1704532 1716713 6988527
43492 6988527 12408018 16767094 18959097 17241811 11232839 4557569 2662236 6543660
$$ packed form
43550g533294R57400N832461M091149k263189o830741n817217q88921L356142
43542i096210L731410J343609L18099K506009M507781K462059j592351k474067
43534A706339m34364j097173n525698o929321j049293O051002O304481J399052
43526D25025o42210K033109L611293J009982j768252j191129L67747l01195j708413
43517A835957q34773J576286K515392J373555M6316j95716N13187J727064K434192
43508A0991460J014623k308601m120951j499727L433240N204277J531549l928267
43500A0317603o133111m269540j560948n53277m13511R08252L421245N271814
43492F988527N419491M359076K192003j717286o008972o675270j895333L881424
$$ plain form
43484 6543660 10888950 10625579 7460127 6724966 8770074 7964065 1575792 -4450577 -2254953
43475 -2254953 7337979 15274092 15465719 11533106 10535610 13313069 14731862 12045553
43467 12045553 8481237 7636907 8260802 7166586 4542127 2791259 1657404 -1253072
43459 -1253072 -5166598 -5800741 -1951580 1331233 -935668 -6668219 -9372296 -6356520
43451 -6356520 -851879 3465635 6524204 9918781 13944749 17865483 21111350 23053832
43443 23053832 23334345 23640766 27537362 36822823 48807974 58534409 63346687 64613067
43435 64613067 65699546 69032607 74324980 78683881 78988460 74938638 69281392 64707404
43427 64707404 61679020 59829088 59449038 59698018 57056997 48732522 37376396 29346438
$$ packed form
43484F543660M345290k63371l165452p35161K045108q06009o388273o026369K195624
43475b254953R592932P936113J91627l932613r97496K777459J418793k686309
43467A2045553l564316q44330O23895j094216k624459j750868j133855k910476
43459a253072l913526o34143L849161L282813k266901n732551k704077L015776
43451f356520N504641M317514L058569L394577M025968L920734L245867J942482
43443B3053832K80513L06421L896596R285461J1985151R726435M812278J266380
43435F4613067J086479L333061N292373M358901L04579m049822n657246m573988
43427F4707404l028384j849932l80050K48980k641021q324475j1356126q029958
$$ plain form
43419 29346438 27505658 28335959 27330441 24634533 23302464 24058018 24677762 23710194 22038505
43410 22038505 20816163 20185417 20188142 20672615 19923622 15879456 9770089 6198651 7800703
43401 7800703 11565010 12589631 10274862 8413439 9740433 12846068 14630537 13784140
43393 13784140 11396527 9717813 10652564 13952606 16630029 15798574 12372149 10002164
43385 10002164 9885426 9188277 6110334 3953184 7166738 14419718 18836797 15658663
43377 15658663 7449362 736563 -981843 390141 1338638 1235563 2212831 5127700
43369 5127700 7472222 6801302 5105731 6751369 11564131 13522519 8847834 2525791
43361 2525791 2643924 9440957 14635447 12201728 5630562 2714386 6466162 13651145
$$ packed form
43419B9346438j840780Q30301j005518k695908j332069P55554O19744r67568j671689
43410B2038505j222342o30746K725M84473p48993m044166o109367l571438J602052
43401G800703L764307J024621k314769j861423J326994L105635J784469q46397
43393A3784140k387613j678714R34751L300042K677423q31455l426425k369985
43385A0002164j16738o97149l077943k157150L213554P252980M417079l178134
43377A5658663q209301o712799j718406J371984R48497j03075R77268K914869
43369E127700K344522o70920j695571J645638M812762J958388m674685o322043
43361B525791J18133O797033N194490k433719o571166k916176L751776P184983
$$ plain form
43353 13651145 19766319 22421357 21127953 16868750 12083332 9224072 8788826 9343432
43345 9343432 9261041 8122907 7065038 7921860 11017792 13900731 13994612 12410754 12346857
43336 12346857 13162727 9919687 1101914 -6916985 -6982041 -156030 6715846 10424066
43328 10424066 13281712 16725754 18885254 18993800 18669609 17462486 12613220 5520230
43320 5520230 2907228 7687286 13238376 11704068 4802477 1157542 4978033 12623229
43312 12623229 19018306 21909062 20170116 13892828 7562955 7897086 15642185 23100317
43304 23100317 22816194 16219962 10729624 10197857 11602659 10683791 7710914 6384961
43296 6384961 8365131 10635879 9105750 4230842 1264467 4013757 10122266 14487247
$$ packed form
43353A3651145O115174K655038j293404m259203m785418k859260m35246N54606
43345I343432q2391j138134j057869Q56822L095932K882939R3881j583858o3897
43336A2346857Q15870l243040q817773q018899o5056O826011O871876L708220
43328A0424066K857646L444042K159500J08546l24191j207123m849266p092990
43320E520230k613002M780058N551090j534308o901591l644935L820491P645196
43312A2623229O395077K890756j738946o277288o329873L34131P745099P458132
43304B3100317k84123o596232n490338n31767J404802r18868k972877j325953
43296F384961J980170K270748j530129m874908k966375K749290O108509M364981
$$ plain form
43288 14487247 15766793 16497664 17713503 17351153 14367356 10720399 8208651 6744806
43280 6744806 6913882 10418009 16057844 19090826 17271412 14031299 12646447 11018568
43272 11018568 6356925 1539276 1404842 5069988 7799831 8956912 11607734 14873832
43264 14873832 14046897 9510478 8158179 12772273 16491920 12459484 3772102 -1575598
43256 -1575598 -1625198 -322821 635056 3086203 6593528 7887569 6681307 6432740 8055835
43247 8055835 8087229 5210485 3676826 6723320 10342490 8215279 1099976 -3184820
43239 -3184820 895798 10759887 19814265 24377405 25071101 23682669 21207186 18473499
43231 18473499 16540824 15814760 15821429 16289571 17387162 18291597 16967873 12965720 9400131
$$ packed form
43288A4487247J279546P30871J215839l62350k983797l646957k511748j463845
43280F744806J69076L504127N639835L032982j819414l240113j384852j627879
43272A1018568m661643m817649j34434L665146K729843J157081K650822L266098
43264A4873832q26935m536419j352299M614094L719647m032436q687382n347700
43256a575598m9600J302377R57877K451147L507325J294041j206262k48567J623095
43247H055835L1394k876744j533659L046494L619170k127211p115303m284796
43239c184820M080618R864089R054378M563140O93696j388432k475483k733687
43231A8473499j932675p26064O669M68142J097591R04435j323724m002153l565589
$$ plain form
43222 9400131 9643473 12106900 11281488 5211271 -788646 -189462 6902517 14627281 18517796
43213 18517796 18417026 15285278 9540968 3466530 1212043 3922910 7391501 7145347
43205 7145347 4179335 3072567 5598078 9009536 10418334 10282592 10827147 12666854
43197 12666854 14041493 12847796 9025673 5217936 4866387 8944354 14557018 17428961
43189 17428961 15973574 12556413 10692638 11364589 12360012 11196824 8254354 6201675
43181 6201675 6229195 6377970 4956972 4084583 6941273 11931664 13402254 9480766 5525256
43172 5525256 6939641 11428384 12364918 8296421 4597197 5657509 9585981 11913135
43164 11913135 11294310 9710657 9314790 11010415 14749285 19641882 24461338 28625776
$$ packed form
43222I400131K43342K463427q25412o070217n999917N99184P091979P724764L890515
43213A8517796j00770l131748n744310o074438k254487K710867L468591k46154
43205G145347k966012j106768K525511L411458J408798j35742N44555J839707
43197A2666854J374639j193697l822123l807737l51549M077967N612664K871943
43189A7428961j455387l417161j863775O71951R95423j163188k942470k052679
43181F201675K7520J48775j420998q72389K856690M990391J470590l921488l955510
43172E525256J414385M488743R36534m068497l699224J060312L928472K327154
43164A1913135o18825j583653l95867J695625L738870M892597M819456M164438
$$ plain form
43156 28625776 31739023 32375227 29501804 25525751 25311061 30875985 39239351 46771924
43148 46771924 53204070 59649430 65436684 69527783 72662761 74793719 72372955 62329663
43140 62329663 47852894 35968294 29403512 25015134 20670580 18799482 20902197 22812338
43132 22812338 19397845 11837208 6346380 6392377 9410369 11167025 10408888 8430429
43124 8430429 6437573 4878517 4077165 3875057 2989610 103226 -4051812 -6597794 -5303702
43115 -5303702 -1183224 2479324 3569873 2627141 941247 -1140570 -3192233 -3825911
43107 -3825911 -2672624 -1967269 -3855681 -6891041 -7701997 -5652485 -3090993 -1284295
43099 -1284295 586440 2198018 1776617 253078 1740365 7410845 12191940 10685303
$$ packed form
43156B8625776L113247O36204k873423l976053k14690N564924Q363366P532573
43148D6771924O432146O445360N787254M091099L134978K130958k420764j0043292
43140F2329663j4476769j1884600o564782m388378m344554j871098K102715J910141
43132B2812338l414493p560637n490828M5997L017992J756656p58137j978459
43124H430429j992856j559056q01352k02108q85447k886384m155038k545982J294092
43115e303702M120478L662548J090549r42732j685894k081817k051663o33678
43107c825911J153287P05355j888412l035360q10956K049512K561492J806698
43099a284295J870735J611578m21401j523539J487287N670480M781095j506637
$$ plain form
43091 10685303 4067807 -1792211 -3033685 65445 5214652 9046531 8133195 2965117
43083 2965117 -603705 2316708 9166851 13339794 12292358 8187004 2749501 -2873977
43075 -2873977 -4826875 -232083 5886530 4963249 -2382352 -5737930 36764 7016029
43067 7016029 6484779 1828390 1986697 7397981 11141322 11309174 13155586 18827134 23039875
43058 23039875 21415466 17271499 16803215 21017707 25360264 25543493 21889516 18694547
43050 18694547 19778147 24098001 26556274 23936021 18064183 11765495 5228168 -324500
43042 -324500 546135 10779095 23050748 26025767 18455310 10318655 9190275 12550722
43034 12550722 15436573 17993009 21229281 21914801 17677004 12751382 12601935 15727742
$$ packed form
43091A0685303o617496n860018j241474L099130N149207L831879r13336n168078
43083B965117l568822K920413O850143M172943j047436m105354n437503n623478
43075b873977j952898M594792O118613r23281p345601l355578N774694O979265
43067G016029n31250m656389J58307N411284L743341J67852J846412N671548M212741
43058B3039875j624409m143967m68284M214492M342557J83229l653977l194969
43050A8694547J083600M319854K458273k620253n871838o298688o537327n552668
43042c24500Q70635J0232960J2271653K975019p570457q136655j128380L360447
43034A2550722K885851K556436L236272O85520m237797m925622j49447L125807
$$ plain form
43026 15727742 16452181 13743413 11761279 12848989 15081153 16278813 15981569 13668762
43018 13668762 9178465 5009335 4467198 7127655 9256930 8911634 7648582 7099475
43010 7099475 6909878 6450421 5822367 4765557 3027165 1963061 3175041 5313623 4896753
43001 4896753 913107 -3585868 -4953191 -2224081 2877043 7145389 7685070 5071096
42993 5071096 4041088 7888250 12957847 12958121 8541705 7211225 12301070 17729653 17003047
42984 17003047 12418570 10335197 10911044 8833171 2913315 -1498604 -738527 1845927
42976 1845927 1437906 -1042300 -680709 4404495 11156312 16089555 18577570 19145151 17401591
42967 17401591 13686830 11043946 12685634 17575885 21009250 20205377 17119867 14848018
$$ packed form
43026A5727742P24439k708768j982134J087710K232164J197660k97244k312807
43018A3668762m490297m169130n42137K660457K129275l45296j263052n49107
43010G099475j89597m59457o28054j056810j738392j064104J211980K138582m16870
43001D896753l983646m498975j367323K729110N101124M268346N39681k613974
42993E071096j030008L847162N069597K74m416416j330480N089845N428583p26606
42984A7003047m584477k083373N75847k077873n919856m411919P60077K584454
42976A845927m08021k480206L61591N085204O751817M933243K488015N67581j743560
42967A7401591l714761k642884J641688M890251L433365q03873l085510k271849
$$ plain form
42959 14848018 13855110 13462224 14206190 15679223 14393378 8073238 864053 -637452
42951 -637452 3341792 5338992 675712 -6746113 -10567456 -9412103 -5519242 -278812
42943 -278812 4970363 7049258 4403153 488407 -260906 1935383 4322254 7042987
42935 7042987 11624761 15730988 15177844 10882997 8102911 8184259 6918352 2756647 683159
42926 683159 4439399 9851059 10708285 8006006 7974398 12421113 16325868 15434844 12027418
42917 12027418 11427477 15160174 19298890 18837502 13085648 7113594 7472634 15616253
42909 15616253 26027591 31758797 31049321 27413102 24589236 23645955 24260498 25896581
42901 25896581 27270603 27163882 26648321 28238898 31625635 32567280 28188594 21812170
$$ packed form
42959A4848018r92908l92886P43966J473033j285845o320140p209185j501505
42951f37452L979244J997200m663280p421825l821343J155353L892861N240430
42943b78812N249175K078895k646105l914746p49313K196289K386871K720733
42935G042987M581774M106227n53144m294847k780086Q1348j265907m161705k073488
42926F83159L756240N411660Q57226k702279l1608M446715L904755q91024l407426
42917A2027418n99941L732697M138716m61388n751854n972054L59040Q143619
42909A5616253J0411338N731206p09476l636219k823866r43281O14543J636083
42901B5896581J374022j06721n15561J590577L386737R41645m378686o376424
$$ plain form
42893 21812170 19797433 24010459 30063444 33475309 35126496 39041688 46436149 54557531
42885 54557531 61496082 69527260 81451499 94420237 100437868 94693583 81645679 70217592
42877 70217592 63653185 57470361 47994339 38744982 35244464 36467113 36227208 32144624
42869 32144624 28215825 27897726 29677021 31490515 34601531 39409936 41606840 37741945
42861 37741945 31905923 30823595 33597676 32974179 26998943 22185907 22770198 23936594
42853 23936594 20585504 17015625 20833336 30459995 36566118 35498957 33960559 38659026
42845 38659026 47560670 54725153 59124644 64407943 72880599 84208958 98718222 117839028
42837 117839028 141480020 168344018 198807169 233407753 266498228 284510046 274686602
$$ packed form
42893B1812170k014737M213026O052985L411865J651187L915192P394461Q121382
42885E4557531O938551Q031178J1924239J2968738O017631n744285j3047904j1428087
42877G0217592o564407o182824r476022r249357l500518J222649k39905m082584
42869C2144624l928799l18099J779295J813494L111016M808405K196904l864895
42861C7741945n836022j082328K774081o23497n975236m813036N84291J166396
42853B3936594l351090l569879L817711R626659O106123j067161j538398M698467
42845C8659026Q901644P164483M399491N283299Q472656J1328359J4509264J9120806
42837A17839028K3640992K6863998L0463151L4600584L3090475J8011818r823444
$$ plain form
42830 274686602 236523637 183475167 133259774 96978196 76019131 65655513 59310740
42823 59310740 51253258 38983810 24561550 12519919 5700843 3503689 3723000 4582685
42815 4582685 5049316 5086979 6058223 9000394 12051345 11919193 8767371 6860204 8678389
42806 8678389 11175772 10290766 6563530 3202918 935286 -1460297 -3380955 -3481046
42798 -3481046 -3229973 -4778256 -6168244 -3816025 526505 1071214 -2928023 -5296566
42790 -5296566 -2034386 3420969 6770605 9026590 12123768 13465538 10136183 4961595
42782 4961595 2948372 4220752 5611485 6977206 10402742 14662404 16158319 14765223
42774 14765223 13451730 12368013 8659747 2540296 -1632179 -1412902 1144333 4055166
$$ packed form
42830B74686602l8162965n3048470n0215393l6281578k0959065j0363618o344773
42823E9310740q057482j2269448j4422260j2041631o819076k197154K19311Q59685
42815D582685M66631L7663R71244K942171L050951j32152l151822j907167J818185
42806H678389K497383q85006l727236l360612k267632k395583j920658j00091
42798c481046K51073j548283j389988K352219M342530N44709l999237k368543
42790e296566L262180N455355L349636K255985L097178J341770l329355n174588
42782D961595k013223J272380J390733J365721L425536M259662J495915j393096
42774A4765223j313493j083717l708266o119451m172475K19277K557235K910833
$$ plain form
42766 4055166 8024705 12961630 16220601 16495477 15887730 16032296 15493104 13094594 10620812
42757 10620812 9861902 9792036 8953677 8038793 7975961 8153376 8771590 12091491 18565933
42748 18565933 24203860 24782453 20773911 15534033 10896892 7500368 6973215 9765676
42740 9765676 12260999 10198035 4537403 432612 665906 3354801 5859954 7450716
42732 7450716 7842169 6524379 4508827 3980006 5141435 5677843 4249512 2294591 1349509
42723 1349509 844911 126278 801142 4839768 10954572 14887281 13908659 10115848 8292694
42714 8292694 10470249 13722624 14399551 13441857 14938906 19433693 22244517 20265973
42706 20265973 16976804 17162494 19198500 17453079 11597412 8299423 12292081 19744607
$$ packed form
42766D055166L969539M936925L258971K74876o07747J44566n39192k398510k473782
42757A0620812p58910o9866q38359r14884o2832J77415O18214L319901O474442
42748A8565933N637927N78593m008542n239878m637141l396524n27153K792461
42740I765676K495323k062964n660632m104791K33294K688895K505153J590762
42732G450716L91453j317790k015552n28821J161429N36408j428331j954921r45082
42723A349509n04598p18633O74864M038626O114804L932709r78622l792811j823154
42714H292694K177555L252375O76927r57694J497049M494787K810824j978544
42706B0265973l289169J85690K036006j745421n855667l297989L992658P452526
$$ plain form
42698 19744607 22839394 18562572 10921153 5950647 6153913 9076140 10458109 9077662
42690 9077662 7964773 9780861 12299929 10967498 5178580 -1089867 -4668324 -5837714
42682 -5837714 -5464083 -3279204 122632 3206999 6468497 11612067 16434350 15127700
42674 15127700 6488881 -2276637 -3753884 738590 4372165 4452727 4350933 7052682
42666 7052682 10918915 11849780 7276034 -1218947 -7626325 -6202162 1103725 5000672
42658 5000672 372330 -5810946 -3441736 6404472 12990180 10944469 6198408 5621231
42650 5621231 8085271 9292835 9477241 11416584 14687085 16721617 17180640 17214662 16429968
42641 16429968 14441431 13565949 15774704 18180219 15938530 9307120 3572126 1589038
$$ packed form
42698A9744607L094787m276822p641419m970506K03266K922227J381969j380447
42690I077662j112889J816088K519068j332431n788918o268447l578457j169390
42682e837714L73631K184879L401836L084367L261498N143570M822283j306650
42674A5127700q638819q765518j477247M492474L633575Q0562j01794K701749
42666G052682L866233R30865m573746q494981o407378J424163P305887L896947
42658E000672m628342o183276K369210R846208O585708k045711m746061n77177
42650E621231K464040J207564J84406J939343L270501K034532M59023L4022p84694
42641A6429968j988537q75482K208755K405515k241689o631410n734994j983088
$$ plain form
42633 1589038 662726 -1746078 -3318918 -863627 3866667 6314836 5861527 6059860 7681922
42624 7681922 6160359 -1090347 -8316071 -7540181 -65055 4001819 -643408 -6876721
42616 -6876721 -5169046 3000498 7769682 4963499 617804 688524 2741772 1244252
42608 1244252 -3444091 -6041073 -4275603 -1448714 -1002137 -1643680 706728 7152694
42600 7152694 13364888 13766343 8175934 2779270 3247853 8360112 12446755 12568979 10234259
42591 10234259 7344297 4650118 3884924 6777117 11330154 13650446 14388525 18270629
42583 18270629 25486360 29080646 24228655 15450495 10742151 12404739 17407175 22806507
42575 22806507 26424802 25806335 21417811 18080259 18821911 20358242 18939515 16653293
$$ packed form
42633A589038r26312k408804j572840K455291M730294K448169m53309J98333J622062
42624G681922j521563p250706p225724P75890P475126M066874m645227o233313
42616f876721J707675Q169544M769184k806183m345695P0720K053248j497520
42608A244252m688343k596982J765470K826889M46577o41543K350408O445966
42600G152694O212194M01455n590409n396664M68583N112259M086643J22224k334720
42591A0234259k889962k694179p65194K892193M553037K320292P38079L882104
42583A8270629P215731L594286m851991q778160m708344J662588N002436N399332
42575B2806507L618295o18467m388524l337552P41652J536331j418727k286222
$$ plain form
42567 16653293 16541944 15931609 11785897 8771836 13025658 20258396 20176500 12401137 7550043
42558 7550043 10841522 14933489 12786777 8176927 7823199 10854289 12632228 13027133
42550 13027133 14236155 15048612 13684278 12564402 14268476 16215571 15330942 14590109
42542 14590109 18246273 23227846 22635154 16485881 11616988 10949749 10047404 5699685
42534 5699685 1289680 724953 2253990 2059734 377305 21661 935991 232987 -2641570
42525 -2641570 -3939677 130860 8688554 16842636 20429704 19015465 14639370 9626734
42517 9626734 6512821 7684910 12311143 15102757 11813425 5349441 2215206 3163490
42509 3163490 2928158 299049 1625072 10386472 19395793 19636809 12866183 8441657
$$ packed form
42567A6653293j11349o10335m145712l014061M253822P232738q1896p775363m851094
42558G550043L291479M091967k146712m609850l53728L031090J777939L94905
42550A3027133J209022Q12457j364334j119876J704074J947095q84629p40833
42542A4590109L656164M981573n92692o149273m868893o67239r02345m347719
42534E699685m410005n64727J529037j94256j682429l55644R14330p03004k874557
42525b641570j298107M070537Q557694Q154082L587068j414239m376095n012636
42517I626734l113913J172089M626233K791614l289332o463984l134235R48284
42509C163490k35332k629109J326023Q761400R009321K41016o770626m424526
$$ plain form
42501 8441657 9897402 12009960 10779317 9140698 10883357 14216553 14242745 9089116
42493 9089116 1919178 -1561982 2257707 10593393 15450852 11972723 4590311 1602392
42485 1602392 5013884 9932544 12727745 14301153 15373904 14478081 12068515 11374806
42477 11374806 12972405 12897155 8469736 2184422 -2344707 -4641436 -5454783 -4367027
42469 -4367027 -1917154 -732352 -1610692 -1132863 4110599 13005299 21522516 26369645
42461 26369645 25531498 18691786 9663574 5081789 7467624 12261252 14707455 16430847
42453 16430847 20987017 25717821 23952554 15053767 6876080 6433583 11713759 15207251
42445 15207251 13455858 10160001 9971245 11950419 11483692 7859606 6282271 10378356
$$ packed form
42501H441657J455745K112558j230643j638619J742659L333196K6192n153629
42493I089116p169938l481160L819689Q335686M857459l478129p382412k987919
42485A602392L411492M918660K795201J573408J072751q95823k409566o93709
42477A1374806J597599p5250m427419o285314m529129k296729q13347J087756
42469d367027K449873J184802q78340M77829N243462Q894700Q517217M847129
42461B6369645q38147o839712r028212m581785K385835M793628K446203J723392
42453A6430847M556170M730804j765267q898787q177687m42497N280176L493492
42445A5207251j751393l295857j88756J979174m66727l624086j577335M096085
$$ plain form
42437 10378356 15921237 16194811 11806163 9734892 12834465 16417491 16840451 17140541
42429 17140541 20457225 23284296 20610053 14178107 9948937 9525431 9750567 9729144 12405446
42420 12405446 18348417 22700000 20590990 13244929 6871231 6282068 10337043 13596834
42412 13596834 12610908 9935528 10351449 13862328 15811778 14189370 12281864 12313810 11464151
42403 11464151 7706841 5000214 7690934 13259635 16251362 16805435 19085224 22796093
42395 22796093 23010472 18731018 15662366 18751405 26016169 31207067 29895887 22793474
42387 22793474 15755022 15791961 23871117 32708022 35180518 33137600 33243644 36088295
42379 36088295 35893276 30496882 24566111 21875101 21139473 21396797 24843308 31242877
$$ packed form
42437A0378356N542881K73574m388648k071271L099573L583026M22960L00090
42429A7140541L316684K827071k674243o431946m229170m23506K25136k1423K676302
42420A2405446N942971M351583k109010p346061o373698n89163M054975L259791
42412A3596834r85926k675380M15921L510879J949450j622408j907506L1946q49659
42403A1464151l757310k706627K690720N568701K991727N54073K279789L710869
42395B2796093K14379m279454l068652L089039P264764N190898j311180p102413
42387B2793474p038452L6939Q079156Q836905K472496k042918J06044K844651
42379C6088295j95019n396394n930771k691010p35628K57324L446511O399569
$$ plain form
42371 31242877 35517808 34851991 33268424 35137220 38601852 39715646 38938009 38596386
42363 38596386 37335111 32724876 27405108 27002446 32238533 37584042 38213926 35099984
42355 35099984 32818995 34895880 41820918 51641033 61495170 69118290 73390697 74407240
42347 74407240 74272465 76716249 83004950 88541537 87444127 81291715 78882008 85222981
42339 85222981 95181635 101374303 104308979 109962609 120031270 130093777 136622633 140749042
42331 140749042 144353466 146212562 143508456 135115408 122489815 108520588 95767681
42324 95767681 85048333 75916668 68517905 63361535 58941579 52478551 44725270 41009943
42316 41009943 44581161 51408424 55246328 55952482 58408085 64132982 68930555 69722972
$$ packed form
42371C1242877M274931o65817j583567J868796L464632J113794p77637l41623
42363C8596386j261275m610235n319768m02662N236087N345509O29884l113942
42355C5099984k280989K076885O925038R820115R854137P623120M272407J016543
42347G4407240j34775K443784O288701N536587j097410o152412k409707O340973
42339H5222981R958654O192668K934676N653630J0068661J0062507O528856M126409
42331A40749042L604424J859096k704106q393048j2625593j3969227j2752907
42324I5767681j0719348r131665p398763n156370m419956o463028p753281l715327
42316D1009943L571218O827263L837904P06154K455603N724897M797573P92417
$$ plain form
42308 69722972 69581723 73925665 84361023 98328610 113065990 127729324 142219065
42301 142219065 155726706 166932940 174894146 178971359 177961404 170559476 157883576
42294 157883576 144587908 135207972 129359607 122854289 113820610 104847007 98111591 91721104
42286 91721104 83235700 74294051 68755439 67632494 68514144 69197989 69626960 70521517 71661904
42277 71661904 71707842 69858919 68603095 73506352 86904938 102071019 108265013 102832250
42269 102832250 93665765 88033490 84613496 79660352 74679518 72314688 69732385 63284721
42261 63284721 56549478 56348230 62560028 68904146 72663335 76652421 82264406 87968106
42253 87968106 94950032 106508520 119878174 125582238 118294435 103448082 90227948
$$ packed form
42308F9722972j41249M343942J0435358J3967587J4737380J4663334J4489741
42301A42219065J3507641J1206234P961206M077213j009955p401928j2675900
42294A57883576j3295668r379936n848365o505318r033679q973603o735416o390487
42286I1721104q485404q941649n538612j122945Q81650O83845M28971Q94557J140387
42277G1661904M5938j848923j255824M903257J3398586J5166081O193994n432763
42269A02832250r166485n632275l419994m953144m980834k364830k582303o447664
42261F3284721o735243k01248O211798O344118L759189L989086N611985N703700
42253H7968106O981926J1558488J3369654N704064p287803j4846353j3220134
$$ plain form
42246 90227948 82228244 77467653 73379131 68701763 63445149 59416369 58349333 58151441
42238 58151441 54137996 45590358 37893471 36083402 38752316 40255068 37149048 31134713
42230 31134713 26964569 27876490 31965138 33861086 31433985 28607236 28929600 29678373
42222 29678373 26943453 23232791 23505529 26197933 26105781 24523401 27212265 32632328
42214 32632328 32750535 27161954 25232530 30434355 33849722 29495308 25569520 31760905
42206 31760905 43850256 50838700 51061643 51082063 53287197 54859077 56106513 60120826
42198 60120826 65776328 69556737 72849628 79534266 88051529 93902042 98284531 105699688
42190 105699688 114342662 118132418 117822297 120333430 126238736 127865307 122270616 116602870
$$ packed form
42246I0227948p999704m760591m088522m677368n256614m028780j067036j97892
42238E8151441m013445q547638p696887j810069K668914J502752l106020o014335
42230C1134713m170144R11921M088648J895948k427101k826749L22364P48773
42222B9678373k734920l710662K72738K692404r2152j582380K688864N420063
42214C2632328J18207n588581j929424N201825L415367m354414l925788O191385
42206C1760905J2089351O988444K22943K0420K205134J571880J247436M014313
42198F0120826N655502L780409L292891O684638Q517263N850513M382489P415157
42190A05699688Q642974L789756l10121K511133N905306J626571n594691n667746
$$ plain form
42182 116602870 116578550 118113963 115610204 111468097 111346968 115231455 119065369 121276161
42174 121276161 122296948 120992380 116971020 113918073 115235861 117889567 115790754 108835175
42166 108835175 103553308 103672691 104214686 97884750 85283325 74949554 72478291 72944257
42158 72944257 67633070 56679258 49454604 51102235 54732323 51320586 42432042 36793851
42150 36793851 37520062 40186752 42023285 44984608 49306513 51612317 51239103 51892029
42142 51892029 54794006 56065828 53161594 48351624 43755227 38753155 34516560 34599111
42134 34599111 37909995 37728941 31851742 27339014 30140953 36046272 37998560 36983638
42126 36983638 38494394 42413352 44286697 43971344 45031503 46701530 44079445 36615355
$$ packed form
42182A16602870k4320J535413k503759m142107j21129L884487L833914K210792
42174A21276161J020787j304568m021360l052947J317788K653706k098813o955579
42166A08835175n281867J19383N41995o329936j2601425j0333771k471263M65966
42158G2944257n311187j0953812p224654J647631L630088l411737q888544n638191
42150C6793851P26211K666690J836533K961323M321905K305804l73214O52926
42142E1892029K901977J271822k904234m809970m596397n002072m236595Q2551
42134C4599111L310884j81054n877199m512728K801939N905319J952288j014922
42126C6983638J510756L918958J873345l15353J060159J670027k622085p464090
$$ plain form
42118 36615355 29802498 27307318 26935986 25902267 25440718 28198201 34194958 40896524
42110 40896524 45367660 46168335 44985699 45592467 48943319 50867061 47717154 42465272
42102 42465272 40926606 43223578 44074729 41342966 38953485 40162342 42644240 42453935
42094 42453935 39482636 36759909 36639135 39409038 43981874 48648876 52170100 54476454
42086 54476454 55501053 54264315 50769847 47421948 46080117 45011245 41584755 36430971
42078 36430971 31515286 25991580 18607401 12674187 12696164 16345307 16237637 10677039
42070 10677039 6148588 7076759 9632678 9187832 7930411 10197232 14830276 17557912
42062 17557912 17762527 17720246 17542767 15861592 13761936 13329129 13637354 12588345 11415120
$$ packed form
42118C6615355o812857k495180l71332j033719m61549K757483N996757O701566
42110D0896524M471136Q00675j182636O06768L350852J923742l149907n251882
42102D2465272j538666K296972Q51151k731763k389481J208857K481898j90305
42094D2453935k971299k722727j20774K769903M572836M667002L521224K306354
42086E4476454J024599j236738l494468l347899j341831j068872l426490n153784
42078C6430971m915685n523706p384179n933214K1977L649143j07670n560598
42070A0677039m528451R28171K555919m44846j257421K266821M633044K727636
42062A7557912K04615m2281j77479j681175k099656m32807L08225j049009j173225
$$ plain form
42053 11415120 12693442 14798612 13418512 8757179 6459206 10084669 16289517 19007776
42045 19007776 15932228 9835362 5436816 5439289 8041991 8750661 6410161 5916470 11760975
42036 11760975 20372772 23527448 18992786 12578182 9062683 7023129 4827687 5542699
42028 5542699 11135401 16249144 13866764 5414985 -142355 3023004 11929791 19540170
42020 19540170 21438652 17753229 12019347 8806947 9744862 11422649 9454889 4366549
42012 4366549 719224 735751 2145709 2495834 2009320 1598367 1791422 4559371 12028604
42003 12028604 21568125 26297958 23192351 17081109 13744377 12932226 11952667 11998670 15285528
41994 15285528 18917479 18536519 16835252 20862719 30021496 34336031 27974960 18276044
$$ packed form
42053A1415120J278322K105170j380100m661333k297973L625463O204848K718259
42045A9007776l075548o096866m398546K473K602702P08670k340500m93691N844505
42036A1760975Q611797L154676m534662o414604l515499k039554k195442P15012
42028E542699N592702N113743k382380q451779n557340L165359Q906787P610379
42020A9540170J898482l685423n733882l212400R37915J677787j967760n088340
42012D366549l647325J6527J409958L50125m86514m10953J93055K767949P469233
42003A2028604R539521M729833l105607o111242l336732q12151r79559M6003L286858
41994A5285528L631951l80960j701267M027467R158777M314535o361071r698916
$$ plain form
41986 18276044 16385613 23264510 30679577 33513690 34768508 38345521 42496086 43031967
41978 43031967 40025747 38123677 40534532 44711185 45003030 39168768 31163982 26952496
41970 26952496 28505049 33005507 36935393 38887158 38743050 36629139 33337712 29949752
41962 29949752 26628763 23525553 22648388 25985667 31258900 32704103 27522576 19067356
41954 19067356 12436070 9546314 9632253 11226848 11805099 8909796 4141447 2822375
41946 2822375 6870117 11202301 10534098 6647196 5011454 6964715 9619631 11217503
41938 11217503 11938698 11292816 9390183 9012387 11534893 12761928 8544482 2873959
41930 2873959 3575741 10521870 15486737 14405160 12191045 13318565 15164386 14523470
$$ packed form
41986A8276044j890431O878897P415067K834113J254818L577013M150565N35881
41978D3031967l006220j902070K410855M176653K91845n834262q004786m211486
41970B6952496J552553M500458L929886J951765j44108k113911l291427l387960
41962B9949752l320989l103210q77165L337279N273233J445203n181527q455220
41954A9067356o631286k889756Q5939J594595N78251k895303m768349j319072
41946B822375M047742M332184o68203l886902j635742J953261K654916J597872
41938A1217503P21195o45882j902633l77796K522506J227035m217446n670523
41930B873959P01782O946129M964867j081577k214115J127520J845821o40916
$$ plain form
41922 14523470 14142231 17526226 22019480 22530139 19011722 15451504 13875867 13617147
41914 13617147 14297421 15343189 14306060 9719663 4467444 2785225 4764742 6705794
41906 6705794 5986976 3201726 707763 1119391 5432552 10533468 10991242 5959022 1537782
41897 1537782 2881188 6728451 6202273 900159 -2943131 -1384742 3206322 6910827
41889 6910827 8263166 7061014 3718812 972279 2348338 7413456 11575557 11793407
41881 11793407 9660376 7937668 7245295 7590039 9983245 14269351 17575093 17275527
41873 17275527 14238204 11373747 10049195 9505023 8995371 8904782 9743715 10880127 10710113
41864 10710113 8483330 6034203 6579341 10856996 15569200 16954526 14661920 10531817
$$ packed form
41922A4523470l81239L383995M493254N10659l518417l560218j575637k58720
41914A3617147O80274J045768j037129m586397n252219j682219J979517J941052
41906F705794p18818k785250k493963M11628M313161N100916M57774n032220m421240
41897A537782J343406L847263n26178n302114l843290J558389M591064L704505
41889F910827J352339j202152l342202k746533J376059N065118M162101K17850
41881A1793407k133031j722708o92373L44744K393206M286106L305742k99566
41873A7275527l037323k864457j324552n44172n09652r0589Q38933J136412j70014
41864A0710113k226783k449127N45138M277655M712204J385326k292606m130103
$$ plain form
41856 10531817 5446821 229473 -1967039 1628977 8404877 12168129 10772457 8233471
41848 8233471 8023801 8047795 4537902 -2044093 -7711891 -9646422 -7956868 -4465557 -1895133
41839 -1895133 -2795120 -6996291 -10896495 -10967183 -7360542 -2963373 110994 1939969 3632196
41830 3632196 5787211 7630272 7692492 6357926 6717801 10278739 12813872 9005719 1551960
41821 1551960 -130972 7256628 15207712 14920600 9087957 5947825 6199969 4479393
41813 4479393 1506509 4397038 13395726 18039859 11303317 239690 -3570138 1067759
41805 1067759 6296685 7836435 8693695 11223298 12669048 10439753 6971702 6580913
41797 6580913 9852943 13208009 13126247 9993744 8028395 10676337 15452945 15411371 7825818
$$ packed form
41856A0531817n084996n217348k196512L596016O775900L763252j395672k538986
41848H233471k09670K3994l509893o581995n667798j934531J689554L491311K570424
41839a895133q99987m201171l900204p0688L606641M397169L074367J828975J692227
41830C632196K155015J843061O2220j334566L59875L560938K535133l808153p453759
41821A551960j682932P387600P951084k87112n832643l140132K52144j720576
41813D479393k972884K890529Q998688M644133o736542j1063627l809828M637897
41805A067759N228926J539750Q57260K529603J445750k229295l468051l90789
41797F580913L272030L355066q1762l132503j965349K647942M776608m1574p585553
$$ plain form
41788 7825818 -786670 -1773230 5025599 11912115 13666102 12209361 10799624 9327404
41780 9327404 7528375 7835011 11578126 15951910 18146849 19428218 21740409 23320764
41772 23320764 21687657 18480644 16961905 16593911 14651565 11876227 11726515 14466821
41764 14466821 16430482 15191687 11699160 7579237 4119239 3288590 5444548 6652554
41756 6652554 3264209 -1241665 196797 7565071 13164675 12912162 11164857 11729481
41748 11729481 11638843 8534874 7275574 12504971 19755213 21343616 17698251 15410233
41740 15410233 16361878 16453794 14283132 13710395 17075491 21868575 25248205 27030648 27495515
41731 27495515 26670404 26182891 27548332 28631850 26244634 21833092 19538881 19146126
$$ packed form
41788G825818q612488r86560O798829O886516J753987j456741j409737j472220
41780I327404j799029L06636L743115M373784K194939J281369K312191J580355
41772B3320764j633107l207013j518739l67994j942346k775338j49712K740306
41764A4466821J963661j238795l492527m119923l459998q30649K155958J208006
41756F652554l388345m505874J438462P368274N599604k52513j747305N64624
41748A1729481r0638l103969j259300N229397P250242J588403l645365k288018
41740A5410233R51645R1916k170662n72737L365096M793084L379630J782443M64867
41731B7495515q25111m87513J365441J083518k387216m411542k294211l92755
$$ plain form
41723 19146126 16943564 13372998 12636525 13799469 10401364 1754060 -3425521 617746
41715 617746 7879262 10288547 9999712 14363594 23015404 28453553 27385564 23431163
41707 23431163 19264784 14024110 9433028 10858712 19024712 26240204 25080557 17594744
41699 17594744 12167510 13217345 17440206 19512305 18490633 17731536 19886237 23313874
41691 23313874 23890092 19942745 14312010 11130243 11672094 14110779 16057752 16046563 13630995
41682 13630995 9718764 6276002 4382330 3195332 1967135 2054929 5357208 11503295
41674 11503295 18050743 22710063 24139775 21891932 17491182 14438463 14846476 16669873
41666 16669873 16311177 13356671 10728073 10827835 13568743 17363175 19834977 18679311
$$ packed form
41723A9146126k202562l570566p36473J162944l398105q647304n179581M043267
41715F17746P261516K409285k88835M363882Q651810N438149j067989l954401
41707B3431163m166379n240674m591082J425684Q166000P215492j159647p485813
41699A7594744n427234J049835M222861K072099j021672p59097K154701L427637
41691B3313874N76218l947347n630735l181767N41851K438685J946973j1189k415568
41682A3630995l912231l442762j893672j186998j228197Q7794L302279O146087
41674A1503295O547448M659320J429712k247843m400750l052719M08013J823397
41666A6669873l58696k954506k628598R9762K740908L794432K471802j155666
$$ plain form
41658 18679311 14672057 12805734 16882708 23555666 25945705 23310968 22151245 26089475
41650 26089475 29794718 26704574 18993166 14789486 17190994 21172812 21452072 18799520
41642 18799520 17073853 17672965 19405641 21378340 23001329 22420528 18170636 12410451
41634 12410451 9691343 11606763 14875080 15940496 15408514 16181970 19079754 22678012
41626 22678012 25948005 28045302 26689362 20767898 14440089 14085076 19801626 24219453
41618 24219453 22111580 17169562 15855659 18154677 19127351 17242831 15696934 16191415
41610 16191415 16726864 16218286 16700829 19487483 22861712 25280950 27650897 30500574
41602 30500574 31797313 30022724 27309224 26851516 28353020 28451040 25244260 20405523
$$ packed form
41658A8679311m007254j866323M076974O672958K390039k634737j159723L938230
41650B6089475L705243l090144p711408m203680K401508L981818K79260k652552
41642A8799520j725667N99112J732676J972699J622989n80801m249892n760185
41634A2410451k719108J915420L268317J065416n31982P73456K897784L598258
41626B2678012L269993K097297j355940n921464o327809l55013N716550M417827
41618B4219453k107873m942018j313903K299018R72674j884520j545897M94481
41610A6191415N35449n08578M82543K786654L374229K419238K369947K849677
41602C0500574J296739j774589k713500m57708J501504R8020l206780m838737
$$ plain form
41594 20405523 16607778 14332479 12143461 9701514 9187055 12392277 16800414 17119078
41586 17119078 12164614 7829833 10302440 17812297 22693617 20994718 16003081 12033120
41578 12033120 9304494 6793274 6013946 8582507 12456433 14083649 13173990 12397274
41570 12397274 12844704 12465105 9423176 5234424 3590073 6306320 10703501 11614542
41562 11614542 6938050 738722 -854141 3266255 8359377 10390214 10657755 12522060
41554 12522060 15986842 17766117 15387451 9512916 3426990 1506655 6263273 14840607
41546 14840607 20081835 17549171 10479788 5647339 5597365 7565438 8813774 9463585
41538 9463585 10127998 10381154 10740625 13257492 18224946 22133726 20897021 14269864 5687089
$$ packed form
41594B0405523l797745k275299k189018k441947n14459L205222M408137L18664
41586A7119078m954464m334781K472607P509857M881320j698899m991637l969961
41578A2033120k728626k511220p79328K568561L873926J627216r09659p76716
41570A2397274M47430l79599l041929m188752j644351K716247M397181R11041
41562A1614542m676492o199328j592863M120396N093122K030837K67541J864305
41554A2522060L464782J779275k378666n874535o085926j920335M756618Q577334
41546A4840607N241228k532664p069383m832449m9974J968073J248336O49811
41538I463585O64413K53156L59471K516867M967454L908780j236705o627157q582775
$$ plain form
41529 5687089 -1446179 -5760114 -6771437 -3891586 2219980 8191683 9738909 6068843
41521 6068843 1730329 2240762 7444731 11078823 8350817 2315212 183619 4064765
41513 4064765 8738234 9293624 7327828 6985218 7807808 6076281 2459158 3010929 10579459
41504 10579459 19451683 22195484 19068044 16126546 15564422 13539147 8224790 4371497
41496 4371497 6718521 12749109 16044377 14749205 12855505 14066754 17769639 20811454
41488 20811454 20612557 16684266 11216711 7913560 8557399 11355241 13953189 16376989
41480 16376989 19062843 20275864 18541625 15690618 13987327 12127853 8156553 4490627
41472 4490627 5048719 8636771 10656547 10568724 11636100 13653541 12863575 9738247 9365019
$$ packed form
41529E687089p133268m313935j011323K879851O111566N971703J547226l670066
41521F068843m338514N10433N203969L634092k728006o035605k131593L881146
41513D064765M673469N55390j965796l42610Q22590j731527l617123N51771P568530
41504A0579459Q872224K743801l127440k941498n62124k025275n314357l853293
41496D371497K347024O030588L295268j295172j893700J211249L702885L041815
41488B0811454j98897l928291n467555l303151O43839K797842K597948K423800
41480A6376989K685854J213021j734239k851007j703291j859474l971300l665926
41472D490627N58092L588052K019776q7823J067376K017441p89966l125328l73228
$$ plain form
41463 9365019 12196354 12085940 6691365 2133247 2716485 3519632 -372901 -3761504 1338547
41454 1338547 12400413 18895409 16224063 9730176 5709513 5073022 5890907 6496823
41446 6496823 5441384 2493996 -226238 -1078022 -1465245 -2591325 -2448638 -118765 363699
41437 363699 -3996666 -8440635 -6414443 212013 4281633 4790721 6832438 10954058
41429 10954058 11736499 7921171 5060401 5907450 6577065 5260923 6459998 12130712
41421 12130712 16024921 12452411 5000807 958104 1541153 2888649 3084049 3336190
41413 3336190 4950319 8793114 14864827 19775488 18717092 12730512 9054611 10849627
41405 10849627 12279066 8387117 3815987 5326737 10810524 13263364 11824810 10920732
$$ packed form
41463I365019K831335j10414n394575m558118N83238Q03147l892533l388603N100051
41454A338547J1061866O494996k671346o493887m020663o36491Q17885O05916
41446F496823j055439k947388k720234q51784l87223j126080J42687K329873M82464
41437C63699m360365m443969K026192O626456M069620N09088K041717M121620
41429A0954058P82441l815328k860770Q47049O69615j316142J199075N670714
41421A2130712L894209l572510p451604m042703N83049J347496J95400K52141
41413C336190J614129L842795O071713M910661j058396n986580l675901J795016
41405A0849627J429439l891949m571130J510750N483787K452840j438554r04078
$$ plain form
41397 10920732 11297040 10226963 8816248 10482371 12715330 8923149 -720281 -8189692
41389 -8189692 -8911662 -6804997 -6086326 -5465880 -3636344 -3617344 -7173587 -10379254 -9450083
41380 -9450083 -6536187 -5050668 -3338210 1626002 7321571 8428985 5087073 2828821
41372 2828821 4354186 6255917 4918399 1666732 142386 1221091 2736433 2901891
41364 2901891 2014155 1098809 560019 873342 3516634 9370636 15845104 17800184 13461560
41355 13461560 8005470 7999684 12569248 14089199 8886451 3043185 4305912 11259848
41347 11259848 15054590 10684140 1992470 -4635587 -7080018 -6537906 -3868798 11090
41339 11090 2620734 2507085 2394100 6211250 12851117 16251920 13040948 7409723 6096733
$$ packed form
41397A0920732L76308j070077j410715J666123K232959l792181r643430p469411
41389h189692p21970K106665P18671O20446J829536J9000l556243l205667R29171
41380i450083K913896J485519J712458M964212N695569J107414l341912k258252
41372B828821J525365J901731j337518l251667j524346J078705J515342J65458
41364B901891q87736r15346n38790L13323K643292N854002O474468J955080m338624
41355A3461560n456090n786M569564J519951n202748n843266J262727O953936
41347A1259848L794742m370450q691670o628057k444431N42112K669108L879888
41339A1090K609644j13649j12985L817150O639867L400803l210972n631225j312990
$$ plain form
41330 6096733 10103423 14008199 12957644 7756419 2601481 -58648 -1142503 -2573842
41322 -2573842 -4613161 -5491304 -3450890 680265 3492475 2577830 -372188 -1657921
41314 -1657921 -505541 361396 -503654 -704527 2043125 5634977 5970514 2649809 -333414
41305 -333414 468937 4326598 7832499 8464397 6333471 3585525 2498974 3608165 5624665
41296 5624665 7268021 8337327 8649126 7488916 5291121 4236767 5293926 6070074
41288 6070074 4089893 1168279 1418972 5208221 8532239 9057660 9292383 11901481 14766894
41279 14766894 13653479 8349457 3186690 1731544 3447403 5986570 8571251 11793063
41271 11793063 15304649 17350654 16474926 12633177 6670412 -39126 -5058157 -5627049
$$ packed form
41330F096733M006690L904776j050555n201225n154938k660129j083855j431339
41322b573842k039319q78143K040414M131155K812210r14645k950018j285733
41314a657921J152380Q66937q65050k00873K747652L591852L35537l320705k983223
41305c33414Q02351L857661L505901O31898k130926k747946j086551J109191K016500
41296E624665J643356J069306L11799j160210k197795j054354J057159P76148
41288F070074j980181k921614K50693L789249L324018N25421K34723K609098K865413
41279A4766894j113415n304022n162767j455146J715859K539167K584681L221812
41271A1793063L511586K046005q75728l841749n962765o709538n019031n68892
$$ plain form
41263 -5627049 -1561808 3422404 5366768 4989902 6847476 13209456 21036904 25872331
41255 25872331 26234294 22734706 15767357 6936506 467135 -846809 -192740 -3042000
41247 -3042000 -8808766 -10636488 -5064487 2147517 3048881 -2125586 -5419260 -1320456
41239 -1320456 6985222 12264459 11567510 8205759 6720867 7992427 9544647 9128025
41231 9128025 6808420 4040515 1933743 663418 -163359 -789114 -495087 2212783 7673400
41222 7673400 13565632 16602239 15694191 12257709 7996998 4437626 3929074 7570110
41214 7570110 11671507 10409798 3835607 -740775 1885458 7866123 10300913 8458873
41206 8458873 6193471 4291129 562618 -3970578 -5382011 -3218692 -814099 973444
$$ packed form
41263e627049M065241M984212J944364l76866J857574O361980P827448M835427
41255B5872331L61963l499588o967349q830851o469371j313944O54069k849260
41247c042000n766766j827722N572001P212004R01364n174467l293674M098804
41239a320456Q305678N279237o96949l361751j484892J271560J552220m16622
41231I128025k319605k767905k106772j270325q26777o25755K94027K707870N460617
41222G673400N892232L036607r08048l436482m260711l559372n08552L641036
41214G570110M101397j261709o574191m576382K626233N980665K434790j842040
41206H458873k265402j902342l728511m533196j411433K163319K404593J787543
$$ plain form
41198 973444 4505215 9141438 10388750 7087636 3934852 4648434 7782834 11440635
41190 11440635 16258483 20515974 18438809 8521229 -1228261 -2281951 3411193 7175732
41182 7175732 5716193 3220918 2826984 2623513 806202 -679998 370193 2804400
41174 2804400 3811658 2123919 -1484192 -5197031 -7039184 -6043750 -2906749 982184
41166 982184 4391933 5706833 3542311 -679187 -2965222 -1637324 125949 -1050814
41158 -1050814 -3872793 -4994163 -4002018 -2244747 802976 5468564 8222825 5600218
41150 5600218 786968 364235 4421866 6098504 2220394 -1793315 -332390 4656969
41142 4656969 8194006 9958662 12633566 15753993 16536947 15188020 14177038 12759170
$$ packed form
41198I73444L531771M636223J247312l301114l152784P13582L134400L657801
41190A1440635M817848M257491k077165r917580r749490j053690N693144L764539
41182G175732j459539k495275l93934k03471j817311j486200J050191K434207
41174B804400J007258j687739l608111l712839j842153R95434L137001L888933
41166I82184L409749J314900k164522m221498k286035J327898J763273j176763
41158a050814k821979j121370R92145J757271L047723M665588K754261k622607
41150E600218m813250m22733M057631J676638l878110m013709J460925M989359
41142D656969L537037J764656K674904L120427P82954j348927j010982j417868
$$ plain form
41134 12759170 7522524 -557047 -4591931 -402074 6671428 7779458 1932418 -3383238
41126 -3383238 -3346278 -2278359 -5666926 -10019371 -6971059 3649437 11849076 10264896
41118 10264896 2755275 -2920982 -5017200 -5495858 -3406731 2111538 5790850 1690881
41110 1690881 -6648569 -9945107 -6859824 -5004648 -7156429 -6490825 435018 5624066
41102 5624066 1645170 -5860482 -6506118 -837494 1941649 -1064418 -3931250 -3811951
41094 -3811951 -5079819 -9205703 -9628158 -1840141 7880326 10059089 4649302 94351
41086 94351 1531047 5475700 6433905 4325350 3472362 6434305 10774508 11721370 7492723
41077 7492723 1773344 236802 4210291 8802210 8424364 3461193 -120070 2208554
$$ packed form
41134A2759170n236646q079571m034884M189857P073502J108030n847040n315656
41126c383238L6960J067919l388567m352445L048312J0620496Q199639j584180
41118A0264896p509621n676257k096218m78658K089127N518269L679312m099969
41110A690881q339450l296538L085283J855176k151781O65604O925843N189048
41102E624066l978896p505652o45636N668624K779143l006067k866832J19299
41094c811951j267868m125884m22455P788017R720467K178763n409787m554951
41086I4351J436696L944653R58205k108555q52988K961943M340203R46862m228647
41077G492723n719379j536542L973489M591919l77846m963171l581263K328624
$$ plain form
41069 2208554 8498252 13176280 13851563 13448163 15088108 16634312 12790933 2762761
41061 2762761 -7065504 -10310538 -8503236 -8279995 -11260483 -11326578 -3774299 6945686
41053 6945686 12420648 10709337 7058426 5423956 4557109 3125000 3368047 6948262
41045 6948262 11188950 12945609 13208974 14081579 13853733 9797716 4116110 1690450 2318083
41036 2318083 652924 -5489468 -12039412 -15088648 -14941766 -11849254 -3824523 7524238
41028 7524238 14725348 13552681 9982074 11631665 15779564 13713279 5331301 644417
41020 644417 5414399 12976653 13784685 7576707 2086922 3222739 9933061 16447445
41012 16447445 17182145 11482360 5091266 4727101 10341060 15641135 16830275 16619693
$$ packed form
41069B208554O289698M678028O75283m03400J639945J546204l843379j0028172
41061B762761r828265l245034J807302K23241k980488o6095P552279J0719985
41053F945686N474962j711311l650911j634470q66847j432109K43047L580215
41045F948262M240688J756659K63365Q72605k27846m056017n681606k425660O27633
41036B318083j665159o142392o549944l049236J46882L092512Q024731J1348761
41028G524238P201110j172667l570607J649591M147899k066285q381978m686884
41020F44417M769982P562254Q08032o207978n489785J135817O710322O514384
41012A6447445P34700n699785o391094l64165N613959N300075J189140k10582
$$ plain form
41004 16619693 18069877 19276900 17296035 13265892 9762127 6310392 1747941 -1500397
40996 -1500397 -109515 4521287 7430599 6262884 3034704 548444 267250 3199925
40988 3199925 9575323 17144732 21940598 21397391 16256730 10115389 7246512 8835354
40980 8835354 10744009 7695485 577404 -3940647 -2550769 314223 -156502 -2230825
40972 -2230825 -2108110 -698374 -603685 -272600 2601838 5084314 3432737 1159036 4860933
40963 4860933 13005192 16736629 12114434 4274990 -1140289 -3466464 -3126268 82052
40955 82052 3126050 1686278 -1920949 -495750 5816610 7723802 1483660 -3475697
40947 -3475697 1704108 11550165 14567227 9594401 4709201 3654225 3026951 1401758
$$ packed form
41004A6619693J450184J207023j980865m030143l503765l451735m562451l248338
40996a500397J390882M630802K909312j167715l228180k486260k81194K932675
40988C199925O375398P569409M795866n43207n140661o141341k868877J588842
40980H835354J908655l048524p118081m518051J389878K864992m70725k074323
40972b230825J22715J409736R4689L31085K874438K482476j651577k273701L701897
40963D860933Q144259L731437m622195p839444n415279k326175L40196L208320
40955H2052L043998j439772l607227J425199O312360J907192o240142m959357
40947c475697N179805R846057L017062m972826m885200j054976o27274j625193
$$ plain form
40939 1401758 1924521 5195176 7360808 6956745 7355471 10492914 13483786 13682560 12772719
40930 12772719 13436864 15082282 14912345 11245875 4809606 -1518499 -4245427 -2663438
40922 -2663438 -377830 -1165280 -4111883 -5607749 -5072862 -5101345 -6507420 -7131283 -5636409
40913 -5636409 -2954434 176721 3847257 7283335 9692358 12063806 14523766 13387266
40905 13387266 6023605 -2378958 -3514455 2265796 6090163 3985742 2151354 5310942
40897 5310942 8063242 4296531 -1440408 -580178 5425973 7086551 1745257 -2550014
40889 -2550014 523528 7028281 10079214 9843831 11448657 16075039 18950512 15746618
40881 15746618 7906687 1017739 -839215 1279604 2799105 651622 -3651379 -6079880
$$ packed form
40939A401758N22763L270655K165632m04063L98726L137443K990872J98774r09841
40930A2772719O64145J645418j69937l666470o436269o328105k726928J581989
40922b663438K285608p87450k946603j495866N34887k8483j406075o23863J494874
40913e636409K681975L131155L670536L436078K409023K371448K459960j136500
40905A3387266p363661q402563j135497N780251L824367k104421j834388L159588
40897E310942K752300l766711n736939Q60230O006151J660578n341294m295271
40889b550014L073542O504753L050933k35383J604826M626382K875473l203894
40881A5746618p839931o888948j856954K118819J519501k147483m303001k428501
$$ plain form
40873 -6079880 -4321821 623276 5827348 8219355 6340679 2163580 97769 2012401
40865 2012401 4147460 1655616 -4240668 -6847656 -2462975 4512202 6414858 579460
40857 579460 -8515861 -14122769 -13135001 -7974483 -3529417 -2148022 -1902903 -163227 2490916
40848 2490916 3718985 3602278 4387634 6176719 6170312 3100943 -628358 -2704863 -3985333
40839 -3985333 -5836021 -7039713 -6152943 -5055275 -6813110 -10626749 -11846437 -7336417
40831 -7336417 968706 7866705 8936674 3448343 -4978262 -10983218 -12311381 -11492102
40823 -11492102 -11250434 -9785969 -3601215 5814925 12183582 12190624 9434537 8785000 9885539
40814 9885539 9010939 5245809 1537556 360826 1096085 1639608 555673 -2295279 -5447218
$$ packed form
40873f079880J758059M945097N204072K392007j878676m177099k065811J914632
40865B012401K135059k491844n896284k606988M384681O975177J902656n835398
40857E79460r095321n606908R87768N160518M445066J381395K45119J739676K654143
40848B490916J228069j16707P85356J789085o407l069369l729301k076505j280470
40839c985333j850688j203692Q86770J097668j757835l813639j219688M510020
40831g336417Q305123O897999J069969n488331q426605o004956j328163Q19279
40823a1492102K41668J464465O184754R416140O368657P042k756087o49537J100539
40814I885539q74600l765130l708253j176730P35259N43523j083935k850952l151939
$$ plain form
40805 -5447218 -6214101 -3146856 1804184 5096424 5499298 4629685 3821104 2532203 175494
40796 175494 -2528889 -4809855 -6807778 -8501466 -9090590 -8047426 -5436519 -1102689
40788 -1102689 4389410 7920870 6180384 1174203 -150234 5525189 12707391 14040804
40780 14040804 9923641 6621412 6353000 4772192 -1359549 -9120760 -13745456 -14075281
40772 -14075281 -11844380 -8754912 -5977749 -3641478 501294 8572331 17425911 20173145
40764 20173145 15068790 8483190 5909102 4714262 441305 -4164439 -3090620 2560080
40756 2560080 5467901 2767627 -1128715 -2831752 -4169974 -6267747 -5993378 -1758967
40748 -1758967 2303744 2046319 -641515 -1551489 -930545 -2244285 -5946555 -8422694 -6622675
$$ packed form
40805e447218p66883L067245M951040L292240M02874q69613q08581j288901k356709
40796A75494k704383k280966j997923j693688n89124J043164K610907M333830
40788a102689N492099L531460j740486n006181j324437N675423P182202J333413
40780A4040804m117163l302229k68412j580808o131741p761211m624696l29825
40772a4075281K230901L089468K777163K336271M142772Q071037Q853580K747234
40764B0173145n104355o585600k574088j194840m272957m605744J073819N650700
40756B560080K907821k700274l896342j703037j338222k097773K74369M234411
40748a758967M062711k57425k687834r09974O20944j313740l702270k476139J800019
$$ plain form
40739 -6622675 -1197163 4423024 6551669 4191372 856086 1578067 6495994 9574301
40731 9574301 5589718 -3781016 -12725612 -17587483 -18145442 -15495149 -11845403 -10216740
40723 -10216740 -11086180 -11089333 -7788438 -3377241 -703547 1255194 3890884 4246530 -582398
40714 -582398 -6651350 -7293044 -3062552 -939966 -3673727 -6658801 -6250786 -4289749 -2365415
40705 -2365415 1683240 8207033 12500682 11264598 7805612 6830598 8027392 8660384
40697 8660384 8699054 9229071 9166290 7637108 6369029 5778391 2559886 -3976080 -7199573
40688 -7199573 -1215196 9337503 14840637 14286067 15216195 20227815 22217858 15581317
40680 15581317 4574628 -3715310 -8735897 -13572351 -17178223 -15745169 -9895599 -4900955
$$ packed form
40739f622675N425512N620187K128645k360297l335286P21981M917927L078307
40731I574301l984583r370734q944596m861871n57959K650293L649746J628663
40723a0216740q69440l153L300895M411197K673694J958741K635690L55646m828928
40714e82398o068952o41694M230492K122586k733761k985074M08015J961037J924334
40705b365415M048655O523793M293649j236084l458986r75014J196794O32992
40697H660384L8670N30017o2781j529182j268079n90638l218505o535966l223493
40688g199573N984377J0552699N503134n54570R30128N011620J990043o636541
40680A5581317j1006689q289938n020587m836454l605872J433054N849570M994644
$$ plain form
40672 -4900955 -3873563 -4937985 -5480782 -5635430 -6548476 -7890291 -8554966 -8276322 -7334635
40663 -7334635 -5609409 -2930175 97947 2334005 3040531 2324990 915864 -223207
40655 -223207 -308598 785557 2372010 3473644 3483307 2034623 -1469613 -7005191 -12122424
40646 -12122424 -12708651 -7594964 -1476940 -358552 -4012750 -6280194 -3905123 -1297642
40638 -1297642 -3790117 -9390570 -11460314 -7894976 -3068435 -1029072 -1194630 -1507647
40630 -1507647 -1865126 -2683327 -2899436 -1263676 2016106 5684547 7709066 5301877 -2128036
40621 -2128036 -9493554 -9507872 -1671474 5845817 6228350 2624490 2652431 6791544 7891747
40612 7891747 2294021 -4033397 -3098363 4810123 11949047 12773623 9170999 5927535
$$ packed form
40672d900955J027392j064422n42797j54648r13046j341815o64675K78644R41687
40663g334635J725226K679234L028122K236058P06526p15541j409126j139071
40655b23207q5391J094155J586453J101634R663j448684l504236n535578n117233
40646a2122424n86227N113687O118024J118388l654198k267444K375071K607481
40638a297642k492475n600453k069744L565338M826541K039363j65558l13017
40630a507647l57479q18201k16109J635760L279782L668441K024519k407189p429913
40621b128036p365518j4318P836398P517291L82533l603860K7941M139113J100203
40612G891747n597726o327418R35034P908486P138924Q24576l602624l243464
$$ plain form
40604 5927535 4490677 3480745 3229668 6037298 11585241 15427908 13969123 8816377
40596 8816377 4120855 1524973 308152 655318 3104007 5591143 4994266 1658987
40588 1658987 -1304024 -3420110 -7370366 -13155605 -16107652 -12884788 -5968060 68694
40580 68694 3664894 5537318 6141749 6385953 7816795 9643004 8894751 6075179 6379325
40571 6379325 11414851 14126948 7712355 -3509351 -8666561 -4112069 3851810 9043477
40563 9043477 11220895 11570976 9589395 6638300 6648648 10337599 13355206 12755777 10841156
40554 10841156 9870796 7580110 1704714 -4748073 -6989690 -4910540 -2509772 -2642541
40546 -2642541 -5102480 -7990394 -8551444 -4976877 141754 935752 -4146943 -8762662
$$ packed form
40604E927535j436858j009932k51077K807630N547943L842667j458785n152746
40596H816377m695522k595882j216821L47166K448689K487136n96877l335279
40588A658987k963011k116086l950256n785239k952047L222864O916728O036754
40580F8694L596200J872424O04431K44204J430842J826209p48253k819572L04146
40571F379325N035526K712097o414593j1221706n157210M554492P963879N191667
40563I043477K177418L50081j981581k951095J0348L688951L017607n99429j914621
40554A0841156r70360k290686n875396o452787k241617K079150K400768j32769
40546b642541k459939k887914n61050L574567N118631P93998n082695m615719
$$ plain form
40538 -8762662 -6407884 882374 5840119 5648863 3323409 1079086 -1838936 -4820762
40530 -4820762 -5036523 -2275134 -313044 -1931606 -5872563 -9518414 -11103965 -8846808
40522 -8846808 -2229697 4726597 6046505 1537039 -2437444 -2057362 -1101393 -3850739
40514 -3850739 -8102700 -9958939 -10957093 -14102193 -16130459 -11355965 -1897365 3893281
40506 3893281 3716576 4205002 9411826 14147682 13027301 9399475 9078646 10120601 6303430
40497 6303430 -1764920 -6644423 -4826164 -739637 921094 885635 1454045 2200934 2253094
40488 2253094 2695862 3780139 3172385 -22521 -2491452 -1079665 2627227 5136564
40480 5136564 5952031 6325767 5633288 3100928 1253046 2966452 6010974 5256592 239432
$$ packed form
40538h762662K354778P290258M957745j91256k325454k244323k918022k981826
40530d820762k15761K761389J962090j618562l940957l645851j585551K257157
40522h846808O617111O956294J319908m509466l974483L80082R55969k749346
40514c850739m251961j856239r98154l145100k028266M774494R458600N790646
40506C893281j76705M88426N206824M735856j120381l627826l20829J041955l817171
40497F303430q068350m879503J818259M086527J660731l5459N68410P46889N2160
40488B253094M42768J084277o07754l194906k468931J411787L706892K509337
40480E136564Q15467L73736o92479k532360j847882J713406L044522p54382n017160
$$ plain form
40471 239432 -4025973 -4330549 -2996842 -3167216 -4477028 -5302375 -5888513 -7022432 -8160606
40462 -8160606 -8724717 -9005615 -8518752 -6213799 -3636031 -4547236 -9431582 -13805778 -14521036
40453 -14521036 -14183200 -15959148 -17546345 -14998154 -10013893 -8031401 -10270507 -12902187
40445 -12902187 -13570398 -13407606 -12483766 -8969361 -4201104 -3151581 -7269865 -11406309
40437 -11406309 -10997252 -8316285 -7747859 -8177401 -4983511 1943459 6989263 5847950
40429 5847950 308137 -4672897 -6210411 -5022322 -3403519 -2556543 -1570417 711372
40421 711372 2869182 1822668 -2322248 -4629276 -977945 6235698 10851479 10208233
40413 10208233 6612729 2634024 -1231289 -4366198 -5575076 -5707910 -7195133 -9762570
$$ packed form
40471B39432m265405l04576J333707j70374j309812q25347n86138j133919j138174
40462h160606n64111k80898M86863K304953K577768r11205m884346m374196p15258
40453a4521036L37836j775948j587197K548191M984261J982492k239106k631680
40445a2902187o68211J62792R23840L514405M768257J049523m118284m136444
40437a1406309M09057K680967N68426m29542L193890O926970N045804j141313
40429E847950n539813m981034j537514J188089J618803Q46976R86126K281789
40421G11372K157810j046514m144916k307028L651331P213643M615781o43246
40413A0208233l595504l978705l865313l134909j208878j32834j487223k567437
$$ plain form
40405 -9762570 -10037493 -7028955 -4574038 -5957127 -9020019 -9483510 -6837901 -3836836
40397 -3836836 -1802599 357641 3286588 6023033 7319860 6362510 3084156 -888875
40389 -888875 -3400391 -5334087 -10016496 -16516077 -17575220 -9219692 867332 1627760
40381 1627760 -6138172 -10897698 -7298584 -3132645 -6042377 -11528175 -10399077 -2244336
40373 -2244336 5776790 9785271 11458014 11732314 9632715 6764242 6289230 7118197 5103070
40364 5103070 663550 -666142 3317602 8035978 9160643 8035629 7478888 6737389
40356 6737389 3906478 -82124 -2994413 -4170804 -3716457 -1952178 -1584688 -6233403
40348 -6233403 -13844154 -16091858 -8792140 945599 3428264 -707883 -2596210 1603424
$$ packed form
40405i762570k74923L008538K454917j383089l062892m63491K645609L001065
40397c836836K034237K160240K928947K736445J296827r57350l278354l973031
40389h88875k511516j933696m682409o499581j059143Q355528J0087024P60428
40381A627760p765932m759526L599114M165939k909732n485798J129098Q154741
40373b244336Q021126M008481J672743K74300k099599k868473m75012Q28967k015127
40364E103070m439520j329692L983744M718376J124665j125014n56741p41499
40356F737389k830911l988602k912289j176391M54347J764279L67490m648715
40348f233403p610751k247704P299718R737739K482665m136147j888327M199634
$$ plain form
40340 1603424 6570693 7042043 4320890 1712222 -669740 -3443458 -4869211 -3924821
40332 -3924821 -3315660 -5677205 -8787506 -8044629 -2605882 3974889 8719400 12096210
$$ packed form
40340A603424M967269M71350k721153k608668k381962k773718j425753R44390
40332c924821O09161k361545l110301P42877N438747O580771M744511L376810
$$ [...]
##END NTUPLES=NMR SPECTRUM
##END=
