##TITLE=31Pdec_IBPA1609
 CDCl3, 24 sc
 17.9.2019
##JCAMPDX= 6.0         $$ Bruker NMR JCAMP-DX V2.0
##DATA TYPE= NMR SPECTRUM
##DATA CLASS= NTUPLES
##ORIGIN= UXNMR, Bruker Analytische Messtechnik GmbH
##OWNER= root
$$ XWIN-NMR		Version 3.5
$$ Tue Sep 17 14:20:36 2019 Russian Standard Time (UT+4h)  she@DPX200
##.OBSERVE FREQUENCY= 81.013821
##.OBSERVE NUCLEUS= ^31P
##.ACQUISITION MODE= SIMULTANEOUS
##.ACQUISITION SCHEME= undefined
##.AVERAGES= 24
##.DIGITISER RES= 17
##SPECTROMETER/DATA SYSTEM= spect
##.PULSE SEQUENCE= zgpg30
##.SOLVENT NAME= CDCl3
##.SHIFT REFERENCE= (INTERNAL, CDCl3, 0, 182.463)
##AUDIT TRAIL= $$ (NUMBER, WHEN, WHO, WHERE, WHAT)
$$ ##TITLE= Audit trail, XWIN-NMR		Version 3.5
$$ ##JCAMPDX= 5.01
$$ ##ORIGIN= Bruker BioSpin GmbH
$$ ##OWNER= she
$$ F:/spectra/data/she/nmr/P31/1/pdata/1/auditp.txt
$$ ##AUDIT TRAIL=  $$ (NUMBER, WHEN, WHO, WHERE, WHAT)
(   1,<2019-09-17 14:19:46.18 +0400>,<she>,<DPX200>,
      <created by zg, POWCHK disabled, PULCHK disabled
       configuration hash MD5:
       00 E9 B6 7A A2 85 ED C7 34 08 36 98 17 FE 4E 26
       data hash MD5: 32K
       F0 A8 2E A2 80 91 AA A7 88 26 28 13 4C DA 92 C9>)
(   2,<2019-09-17 14:19:48.37 +0400>,<she>,<DPX200>,
      <Start of raw data processing
       efp BC_mod = 2 LB = 1 FT_mod = 6 PKNL = 1 PHC0 = -470.9523 PHC1 = 287.8003 SI = 64K 
       data hash MD5: 64K
       91 76 51 C2 C7 80 39 43 6F D2 16 D6 CC 1F 16 BC>)
(   3,<2019-09-17 14:20:08.65 +0400>,<she>,<DPX200>,
      <pk PHC0 = 71.82217 PHC1 = -180.6 
       data hash MD5: 64K
       FC 2E 45 6A E1 5B AC 15 80 98 3B BA BA 00 54 46>)
$$ ##END=
$$ 
$$ hash MD5
$$ 88 5D 0B CE 49 17 54 9B 61 56 A7 D8 7D 49 CD 4A
##$RELAX= 
##$RELAX= 
##$RELAX= 
##$RELAX= 
##$RELAX= 
##$RELAX= 
##$RELAX= 
##$RELAX= 
$$ Bruker specific parameters
$$ --------------------------
##$DU= <F:/spectra>
##$EXPNO= 1
##$NAME= <P31>
##$PROCNO= 1
##$TYPE= <nmr>
##$USER= <she>
##$AMP= (0..31)
100 100 100 100 100 100 100 100 100 100 100 100 100 100 100 100 100 100 
100 100 100 100 100 100 100 100 100 100 100 100 100 100 
##$AQSEQ= 0
##$AQ_mod= 1
##$AUNM= <au_zg>
##$AUTOPOS= <>
##$BF1= 81.014009
##$BF2= 200.13
##$BF3= 200.13
##$BF4= 200.13
##$BF5= 200.13
##$BF6= 200.13
##$BF7= 200.13
##$BF8= 200.13
##$BYTORDA= 1
##$CFDGTYP= 0
##$CFRGTYP= 5
##$CHEMSTR= <none>
##$CNST= (0..31)
1 1 145 1 1 1 1 1 1 1 1 1 1 1 1 1 1 1 1 1 1 1 1 1 1 1 1 1 1 1 1 1 
##$CPDPRG= <waltz16>
##$CPDPRG1= <>
##$CPDPRG2= <waltz16>
##$CPDPRG3= <>
##$CPDPRG4= <mlev>
##$CPDPRG5= <mlev>
##$CPDPRG6= <mlev>
##$CPDPRG7= <mlev>
##$CPDPRG8= <mlev>
##$CPDPRGB= <>
##$CPDPRGT= <>
##$D= (0..31)
0 1 0 0 0 0 0 0 0 0 0 0.03 2e-05 3e-06 0 0 0 0 0 0 0 0 0 0 0 0 0 0 0 0 
0 0 
##$DATE= 1568715585
##$DBL= (0..7)
120 120 120 11 120 120 24 19 
##$DBP= (0..7)
150 150 150 150 150 150 150 150 
##$DBP07= 0
##$DBPNAM0= <>
##$DBPNAM1= <>
##$DBPNAM2= <>
##$DBPNAM3= <>
##$DBPNAM4= <>
##$DBPNAM5= <>
##$DBPNAM6= <>
##$DBPNAM7= <>
##$DBPOAL= (0..7)
0.5 0.5 0.5 0.5 0.5 0.5 0.5 0.5 
##$DBPOFFS= (0..7)
$$ [...]
##$SUBNAM2= <"">
##$SUBNAM3= <"">
##$SUBNAM4= <"">
##$SUBNAM5= <"">
##$SUBNAM6= <"">
##$SUBNAM7= <"">
##$SUBNAM8= <"">
##$SUBNAM9= <"">
##$SW= 369.568048894756
##$SWIBOX= (0..15)
0 1 3 0 0 0 0 0 0 0 0 0 0 0 0 0 
##$SW_h= 29940.119760479
##$TD= 32768
##$TD0= 1
##$TE= 0
##$TE2= 300
##$TE3= 300
##$TEG= 300
##$TL= (0..7)
0 120 53 12 22 120 120 120 
##$TP= (0..7)
150 150 150 150 150 150 150 150 
##$TP07= 0
##$TPNAME0= <>
##$TPNAME1= <>
##$TPNAME2= <>
##$TPNAME3= <>
##$TPNAME4= <>
##$TPNAME5= <>
##$TPNAME6= <>
##$TPNAME7= <>
##$TPOAL= (0..7)
0.5 0.5 0.5 0.5 0.5 0.5 0.5 0.5 
##$TPOFFS= (0..7)
0 0 0 0 0 0 0 0 
##$TUNHIN= 0
##$TUNHOUT= 0
##$TUNXOUT= 0
##$USERA1= <user>
##$USERA2= <user>
##$USERA3= <user>
##$USERA4= <user>
##$USERA5= <user>
##$V9= 5
##$VALIST= <valist>
##$VCLIST= <CCCCCCCCCCCCCCC>
##$VD= 0
##$VDLIST= <DDDDDDDDDDDDDDD>
##$VPLIST= <PPPPPPPPPPPPPPP>
##$VTLIST= <TTTTTTTTTTTTTTT>
##$WBST= 1024
##$WBSW= 4
##$XGAIN= (0..3)
0 0 0 0 
##$XL= 0
##$YL= 0
##$YMAX_a= 14801
##$YMIN_a= -17828
##$ZGOPTNS= <>
##$ZL1= 120
##$ZL2= 120
##$ZL3= 120
##$ZL4= 120
##$ABSF1= 0
##$ABSF2= 0
##$ABSG= 0
##$ABSL= 0
##$ALPHA= 0
##$AQORDER= 0
##$ASSFAC= 0
##$ASSFACI= 0
##$ASSFACX= 0
##$ASSWID= 0
##$AUNMP= <proc_1d>
##$AZFE= 0.1
##$AZFW= 0.5
##$BCFW= 0
##$BC_mod= 2
##$BYTORDP= 0
##$COROFFS= 0
##$CY= -3
##$DATMOD= 1
##$DC= 0
##$DFILT= <>
##$DTYPP= 0
##$F1P= 0
##$F2P= 0
##$FCOR= 1
##$FTSIZE= 65536
##$FT_mod= 6
##$GAMMA= 0
##$GB= 0
##$INTBC= 1
##$INTSCL= 5.30512e-09
##$ISEN= 30
##$LB= 1
##$LEV0= 0
##$LPBIN= 0
##$MAXI= 10000
##$MC2= 0
##$MEAN= 0
##$ME_mod= 0
##$MI= 50
##$NCOEF= 0
##$NC_proc= -9
##$NLEV= 6
##$NOISF1= 182.463
##$NOISF2= 159.3651
##$NSP= 0
##$NTH_PI= 0
##$NZP= 0
##$OFFSET= 182.463
##$PC= 4
##$PHC0= -399.1301
##$PHC1= 107.2003
##$PH_mod= 1
##$PKNL= yes
##$PPARMOD= 0
##$PSCAL= 0
##$PSIGN= 0
##$REVERSE= no
##$SF= 81.0140089999434
##$SI= 65536
##$SIGF1= 159.3651
##$SIGF2= -187.1042
##$SINO= 113.3802
##$SIOLD= 16384
##$SREGLST= <1H.CDCl3>
##$SSB= 0
##$STSI= 65536
##$STSR= 0
##$SW_p= 29940.119760479
##$SYMM= 0
##$S_DEV= 0
##$TDeff= 32768
##$TDoff= 0
##$TI= <>
##$TILT= no
##$TM1= 0
##$TM2= 0
##$TOPLEV= 0
##$USERP1= <user>
##$USERP2= <user>
##$USERP3= <user>
##$USERP4= <user>
##$USERP5= <user>
##$WDW= 1
##$XDIM= 65536
##$YMAX_p= 466931540
##$YMIN_p= -335317328
$$ End of Bruker specific parameters
$$ ---------------------------------
##NTUPLES= NMR SPECTRUM
##VAR_NAME=  FREQUENCY,     SPECTRUM/REAL,   SPECTRUM/IMAG
##SYMBOL=    X,             R,               I
##VAR_TYPE=  INDEPENDENT,   DEPENDENT,       DEPENDENT
##VAR_FORM=  AFFN,          ASDF,            ASDF
##VAR_DIM=   65536,         65536,           65536
##UNITS=     HZ,            ARBITRARY UNITS, ARBITRARY UNITS
##FACTOR=    0.456856943014862, 1,           1
##FIRST=     14782.0589164792, 0,            0
##LAST=      -15158.0608439998, 0,           0
##MIN=       -15158.0608439998, -335317328,  0
##MAX=       14782.0589164792, 466931540,    0
$$ Real data points
##PAGE= N=1
##DATA TABLE= (X++(R..R)), XYDATA
$$ [...]
$$ plain form
40270 31837060 25764267 11801816 1355076 -1299406 -348298 -1410710 -3557091 -693775
40262 -693775 8009813 14184833 11267432 4615654 3951423 9605357 14361233 15950441
40254 15950441 18109756 20548855 18215712 11356516 6795091 7601858 10039429 11509534
40246 11509534 12076769 8018697 -3737432 -12936937 -3148309 21842911 34124534 15521252
40238 15521252 -17138518 -34154831 -29516686 -18997068 -10497994 2727539 21156479
40231 21156479 32327059 30009545 23823890 23331850 26083576 28139241 33109743 41594111
40223 41594111 43500700 32783028 21226279 24631203 40820058 54536769 61045247
40216 61045247 70787212 89819132 109010937 117922268 119483127 123298402 129990693 129903020
$$ packed form
40270C1837060o072793j3962451j0446740k654482R51108j062412k146381K863316
40262f93775Q703588O175020k917401o651778o64231N653934M755876J589208
40254A5950441K159315K439099k333143o859196m561425Q06767K437571J470105
40246A1509534N67235m058072j1756129r199505R788628K4991220J2281623j8603282
40238A5521252l2659770j7016313M638145J0519618Q499074J3225533J8428940
40231B1156479J1170580k317514o185655m92040K751726K055665M970502Q484368
40223D1594111J906589j0717672j1556749L404924J6188855J3716711O508478
40216F1045247R741965J9031920J9191805Q911331J560859L815275O692291q7673
$$ plain form
40208 129903020 115785642 91306404 66762122 49625065 40038020 33789240 28104939
40201 28104939 23472881 19988298 14905793 6703446 -571916 -1648144 2000337 3947130
40193 3947130 3047765 5351897 12982810 17726822 11649113 -243951 -5194109 1297976
40185 1297976 11745193 18541195 22034142 24859849 25193748 20181707 11826166 4792552
40177 4792552 794253 -1169182 -1499786 -1004207 -3060376 -9922317 -17675062 -19417551
40169 -19417551 -13269334 -3135747 7557146 17064732 20297218 10935021 -7120708 -17778697
40161 -17778697 -10394983 4429680 6082410 -9577500 -24516654 -21785311 -5524704
40154 -5524704 7523631 8653680 1276272 -9579785 -20453705 -23884676 -12329278 8549104
$$ packed form
40208A29903020j4117378k4479238k4544282j7137057r587045o248780n684301
40201B8104939m632058l484583n082505q202347p275362j076228L648481J946793
40193C947130q99365K304132P630913M744012o077709j1893064m950158O492085
40185A297976J0447217O796002L492947K825707L33899n012041q355541p033614
40177D792552l998299j963435l30604M95579k056169o861941p752745j742489
40169a9417551O148217J0133587J0692893R507586L232486r362197j8055729j0657989
40161a7778697P383714J4824663J652730j5659910j4939154K731343J6260607
40154e524704J3048335J130049p377408j0856057j0873920l430971J1555398K0878382
$$ plain form
40146 8549104 20711438 14572468 1647340 -1312068 5213974 6763079 -2750357 -13537130
40138 -13537130 -15893102 -12896710 -12101893 -12396862 -6559944 6584981 19212828 23240010
40130 23240010 17915944 8586686 406227 -6189259 -13975932 -22386675 -24453622 -14595714
40122 -14595714 1134301 9041531 3937059 -5445162 -10542599 -14529364 -23104424 -31106907
40114 -31106907 -28953749 -18814355 -12988241 -16715782 -23147308 -25934443 -25883948 -23210432
40106 -23210432 -15281642 -6968441 -11132802 -30031209 -45913543 -41206051 -21452498 -6734313
40098 -6734313 -5362697 -8790815 -9469011 -9101201 -8284904 -2246528 8568194 15862788
40090 15862788 17465993 22555197 34929477 41938350 31671746 13302363 6653799 15901359
$$ packed form
40146H549104J2162334o138970j2925128k959408O526042J549105r513436j0786773
40138a3537130k355972K996392P94817k94969N836918J3144925J2627847M027182
40130B3240010n324066r329258q180459o595486p786673q410743k066947R857908
40122a4595714J5730015P907230n104472r382221n097437l986765q575060q002483
40114c1106907K153158J0139394N826114l727541o431526k787135N0495K673516
40106b3210432P928790Q313201m164361j8898407j5882334M707492J9753553J4718185
40098f734313J371616l428118o78196L67810Q16297O038376J0814722P294594
40090A5862788J603205N089204J2374280P008873j0266604j8369383o648564R247560
$$ plain form
40082 15901359 27942996 35003953 42734793 53093853 55439109 43416135 28400857
40075 28400857 24523454 28442310 26312631 15666454 7466154 8525058 14313361 19225890
40067 19225890 21991200 19454719 7704223 -6287275 -6459695 11358580 30495212 34485347
40059 34485347 27896381 24930938 25438589 17737624 2020767 -6132068 1447078 13728905
40051 13728905 17892937 16860028 20761855 29397664 33361085 28592880 21543299 22016926
40043 22016926 36415633 64118141 93883330 107812917 97421807 74058922 55693780
40036 55693780 45649182 34063306 19089773 13240307 23684465 37680148 37105984
40029 37105984 20904431 3244922 -6618108 -11955500 -16942592 -18526520 -13785877 -7529952
$$ packed form
40082A5901359J2041637P060957P730840J0359060K345256j2022974j5015278
40075B8400857l877403L918856k129679j0646177q200300J058904N788303M912529
40067A9225890K765310k536481j1750496j3991498j72420J7818275J9136632L990135
40059C4485347o588966k965443N07651p700965j5716857q152835P579146J2281827
40051A3728905M164032j032909L901827Q635809L963421m768205p049581M73627
40043B2016926J4398707K7702508K9765189J3929587j0391110k3362885j8365142
40036E5693780j0044598j1585876j4973533n849466J0444158J3995683n74164
40029C7105984j6201553j7659509r863030n337392m987092j583928M740643O255925
$$ plain form
40021 -7529952 -6540192 -10188699 -12103273 -9392756 -6145054 -8410595 -18116606 -30718999
40013 -30718999 -36911962 -28872045 -8004399 14746361 29044719 34153736 35170294 33303044
40005 33303044 25513135 12818515 2123844 -2258456 -3596010 -6395098 -9559324 -9403765
39997 -9403765 -5707883 -446644 6823685 17511519 29116777 36287553 36937880 34109071
39989 34109071 31318197 28492053 23322667 15595462 9789909 12745117 26630261 43891327
39981 43891327 52260206 46369412 31764498 16459923 2935844 -9035607 -16902329
39974 -16902329 -17972145 -14600330 -11847925 -11931791 -14421084 -18378220 -20162251 -13898819
39966 -13898819 -301579 9393719 5782631 -6238154 -15465663 -20349248 -26046602 -28880978
$$ packed form
40021g529952R89760l648507j914574K710517L247702k265541r706011j2602393
40013c0718999o192963Q039917K0867646K2750760J4298358N109017J016558j867250
40005C3303044p789909j2694620j0694671m382300j337554k799088l164226J55559
39997i403765L695882N261239P270329J0687834J1605258P170776O50327k828809
39989C4109071k790874k826144n169386p727205n805553K955208J3885144J7261066
39981D3891327Q368879n890794j4604914j5304575j3524079j1971451p866722
39974a6902329j069816L371815K752405q3866k489293l957136j784031O263432
39966a3898819J3597240R695298l611088j2020785r227509m883585n697354k834376
$$ plain form
39958 -28880978 -18156872 4794441 22689716 22337379 8533609 -6177655 -15447270
39951 -15447270 -18038664 -13256700 -4570712 -51758 -2851097 -7496956 -9467224 -10313837
39943 -10313837 -9978344 -4844302 1562620 -1531941 -13943729 -19222848 -7774160 7609082
39935 7609082 11990835 11007370 16830105 23109768 14965920 -3275614 -13252841 -12605293
39927 -12605293 -16619616 -29197385 -35879301 -30768705 -27187139 -31918632 -30262490 -11150320
39919 -11150320 10147330 11952310 -2853638 -13291489 -10222087 -3219241 -1889037 -6045836
39911 -6045836 -13381257 -22984704 -29612220 -25643438 -12132192 -425325 153311 -8395693
39903 -8395693 -16599743 -16639202 -8119904 957277 -152830 -13773525 -28846482 -31172545
$$ packed form
39958b8880978J0724106K2951313J7895275l52337j3803770j4711264r269615
39951a5447270k591394M781964Q685988M518954k799339m645859j970268q46613
39943a0313837L35493N134042O406922l094561j2411788n279119J1448688J5383242
39935G609082M381753r83465N822735O279663q143848j8241534r977227O47548
39927a2605293m014323j2577769o681916N110596L581566m731493J656142J9112170
39919a1150320K1297650J804980j4805948j0437851L069402P002846J330204m156799
39911f045836p335421r603447o627516L968782J3511246J1706867N78636q549004
39903h395693q204050l9459Q519298R077181j110107j3620695j5072957k326063
$$ plain form
39895 -31172545 -17932152 1256226 15608368 20927280 18112221 10159271 1422884 -4424618
39887 -4424618 -6863632 -6812768 -3395041 4331929 13086505 16524238 11564449 1994717
39879 1994717 -4008615 509098 15496865 31586193 36297772 25762924 8561205 -4257914
39871 -4257914 -9941049 -12089426 -12406288 -9857924 -5170622 135848 7619284 18300046
39863 18300046 26056406 22321681 9000085 -304550 4444508 18414857 29693223 33393817
39855 33393817 32423764 28007442 17837903 4337704 -3243497 -13879 6102151 3855897
39847 3855897 -5516993 -10017856 -5109093 -895330 -5893641 -12091140 -6202202 8718728
39839 8718728 15238588 5246680 -10307560 -18844843 -21915393 -26503244 -30129957 -25214018
$$ packed form
39895c1172545J3240393J9188378J4352142N318912k815059p952950q736387n847502
39887d424618k439014N0864L417727P726970Q754576L437733m959789r569732
39879A994717o003332M517713J4987767J6089328M711579j0534848j7201719j2819119
39871d257914n683135k148377l16862K548364M687302N306470P483436J0680762
39863A8300046P756360l734725j3321596r304635M749058J3970349J1278366L700594
39855C3393817r70053m416322j0169539j3500199p581201L229618O116030k246254
39847C855897r372890m500863M908763M213763m998311o197499N888938J4920930
39839H718728O519860r991908j5554240q537283l070550m587851l626713M915939
$$ plain form
39831 -25214018 -13297299 -4160629 -2145036 -2579888 -1928129 -2602087 -5242443 -4004115
39823 -4004115 5096404 15544441 16370436 6394033 -2594847 702139 13109280 20308079
39815 20308079 13898546 587852 -7910734 -9531386 -11166165 -16185436 -19578648 -15293975
39807 -15293975 -2210855 17259454 37829566 50082131 46552667 31877393 20020888
39800 20020888 18231246 20158225 17864845 13346603 13553412 20165388 28917473 33960160
39792 33960160 30135923 17728269 7466694 11687034 26375657 32335556 20278220
39785 20278220 3848717 -335104 5626582 9347810 7013679 961384 -11177742 -29186126
39777 -29186126 -40167163 -33014401 -17462689 -11440416 -14394467 -12249212 -5078064 -7325072
$$ packed form
39831b5214018J1916719R136670K015593m34852O51759o73958k640356J238328
39823d004115R100519J0448037Q25995r976403q988880L296986J2407141P198799
39815B0308079o409533j3310694q498586j620652j634779n019271l393212M284673
39807a5293975J3083120J9470309K0570112J2252565l529464j4675274j1856505
39800B0020888j789642J926979k293380m518242K06809O611976Q752085N042687
39792C3960160l824237j2407654j0261575M220340J4688623N959899j2057336
39785B0278220j6429503m183821N961686L721228k334131o052295j2139126j8008384
39777b9186126j0981037P152762J5551712O022273k954051K145255P171148k247008
$$ plain form
39769 -7325072 -19677952 -24046371 -12495036 353748 3078348 5757376 19592279 35024050
39761 35024050 36298674 26065003 18757623 16903995 10399660 -3358623 -12769363 -7009982
39753 -7009982 10928800 27700989 31380566 20266590 3523553 -7615932 -10338590
39746 -10338590 -9608333 -8275113 -4125488 3174201 10301028 16867142 25130928 31391875
39738 31391875 27909161 16673303 10290443 14146579 18528282 14488883 6453078 1678562
39730 1678562 -1676741 -6812458 -8727835 -2566947 6983883 13964398 19918425 25440067
39722 25440067 23936146 15140373 13027381 25388803 36297128 27251731 7635166 2868565
39714 2868565 16051307 23762074 11454881 -7759853 -15043693 -8974634 394225 6117473
$$ packed form
39769g325072j2352880m368419J1551335J2848784K724600K679028J3834903J5431771
39761C5024050J274624j0233671p307380j853628o504335j3758283r410740N759381
39753g009982J7938782J6772189L679577j1113976j6743037j1139485k722658
39746a0338590P30257J333220M149625P299689P126827O566114Q263786O260947
39738C1391875l482714j1235858o382860L856136M381703m039399q035805m774516
39730A678562l355303n135717j915377O160888R550830O980515N954027N521642
39722B5440067j503921q795773k112992J2361422J0908325r045397j9616565m766601
39714B868565J3182742P710767j2307193j9214734p283840O069059R368859N723248
$$ plain form
39706 6117473 5325625 -2427924 -10621458 -10012731 -3580317 -6448693 -24016144 -40826108
39698 -40826108 -39875474 -24037522 -8987087 -2542110 -1483174 -3175396 -8478005 -14455898
39690 -14455898 -14240999 -5905248 4780001 12031201 16143842 20557221 26147958 30355519
39682 30355519 30622981 27287061 23105997 20793075 21861897 26979418 34664032 39408919
39674 39408919 35467670 24797072 16628067 15519238 14998097 8548642 1572532 4349280
39666 4349280 16853163 29749315 37887553 42572441 41935783 31180282 14295626 4279267
39658 4279267 7379210 15818888 20008779 19674425 18866347 18109895 16295047 13380264 7360431
39649 7360431 -3861640 -13954248 -10943654 5571776 19396967 18216337 10970658 14642355
$$ packed form
39706F117473p91848p753549q193534O08727O432414k868376j7567451j6809964
39698d0826108R50634J5837952J5050435O444977J058936j692222n302609n977893
39690a4455898K14899Q335751J0685249P251200M112641M413379N590737M207561
39682C0355519K67462l335920m181064k312922J068822N117521P684614M744887
39674C9408919l941249j0670598q169005j108829n21141o449455o976110K776748
39666D349280J2503883J2896152Q138238M684888o36658j0755501j6884656j0016359
39658D279267L099943Q439678M189891l34354q08078p56452j814848k914783o019833
39649G360431j1222071j0092608L010594J6515430J3825191j180630p245679L671697
$$ plain form
39641 14642355 29976455 42224644 42814575 37847193 34712986 31877930 26091403 21058694
39633 21058694 22420775 28485278 32102152 30244639 26404376 23059672 17053163 6081837
39625 6081837 -3876308 -4183682 3749738 8881242 6068311 3219696 8032964 16147752
39617 16147752 20589708 24512623 32720331 37827057 30722020 20594137 25906931 45687126
39609 45687126 59495426 58904806 58043500 66191858 72166663 68096851 67352546 81047614
39601 81047614 94652563 89444041 73127088 65304761 63388028 50013395 28651734
39594 28651734 22568322 36373181 45511273 31676318 6631258 -8593013 -9337414 -2007009
39586 -2007009 9799856 21868707 25853551 21232283 19691663 26944411 31199082 21059004
$$ packed form
39641A4642355J5334100J2248189N89931m967382l134207k835056n786527n032709
39633B1058694J362081O064503L616874j857513l840263l344704o006509j0971326
39625F081837r958145l07374P933420N131504k812931k848615M813268Q114788
39617A6147752M441956L922915Q207708N106726p105037j0127883N312794J9780195
39609D5687126J3808300n90620q61306Q148358N974805m069812p44305J3695068
39601H1047614J3604949n208522j6316953p822327j916733j3374633k1361661
39594B8651734o083412J3804859R138092j3834955k5045060j5224271p44401P330405
39586b007009J1806865J2068851L984844m621268j540620P252748M254671j0140078
$$ plain form
39578 21059004 4484411 -2958858 -475213 685662 -3824200 -8702650 -11576230 -15571102
39570 -15571102 -20160731 -19694834 -11513850 1315353 14464019 24464444 29361210 32026052
39562 32026052 37926942 44394521 39444013 19164745 -1460488 -5604987 4213754 13573661
39554 13573661 17682204 20772824 19769212 7018076 -11777931 -20810565 -17214023 -13243883
39546 -13243883 -12868594 -6111359 7021183 8563155 -8663282 -23272804 -14009404 8106745
39538 8106745 16466044 7725869 2270366 10943117 23027265 27088977 24181233 17908055
39530 17908055 8928029 3035178 8200149 18785302 18858824 7340015 3213516 16634436
39522 16634436 30969663 26681646 9891975 1443790 6800253 13504558 13118861 9147379
$$ packed form
39578B1059004j6574593p443269K483645J160875m509862m878450k873580l994872
39570a5571102m589629M65897Q180984J2829203J3148666J0000425M896766K664842
39562C2026052N900890O467579m950508k0279268k0625233m144499R818741R359907
39554A3573661M108543L090620j003612j2751136j8796007r032634L596542L970140
39546a3243883L75289O757235J3132542J541972j7226437j4609522R263400K2116149
39538H106745Q359299q740175n455503Q672751J2084148M061712k907744o273178
39530A7908055q980026n892851N164971J0585153P3522j1518809m126499J3420920
39522A6634436J4335227m288017j6789671q448185N356463O704305l85697l971482
$$ plain form
39514 9147379 4887171 -1738985 -10354397 -16980697 -21358672 -24936716 -22265524 -6731249
39506 -6731249 14173521 22571666 13285535 1449080 1361253 8337912 9194546 1935952
39498 1935952 -4582381 -5238722 -3364015 -3051373 -4583967 -7170377 -10189742 -11016555 -5887465
39489 -5887465 5668274 19212772 28804224 31400728 28497058 23978165 19768534 14060279
39481 14060279 5342039 -2846996 -4382407 1657203 8204424 6616873 -4418513 -16090852
39473 -16090852 -16523870 -4134373 6364317 -1617077 -23547385 -34922042 -22707873
39466 -22707873 -5224943 -7596883 -25873954 -34228988 -24180061 -14255068 -17251176 -20605590
39458 -20605590 -9995475 6822083 15041125 17007699 23714979 32057702 29343060 15994667
$$ packed form
39514I147379m260208o626156q615412o626300m377975l578044K671192J5534275
39506f731249K0904770Q398145r286131j1836455q7827O976659Q56634p258594
39498A935952o518333o56341J874707L12642j532594k586410l019365q26813N129090
39489e887465J1555739J3544498R591452K596504k903670m518893m209631n708255
39481A4060279q718240q189035j535411O039610O547221j587551j1035386j1672339
39473a6090852m33018J2389497J0498690p981394k1930308j1374657J2214169
39466b2707873J7482930k371940j8277071q355034J0048927R924993k996108l354414
39458b0605590J0610115J6817558Q219042J966574O707280Q342723k714642j3348393
$$ plain form
39450 15994667 6791295 10104053 19164226 24030465 21494570 13617498 5981905 6278258
39442 6278258 15723611 23847396 20773244 11830628 9857628 15887587 19293096 15616598
39434 15616598 11333161 9928046 5889693 -3768908 -12463372 -13433252 -8704430 -4549721
39426 -4549721 -3588944 -4079229 -2485088 4150078 13846224 18466060 12375371 976893
39418 976893 -5339195 -3372787 3563750 14498324 29019029 39451938 36883537 24983151
39410 24983151 16516020 15494634 14098593 8155700 3274742 3019175 3167345 1682560
39402 1682560 3033432 7999510 9916420 6242324 4034925 8794474 17008864 24174919
39394 24174919 30518658 34302511 29959862 18433701 9295695 6888967 4464315 -2284405
$$ packed form
39450A5994667r203372L312758R060173M866239k535895p877072p635593K96353
39442F278258R445353Q123785l074152q942616j973000O029959L405509l676498
39434A5616598m283437j405115m038353r658601q694464r69880M728822M154709
39426d549721R60777m90285J594141O635166R696146M619836o090689j1398478
39418I76893o316088J966408O936537J0934574J4520705J0432909k568401j1900386
39410B4983151q467131j021386j396041n942893m880958k55567J48170j484785
39402A682560J350872M966078J916910l674096k207399M759549Q214390P166055
39394B4174919O343739L783853m342649j1526161r138006k406728k424652o748720
$$ plain form
39386 -2284405 -6896063 -3917171 2413552 8630055 18805672 31428531 32298227 13553299
39378 13553299 -10302100 -19547297 -14623371 -10103387 -10136667 -6175564 3888126 10392454
39370 10392454 7037071 -888442 -5748876 -6180497 -4958653 -5164613 -9070593 -15518074
39362 -15518074 -19107340 -16142456 -9047542 -1649656 5115335 9360004 7608045 3092635
39354 3092635 5521351 15576958 20286896 13226891 7168527 13134369 19028947 7857863
39346 7857863 -11760531 -15731180 -1188710 10332176 7174397 1897935 5975025 11505147
39338 11505147 8097695 1030942 858731 7062892 12577029 15185765 15653738 12561754
39330 12561754 6125745 -119404 -6093961 -14799569 -21634865 -16112916 -321939 7225511
$$ packed form
39386b284405m611658K978892O330723O216503J0175617J2622859Q69696j8744928
39378A3553299k3855399r245197M923926M519984l3280L961103J0063690O504328
39370A0392454l355383p925513m860434m31621J221844k05960l905980o447481
39362a5518074l589266K964884P094914P397886O764991M244669j751959m515410
39354C092635K428716J0055607M709938p060005o058364N965842N894578j1171084
39346G857863j9618394l970649J4542470J1520886l157779n276462M077090N530122
39338A1505147l407452p066753j72211O204161N514137K608736M67973l091984
39330A2561754o436009o245149n974557q705608o835296N521949J5790977P547450
$$ plain form
39322 7225511 -4327646 -21276649 -23673435 -11743721 -2073688 -3779417 -10316050 -11334113
39314 -11334113 -2653080 12909098 26377307 26996220 12943445 -4965232 -15511531
39307 -15511531 -18298817 -17631299 -12806676 -3125408 4260007 2625044 -2339028 248802
39299 248802 10164897 17817409 19835239 21072741 21806516 15665711 2837316 -5983534
39291 -5983534 -3689869 3725586 6753248 4549048 2557635 3768206 7509987 12333974
39283 12333974 14905231 9756320 -4155789 -18571736 -22880743 -15801908 -6406415 -3309523
39275 -3309523 -5767509 -5960175 2298048 17849592 33060481 39170066 32538001 17574678
39267 17574678 2871784 -6999307 -14733315 -23473087 -29318232 -26347302 -18780812 -19284957
$$ packed form
39322G225511j1553157j6949003k396786J1929714R670033j705729o536633j018063
39314a1334113Q681033J5562178J3468209O18913j4052775j7908677j0546299
39307a5511531k787286O67518M824623R681268P385415j634963m964072K587830
39299B48802R916095P652512K017830J237502P33775o140805j2828395q820850
39291e983534K293665P415455L027662k204200j991413J210571L741781M823987
39283A2333974K571257n148911j3912109j4415947m309007P078835R395493L096892
39275c309523k457986j92666Q258223J5551544J5210889O109585o632065j4963323
39267A7574678j4702894r871091p734008q739772n845145K970930P566490n04145
$$ plain form
39259 -19284957 -30059309 -34015470 -15608898 13571650 23835285 4343989 -21349715
39252 -21349715 -23583555 -1332215 20525792 23160645 12241641 4625270 5779081 5848307
39244 5848307 -4202046 -18124113 -20737479 -8637795 2571808 -1971423 -15027257
39237 -15027257 -16711633 -3288839 7365522 1541803 -13537859 -24858847 -30645484
39230 -30645484 -31718238 -20131689 7026147 32024460 34166113 19358778 13027932
39223 13027932 23720324 32966765 25465664 10843330 6049719 10982715 14353694 13788338
39215 13788338 16058767 22151088 25158798 22466403 19670453 20717619 21949702 18865612
39207 18865612 13268833 9979414 9713085 9301902 8003796 9443918 15333282 19982949
$$ packed form
39259a9284957j0774352l956161J8406572K9180548J0263635j9491296k5693704
39252b1349715k233840K2251340K1858007K634853j0919004p616371J153811O9226
39244E848307j0050353j3922067k613366J2099684J1209603m543231j3055834
39237a5027257j684376J3422794J0654361n823719j5079662j1320988n786637
39230c0645484j072754J1586549K7157836K4998313K141653j4807335o330846
39223A3027932J0692392R246441p501101j4622334m793611M932996L370979n65356
39215A3788338K270429O092321L007710k692395k795950J047166J232083l084090
39207A8865612n596779l289419k66329m11183j298106J440122N889364M649667
$$ plain form
39199 19982949 15504826 2878407 -6691822 -4194629 6865457 15972628 17945882 14854917
39191 14854917 8405069 -2791932 -18296174 -33767158 -44800081 -49126176 -45697177
39184 -45697177 -36355701 -27758455 -25877982 -27991627 -25050326 -12248530 7269714 27688270
39176 27688270 42701738 43786733 26136583 -1260956 -20139492 -21376859 -12070743
39169 -12070743 -2202868 6165735 12281509 10708012 973835 -5455114 1052395 13107502
39161 13107502 15977666 8320656 1473403 701133 444291 -1365665 1711897 10389778
39153 10389778 12412305 -1651031 -22786306 -32966444 -26332350 -12725028 -2366421
39146 -2366421 4379742 11395872 18952717 25507967 32444141 41558626 49483434 49809410
$$ packed form
39199A9982949m478123j2626419r570229K497193J1060086R107171J973254l090965
39191A4854917o449848j1197001j5504242j5470984j1032923m326095L428999
39184d5697177R341476Q597246J880473k113645K941301J2801796J9518244K0418556
39176B7688270J5013468J084995j7650150k7397539j8878536j237367R306116
39169a2070743R867875Q368603O115774j573497r734177o428949O507509J2055107
39161A3107502K870164p657010o847253p72270k56842j809956L077562Q677881
39153A0389778K022527j4063336k1135275j0180138O634094J3607322J0358607
39146b366421O746163P016130P556845O555250O936174R114485P924808L25976
$$ plain form
39138 49809410 41503978 30970538 23825778 18737189 12851148 8817854 9480765 8115310
39130 8115310 -5918453 -29836022 -46215179 -45146052 -38149941 -40443618 -47200878 -41178247
39122 -41178247 -20237592 -1401977 3792236 2318708 2828327 977533 -8528018 -17865853
39114 -17865853 -17481354 -12448547 -12130496 -9827668 8814824 37870153 50775567 33919296
39106 33919296 5314246 -8930640 -4356445 5659171 11919627 13581964 7917315 -7235050
39098 -7235050 -22005585 -21182584 -5775858 5318503 1559664 -2713842 11466203 37766787
39090 37766787 48389599 28783851 -2601033 -16028265 -5957467 4970401 -2380362
39083 -2380362 -18684238 -21078235 -6400736 4747538 -1351667 -12021121 -8824926 4326378
$$ packed form
39138D9809410q305432j0533440p144760n088589n886041m033294O62911j365455
39130H115310j4033763k3917569j6379157J069127O996111k293677o757260O022631
39122d1178247K0940655J8835615N194213j473528N09619j850794r505551r337835
39114a7865853L84499N032807L18051K302828J8642492K9055329J2905414j6856271
39106C3919296k8605050j4244886M574195J0015616O260456J662337n664649j5152365
39098g235050j4770535Q23001J5406726J1094361l758839m273506J4180045K6300584
39090C7766787J0622812j9605748l1384884j3427232J0070798J0927868p350763
39083b380362j6303876k393997J4677499J1148274o099205j0669454L196195J3151304
$$ plain form
39075 4326378 9191149 2983745 1781757 14062045 28868284 35382641 37573101 40422568
39067 40422568 36827180 21489685 6036010 4220623 9827176 6343429 -6183473 -12469291
39059 -12469291 -8879355 -9047591 -18599067 -23667407 -14281555 -2386256 -1841290 -2966474
39051 -2966474 13731515 43621161 58209650 42817590 17510937 11588973 28091766
39044 28091766 44505063 42359582 24140955 2618955 -14171396 -23257515 -21762833
39037 -21762833 -10413432 1362263 1965661 -9979822 -24398430 -30704273 -25239393 -8809070
39029 -8809070 15224666 37374850 44064249 30367499 7845115 -6172908 -5465515 3458434
39021 3458434 13464399 22967691 30194951 29444866 17522406 227455 -11606429 -11873638
$$ packed form
39075D326378M864771o207404j201988J2280288J4806239O514357K190460K849467
39067D0422568l595388j5337495j5453675j815387N606553l483747j2526902o285818
39059a2469291L589936j68236r551476n068340R385852J1895299N44966j125184
39051b966474J6697989K9889646J4588489j5392060k5306653n921964J6502793
39044B8091766J6413297k145481j8218627k1522000j6790351r086119J494682
39037b1762833J1349401J1775695O03398j1945483j4418608o305843N464880J6430323
39029h809070K4033736K2150184O689399j3696750k2522384j4018023P07393Q923949
39021C458434J0005965R503292P227260p50085j1922460j7294951j1833884k67209
$$ plain form
39013 -11873638 -3723368 4530442 7452305 7671987 13013988 27032206 43142615 50595267
39005 50595267 45956887 35854552 28080065 22965898 14995773 1122324 -14158790 -21832475
38997 -21832475 -16507568 -2336823 9362325 9361086 -2034843 -15881423 -21755599 -15205219
38989 -15205219 -1258344 9113617 8999799 2316917 -2517211 -4433023 -9029015 -16173240
38981 -16173240 -17535185 -10147408 -2967413 -3109961 -4064984 3123049 14029142 17483485
38973 17483485 13173734 10374765 11665223 10263266 3139451 -4654627 -9228917 -10892092
38965 -10892092 -7676187 3162794 16151601 21192220 17839977 15080494 15258281 10397402
38957 10397402 -2406473 -14664921 -20624705 -25470383 -32570502 -33809271 -21626777 -2543067
$$ packed form
39013a1873638Q150270Q253810K921863K19682N342001J4018218J6110409P452652
39005E0595267m638380j0102335p774487n114167p970125j3873449j5281114p673685
38997b1832475N324907J4170745J1699148j239j1395929j3846580n874176O550380
38989a5205219J3946875J0371961j13818o682882m834128j915812m595992p144225
38981a6173240j361945P387777P179995j42548r55023P188033J0906093L454343
38973A7483485m309751k798969J290458j401957p123815p794078m574290j663175
38965a0892092L215905J0838981J2988807N040619l352243k759483J77787m860879
38957A0397402j2803875j2258448n959784m845678p100119j238769J2182494J9083710
$$ plain form
38949 -2543067 9843610 9768240 1491352 -7206971 -9196017 -2846077 3074109 -2869004
38941 -2869004 -18584863 -29110384 -26725638 -19189939 -13715834 -6260787 6268106 17081561
38933 17081561 22000397 27393915 35387969 35512468 23703219 14815877 20333760 27742088
38925 27742088 21374969 11115693 16920878 33484861 36189282 18677485 -1087533
38918 -1087533 -12049504 -21525146 -31601390 -29538316 -11378963 5968473 8376977 3675080
38910 3675080 5266028 10989481 11276553 7042033 6020000 8578925 8828065 5313763
38902 5313763 1787069 774819 2471555 6266444 9104474 6748568 -264134 -6837860
38894 -6837860 -10949730 -14562633 -16138358 -10858897 -161851 7960417 10142235 9617379
$$ packed form
38949b543067J2386677p5370q276888q698323j989046O349940N920186n943113
38941b869004j5715859j0525521K384746P535699N474105P455047J2528893J0813455
38933A7081561M918836N393518P994054J24499j1809249q887342N517883P408328
38925B7742088o367119j0259276N805185J6563983K704421j7511797j9765018
38918a087533j0961971r475642j0076244K063074J8159353J7347436K408504m701897
38910C675080J590948N723453K87072m234520j022033K558925K49140l514302
38902E313763l526694j012250J696736L794889K838030k355906p012702o573726
38894f837860m111870l612903j575725N279461J0697046Q122268K181818n24856
$$ plain form
38886 9617379 5966879 -4706061 -16514979 -15215035 464782 12560610 8056986 -2832971
38878 -2832971 -3351879 5503448 10078509 5784918 475615 -79735 1001361 -1993620
38870 -1993620 -11368469 -23916110 -30504644 -23188832 -7183305 1814611 -2125795 -6479759
38862 -6479759 885709 13833339 18746592 14435008 9529767 6879344 3022812 -1593048
38854 -1593048 -3870762 -6013172 -11369964 -15888246 -14194102 -10376728 -11885848 -16430087
38846 -16430087 -16197173 -11480609 -8182685 -5211245 2427170 10447692 9825944 4363856
38838 4363856 8877088 27135073 44780427 48278856 39359255 26139208 11074959 -5563984
38830 -5563984 -18577060 -21686777 -14752645 -3384042 5482089 6987605 2277451 -858035
$$ packed form
38886I617379l650500j0672940j1808918J299944J5679817J2095828m503624j0889957
38878b832971n18908Q855327M575061m293591n309303n55350J081096k994981
38870a993620r374849j2547641o588534P315812J6005527Q997916l940406m353964
38862f479759P365468J2947630M913253m311584m905241k650423l856532m615860
38854a593048k277714k142410n356792m518282J694144L817374j509120m544239
38846a6430087K32914M716564L297924K971440P638415Q020522o21748n462088
38838D363856M513232J8257985J7645354L498429q919601j3220047j5064249j6638943
38830e563984j3013076l109717O934132J1368603Q866131J505516m710154l135486
$$ plain form
38822 -858035 3387224 10707232 13775564 14953865 21956639 31772965 31372172 17330810
38814 17330810 2982134 416282 5202963 5883215 501003 -4445295 -6060935 -7779233
38806 -7779233 -12004960 -15879015 -14246668 -4673114 9276981 19540873 21117715 17482127
38798 17482127 14428034 10329439 -598010 -16011470 -25279878 -23722146 -18914394 -19436809
38790 -19436809 -24454213 -28227827 -28384968 -25367268 -19103384 -10379211 -1378730 7623006
38782 7623006 17578538 25474968 25859829 18973243 10674021 3179993 -5928731 -14156073
38774 -14156073 -14071546 -6468272 -2305551 -5654060 -6177768 3001304 11201221 5685879
38766 5685879 -7696158 -13275804 -8921690 -5708129 -7618680 -7719393 -5085047 -9201805
$$ packed form
38822h58035M245259P320008L068332J178301P002774R816326m00793j4041362
38814A7330810j4348676k565852M786681O80252n382212m946298j615640j718298
38806g779233m225727l874055J632347R573554J3950095J0263892J576842l635588
38798A7482127l054093m098595j0927449j5413460r268408J557732M807752n22415
38790a9436809n017404l773614j57141L017700O263884Q724173R000481R001736
38782G623006R955532P896430L84861o886586q299222p494028r108724q227342
38774a4156073Q4527P603274M162721l348509n23708R179072Q199917n515342
38766E685879j3382037n579646M354114L213561j910551j00713K634346m116758
$$ plain form
38758 -9201805 -21816981 -28086292 -15748347 5409534 14372599 5562924 -5678251 -4442671
38750 -4442671 6137355 12735587 10480040 5908736 3520790 -917363 -9868970 -14934441
38742 -14934441 -6802674 9489576 18989668 16053457 9680583 8445263 10222215 10755923
38734 10755923 12487399 17713949 20468148 13832885 988740 -8649060 -11220319 -9735378
38726 -9735378 -6559082 -1399239 4724027 9084888 10011564 6876286 100757 -5942368
38718 -5942368 -4634024 4386854 13627148 18686976 23700072 30227313 30003269 18707627
38710 18707627 8490708 12760679 23927799 22754527 8061021 -945687 5256466 12384202
38702 12384202 6536080 -3543765 -1802120 8585443 10477701 199817 -6397630 2910308
$$ packed form
38758i201805j2615176o269311J2337945K1157881Q963065q809675j1241175J235580
38750d442671J0580026O598232k255547m571304k387946m438153q951607n065471
38742a4934441Q131767J6292250R500092k936211o372874j235320J776952N33708
38734A0755923J731476N226550K754199o635263j2844145r637800k571259J484941
38726i735378L176296N159843O123266M360861R26676l135278o775529o043125
38718e942368J308344R020878R240294N059828N013096O527241k24044j1295642
38710A8707627j0216919M269971J1167120j173272j4693506r006708O202153P127736
38702A2384202n848122j0079845J741645J0387563J892258j0277884o597447R307938
$$ plain form
38694 2910308 20419214 30858709 30766955 27527845 24579277 17697185 6010480 -2865993
38686 -2865993 -3888441 -4300168 -14083467 -29569870 -36343061 -29292799 -19661596 -17861628
38678 -17861628 -18875003 -12438017 -24147 8596276 10925386 12679457 15376586 14308064
38670 14308064 9224464 6667173 9609219 13442433 14187804 12407343 7394642 -2997002
38662 -2997002 -13640288 -13128829 1094496 16894796 22571003 19879304 15328005 7212903
38654 7212903 -8094277 -22591909 -22373222 -6861199 8527634 11790940 7981238 9000066
38646 9000066 16289219 20366175 14963750 4985514 -635592 642605 4419142 6269932
38638 6269932 5354900 2530312 -279302 1422982 11106827 23776068 28319866 22220199
$$ packed form
38694B910308J7508906J0439495r1754l239110k948568o882092j1686705q876473
38686b865993j022448m11727r783299j5486403o773191P050262R631203J799968
38678a7861628j013375O436986J2413870Q620423K329110J754071K697129j068522
38670A4308064n083600k557291K942046L833214P45371j780461n012701j0391644
38662b997002j0643286N11459J4223325J5800300N676207k691699m551299q115102
38654G212903j5307180j4497632K18687J5512023J5388833L263306l809702J018828
38646I000066P289153M076956n402425r978236n621106J278197L776537J850790
38638F269932r15032k824588k809614J702284R683845J2669241M543798o099667
$$ plain form
38630 22220199 18021059 27062191 40655695 38131942 13789274 -14466306 -26408386
38623 -26408386 -20581676 -9628638 -2668375 427512 2082906 2399364 1021310 -1103480
38615 -1103480 -2216310 -472803 4322916 8733408 8321882 3869697 1894487 6946004
38607 6946004 15953729 21795432 20089749 12020440 3955298 4483341 16862377 33071412
38599 33071412 40312050 34988309 25183108 18237852 12872382 6470552 2663744 6188227
38591 6188227 15348884 24457014 29262024 26373097 13689377 -3257023 -11829980 -6309635
38583 -6309635 3599958 5665030 1954576 4241786 15573719 25533771 23643384 10538970
38575 10538970 -4295677 -10751602 -4996807 6923373 13607751 10359447 3968790 1650904
$$ packed form
38630B2220199m199140R041132J3593504k523753k4342668k8255580j1942080
38623b6408386N826710J0953038O960263L095887J655394L16458j378054k124790
38615a103480j112830J743507M795719M410492m11526m452185j975210N051517
38607F946004R007725N841703j705683q069309q065142N28043J2379036J6209035
38599C3071412P240638n323741r805201o945256n365470o401830l806808L524483
38591F188227R160657R108130M805010k888927j2683720j6946400q572957N520345
38583f309635R909593K065072l710454K287210J1331933R960052j890387j3104414
38575A0538970j4834647o455925N754795J1920180O684378l248304o390657k317886
$$ plain form
38567 1650904 805667 -3229748 -5038252 4540574 22586229 35887384 38221443 35023433
38559 35023433 30180831 20070947 4603034 -6517955 -5374036 3246676 8748500 7570940
38551 7570940 3926182 2086611 3222837 7098383 12487217 17253442 20025606 19814873
38543 19814873 14015683 1729980 -9884512 -9571110 3391563 14412859 9997524 -4576057
38535 -4576057 -11308058 -2224805 11338015 14407564 7449244 4520284 14498437 30208107
38527 30208107 38135045 34268970 25773759 19859254 17528503 17590899 18856569 16463116
38519 16463116 4666408 -12043192 -18880876 -8751710 7091065 14645322 15811703
38512 15811703 20449414 26812662 24960319 16441611 13921506 20266100 24158027 20324797
$$ packed form
38567A650904q45237m035415j808504R578826J8045655J3301155K334059l198010
38559C5023433m842602j0109884j5467913j1120989J143919Q620712N501824j177560
38551G570940l644758j839571J136226L875546N388834M766225K772164k10733
38543A9814873n799190j2285703j1614492L13402J2962673J1021296m415335j4573581
38535d576057o732001R083253J3562820L069549o958320k928960R978153J5709670
38527C0208107P926938l866075q495211n914505k330751O2396J265670k393453
38519A6463116j1796708j6709600o837684J0129166J5842775P554257J166381
38512A5811703M637711O363248j852343q518708k520105O344594L891927l833230
$$ plain form
38504 20324797 18572493 25974988 34132820 33377518 28182989 28118291 32343528 33408214
38496 33408214 29800008 25502268 22695780 22819839 29133617 40894419 51023561 56142561
38488 56142561 61377878 68153703 67062199 53272814 39597751 40640353 50841198 52969097
38480 52969097 43477841 33846959 29682231 24927162 16804347 10753972 8406139 4940967
38472 4940967 1055756 3392273 9511952 7196206 -5492418 -13823724 -8218120 927798
38464 927798 886459 -2820209 2578705 13745477 15055345 3322475 -6303281 -1506347
38456 -1506347 11729464 19546694 17807476 13337790 12874466 17412382 25463585 35159000
38448 35159000 41527572 37240035 21284980 4688938 852258 9085270 14696788 9171875
$$ packed form
38504B0324797j752304P402495Q157832p55302n194529o4698M225237J064686
38496C3408214l608206m297740k806488J24059O313778J1760802J0129142N119000
38488E6142561N235317O775825j091504j3789385j3675063J042602J0200845K127899
38480E2969097r491256r630882m164728m755069q122815o050375k347833l465172
38472D940967l885211K336517O119679k315746j2688624q331306N605604R145918
38464I27798m1339l706668N398914J1166772J309868j1732870r625756M796934
38456a506347J3235811P817230j739218m469686m63324M537916Q051203R695415
38448C5159000O368572m287537j5955055j6596042l836680Q233012N611518n524913
$$ plain form
38440 9171875 3011984 11067839 30558063 43938399 41519446 30541375 21546460 16545070
38432 16545070 13367122 11882412 11424163 9849310 9103929 14102698 22403179 23620368
38424 23620368 14147762 3821481 1542428 2599041 -1714285 -9200612 -10975252 -5402875
38416 -5402875 1593674 6612786 10541014 13006463 12845190 11677776 10540225 6680615
38408 6680615 232475 -1579840 4276983 7020759 -4694550 -24001472 -33279876 -28063997
38400 -28063997 -19598886 -14337845 -6429483 6882062 17904611 22432391 27461606 37473372
38392 37473372 44864128 42349405 34108047 25706816 13675047 -4085105 -17196656 -15012910
38384 -15012910 -2844202 6805937 12788232 21157143 28334848 25390239 16903615 17720173
$$ packed form
38440I171875o159891Q055855J9490224J3380336k418953j0978071q994915n001390
38432A6545070l177948j484710m58249j574853p45381M998769Q300481J217189
38424B3620368r472606j0326281k279053J056613m313326p486327j774640N572377
38416e402875O996549N019112L928228K465449j61273j167414j137551l859610
38408F680615o448140j812315N856823K743776j1715309j9306922r278404N215879
38400b8063997Q465111N261041P908362J3311545J1022549M527780N029215J0011766
38392C7473372P390756k514723q241358q401231j2031769j7760152j3111551K183746
38384a5012910J2168708R650139N982295Q368911P177705k944609q486624Q16558
$$ plain form
38376 17720173 29380182 36918213 32994712 27988158 29189300 27161227 14114064 875316
38368 875316 679118 7552024 7578230 2810347 4704198 9096511 19977 -20201750 -26522269
38359 -26522269 -4928504 26817274 43175987 41577137 36332446 33448710 27881344 20016046
38351 20016046 18146484 24217829 29866918 28883844 24006127 19131000 13239886 5351583
38343 5351583 -676205 307693 9396721 21998056 28417198 18781111 -6301239 -31705265
38335 -31705265 -41620971 -36386619 -28349172 -23324430 -16465516 -5759700 3226034 9022197
38327 9022197 18074580 31123287 37304709 29960285 18680255 16188317 21032029 23425000
38319 23425000 22096800 24371748 32980857 42683424 48226525 47862630 40984524 29095761
$$ packed form
38376A7720173J1660009P538031l923501n006554J201142k028073j3047163j3238748
38368H75316j96198O872906K6206m767883J893851M392313r076534k0221727o320519
38359b6522269K1593765L1745778J6358713j598850n244691k883736n567366p865298
38351B0016046j869562O071345N649089r83074m877717m875127n891114p888303
38343E351583o027788R83898R089028J2601335O419142r636087k5082350k5404026
38335c1705265r915706N234352Q037447N024742O858914J0705816Q985734N796163
38327I022197R052383J3048707O181422p344424j1280030k491938M843712K392971
38319B3425000j328200K274948Q609109R702567N543101l63895o878106j1888763
$$ plain form
38311 29095761 17004508 7864348 855096 -2091220 4871945 18993414 25217333 16333308
38303 16333308 7316069 14353005 27896222 26511881 12862347 11777209 30276661 44117138
38295 44117138 33634095 11793391 2434267 7307830 11492852 9545069 8311025 10535592
38287 10535592 12083513 12237787 13367151 12933161 7566649 2212164 3620976 7613930
38279 7613930 5219296 -470105 2862899 16642840 27644666 27457135 23351199 24350432
38271 24350432 27155679 23667805 14958441 9044004 8551401 8226269 3657268 -3108799
38263 -3108799 -7072963 -6062858 -2212338 1000386 2856331 6403226 14555340 25645841
38255 25645841 34394393 36942026 33290654 25548255 16294255 8591032 5053177 6064323
$$ packed form
38311B9095761j2091253r140160p009252k946316O963165J4121469O223919q884025
38303A6333308r017239P036936J3543217j384341j3649534j085138J8499452J3840477
38295D4117138j0483043k1840704r359124M873563M185022j947783j234044K224567
38287A0535592J547921J54274J129364m33990n366512n354485J408812L992954
38279G613930k394634n689401L333004J3779941J1001826j87531m105936R99233
38271B4350432K805247l487874q709364n914437m92603l25132m569001o766067
38263c108799l964164J010105L850520L212724J855945L546895Q152114J1090501
38255B5645841Q748552K547633l651372p742399r254000p703223l537855J011146
$$ plain form
38247 6064323 10008127 15082610 19988620 23990293 27741368 32525946 36848514 35908398
38239 35908398 27660298 18108886 16720829 26106719 38785990 44850352 41377277 33934044
38231 33934044 29621565 29148274 26835521 19418930 12260236 12655569 18657560 20995980
38223 20995980 16184175 10112194 7218484 5199983 3817203 8217401 16749872 16554199
38215 16554199 2325450 -9571891 -64960 24862245 40558878 35600838 22109047
38208 22109047 14227068 11970052 10035652 8476017 8123775 6124321 2395672 1988987
38200 1988987 5917560 8001797 5766091 6268268 15785069 30833123 43840549 50697022
38192 50697022 49487832 40232186 29311941 24665425 23099675 13915395 -176346 -354022
$$ packed form
38247F064323L943804N074483M906010M001673L751075M784578M322568r40116
38239C5908398q248100r551412j388057R385890J2679271O064362l473075p443233
38231C3934044m312479m73291k312753p416591p158694L95333O001991K338420
38223B0995980m811805o071981k893710k018501j382780M400198Q532471j95673
38215A6554199j4228749j1897341R506931K4927205J5696633m958040j3491791
38208B2109047p881979k257016j934400j559635l52242j999454l728649m06685
38200A988987L928573K084237k235706N02177R516801J5048054J3007426O856473
38192E0697022j209190r255646j0920245m646516j565750r184280j4091741j77676
$$ plain form
38184 -354022 20486516 41048227 37038015 13329021 -4739218 -4886996 3902181 12077173
38176 12077173 20129879 27665994 27952194 18598634 7404030 3310979 8238416 18638755
38168 18638755 27610364 25649522 8248348 -15757786 -30519591 -28565247 -14517915
38161 -14517915 3443415 17436616 19016593 6692280 -6497133 -5240782 7806795
38154 7806795 16346767 15053451 14884158 21311940 24284565 17201124 10203163 13637518
38146 13637518 21004759 20725214 14584696 11502485 11395894 8597194 4373367 2622596
38138 2622596 -414183 -7563506 -7808732 10595713 36880422 46532639 34672776 22302589
38130 22302589 24958654 33629796 35199792 33930157 38568329 42089922 32633146 17028244
$$ packed form
38184c54022K0840538K0561711m010212k3708994j8068239j47778Q789177Q174992
38176A2077173Q052706P536115K86200r353560j1194604m093051M927437J0400339
38168A8638755Q971609j960842j7401174k4006134j4761805J954344J4047332
38161a4517915J7961330J3993201J579977j2324313j3189413J256351J3047577
38154G806795Q539972j293316j69293O427782K972625p083441o997961L434355
38146A3637518P367241k79545o140518l082211j06591k798700m223827j750771
38138B622596l036779p149323k45226J8404445K6284709R652217j1859863j2370187
38130B2302589K656065Q671142J569996j269635M638172L521593r456776j5604902
$$ plain form
38122 17028244 14087000 25737066 32666155 22486871 7324940 5650263 17133544
38115 17133544 25198435 19038833 4374068 -5601800 -3397377 8169651 20228365 26841605
38107 26841605 31448828 41680406 55622889 58609822 40175489 10822586 -7264637
38100 -7264637 -6712104 -2777552 -10594544 -23394185 -22546096 -4933672 11447329 11360485
38092 11360485 1768854 502518 11851060 23208138 24199763 18420768 13450124 9637761
38084 9637761 6314721 10771606 28770937 49323285 52827534 36727523 20868935 22343010
38076 22343010 36190583 47929937 53502396 55728734 51171655 36276115 21351724
38069 21351724 21456306 33933212 40807275 35148696 29449631 33761291 40920544 40626209
$$ packed form
38122A7028244k941244J1650066O929089j0179284j5161931j674677J1483281
38115A7133544Q064891o159602j4664765r975868K204423J1567028J2058714O613240
38107B6841605M607223J0231578J3942483K986933j8434333k9352903j8087223
38100g264637N52533L934552p816992j2799641Q48089J7612424J6381001q6844
38092A1360485r591631j266336J1348542J1357078R91625n778995m970644l812363
38084I637761l323040M456885J7999331K0552348L504249j6100011j5858588J474075
38076B2343010J3847573J1739354N572459K226338m557079j4895540j4924391
38069B1351724J04582J2476906O874063n658579n699065M311660P159253k94335
$$ plain form
38061 40626209 34408126 27394488 17149745 1557382 -11625694 -14168349 -9078124 -3350413
38053 -3350413 3266947 12371803 18006319 15334591 11433104 15589948 24994397 31706915
38045 31706915 36740432 43769997 46016106 35691514 21510583 19226389 27479297 30751970
38037 30751970 24697157 20002639 21536974 23642388 27808639 43643200 67132434 78913354
38029 78913354 72164984 62600332 61590371 59562398 48326019 40128738 48067354 63732396
38021 63732396 71981706 74362248 79859858 84720078 80950687 74820705 76795622 81134029
38013 81134029 75934332 66977540 70270135 84901359 94308171 92160491 86480829 80025139
38005 80025139 68564045 58665361 63746869 78693785 81024188 63673534 45111317
$$ packed form
38061D0626209o218083p013638j0244743j5592363j3183076k542655N090225N727711
38053c350413O617360R104856N634516k671728l901487M156844R404449O712518
38045C1706915N033517P029565K246109j0324592j4180931k284194Q252908L272673
38037C0751970o054813m694518J534335K105414M166251J5834561K3489234J1780920
38029G8913354o748370r564652j009961k027973j1236379q197281P938616J5665042
38021F3732396Q249310K380542N497610M860220l769391o129982J974917M338407
38013H1134029n199697q956792L292595J4631224R406812k147680n679662o455690
38005H0025139j1461094r898684N081508J4946916K330403j7350654j8562217
$$ plain form
37998 45111317 38895868 35023032 22809922 10971925 9091209 7477783 -5008113 -16857569
37990 -16857569 -9241860 12618456 24570916 17193481 5732831 5817688 14979308 21735883
37982 21735883 21434125 18688040 20778616 30573468 42036803 44910245 38352315 34380167
37974 34380167 40108083 43349803 28297269 1586361 -12184491 -1552019 19075360
37967 19075360 30795432 31285604 29087058 28616207 29151386 30515178 31444910 28140232
37959 28140232 21509250 19982855 27433900 34017940 28720329 17160779 15596100 28010298
37951 28010298 41133416 45088656 47197587 57448529 69031770 65489573 45029894
37944 45029894 25964529 24879658 38138873 50422607 54817975 56234770 58074817 55458962
$$ packed form
37998D5111317o215449l872836j2213110j1837997j880716j613426j2485896j1849456
37990a6857569P615709K1860316J1952460p377435j1460650Q4857R161620O756575
37982B1735883l01758k746085K090576R794852J1463335K873442o557930l972148
37974C4380167N727916L241720j5052534k6710908j3770852J0632472K0627379
37967A9075360J1720072M90172k198546m70851N35179J363792R29732l304678
37959B8140232o630982j526395P451045O584040n297611j1559550j564679J2414198
37951B8010298J3123118L955240K108931J0250942J1583241l542197k0459679
37944D5029894j9065365j084871J3259215J2283734M395368J416795J840047k615855
$$ plain form
37936 55458962 44502832 31689141 28453833 38203563 52634236 61063690 61079337 59026195
37928 59026195 61197969 66759819 70917604 73493810 79989747 92665955 105218389 110470400
37920 110470400 109920559 110302130 113548689 117254097 123364140 137228412 156702954 171496848
37912 171496848 177482358 183647713 199200591 220840295 240122990 257757774 281391962
37905 281391962 311789524 340363911 361028143 377617844 397754622 423542026 449292850
37898 449292850 465709391 466931540 456332685 444158529 437021993 432371356 425725799
37891 425725799 417602312 407316392 386374148 349095683 307159659 280672149 273085856
37884 273085856 266983380 248668143 224906894 208172316 196608357 180252986 159873446
$$ packed form
37936E5458962j0956130j2813691l235308R749730J4430673Q429454J5647k053142
37928E9026195K171774N561850M157785K576206O495937J2676208J2552434N252011
37920A10470400n49841L81571L246559L705408O110043J3864272J9474542J4793894
37912A71496848N985510O165355J5552878K1639704J9282695J7634784K3634188
37905B81391962L0397562K8574387K0664232J6589701K0136778K5787404K5750824
37898D49292850J6416541J222149j0598855j2174156p136536m650637o645557
37891D25725799q123487j0285920k0942244l7278465m1936024k6487510p586293
37884B73085856o102476j8315237k3761249j6734578j1563959j6355371k0379540
$$ plain form
37877 159873446 145878313 140756285 135671033 125963736 118333920 118022986 118529134 111414690
37869 111414690 99790643 93035541 90969685 82817293 63352308 42215669 32479967
37862 32479967 34764450 38744876 38186224 37235026 40438481 43415397 38851440 28156724
37854 28156724 20417725 20139741 22387043 21937030 21558878 27086550 38054259 48419814
37846 48419814 54971623 59846137 64579143 66473626 63024727 57058734 54826790 59741919
37838 59741919 69174382 76780068 77614692 72194871 66124767 64612065 67019229 68258364
37830 68258364 65768442 62802378 63698428 68302556 73008749 75112756 73664275 68632031
37822 68632031 63591689 67593665 87859643 118725187 143065688 148250580 137360606
$$ packed form
37877A59873446j3995133n122028n085252r707297p629816l10934N06148p114444
37869A11414690j1624047o755102k065856q152392j9464985k1136639r735702
37862C2479967K284483L980426n58652r51198L203455K976916m563957j0694716
37854B8156724p738999k77984K247302m50013l78152N527672J0967709J0365555
37846D8419814O551809M874514M733006J894483l448899n965993k231944M915129
37838E9741919R432463P605686Q34624n419821o070104j512702K407164J239135
37830F8258364k489922k966064Q96050M604128M706193K104007j448481n032244
37822F8632031n040342M001976K0265978L0865544K4340501N184892j0889974
$$ plain form
37815 137360606 121942974 108577300 97866565 92093861 94553581 101160118 101745333 93461664
37807 93461664 86255266 90278155 103462537 117407025 130266053 145013304 157645647
37800 157645647 158543179 148547533 143927832 158083973 183956992 202725383 206661279 203856544
37792 203856544 200598635 190267037 165562694 133741687 110255671 100171685 94891082
37785 94891082 86851317 78397680 73976208 72323184 71197954 72337343 75089779 71785257
37777 71785257 58620968 46703376 51117471 70142630 86626247 91165006 92002489 97570813
37769 97570813 101123969 91704957 71944348 54103895 43434768 36462282 32713455 35845308
37761 35845308 42549283 42173983 31686566 21875048 22975208 31141669 35388888 31957269
$$ packed form
37815A37360606j5417632j3365674j0710735n772704K459720O606537N85215q283669
37807I3461664p206398M022889J3184382J3944488J2859028J4747251J2632343
37800A57645647Q97532r995646m619701J4156141K5873019J8768391L935896k804735
37792B03856544l257909j0331598k4704343l1821007k3486016j0083986n280603
37785I4891082q039765q453637m421472j653024j125230J139389K752436l304522
37777G1785257j3164289j1917592M414095J9025159J6483617M538759Q37483N568324
37769I7570813L553156r419012j9760609j7840453j0669127o972486l748827L131853
37761C5845308O703975l75300j0487417r811518J100160Q166461M247219l431619
$$ plain form
37753 31957269 24350276 14011718 805308 -8835240 -5215397 10015038 21600223
37746 21600223 19173185 11383801 13217855 23315205 24793885 9401999 -9857230 -15598874
37738 -15598874 -7519399 965685 2467266 2453775 7745677 17373978 26611024 33008408
37730 33008408 35725919 34227983 30263579 26897155 23848452 18162054 10629298 6217096
37722 6217096 6646336 8580214 11053560 17338123 25823062 26978113 15781981 1100050
37714 1100050 -4531669 -114917 5474773 6105031 2152731 -4688508 -12559464 -17620907
37706 -17620907 -18077844 -17979118 -20650645 -21150606 -12260314 4821819 23021236 39099677
37698 39099677 52254015 56844312 47833930 32071510 22414270 20346037 16088168 6932582
$$ packed form
37753C1957269p606993j0338558j3206410r640548L619843J5230435J1585185
37746B1600223k427038p789384J834054J0097350J478680j5391886j9259229n741644
37738a5598874Q079475Q485084J501581j3491N291902R628301R237046O397384
37730C3008408K717511j497936l964404l366424l048703n686398p532756m412202
37722F217096M29240J933878K473346O284563Q484939J155051j1196132j4681931
37714A100050n631719M416752N589690O30258l952300o841239p870956n061443
37706a7620907m56937R8726k671527m99961Q890292J7082133J8199417J6078441
37698C9099677J3154338M590297r010382j5762420r657240k068233m257869r155586
$$ plain form
37690 6932582 2476082 8177587 16619737 21037540 25542756 33734018 37550301 27867535
37682 27867535 9322631 -5102607 -9208364 -4994227 5329196 18852233 27433460
37675 27433460 24386251 14957993 11309782 16724009 22205156 19615794 11703341 7228011
37667 7228011 10613490 18078569 21515116 16163514 6397780 2190274 7121887 12622325
37659 12622325 8413586 -3701606 -12114996 -10574960 -5131452 -4939601 -11103083 -17030384
37651 -17030384 -16715956 -10009746 -1086831 5946602 9543024 10006352 7980870 4440213
37643 4440213 644764 -3701800 -10539021 -18671171 -20783439 -10361474 8521311 23535005
37635 23535005 26853580 20760644 10889009 1039777 -3976191 1233809 14953004 27356247
$$ packed form
37690F932582m456500N701505Q442150M417803M505216Q191262L816283r682766
37682B7867535j8544904j4425238m105757M214137J0323423J3523037Q581227
37675B7433460l047209r428258l648211N414227N481147k589362p912453m475330
37667G228011L385479P465079L436547n351602r765734m207506M931613N500438
37659A2622325m208739j2115192q413390J540036N443508J91851o163482n927301
37651a7030384L14428O706210Q922915P033433L596422M63328k025482l540657
37643D440213l795449m346564o837221q132150k112268J0421965J8882785J5013694
37635B3535005L318575o092936r871635r849232n015968N210000J3719195J2403243
$$ plain form
37627 27356247 31388435 29117546 24398607 16878431 7733982 2970368 4519125 5785590
37619 5785590 3302808 4690011 15847174 27904406 28317886 19185785 12440930 11672673
37611 11672673 12142700 15105973 26023837 38288255 35259872 13893263 -6631092 -7051404
37603 -7051404 10383348 28566848 35554577 31660609 23912407 20862895 28221348 42736133
37595 42736133 52635891 48940163 35095387 23122453 22367145 33016385 46782740 52138367
37587 52138367 42995781 25143864 11505781 8990652 12154779 10896208 1928927 -8493440
37579 -8493440 -11542296 -4982375 4200135 7934231 7635143 11480294 19762351 21849971
37571 21849971 13670581 8079216 16284184 27259598 21740358 2246962 -9514830 -5070933
$$ packed form
37627B7356247M032188k270889m718939p520176r144449m763614J548757J266465
37619E785590k482782J387203J1157163J2057232M13480r132101o744855p68257
37611A1672673M70027K963273J0917864J2264418l028383k1366609k0524355m20312
37603g051404J7434752J8183500O987729l893968p748202l049512P358453J4514785
37595D2736133R899758l695728j3844776j1972934p55308J0649240J3766355N355627
37587E2138367r142586j7851917j3638083k515129L164127j258571q967281j0422367
37579h493440l048856O559921R182510L734096k99088L845151Q282057K087620
37571B1849971q179390n591365Q204968J0975414n519240j9493396j1761792M443897
$$ plain form
37563 -5070933 882210 -2495709 -5058356 4222856 16577594 16833888 6241990 -2014808
37555 -2014808 -2459561 210638 2655717 5325043 7275988 8178359 11786798 19250650
37547 19250650 23521305 18589139 9631960 6025331 9203364 15030580 21855722 27369536
37539 27369536 24581116 11915636 737881 22717 -481501 -16061968 -39444186 -45853347
37531 -45853347 -27926746 -8126257 -8873203 -23820761 -29050905 -14135524 8558630
37524 8558630 21221088 17985384 5920256 -4219066 -6254674 -1188582 5288302 7409274
37516 7409274 3397939 -2254423 -1063463 10735613 25287940 30549298 25983077 23060226
37508 23060226 26742412 26746912 15181626 2574528 3086680 10474771 4845594 -18562455
$$ packed form
37563e070933N953143l377919k562647R281212J2354738K56294j0591898q256798
37555b014808m44753K670199K445079K669326J950945R02371L608439P463852
37547A9250650M270655m932166q957179l606629L178033N827216O825142N513814
37539B7369536k788420j2665480j1177755p15164n04218j5580467k3382218o409161
37531d5853347J7926601J9800489p46946j4947558n230144J4915381K2694154
37524H558630J2662458l235704j2065128j0139322k035608N066092O476884K120972
37516G409274m011335n652362J190960J1799076J4552327N261358m566221k922851
37508B3060226L682186M500j1565286j2607098N12152P388091n629177k3408049
$$ plain form
37500 -18562455 -43048958 -53961640 -53589566 -49297754 -41533416 -30391983 -21749076 -17970815
37492 -17970815 -11594776 2917122 18363524 24681765 23978061 26032483 31768659 30959003
37484 30959003 17572691 500600 -4940301 5833679 21292775 26983062 22147479
37477 22147479 18648877 23100799 27974888 25493321 21472129 24522448 28027129 18212055
37469 18212055 -1618589 -11816220 -4296645 6424659 6150967 -647787 -4839418 -10473445
37461 -10473445 -24704959 -39968116 -41893681 -30221330 -18073904 -13062776 -11666401
37454 -11666401 -11097064 -14223169 -20818393 -24004128 -19148759 -10019225 -3385134 -1855642
37446 -1855642 -3355600 -3906308 -129182 8001393 16442304 20611495 18608594 10567398
$$ packed form
37500a8562455k4486503j0912682L72074M291812P764338J1141433Q642907L778261
37492a7970815O376039J4511898J5446402O318241p03704K054422N736176q09656
37484C0959003j3386312j7072091n440901J0773980J5459096N690287m835583
37477B2147479l498602M451922M874089k481567m021192L050319L504681r815074
37469A8212055j9830644j0197631P519575J0721304k73692o798754m191631n634027
37461a0473445j4231514j5263157j925565J1672351J2147426N011128J396375
37454a1666401N69337l126105o595224l185735M855369R129534O634091J529492
37446a855642j499958n50708L777126Q130575Q440911M169191k002901q041196
$$ plain form
37438 10567398 -1335712 -10918203 -11951426 -7446532 -8495529 -18847554 -27475266 -23303732
37430 -23303732 -10666240 -1695666 92505 -1878599 -9133809 -24470201 -39493728 -41294998
37422 -41294998 -32222665 -27936171 -32849868 -33133800 -20494992 -7369160 -7212556 -12529450
37414 -12529450 -7863691 3609139 4402337 -8648231 -17950041 -10894749 3512498 11371871
37406 11371871 14173002 20791526 28492860 26513422 14388236 1654978 -9695585 -25801020
37398 -25801020 -40906898 -35869518 -7915008 14781509 6658306 -17955149 -23303923
37391 -23303923 -2745170 14375428 8212057 -5582717 -5713443 2410990 1678261 -6767052
37383 -6767052 -9469692 -5719921 -5780175 -10255673 -10788461 -7858995 -9493446 -14159324 -12960003
$$ packed form
37438A0567398j1903110r582491j033223M504894j048997j0352025q627712M171534
37430b3303732J2637492Q970574J788171j971104p255210j5336392j5023527j801270
37422d1294998R072333M286494m913697k83932J2638808J3125832J56604n316894
37414a2529450M665759J1472830P93198j3050568r301810P055292J4407247P859373
37406A1371871K801131O618524P701334j979438j2125186j2733258j1350563j6105435
37398b5801020j5105878N037380K7954510K2696517q123203k4613455n348774
37391b3303923K0558753J7120598o163371j3794774j30726Q124433p32729q445313
37383f767052k702640L749771o0254m475498n32788K929466j634451m665878J199321
$$ plain form
37374 -12960003 -8204736 -11308303 -20727032 -20718518 -6577303 6320717 5287857 -3427929
37366 -3427929 -8570805 -9293956 -7932529 -1241632 10619504 18104965 16035192 12675142
37358 12675142 14358024 12407087 -1143152 -14855900 -11698873 4283776 12512995 5342602
37350 5342602 -3601234 -2221019 4174794 5109479 698956 -2924198 -5920361 -13336857
37342 -13336857 -24167669 -28929807 -19297132 2394587 24177293 35008416 34495296 31124149
37334 31124149 30555138 28876466 20120953 7030583 -1153307 -773097 2014578 295109
37326 295109 -5279966 -10391524 -15726096 -26073312 -40012874 -45894865 -33774988 -10183379
37318 -10183379 6117223 5969200 813612 6194928 20403542 28601400 24158843 14405205
$$ packed form
37374a2960003M755267l103567r418729Q514J4141215J2898020j032860q715786
37366c427929n142876p23151J361427O690897J1861136P485461k069773l360050
37358A2675142J682882j950937j3550239j3712748L157027J5982649Q229219p170393
37350E342602q943836J380215O395813R34685m410523l623154k996163p416496
37342a3336857j0830812m762138R632675K1691719K1782706J0831123n13120l371147
37334C1124149n69011j678672q755513j3090370q183890L80210K787675j719469
37326B95109n575075n111558n334572j0347216j3939562n881991J2119877K3591609
37318a0183379J6300602j48023n155588N381316J4208614Q197858m442557r753638
$$ plain form
37310 14405205 6380844 -403753 -5332487 -3783236 2800050 5878707 3982042 5500959
37302 5500959 11205173 8430339 -7282899 -19274563 -12845424 1399599 5089030 2448230
37294 2448230 11097505 28565759 33360684 20560731 11430604 19994428 31982227 29251209
37286 29251209 16987887 10980142 11469244 7415294 -1791843 -6986295 -7537913 -11649102
37278 -11649102 -18492721 -16395276 -2779906 8316498 6135904 -682571 1797336 10554592
37270 10554592 10650415 -576961 -9176698 -7347034 -6037945 -15444976 -24791349 -17353498
37262 -17353498 241685 3377604 -13865368 -26882415 -14615347 10966804 23632523
37255 23632523 18839323 13423725 16690629 20813338 18422224 12447905 6386129 -1112185
$$ packed form
37310A4405205q024361o784597m928734J549251O583286L078657j896665J518917
37302E500959N704214k774834j5713238j1991664O429139J4245023L689431k640800
37294B448230Q649275J7468254M794925j2799953r130127Q563824J1987799k731018
37286B9251209j2263322o007745M89102m053950r207137n194452n51618m111189
37278a1649102o843619K097445J3615370J1096404k180594o818475K479907Q757256
37270A0554592R5823j1227376q599737J829664J309089r407031r346373P437851
37262a7353498J7595183L135919j7242972j3017047J2267068K5582151J2665719
37255B3632523m793200n415598L266904M122709k391114n974319o061776p498314
$$ plain form
37247 -1112185 -9019251 -12994172 -13751584 -15627785 -16162759 -8858738 3355166 10453885
37239 10453885 11509460 13887280 15679793 6901555 -8398310 -11526227 1445932 9901540
37231 9901540 52496 -13584417 -13786472 -9001821 -15138759 -23958439 -15278989 7129208
37223 7129208 17664895 5159756 -15778382 -30095565 -37084635 -36907040 -23930324 -1226518
37215 -1226518 15774635 19146465 17938120 19745082 17028058 2474565 -13941727 -16427812
37207 -16427812 -4997969 6224866 8516175 6338370 7428793 13326452 19988498 22818659
37199 22818659 20917599 18593924 20982815 26591033 27339821 18155783 3251018 -9319152
37191 -9319152 -15978648 -18319597 -19001072 -19676402 -20414239 -19118823 -13807344 -6645161 -3001920
$$ packed form
37247a112185p907066l974921p57412j876201n34974P304021J2213904P098719
37239A0453885J055575K377820J792513q778238j5299865l127917J2972159Q455608
37231I901540r849044j3636913k02055M784651o136938q819680Q679450K2408197
37223G129208J0535687j2505139k0938138j4317183o989070J77595J2976716K2703806
37215a226518J7001153L371830j208345J806962k717024j4553493j6416292k486085
37207a6427812J1429843J1222835K291309k177805J090423N897659O662046K830161
37199B2818659j901060k323675K388891N608218P48788r184038j4904765j2570170
37191i319152o659496k340949o81475o75330p37837J295416N311479P162183L643241
$$ plain form
37182 -3001920 -5468602 -11484324 -17532491 -22990151 -29499457 -38729542 -49732859 -56216620
37174 -56216620 -49880581 -31369976 -14083513 -9655406 -12710739 -9416744 1016976 5445655
37166 5445655 -1755089 -9293815 -5861873 4395417 9959554 7486003 3015542 3526428
37158 3526428 11216702 20153269 17358903 -3264371 -26596328 -29171907 -10887030 1716065
37150 1716065 -7570052 -21166778 -15629028 2384373 8811678 820445 -1770796 8897952
37142 8897952 17070593 10612676 -1087801 -4919924 -2687542 -1175825 2685914 13575939
37134 13575939 23763937 21341000 8861687 1626735 6893510 14123615 9846411 -2702003
37126 -2702003 -4814669 15058741 43631863 54577722 39415172 18013354 11984256
$$ packed form
37182c001920k466682o015722o048167n457660o509306r230085j1003317o483761
37174e6216620O336039J8510605J7286463M428107l055333L293995J0433720M428679
37166E445655p200744p538726L431942J0257290N564137k473551m470461N10886
37158C526428P690274Q936567k794366k0623274k3331957k575579J8284877J2603095
37150A716065r286117j3596726N537750J8013401O427305p991233k591241J0668748
37142H897952Q172641o457917j1700477l832123K232382J511717L861739J0890025
37134A3575939J0187998k422937j2479313p234952N266775P230105m277204j2548414
37126b702003k112666J9873410K8573122J0945859j5162550k1401818o029098
$$ plain form
37119 11984256 16965076 14117231 2181994 -1441170 7947091 11575763 -2967893 -19642669
37111 -19642669 -16958401 120975 9414009 4420174 -1696253 -1531822 -1958735 -4560370
37103 -4560370 2397978 22831262 39014747 33004184 13265242 5128976 17721377 34346008
37095 34346008 37368371 30057414 26850840 30621223 30615378 21198297 11687129 12651255 19325543
37086 19325543 17045512 1589922 -14465120 -18342252 -12943557 -10433669 -14688206 -18226882
37078 -18226882 -15629540 -11511399 -12178486 -15826369 -16303558 -13019618 -11462244 -15135111
37070 -15135111 -21852265 -27761707 -30543691 -28259784 -19884352 -8989983 -2731627 -3816200
37062 -3816200 -6257742 -2685797 6307686 14267605 18731294 23530768 30613360 34905546
$$ packed form
37119A1984256M980820k847845j1935237l623164R388261L628672j4543656j6674776
37111a9642669K684268J7079376R293034m993835o116427J64431m26913k601635
37103d560370O958348K0433284J6183485o010563j9738942q136266J2592401J6624631
37095C4346008L022363p310957l206574L770383n845r417081r511168R64126O674288
37086A9325543k280031j5455590j6055042l877132N398695K509888m254537l538676
37078a8226882K597342M118141o67087l647883m77189L283940J557374l672867
37070a5135111o717154n909442k781984K283907Q375432J0894369O258356j084573
37062c816200k441542L571945Q993483P959919M463689M799474P082592M292186
$$ plain form
37054 34905546 30544571 19284428 9290015 6631560 10212685 14287611 14141886 9776828
37046 9776828 5298491 4381058 6003863 5859010 2342393 -823766 754975 6345393
37038 6345393 10569045 9347226 4865530 4704736 14680542 30931473 41278244 38173313
37030 38173313 28532577 25224964 29894598 31854047 24771528 15026658 9509545 4724336
37022 4724336 -4471352 -13086686 -12691513 -4925376 1317301 2508265 778476 -4814729
37014 -4814729 -16254751 -27456304 -28373391 -18427970 -6364713 2224475 6781448 3426030
37006 3426030 -10966748 -25812055 -24213464 -7632841 3012863 -2087870 -6672633 4978417
36998 4978417 22377194 25762089 16421522 10908823 12548942 9546838 -603469 -5157852
$$ packed form
37054C4905546m360975j1260143r994413k658455L581125M074926j45725m365058
37046I776828m478337r17433J622805j44853l516617l166159J578741N590418
37038F345393M223652j221819m481696j60794R975806J6250931J0346771l104931
37030C8173313r640736l307613M669634J959449p082519r744870n517113m785209
37022D724336r195688q615334L95173P766137O242677J190964j729789n593205
37014d814729j1440022j1201553r17087R945421J2063257Q589188M556973l355418
37006C426030j4392778j4845307J598591J6580623J0645704n100733m584763J1651050
36998D978417J7398777L384895r340567n512699J640119l002104j0150307m554383
$$ plain form
36990 -5157852 2227261 10822408 9572418 1072840 -7226636 -13853055 -18422448 -16454663
36982 -16454663 -7405922 -20621 -1502004 -7105335 -7420009 -538661 9614746 21269838
36974 21269838 33200840 39781182 36601979 28749426 25337833 27110945 27196684 23293050
36966 23293050 20592053 21546176 21027585 14997527 7375349 3929479 4341456 4905938 4882456
36957 4882456 4879144 2181000 -5981802 -15702346 -18967211 -13319328 -4010886 3857662 10091970
36948 10091970 15327269 18068037 18303364 18540211 17784440 10210694 -4899683 -16803190
36940 -16803190 -13780639 2832194 21307982 33148044 37238390 34264473 26673650 22352860
36932 22352860 27358137 34651825 31218679 17715353 8674594 10165892 11375397 4749973
$$ packed form
36990e157852P385113Q595147j249990q499578q299476o626419m569393J967785
36982a6454663R048741P385301j481383n603331l14674O881348J0153407J1655092
36974B1269838J1931002O580342l179203p852553l411593J773112Q5739l903634
36966B3293050k700997R54123n18591o030058p622178l445870M11977N64482k3482
36957D882456l312k698144q162802r720544l264865N647883R308442P868548O234308
36948A0091970N235299K740768K35327K36847p55771p573746j5110377j1903507
36940a6803190L022551J6612833J8475788J1840062M090346k973917p590823m320790
36932B2352860N005277P293688l433146j3503326r040759J491298J209505o625424
$$ plain form
36924 4749973 -378391 4896513 11748648 8600701 2638331 8153833 20466623 22184068
36916 22184068 13177112 12231917 25142066 32274277 17776708 -5748499 -15217811 -7988939
36908 -7988939 -281830 -1811105 -6530810 -6366923 -1832006 2078359 1930977 -3556762
36900 -3556762 -12395921 -17539800 -11876203 2869180 15934232 18109618 10281385 369401
36892 369401 -6043161 -10001509 -14467321 -17616045 -14081252 -4066646 2626759 -3387434
36884 -3387434 -18445598 -29080399 -28289649 -22476175 -20405334 -21651171 -19977058 -13021145
36876 -13021145 -3266751 7391478 18302772 26321857 26613392 18832787 10124075 9353767
36868 9353767 16920292 21370202 10740107 -10210946 -19909004 -4182274 23815979 38473254
$$ packed form
36924D749973n128364N274904O852135l147947n962370N515502J2312790J717445
36916B2184068r006956r45195J2910149P132211j4497569k3525207r469312P228872
36908g988939P707109j529275m719705J63887M534917L910365j47382n487739
36900c556762q839159n143879N663597J4745383J3065052K175386p828233r911984
36892C69401o412562l958348m465812l148724L534793J0014606O693405o014193
36884c387434j5058164j0634801P90750N813474K070841j245837J674113O955913
36876a3021145R754394J0658229J0911294Q019085K91535p780605q708712p70308
36868I353767P566525M449910j0630095k0951053r698058J5726730K7998253J4657275
$$ plain form
36860 38473254 34501403 30983248 40355038 49380702 40472123 18793801 3870818 2099225
36852 2099225 3048353 -482734 -4251423 -5094623 -8101365 -17489904 -30169580 -41689796
36844 -41689796 -50013707 -50897371 -39319148 -20044647 -7487033 -8397680 -12231652 -6284987
36836 -6284987 6336044 13486799 13721070 16639321 23709763 22296701 5351433 -13056658
36828 -13056658 -13188179 3391040 14538279 6565189 -9009042 -13809866 -8086527 -7091823
36820 -7091823 -17109563 -27994885 -29629977 -23556824 -14910956 -4355466 5349436 4807572
36812 4807572 -10106324 -28210132 -35149451 -31398547 -27926829 -27337254 -21862835 -10409534
36804 -10409534 -4336821 -10419989 -17702080 -10205765 11551553 29977774 30811531 17792860
$$ packed form
36860C8473254l971851l518155R371790R025664q908579k1678322j4922983j771593
36852B099225R49128l531087l768689q43200l006742r388539j2679676j1520216
36844d1689796q323911q83664J1578223J9274501J2557614r10647l833972N946665
36836f284987J2621031P150755K34271K918251P070442j413062j6945268j8408091
36828a3056658j31521J6579219J1147239p973090j5574231m800824N723339R94704
36820g091823j0017740j0885322j635092O073153Q645868J0555490R704902n41864
36812D807572j4913896j8103808o939319L750904L471718N89575N474419J1453301
36804a0409534O072713o083168p282091P496315K1757318J8426221Q33757j3018671
$$ plain form
36796 17792860 5161100 224633 -1724019 -5864971 -7460747 1799901 19693161 33190062
36788 33190062 33675844 25590685 16940294 8586764 -1454925 -9891146 -12520899 -12108489
36780 -12108489 -13074411 -11878769 -2651288 9654324 12876734 4934822 -3282165 -4629625
36772 -4629625 -4806854 -10226424 -16248519 -14509032 -5573578 2841392 6166204 5158523
36764 5158523 698527 -7372782 -16825575 -22733850 -21192868 -12382026 -1515322 2691330
36756 2691330 -5955880 -23994720 -39287233 -41507781 -30738146 -15020740 -1518423
36749 -1518423 8541253 17342749 24073644 22402977 7859105 -11506141 -18690781 -7996910
36741 -7996910 4255209 -963572 -19085480 -27342884 -15688337 2038356 11120157 15020188
$$ packed form
36796A7792860j2631760m936467j948652m140952j595776R260648J7893260J3496901
36788C3190062M85782q085159q650391q353530j0041689q436221k629753M12410
36780a2108489r65922J195642R227481J2305612L222410p941912q216987j347460
36772d629625j77229n419570o022095J739487Q935454Q414970L324812j007681
36764E158523m459996q071309r452793n908275J540982Q810842J0866704M206652
36756B691330q647210j8038840j5292513k220548J0769635J5717406J3502317
36749a518423J0059676Q801496O730895j670667j4543872j9365246p184640J0693871
36741g996910J2252119n218781j8121908q257404J1654547J7726693R081801L900031
$$ plain form
36733 15020188 22668709 29348741 23812064 8031540 -3653135 -3735025 630761 -560005
36725 -560005 -8824443 -19251307 -27484175 -31676470 -30666500 -23199810 -9938127 3558868
36717 3558868 8622865 2577717 -5494990 -4334529 5022518 12410693 15473897 21608549
36709 21608549 30698521 30578767 17502221 7083019 12370238 22455284 18511302 2980042
36701 2980042 -4828458 1990508 11001057 12058083 8702139 5696223 940327 -5383073
36693 -5383073 -6757716 -1080400 5011930 6791251 6159496 2581576 -8356681 -22066533
36685 -22066533 -23492517 -7211557 11375441 14908871 6349433 2530537 11487443 26047621
36677 26047621 35983726 37499768 32789584 27238568 25539384 26156716 22999508 16155945
$$ packed form
36733A5020188P648521O680032n536677j5780524j1684675q1890M365786j190766
36725e60005q264438j0426864q232868m192295J009970P466690J3261683J3496995
36717C558868N063997o045148q072707J160461R357047P388175L063204O134652
36709B1608549R089972j19754j3076546j0419202N287219J0085046l943982j5531260
36701B980042p808500O818966R010549J057026l355944l005916m755896o323400
36693e383073j374643N677316O092330J779321o31755l577920j0938257j3709852
36685b2066533j425984J6280960J8586998L533430q559438l818896Q956906J4560178
36677B6047621R936105J516042m710184n551016j699184O17332l157208o843563
$$ plain form
36669 16155945 14799666 23778798 34210737 35486520 30463799 28586167 28561934 20332548
36661 20332548 3506958 -8319614 -4956357 7307137 14227700 9585625 -1112401
36654 -1112401 -9449050 -13423967 -18251625 -27622574 -35026968 -29183633 -10632791 4693236
36646 4693236 5213680 -484460 1971616 9198774 6188682 -6590259 -10653288 2039951
36638 2039951 15765891 15447535 9271552 13185859 23616210 22452759 4811468 -14173243
36630 -14173243 -20788202 -18017530 -16533553 -20530430 -26652956 -29956288 -27166418 -18945770
36622 -18945770 -11372664 -10961731 -16742253 -21172320 -19266355 -12542485 -4734459 461228
36614 461228 -1760463 -12368655 -21165542 -13785306 9471048 29548083 29319180 12586430
$$ packed form
36669A6155945j356279Q979132J0431939J275783n022721j877632k4233q229386
36661B0332548j6825590j1826572L363257J2263494O920563m642075j0698026
36654a112401q336649l974917m827658r370949p404394N843335J8550842J5326027
36646D693236N20444n698140K456076P227158l010092j2778941m063029J2693239
36638B039951J3725940l18356o175983L914307J0430351j163451j7641291j8984711
36630a4173243o614959K770672J483977l996877o122526l303332K789870Q220648
36622a8945770P573106M10933n780522m430067J905965O723870P808026N195687
36614D61228k221691j0608192q796887P380236K3256354K0077035k28903j6732750
$$ plain form
36606 12586430 -3138583 -7118473 -2146249 4159945 6965905 5616721 3886032 6892109
36598 6892109 13076507 13348795 4158071 -3909027 586839 12324325 15995181 8606053
36590 8606053 2433869 4820772 7938568 3007474 -6652678 -13129166 -15051278 -14128964
36582 -14128964 -8876636 96809 5533472 3178680 393013 5750114 14615055 15535151
36574 15535151 8230821 3900887 7581882 11175558 7085799 -214497 -1340148 5169577
36566 5169577 12297969 13465636 8016745 7548 -5287714 -4792907 345776 6420199
36558 6420199 10850556 12698019 9981470 -158057 -16707827 -31942687 -36043506 -25953241
36550 -25953241 -9599823 384926 -880410 -5573257 -3918383 1666332 -307277 -12360788
$$ packed form
36606A2586430j5725013l979890M972224O306194K805960j349184j730689L006077
36598F892109O184398K72288r190724q067098M495866J1737486L670856p389128
36590H606053o172184K386903L117796m931094r660152o476488j922112R22314
36582a4128964N252328Q973445N436663k354792k785667N357101Q864941R20096
36574A5535151p304330m329934L680995L593676m089759p300296j125651O509725
36566E169577P128392J167667n448891q009197n295262M94807N138683O074423
36558F420199M430357J847463k716549j0139527j6549770j5234860m100819J0090265
36550b5953241J6353418R984749j265336m692847J654874N584715j973609j2053511
$$ plain form
36542 -12360788 -22006607 -19027613 -10820620 -11673104 -21986565 -28463885 -22438989 -7873131
36534 -7873131 7622529 19218875 22469762 15974733 8665616 13131401 27297871 33398593
36526 33398593 21518780 4320171 -415508 6117536 8207121 -394738 -9138231 -7542718
36518 -7542718 1066805 6801976 7541709 10049475 18633205 27967248 29806314 24940530
36510 24940530 23829643 33210197 46312100 51374800 46653879 39676418 33585305 24284698
36502 24284698 12289672 6054422 8303467 9221152 1149022 -8367082 -7880376 326299
36494 326299 5134475 4381586 4963246 7072060 2494400 -8502645 -11425817 3700366
36486 3700366 25842750 34013522 21673942 3032925 -4522206 851505 5607577 -2948509
$$ packed form
36542a2360788r645819K978994Q206993q52484j0313461o477320O024896J4565858
36534g873131J5495660J1596346L250887o495029p309117M465785J4166470O100722
36526C3398593j1879813j7198609m735679O533044K089585q601859q743493J595513
36518g542718Q609523N735171P39733K507766Q583730R334043J839066m865784
36510B4940530j110887R380554J3101903N062700m720921o977461o091113r300607
36502B4284698j1995026o235250K249045R17685q072130r516104M86706Q206675
36494C26299M808176p52889N81660K108814m577660j0997045k923172J5126183
36486C700366K2142384Q170772j2339580j8641017p555131N373711M756072q556086
$$ plain form
36478 -2948509 -22544525 -38193383 -37683254 -23270102 -7471974 439598 1384398 1483052
36470 1483052 3782802 6026412 5058149 1945322 1435336 5279416 8065063 3775163
36462 3775163 -4068534 -4898510 4408421 14075284 14388190 7698353 1783314 -2412760
36454 -2412760 -8080024 -12360696 -9371040 -1992523 -542173 -8703309 -19185445 -24644465
36446 -24644465 -24937827 -21837100 -14529236 -3337938 8677622 20342328 32286148 40656936
36438 40656936 39015973 29914372 26263947 35375268 47989537 49337580 36065289 16438535
36430 16438535 -1000108 -11738211 -12101731 -419371 18147294 33216589 36889742
36423 36889742 28541176 14082650 2243614 -2086007 -3574621 -11352972 -25184765 -32661797
$$ packed form
36478b948509j9596016j5648858N10129J4413152J5798128P911572R44800R8654
36470A483052K299750K243610r68263l112827n09986L844080K785647m289900
36462C775163p843697q29976R306931R666863L12906o689837n915039m196074
36454b412760n667264m280672K989656P378517J450350q161136j0482136n459020
36446b4644465k93362L100727P307864J1191298J2015560J1664706J1943820Q370788
36438D0656936j640963r101601l650425R111321J2614269J348043j3272291j9626754
36430A6438535j7438643j0738103l63520J1682360J8566665J5069295L673153
36423C6889742q348566j4458526j1839036m329621j488614p778351j3831793p477032
$$ plain form
36415 -32661797 -25690144 -13780613 -12458290 -22320657 -29599274 -26302762 -19354700 -17830424
36407 -17830424 -20270418 -18884084 -9880603 4616935 19918674 30039506 29897779 20364787
36399 20364787 8106787 -2498403 -13230552 -24039720 -26088956 -10341740 17640468
36392 17640468 38813644 39615686 25717719 13612167 11725749 14734458 15199691 13629960
36384 13629960 13236318 10401376 -1262444 -18069060 -26562750 -20387663 -9326007 -5309746
36376 -5309746 -5923009 -1035460 8560833 11708014 6551408 6457194 20027229 35389658
36368 35389658 34385506 17172399 2369012 3864848 16383663 25528583 24924490 19638413
36360 19638413 17065434 19442764 24735239 30862657 36399590 38340677 33493215 24339691
$$ packed form
36415c2661797O971653J1909531J322323r862367p278617L296512O948062J524276
36407a7830424k439994J386334R003481J4497538J5301739J0120832j41727r532992
36399B0364787j2258000j0605190j0732149j0809168k049236J5747216K7982208
36392A7640468K1173176Q02042j3897967j2105552j886418L008709M65233j569731
36384A3629960l93642k834942j1663820j6806616q493690O175087J1061656M016261
36376e309746o13263M887549R596293L147181n156606r4214J3570035J5362429
36368C5389658j004152j7213107j4803387J495836J2518815R144920o04093n286077
36360A9638413k572979K377330N292475O127418N536933J941087m847462r153524
$$ plain form
36352 24339691 19235999 21407556 21359816 9167560 -7267364 -9015510 5686906 14617676
36344 14617676 2120341 -17062096 -19039721 -4937340 5401230 6660668 11136350
36337 11136350 19566978 15754831 -1924347 -9095404 9195221 32558761 34425721 20128636
36329 20128636 12491643 12809759 4789580 -9077592 -7104767 12264533 21114479 4159704
36321 4159704 -15073695 -8194863 16727255 29298331 20562350 9928899 12570023 20843447
36313 20843447 20550457 9500565 -5508726 -18601984 -25501748 -22672574 -12776344 -6218212
36305 -6218212 -10506794 -19286349 -17306778 1719023 24748890 30762813 13625385 -10219899
36297 -10219899 -20804029 -17554423 -15495781 -20659680 -21400266 -8198634 9620423 16003211
$$ packed form
36352B4339691n103692K171557m7740j2192256j6434924j748146J4702416Q930770
36344A4617676j2497335j9182437j977625J4102381J0338570J259438M475682
36337A1136350Q430628l812147j7679178p171057J8290625K3363540J866960j4297085
36329B0128636p636993L18116q020179j3867172J972825J9369300Q849946j6954775
36321D159704j9233399O878832K4922118J2571076q735981j0633451K641124Q273424
36313B0843447k92990j1049892j5009291j3093258o899764K829174R896230O558132
36305f218212m288582q779555J979571J9025801K3029867O013923j7137428k3845284
36297a0219899j0584130L249606K058642n163899p40586J3201632J7819057O382788
$$ plain form
36289 16003211 8663041 -3304879 -16026821 -31671571 -44782606 -42329880 -21722467
36282 -21722467 1546921 10925857 7617973 6098368 14115802 23824633 23644629 14114950
36274 14114950 7302784 10686238 17224491 15986178 8482359 6130529 12558105 18549222
36266 18549222 16673594 10459580 4771657 -1815118 -8300206 -6498155 4943720 12314575
36258 12314575 5415373 -4638771 -1297875 11010307 14037498 4888719 -1758796 -334159
36250 -334159 -2540990 -13662869 -19520566 -7342020 13733188 24313645 18743362 8254839
36242 8254839 5487287 12299088 19146065 13683717 -5282953 -22298396 -21111104 -5403183
36234 -5403183 6461666 7142008 7542179 15979833 24812549 24152166 16230042 8502530
$$ packed form
36289A6003211p340170j1967920j2721942j5644750j3111035K452726K0607413
36282b1722467K3269388R378936l307884j519605Q017434R708831j80004r529679
36274A4114950o812166L383454O538253j238313p503819k351830O427576N991117
36266A8549222j875628o214014n687923o586775o485088J802051J1441875P370855
36258A2314575o899202j0054144L340896J2308182L027191r148779o647515J424637
36250c34159k206831j1121879n857697J2178546K1075208J0580457n570283j0488523
36242H254839k767552O811801O846977n462348j8966670j7015443J187292J5707921
36234e403183J1864849O80342M00171Q437654Q832716o60383p922124p727512
$$ plain form
36226 8502530 3013382 -644582 -2011340 -5064410 -15301641 -25968833 -21179280 -724321
36218 -724321 13172986 5012168 -12006667 -16278233 -7244540 342729 171615 -4191801
36210 -4191801 -12286820 -23816805 -29798940 -23561651 -14593331 -15008326 -18573137 -11165734
36202 -11165734 3443471 8377885 1373817 -3058123 612732 1284968 -7631854 -17996528
36194 -17996528 -22739520 -25431489 -28456447 -26334904 -16877607 -6459229 635782 6325621
36186 6325621 9129411 3737790 -6369385 -10019289 -6369804 -7192917 -15930222 -20058412
36178 -20058412 -11902959 -1961556 -1654004 -5967182 -3816581 5860099 18504857 32899226
36170 32899226 44911972 43798485 27405644 11282087 9472089 14950093 12888307 5154476
$$ packed form
36226H502530n489148l657964j366758l053070j0237231j0667192M789553K0454959
36218g24321J3897307q160818j7018835m271566R033693P587269j71114m363416
36210d191801q095019j1529985n982135O237289Q968320m14995l564811P407403
36202a1165734J4609205M934414p004068m431940L670855O72236q916822j0364674
36194a7996528m742992k691969l024958K121543R457297J0418378P095011N689839
36186F325621K803790n391621j0107175l649904L649485q23113q737305m128190
36178b0058412Q155453R941403L07552m313178K150601R676680J2644758J4394369
36170C2899226J2012746j113487j6392841j6123557j809998N478004k061786p733831
$$ plain form
36162 5154476 5741566 17264233 28323446 31657016 29447020 21687698 5106817 -14269449
36154 -14269449 -21884080 -12944335 896901 7889309 9652716 13115251 17936688 19536823
36146 19536823 19054363 22144319 29359719 33850942 29559865 18362141 7566028 1849138
36138 1849138 -220584 -1252829 678630 9077444 20731879 25343212 16102159 -2354742
36130 -2354742 -18994641 -26987428 -27623523 -26870444 -30059131 -36583323 -37784635 -24358782
36122 -24358782 810486 21162448 22215470 6407473 -11386854 -20493488 -22282094
36115 -22282094 -22919263 -23119812 -17370885 -3210756 10520690 9731514 -7121939 -23070055
36107 -23070055 -22942366 -15332637 -21461792 -43183093 -58409813 -52877936 -39550909 -36459537
$$ packed form
36162E154476N87090J1522667J1059213L333570k209996p759322j6580881j9376266
36154a4269449p614631Q939745J3841236O992408J763407L462535M821437J600135
36146A9536823m82460L089956P215400M491223m291077j1197724j0796113n716890
36138A849138k069722j032245J931459Q398814J1654435M611333r241053j8456901
36130b354742j6639899p992787o36095P53079l188687o524192j201312J3425853
36122b4358782K5169268K0351962J053022j5807997j7794327r106634j788606
36115b2282094o37169k00549N748927J4160129J3731446p89176j6853453j5948116
36107b3070055J27689P609729o129155k1721301j5226720N531877J3327027L091372
$$ plain form
36099 -36459537 -40462499 -37620168 -27915187 -22080396 -21014757 -16545882 -9414159 -9059507
36091 -9059507 -15871011 -19612746 -16712196 -14233442 -14552470 -10832739 -1576724 4351220
36083 4351220 2647265 658626 3245724 3981438 -1492577 -4992738 604753 6397279
36075 6397279 -1090108 -18149291 -25984987 -14238356 6807975 18746485 13313197 -3120621
36067 -3120621 -18182171 -24185995 -22445382 -18995864 -17128213 -15458063 -12254386 -7938003
36059 -7938003 -2854975 3276648 8487467 9411104 6636386 4724658 5012943 3478095
36051 3478095 -1600196 -5444487 -4207428 -1216789 -697409 -373425 2946191 4554660
36043 4554660 -2697147 -15485163 -21333513 -14184399 -1375824 7028180 8792593 5943281
$$ packed form
36099c6459537m002962K842331R704981N834791J065639M468875P131723L54652
36091i059507o811504l741735K900550K478754l19028L719731R256015N927944
36083D351220j703955j988639K587098P35714n474015l500161N597491N792526
36075F397279p487387j7059183p835696J1746631K1046331J1938510n433288j6433818
36067c120621j5061550o003824J740613L449518J867651J670150L203677M316383
36059g938003N083028O131623N210819R23637k774718j911728K88285j534848
36051C478095n078291l844291J237059K990639N19380L23984L319616J608469
36043D554660p251807j2788016n848350P149114J2808575Q404004J764413k849312
$$ plain form
36035 5943281 -1996659 -14280301 -23176056 -20926189 -11654049 -7686672 -12288755 -14737983
36027 -14737983 -7543385 -572293 -8676029 -29341753 -43967376 -41728813 -31090701 -23822910
36019 -23822910 -18371692 -7486230 5312389 8530083 67953 -8333467 -5448870 7753135
36011 7753135 22308773 30927542 31463661 26380311 21868280 23464639 29470889 31716098
36003 31716098 25708856 17478442 16820772 24804477 31691962 28526971 18126829 10869873
35995 10869873 9657379 4783392 -11316513 -28739504 -29333737 -11480529 5501352 6428273
35987 6428273 -1124385 -1859902 3533989 3216282 -3127684 -2876580 7889252 16528995
35979 16528995 12524172 2165958 -2186728 1348728 5772311 7018367 6690415 6510596
$$ packed form
36035E943281p939940j2283642q895755K249867R272140L967377m602083k449228
36027a4737983P194598O971092q103736k0665724j4625623K238563J0638112P267791
36019b3822910N451218J0885462J2798619L217694q462130q401420K884597J3202005
36011G753135J4555638Q618769N36119n083350m512031J596359O006250K245209
36003C1716098o007242q230414o57670P983705O887485l164991j0400142p256956
35995A0869873j212494m873987j6099905j7422991n94233J7853208J6981881R26921
35987F428273p552658p35517N393891l17707o343966K51104J0765832Q639743
35979A6528995m004823j0358214m352686L535456M423583J246056l27952j79819
$$ plain form
35971 6510596 6173083 5139651 2934607 -506467 -2552470 1140356 10674110 19189609
35963 19189609 18422029 6053396 -12185883 -25410669 -24140819 -8784333 8735821
35956 8735821 16766075 16977173 20167747 29821045 37290447 34342656 22972470 10644644
35948 10644644 2789228 2114528 7765609 12255620 7104173 -4611402 -9304296 -1469707
35940 -1469707 6718672 1350428 -14063745 -23362453 -17526597 -2144615 12264573 20277874
35932 20277874 22476416 21324905 16840044 5776458 -12034759 -26721469 -24825496 -6203550
35924 -6203550 12351639 15884423 8062096 3189491 6817531 11972072 11467661 6270398
35916 6270398 2449132 5301620 15636406 27857184 33609662 31087140 27945342 30619830
$$ packed form
35971F510596l37513j033432k205044l441074k046003L692826R533754Q515499
35963A9189609p67580j2368633j8239279j3224786J269850J5356486J7520154
35956H735821Q030254K11098L190574R653298P469402k947791j1370186j2327826
35948A0644644p855416o74700N651081M490011n151447j1715575m692894P834589
35940a469707Q188379n368244j5414173r298708N835856J5381982J4409188Q013301
35932B0277874K198542j151511m484861j1063586j7811217j4686710J895973J8621946
35924f203550J8555189L532784p822327m872605L628040N154541n04411n197263
35916F270398l821266K852488J0334786J2220778N752478k522522l141798K674488
$$ plain form
35908 30619830 33857038 26794202 8382172 -8744991 -11099811 1318928 14523391
35901 14523391 14629265 2753492 -6700765 -4902180 -341252 -4666113 -12625526 -9375251
35893 -9375251 4360126 11239261 4060722 -4372012 -4737716 -5545463 -12522606 -12627115
35885 -12627115 3747715 20329863 16738506 1745828 797096 17008682 29783597
35878 29783597 29641770 28239875 31527532 29041299 17739311 12888000 22726830 31403011
35870 31403011 21888802 1420697 -10814469 -10232866 -6440878 -4678804 -2232632 1429967
35862 1429967 3468757 4084786 4748945 2994865 -2853510 -7212298 -3602774 5414813
35854 5414813 11982064 13494451 12177845 7442501 -3031163 -16113793 -24738811 -26297701
$$ packed form
35908C0619830L237208p062836j8412030j7127163k354820J2418739J3204463
35901A4523391J05874j1875773r454257J798585M560928m324861p959413L250275
35893i375251J3735377O879135p178539q432734l65704q07747o977143j04509
35885a2627115J6374830J6582148l591357j4992678r48732J6211586J2774915
35878B9783597j41827j401895L287657k486233j1301988m851311R838830Q676181
35870C1403011r514209k0468105j2235166N81603L791988J762074K446172L662599
35862A429967K038790O16029O64159j754080n848375m358788L609524R017587
35854E414813O567251J512387j316606m735344j0473664j3082630q625018j558890
$$ plain form
35846 -26297701 -23629003 -18534312 -10375575 -1002581 4514040 3175787 -3227051 -10530784
35838 -10530784 -14426115 -11464314 -1780539 9102993 14084376 10561711 1699594 -7077652
35830 -7077652 -11453681 -10010368 -4957945 -376912 1166981 -709463 -5984891 -13234570
35822 -13234570 -17268261 -13046486 -3340417 2885833 1995434 30524 2700375 7499516
35814 7499516 10585821 14993707 24468267 33535237 32623271 21605717 10101226 4443597
35806 4443597 2209215 673590 2231970 7408580 9593767 3660274 -3837667 -830281
35798 -830281 13949310 27642929 28739928 20234143 12742829 9002078 2864420 -7303897
35790 -7303897 -13303976 -8976113 -529300 1282303 -4492457 -8847050 -5200465 3647533
$$ packed form
35846b6297701K668698N094691Q158737R372994N516621j338253o402838p303733
35838a0530784l895331K961801R683775J0883532M981383l522665q862117q777246
35830g077652m376029J443313N052423M581033J543893j876444n275428p249679
35822a3234570m033691M221775R706069O226250q90399j964910K669851M799141
35814G499516L086305M407886R474560R066970r11966j1017554j1504491n657629
35806D443597k234382j535625J558380N176610K185187n933493p497941L007386
35798h30281J4779591J3693619J096999q505785p491314l740751o137658j0168317
35790g303897o000079M327863Q446813J811603n774760m354593L646585Q847998
$$ plain form
35782 3647533 10132239 9028187 780882 -8574890 -12117637 -9538550 -7235923 -8218764
35774 -8218764 -7183267 -512719 5407848 3866445 -301563 935445 3637548 -1807441
35766 -1807441 -12083586 -13611607 -4178900 3007165 -326624 -7148755 -8994095 -6476077
35758 -6476077 -1320545 7786988 15325677 9954646 -6070972 -13381209 -2532360 9568335
35750 9568335 4297494 -10246152 -12847310 -2177862 3466859 -4235283 -13285200 -11837749
35742 -11837749 -3208466 3591120 6412592 8242648 10947040 14426632 16803233 14392298
35734 14392298 6395316 -887946 108117 8881613 18029525 21837024 18929962 9506439
35726 9506439 -3923067 -15420484 -21001606 -22824037 -23454373 -20151972 -10300289 2377445
$$ packed form
35782C647533O484706j104052q247305r355772l542747K579087K302627r82841
35774h218764J035497O670548N920567j541403m168008J237008K702103n444989
35766a807441j0276145j528021R432707P186065l333789o822131j845340K518018
35758f476077N155532R107533P538689n371031j6025618p310237J0848849J2100695
35750I568335n270841j4543646k601158J0669448N644721p702142r049917J447451
35742a1837749Q629283O799586K821472J830056K704392L479592K376601k410935
35734A4392298p996982p283262R96063Q773496R147912L807499k907062r423523
35726I506439j3429506j1497417n581122j822431o30336L302401R851683J2677734
$$ plain form
35718 2377445 13219831 22933566 31931806 34619240 27114132 14434504 2161653 -11142964
35710 -11142964 -23899874 -24151129 -6573820 11251212 6994170 -16122664 -33918253
35703 -33918253 -32998228 -20610619 -5362500 11912312 26432688 28088548 17337305
35696 17337305 7161056 4599208 4397335 3821864 7785691 15207710 16879161 12299653
35688 12299653 12044430 17342779 15126059 1714153 -6823249 551303 11552718 10790303
35680 10790303 3105299 852098 801469 -8037003 -22011210 -26189036 -16053920 -1274823
35672 -1274823 9210245 13776867 12887441 8196177 4658566 5518654 8504825 12067345
35664 12067345 17979433 22408821 15766652 -441083 -9954997 -5821178 -2926464 -11830287
$$ packed form
35718B377445J0842386R713735Q998240K687434p505108j2679628j2272851j3304617
35710a1142964j2756910k51255J7577309J7825032m257042k3116834j7795589
35703c3918253R20025J2387609J5248119J7274812J4520376J655860j0751243
35696A7337305j0176249k561848k01873n75471L963827P422019J671451m579508
35688A2299653k55223N298349k216720j3411906q537402P374552J1001415p62415
35680A0790303p685004k253201n0629q838472j3974207m177826J0135116J4779097
35672a274823J0485068M566622q89426m691264l537611Q60088K986171L562520
35664A2067345N912088M429388o642169j6207735r513914M133819K894714q903823
$$ plain form
35656 -11830287 -17105365 -3290353 12923256 5276387 -16611385 -17548591 8918184 30502094
35648 30502094 26227300 13251183 10954448 9480971 -5162408 -19890138 -14729250 2311006
35640 2311006 7340881 -2267152 -8266681 -3795353 -801018 -5875571 -11065682 -11989885
35632 -11989885 -15494186 -23298201 -24603793 -12725103 4112825 15889254 22664109 26092104
35624 26092104 21795822 10305173 4117042 10732041 17463416 8509405 -8579282 -11179306
35616 -11179306 4687377 17402621 11106890 -2892394 -5351683 4196189 12672969 14987801
35608 14987801 15009493 11072450 -2780967 -21738543 -31251250 -25615026 -13611271 -3316548
35600 -3316548 6571635 16613648 20344505 14760906 7135050 4593139 5650376 7963812
$$ packed form
35656a1830287n275078J3815012J6213609p646869k1887772r37206K6466775K1583910
35648C0502094m274794j2976117k296735j473477j4643379j4727730N160888J7040256
35640B311006N029875r608033n999529M471328K994335n074553n190111r24203
35632a1989885l504301p804015j305592J1878690J6837928J1776429O774855L427995
35624B6092104m296282j1490649o188131O614999O731375q954011j7088687k600024
35616a1179306J5866683J2715244o295731j3999284k459289R547872Q476780K314832
35608A4987801K1692l937043j3853417j8957576r512707N636224J2003755J0294723
35600c316548R888183J0042013L730857n583599p625856k541911J057237K313436
$$ plain form
35592 7963812 14060135 21403363 17620165 -3104913 -27372137 -38432444 -37485280 -36207474
35584 -36207474 -35147300 -25919089 -11252245 -4832513 -9946941 -14545040 -11157127 -6795425
35576 -6795425 -7669117 -8316869 -3995523 -1298870 -5646106 -7713083 4817532 26707597
35568 26707597 38567135 30341863 12143411 337088 -208120 2584763 -215947 -9106425
35560 -9106425 -17189502 -17882737 -10462511 809630 10209529 12403409 4613009 -9418660
35552 -9418660 -19893120 -19439383 -9865059 2167225 12516260 18336067 14805262 1316890
35544 1316890 -12253474 -14908509 -8554352 -3067047 763675 10983877 26671362 34533409
35536 34533409 28057997 17559046 14479763 16754794 17271507 16131663 15190920 9956149
$$ packed form
35592G963812O096323P343228l783198k0725078k4267224j1060307R47164J277806
35584c6207474J060174R228211J4666844O419732n114428m598099L387913M361702
35576f795425q73692o47752M321346K696653m347236k066977J2530615K1890065
35568B6707597J1859538q225272j8198452j1806323n45208K792883k800710q890478
35560i106425q083077o93235P420226J1272141R399899K193880p790400j4031669
35552i418660j0474460M53737R574324J2032284J0349035N819807l530805j3488372
35544A316890j3570364k655035O354157N487305L830722J0220202J5687485P862047
35536C4533409o475412j0498951l079283K275031N16713j139844r40743n234771
$$ plain form
35528 9956149 -2231930 -13550023 -16299415 -15456643 -18829436 -20711924 -9301505 12542441
35520 12542441 28075796 28319377 20483734 13554130 7471445 -57659 -6479136 -9125192
35512 -9125192 -9520701 -8805224 -5090129 1434770 6898606 10209172 14928454 21525889
$$ packed form
35528I956149j2188079j1318093k749392Q42772l372793j882488J1410419K1843946
35520A2542441J5533355K43581p835643o929604o082685p529104o421477k646056
35512i125192l95509P15477L715095O524899N463836L310566M719282O597435
$$ [...]
##END NTUPLES=NMR SPECTRUM
##END=
