##TITLE=31Pdec_IBM1003
 CDCl3, 24 sc
 12.3.2019
##JCAMPDX= 6.0         $$ Bruker NMR JCAMP-DX V2.0
##DATA TYPE= NMR FID
##DATA CLASS= NTUPLES
##ORIGIN= UXNMR, Bruker Analytische Messtechnik GmbH
##OWNER= root
$$ XWIN-NMR		Version 3.5
$$ Tue Mar 12 14:51:39 2019 Russian Standard Time (UT+4h)  she@DPX200
##.OBSERVE FREQUENCY= 81.013821
##.OBSERVE NUCLEUS= ^31P
##.DELAY= (6, 6)
##.ACQUISITION MODE= SIMULTANEOUS
##.ACQUISITION SCHEME= undefined
##.AVERAGES= 24
##.DIGITISER RES= 17
##SPECTROMETER/DATA SYSTEM= spect
##.PULSE SEQUENCE= zgpg30
##.SOLVENT NAME= CDCl3
##.SHIFT REFERENCE= (INTERNAL, CDCl3, 0, 243.863)
##AUDIT TRAIL= $$ (NUMBER, WHEN, WHO, WHERE, WHAT)
$$ ##TITLE= Audit trail, XWIN-NMR		Version 3.5
$$ ##JCAMPDX= 5.01
$$ ##ORIGIN= Bruker BioSpin GmbH
$$ ##OWNER= she
$$ F:/spectra/data/she/nmr/P31/1/audita.txt
$$ ##AUDIT TRAIL=  $$ (NUMBER, WHEN, WHO, WHERE, WHAT)
(   1,<2019-03-12 14:50:02.65 +0400>,<she>,<DPX200>,
      <created by zg, POWCHK disabled, PULCHK disabled
       configuration hash MD5:
       00 E9 B6 7A A2 85 ED C7 34 08 36 98 17 FE 4E 26
       data hash MD5: 32K
       51 D8 15 4D 37 D9 5A 7E EF AF F9 E8 FA B8 93 87>)
$$ ##END=
$$ 
$$ hash MD5
$$ 53 89 83 AF 90 CD E6 41 57 73 95 E5 F0 31 52 96
##$RELAX= 
##$RELAX= 
##$RELAX= 
##$RELAX= 
##$RELAX= 
##$RELAX= 
##$RELAX= 
##$RELAX= 
$$ Bruker specific parameters
$$ --------------------------
##$DU= <F:/spectra>
##$EXPNO= 1
##$NAME= <P31>
##$PROCNO= 1
##$TYPE= <nmr>
##$USER= <she>
##$AMP= (0..31)
100 100 100 100 100 100 100 100 100 100 100 100 100 100 100 100 100 100 
100 100 100 100 100 100 100 100 100 100 100 100 100 100 
##$AQSEQ= 0
##$AQ_mod= 1
##$AUNM= <au_zg>
##$AUTOPOS= <>
##$BF1= 81.014009
##$BF2= 200.13
##$BF3= 200.13
##$BF4= 200.13
##$BF5= 200.13
##$BF6= 200.13
##$BF7= 200.13
##$BF8= 200.13
##$BYTORDA= 1
##$CFDGTYP= 0
##$CFRGTYP= 5
##$CHEMSTR= <none>
##$CNST= (0..31)
1 1 145 1 1 1 1 1 1 1 1 1 1 1 1 1 1 1 1 1 1 1 1 1 1 1 1 1 1 1 1 1 
##$CPDPRG= <waltz16>
##$CPDPRG1= <>
##$CPDPRG2= <waltz16>
##$CPDPRG3= <>
##$CPDPRG4= <mlev>
##$CPDPRG5= <mlev>
##$CPDPRG6= <mlev>
##$CPDPRG7= <mlev>
##$CPDPRG8= <mlev>
##$CPDPRGB= <>
##$CPDPRGT= <>
##$D= (0..31)
0 1 0 0 0 0 0 0 0 0 0 0.03 2e-05 3e-06 0 0 0 0 0 0 0 0 0 0 0 0 0 0 0 0 
0 0 
##$DATE= 1552387802
##$DBL= (0..7)
120 120 120 11 120 120 24 19 
##$DBP= (0..7)
150 150 150 150 150 150 150 150 
##$DBP07= 0
##$DBPNAM0= <>
##$DBPNAM1= <>
##$DBPNAM2= <>
##$DBPNAM3= <>
##$DBPNAM4= <>
##$DBPNAM5= <>
##$DBPNAM6= <>
##$DBPNAM7= <>
##$DBPOAL= (0..7)
0.5 0.5 0.5 0.5 0.5 0.5 0.5 0.5 
##$DBPOFFS= (0..7)
0 0 0 0 0 0 0 0 
##$DE= 6
##$DECBNUC= <off>
##$DECIM= 4
##$DECNUC= <off>
##$DECSTAT= 4
##$DIGMOD= 1
##$DIGTYP= 9
##$DL= (0..7)
0 0 52 120 120 21 21 25 
##$DP= (0..7)
150 150 150 150 150 150 150 150 
##$DP07= 0
##$DPNAME0= <>
##$DPNAME1= <>
##$DPNAME2= <>
##$DPNAME3= <>
##$DPNAME4= <>
##$DPNAME5= <>
##$DPNAME6= <>
##$DPNAME7= <>
##$DPOAL= (0..7)
0.5 0.5 0.5 0.5 0.5 0.5 0.5 0.5 
##$DPOFFS= (0..7)
0 0 0 0 0 0 0 0 
##$DQDMODE= 0
##$DR= 17
##$DS= 0
$$ [...]
##$SUBNAM1= <"">
##$SUBNAM2= <"">
##$SUBNAM3= <"">
##$SUBNAM4= <"">
##$SUBNAM5= <"">
##$SUBNAM6= <"">
##$SUBNAM7= <"">
##$SUBNAM8= <"">
##$SUBNAM9= <"">
##$SW= 369.568048894756
##$SWIBOX= (0..15)
0 1 3 0 0 0 0 0 0 0 0 0 0 0 0 0 
##$SW_h= 29940.119760479
##$TD= 32768
##$TD0= 1
##$TE= 0
##$TE2= 300
##$TE3= 300
##$TEG= 300
##$TL= (0..7)
0 120 53 12 22 120 120 120 
##$TP= (0..7)
150 150 150 150 150 150 150 150 
##$TP07= 0
##$TPNAME0= <>
##$TPNAME1= <>
##$TPNAME2= <>
##$TPNAME3= <>
##$TPNAME4= <>
##$TPNAME5= <>
##$TPNAME6= <>
##$TPNAME7= <>
##$TPOAL= (0..7)
0.5 0.5 0.5 0.5 0.5 0.5 0.5 0.5 
##$TPOFFS= (0..7)
0 0 0 0 0 0 0 0 
##$TUNHIN= 0
##$TUNHOUT= 0
##$TUNXOUT= 0
##$USERA1= <user>
##$USERA2= <user>
##$USERA3= <user>
##$USERA4= <user>
##$USERA5= <user>
##$V9= 5
##$VALIST= <valist>
##$VCLIST= <CCCCCCCCCCCCCCC>
##$VD= 0
##$VDLIST= <DDDDDDDDDDDDDDD>
##$VPLIST= <PPPPPPPPPPPPPPP>
##$VTLIST= <TTTTTTTTTTTTTTT>
##$WBST= 1024
##$WBSW= 4
##$XGAIN= (0..3)
0 0 0 0 
##$XL= 0
##$YL= 0
##$YMAX_a= 42156
##$YMIN_a= -43919
##$ZGOPTNS= <>
##$ZL1= 120
##$ZL2= 120
##$ZL3= 120
##$ZL4= 120
##$ABSF1= 60
##$ABSF2= -190
##$ABSG= 5
##$ABSL= 3
##$ALPHA= 0
##$AQORDER= 0
##$ASSFAC= 0
##$ASSFACI= 0
##$ASSFACX= 0
##$ASSWID= 0
##$AUNMP= <proc_1d>
##$AZFE= 0.1
##$AZFW= 0.5
##$BCFW= 1
##$BC_mod= 2
##$BYTORDP= 1
##$COROFFS= 0
##$CY= 9.86611175537109
##$DATMOD= 1
##$DC= 1
##$DFILT= <>
##$DTYPP= 0
##$F1P= 182.46299112037
##$F2P= -745.623069630181
##$FCOR= 0.5
##$FTSIZE= 0
##$FT_mod= 0
##$GAMMA= 1
##$GB= 0
##$INTBC= 1
##$INTSCL= 1
##$ISEN= 30
##$LB= 1
##$LEV0= 0
##$LPBIN= 0
##$MAXI= 11.51145
##$MC2= 0
##$MEAN= 0
##$ME_mod= 0
##$MI= 1.244541
##$NCOEF= 0
##$NC_proc= 0
##$NLEV= 6
##$NOISF1= 0
##$NOISF2= 0
##$NSP= 1
##$NTH_PI= 0
##$NZP= 1
##$OFFSET= 243.8632
##$PC= 1.4
##$PHC0= -1996.048
##$PHC1= 524.999
##$PH_mod= 0
##$PKNL= yes
##$PPARMOD= 0
##$PSCAL= 0
##$PSIGN= 0
##$REVERSE= no
##$SF= 81.0140731611343
##$SI= 65536
##$SIGF1= 0
##$SIGF2= 0
##$SINO= 80
##$SIOLD= 65536
##$SREGLST= <31P.CDCl3>
##$SSB= 0
##$STSI= 0
##$STSR= 0
##$SW_p= 25641.0256410257
##$SYMM= 0
##$S_DEV= 0
##$TDeff= 0
##$TDoff= 0
##$TI= <>
##$TILT= no
##$TM1= 0
##$TM2= 0
##$TOPLEV= 0
##$USERP1= <user>
##$USERP2= <user>
##$USERP3= <user>
##$USERP4= <user>
##$USERP5= <user>
##$WDW= 1
##$XDIM= 64
##$YMAX_p= 0
##$YMIN_p= 0
$$ End of Bruker specific parameters
$$ ---------------------------------
##NTUPLES= NMR FID
##VAR_NAME=  TIME,          FID/REAL,        FID/IMAG
##SYMBOL=    X,             R,               I
##VAR_TYPE=  INDEPENDENT,   DEPENDENT,       DEPENDENT
##VAR_FORM=  AFFN,          ASDF,            ASDF
##VAR_DIM=   16384,         16384,           16384
##UNITS=     SECONDS,       ARBITRARY UNITS, ARBITRARY UNITS
##FACTOR=    3.34e-05,      1,               1
##FIRST=     0,             0,               0
##LAST=      0.547192200000001, 0,           0
##MIN=       0,             -43919,          0
##MAX=       0.547192200000001, 42156,       0
$$ Real data points
##PAGE= N=1
##DATA TABLE= (X++(R..R)), XYDATA
$$ [...]
11659A807j881p69j192J884k657N44J760L215j474O99j894J756r63k39j238j652
11675b294j28J382J973k92K650j665Q12k188J382k433J32k020J701N03l20P09
11691i6p66K673p84J39j217j265R39k867J824j074L63K826K790j006J395k502
11707A372l38l24J24k255m37j89R66L582k261J005J126j983R58M33k831j419L53
11724b118J386M64P3Q76L81j065K16M69j989O87j936O06o55K154L0N91k90J281
11742A161M10J178j756k426p07P62J104q23J35R40K496P12r37k092l92k074J018
11759a291j910K383J24K67Q1J032J628m66n80R62k353k658J329R33j545K596K52
11776G84M89q33L12Q67k90j132j090k369P61J305K628P95j229o92J838O56j802
$$ y = [1807, -74, -843, -2035, -151, -2808, -2264, -504, 2711, 1237, 1936, 42, 1798, 835, 596, -642, -2294, -2422, -1040, 933, 641, 3291, 1626, 2438, 250, 1632, -801, -669, -2689, -988, -485, -805, -96, -862, 1811, 1027, 1166, -51, -1316, -377, -3244, -1420, -2494, -2131, 695, 3485, 2479, 3874, 1372, 1034, 710, 834, -1421, -1858, -2047, -1081, 2501, 240, 1245, 2371, 388, 1346, 1779, -1052, -2471, -2118, -732, -268, -195, 681, 1062, -3, 213, 682, -1307, -620, -2556, -1950, -2605, -451, -421, 170, -120, 1161, 1571, 2749, 993, -1433, -2140, -1378, -274, -1097, -962, -22, 2474, 3186, 2249, 157, -235, -2309, -1291, -3201, -818, -694, -427, -346, 686, 2314, 1848, 1268, 2230, -123, -2781, -1452, -519, -2064, 532, 784, 1273, 440, 752, 1619, 1329, 197, -893, -3262, -2501, -1196, 1432, 2227, 998, 306, 2144, 2800, 998]
11793I98j963R54k899J176J382j343J623j92J438R71n00k139j69K11q33L58K88
11810f39J088J02q25J013lR77j247q42k28j903J420J521j850J294K41K072m92
11827A699k83k99j100m16j550M83L58O58J436j161J483J137j592k56o0j159P29
11844A07k178o5p72N072k826J850J546k994J015j152j227R35l02o86J394j069
11860a352K732o06J20r2Q57j935Q70l448K483j144K50J546J773l52k90P54r04
11877A262k030O29j274k63J246j649J563J245r2P68p98K85q98J99j406l10n66
11894b089K00M73J593J114K886k781R7r92j545n27j099M66k03K366P8N91Q0R13
11912A621Q08j606j117j301J003o06j508K243O3J013K516j252j196K50k482J870
$$ y = [998, -965, -11, -2910, -1734, -352, -1695, -72, -264, 1174, 2145, 1645, -494, -663, -452, -1285, -927, -639, 449, 551, -274, 739, 736, 1713, 466, -376, -604, -2507, -1087, 434, -1416, -122, 119, 2191, 1699, 1416, 1117, 17, -399, -1949, -1466, -1108, -450, 986, -175, 1308, 2445, 853, 597, 537, -622, 107, -2071, -2136, -2908, 2164, -662, 1188, 2734, -260, 755, -397, -1624, -689, -991, -1677, -283, -1352, 1380, 774, 894, 802, 1659, -276, 594, -2854, -371, -1515, -1265, 281, 2054, 1702, 1412, 2166, 1262, -768, -139, -1413, -1676, -430, -2079, -516, 729, 637, 1405, 607, 892, -6, 193, -1213, -1523, -2089, -1889, -1416, 177, 1291, 4177, 1396, 1493, 501, -1044, -1571, -2670, -2204, -2407, -41, 37, 628, 708, 1621, 2429, 823, -294, -1595, -592, -1198, -2706, -463, -400, 613, 3129, 1877, 681, 931, -1551, 319]
11928C19j919j626K680P73j04R44j17r33J258k43q79j310N3j078Q08P83J99J496
11946A104k21o25K164j570P29k147j629j05Q12R51K348j459N29j9K657k030k859
11963a370J577j559K03j198J820J169p16J398j455J396j735L38J6n67j517O75
11979a525j34J237K296J595l313Q52J008j002j729n57j824q57J354K135R65R23
11995A424K257k303o2j112k88j232n49n4J462N82r34M256j384l27J1k400O08p43
12013g88L59j324J633j994L215R3o44J164k476K93j354N50o76J359N91m47L68
12030g8k74L45K0J568j461m92j3k748Q35K695k154J200K31K356j818O76p51N03
12048F40o48O06k203J339n49O5J77K039k013K045J361l022k97k244J677N18J699
$$ y = [319, -1600, -3226, -546, 227, 123, 1067, 950, 17, 1275, 1032, 153, -1157, -1104, -2182, -1374, -591, -392, 1104, 883, 258, 2422, 852, 1581, -566, -2195, -2300, -1488, -537, 1811, 352, 881, 862, 3519, 1489, -1370, 207, -1352, -1149, -2347, -527, 642, -74, 1324, -131, 1265, -470, -132, -116, -683, -2200, -1525, -1659, -422, 1874, 3469, 156, 1008, 2016, 1014, -715, -1272, -3096, -3953, -2599, -464, 501, 1424, 3681, 1378, 1316, 204, -84, -1316, -1865, -1919, -457, 125, -809, 3447, 2063, 1736, 1747, -653, -45, -788, -429, -1753, -120, -2114, 1101, 1194, 550, 1714, -762, -469, -1823, -1273, -1949, -590, 1, -446, -78, -352, -7, 13, 1581, 120, -372, -385, -3133, -2298, 397, -1757, -557, -326, 2030, 212, 888, 137, 640, -8, 598, -1605, -266, -815, -750, -573, 1466, -547, 1498, 2859, -163, -460, -2704, -1027, -509, 1190]
12065A190j559K224J33k904K165j193q95O77j717J274q56J66J157N12J424J621
12081C419k056J45j558j04j004j176P20N77M69J465J542K18l511J018m16j292
12097a544N9M5j450O66J572j50M442k175K27j300M51m96M20l390j326K170N63
12114a216K087R13M63N17j772o17K06j342K07j363M09K443Q09k016J664j121o3
12131B08n62r20J856j792J216j057k05J804P88j33M6r15J177l137j74Q26j576
12148b550o84L671l80J082O27r0P75k513K90k451P63o29R25p84J534O45m16M78
12166B93Q8R63o5k585N46L21o62J451l16j436L299m95j84k965J118q90j339K217
12184f41k275K60K771J241O10q0k95o68j099j000J704n22j845J990j124J061J143
$$ y = [1190, -369, 1855, 1988, -916, 1249, 56, -839, -162, -1879, -605, -1461, -1295, -138, 374, 1798, 3419, 1363, 1508, -50, -154, -1158, -2334, -1614, -1037, -568, 897, 2439, 2657, -854, 164, -252, -1544, -1485, -1440, -2890, -2224, -652, -802, 3640, 1465, 1692, 392, 843, 347, 767, -2623, -3949, -1779, -1216, 871, 1784, 2247, 2764, 992, 375, 581, -761, -554, -1917, -1508, 935, 1744, -272, 1392, 271, 208, -354, -1274, 582, -1210, 6, -1051, -1256, 548, 1336, 1203, 1249, 334, 1511, -1626, -1800, -974, -2550, -3234, 437, 57, 1139, 1766, 1676, 2451, -62, 228, -2223, -1460, -2089, -1164, -1948, -414, 231, -185, 293, 381, 1344, 1279, -1306, -760, -439, -1101, 350, 34, -1402, 1897, 1402, 1218, -1747, -629, -1519, -2858, -641, -2916, -2656, 115, 1356, 1966, 1886, 1591, 923, -176, -1176, 528, 6, -1839, 151, -973, 88, 1231]
12201A231P91j537K17M7j647J214j90j021K97l4K88K36J175R43j770Q78j143j540
12219a565M4J49m2Q14L038j686N16K01L89j577j195k38k091L155j971N61K288
12236G90R91j80N08p54J69k913J129l120K38J879J306R29j541K117K42k227J615
12253A178k064j010Q40m62j5L72J36J298J240K58j025o71j244J644k475M9K44
12270a707k26M3K619J319N33q11o31N73l161J81J1L39j476J482k31L374j147K18
12288A302j806J369j680k230K592r98L6Q25K333K93K59j183L41J122m871K15P57
12305a324J174M6j30N49J926o24l51M47j275k411L21L43j400K472O95R47L32o95
12323A042L68N96j728k455j41k10M97J441l9L96J983J172k133O81j316j724j104
$$ y = [1231, 2022, 485, 702, 749, -898, 316, 126, -895, -598, -632, -344, -108, 1067, 2010, 240, 1118, -25, -1565, -1521, -1372, -1414, -600, 2438, 752, 1268, 1469, 1858, 281, -914, -1152, -3243, -88, -2059, -1498, 790, 1781, 1601, 2109, 1355, 1524, -1389, -260, -3380, -3142, -1263, 43, 972, -569, 1548, 1790, -437, 1178, -886, -1896, -1056, -1518, -1533, -1161, -1025, 273, 1513, 1771, 746, 75, -1169, 475, -2000, -1951, -1707, -1933, -1890, 729, 2048, 2581, 1770, 1139, 1712, -1449, -1268, -1257, -918, -2394, -912, -1143, 2231, 1084, 1302, -504, 865, -815, -3045, -453, -1451, -1415, -590, 1743, 2036, 2295, 1112, 1453, 2575, -2296, -2081, -1324, -150, -104, -234, 315, 2241, 1617, 1266, 1713, 438, -1973, -1652, -1309, -2709, -237, 458, 1405, 1737, 1042, 1410, 2006, 278, -2177, -2318, -2528, -2031, -590, -629, -233, 1750, 2922, 789, 1470, 154, -1570, -2674]
12340b674K36R74K80J11Q84J828k98j85j79j416J686k753j657K131k275K616K783
12357B092j817Q56k20k65J16p61l38j435P4O62J89J940r6R32j287j701M12l93
12375a040K624l540J308j468K801j962L460K41j069L284l864J30k728J173K34
12390d16j401l60K455k60P22o82K979k909O56k64k638J306k49O0J911p84K786
12407B912j630m01k01j040P47j572K4j302J761O35N85J499P55n09k147P00r73
12424a57k525N18L55K504j10R57O76k001K163k28k156p77n43j862K614k184L378
12441F22J04j124K783o66j929M49p62r21J31j061N61K814j290N25J610j004j01
12458G41n60k579R1J722o52p1N24J065L06P15N08j866L79j096J266n106K761J698
$$ y = [-2674, -2438, -1464, -1184, -1073, -189, 1639, 1341, 1156, 977, -439, 1247, -1506, -3163, -1032, -3307, -691, 2092, 275, 1131, 911, 646, 762, 1, -337, -1772, -1698, -1036, -847, 1093, 997, 1929, 642, -1059, -647, -1040, 1584, -1956, -648, -2116, 685, -1277, 2183, 2424, 1355, 4639, 775, 905, -1823, -650, -416, -1817, -2177, 278, 18, 740, 58, 3037, 128, 784, 520, -2118, -812, -1061, -1001, 910, 126, 2912, 1282, 881, 680, -360, 387, -1185, -1161, -2463, -702, -67, 518, 2017, 2772, 2263, 116, 816, -157, -2682, -2164, -1809, 695, 585, 1542, 2218, 217, 2380, 2152, -4, -781, -1324, -3186, -572, -2756, 622, 726, -398, 2385, 1719, -210, 239, -523, -1444, -1313, -2374, -1813, 1001, -289, 236, 1846, 842, 741, 181, -2398, -2307, -585, -1237, -1308, -784, 281, 587, 1302, 1810, -56, 323, -773, 493, -4613, -1852, -154]
12476a54M15j613K562o8j40N86r87N15k473R0J92m00K315Q41j046N8O42j99j415
12495b79K09k564K143l76p51Q9K547j820P53J573j689k77J125k487r36j67K359
12512e48N67j81J164J248j704R6M86j188j863J551l094L328n87J318j598K213
12528A208N08r66K143l008p92m75k40O45O39Q44l69J445m13q88O09l435L285j262
12546e22J33j965M061l940L596J260O22o67j888r08P37j709l89J238l189K331
12562a199K231q82K37K6K5j617n3k42J493m04L40P61M85L05j590P68O32k387L3
12581a038O42r8j985P83L16J658P13J991l382M62J723k272j304J592o74m91J94
12598a170L96P07K363n17P60j961k78n76n53p52n38J567O85K111N53q10p82j732
$$ y = [-154, 261, -1352, 1210, 1142, 1002, 1588, 601, 1116, -1357, -1267, -1075, -1475, 840, 1681, 635, 693, 1335, 1136, -279, -70, -2634, -491, -867, -1618, -1529, 1018, -802, -49, 1524, -165, -442, 683, -1804, -2740, -2907, -548, 19, -162, 1002, 2250, 546, 642, 1128, -60, -1923, -372, -3466, -138, -725, 593, -1005, 1208, 1716, 750, 2893, -115, -907, -1382, -1622, -977, -338, 506, 137, 1582, 1169, 281, 890, -2545, 740, -522, -389, -2354, 1707, -2233, 1363, 2623, 3245, 2578, 690, -218, 519, -1190, -1579, -341, -3530, -1199, 1032, 150, 387, 413, 438, -1179, -1232, -1474, 19, -385, -45, 716, 1201, 1506, -84, 684, 1316, -1071, -1038, -396, -494, -2479, -1696, -1380, 278, 991, 2982, -400, 62, 1785, -487, -1791, -199, -873, -1364, -1170, -774, -67, 2296, 1779, 2539, 578, 300, -276, -829, -1581, -2119, -552, 133, 2244, 2797, 1987, 1205, -527]
12616e27K708k636j743Q51j239K531Q74Q58k65n49K28j36j952L24q67P3M69l78
12634a376K118M59O28p16J88o90J43k295j061J053J066J28J574m73O57O30j39
12651A894j030m67n3j575P01n47Q53O16Q8j8J435n69q72k71j422n83r4K107q56
12670f63J14l84L088j032J054j227j502J240J2l598L526l47O29J365k049J271
12686A497J56j7k258n52L68q54N66R96N92O63q50o47K238k325J716k074k170O23
12704b332J527q16K379M5j532K096J021r03K85k093q11R73j53j854J762Q68R31
12721A393m35j162l53N80q22Q6k567J494R53L45O82j183M25J255P33k218O99j169
12739a264n72m88J551j15J627o37K899j186K93k513J97J0k288R46N51J583r22
$$ y = [-527, 2181, -455, -2198, -1347, -2586, -55, 819, 1677, 1412, 863, 1091, 955, -997, -673, -1540, -1467, -998, -1376, 742, 1201, 1829, 1113, 1301, 611, 754, -1541, -2602, -1549, -483, -355, 1219, 746, 1403, 2033, 1894, 864, 397, 344, -1231, -530, -1077, -224, 392, 480, 462, 1897, 1328, 456, 185, -1237, -1820, -1914, 193, -663, -549, -933, 2155, 1123, 2177, 950, -552, 688, 700, -2898, 628, 281, 910, 2275, 226, 1497, 1653, 1636, -622, -1174, -806, -1660, -1094, -98, 494, 1157, 307, -340, 1898, -427, 1289, -785, -2955, -2332, -805, -1621, 758, 803, -729, 1367, 2388, 1485, 1770, -323, -1134, -161, -314, -2168, -406, 462, 1393, 958, -204, -557, 23, -799, -713, -3280, -1786, -833, -488, 194, -989, -564, 691, 1424, -794, -95, -1264, -1836, -2324, -773, -888, 739, 102, 3001, 1815, 2108, -405, -208, -198, -2486, -1540, -989, 594, -328]
12756c28n33L029o02K78n21J233k323o38j220J356P56N02j20J013r49R35j177
12773F91o12k320j067L344k422L050q16J905P49j759R89r60l440K621K81j678
12789a444O35O53o14Q05Q09q27j14M69Q39k754j25J153N80k737K650P3R10k94
12807F67K067q03j341O48k202l95j27M73K399k349L567q46R21k567J277k851k61
12824a723L67O86M69N21J689k102k87P82K80j240K319l059J44j495R37P90K3L546
12842B647j310k27N39j966p38O17k008j010R79J951J438O08J851k406J894l014
12858a55j642J45p29p37J805p91K459K005j610K251l12j997m85o7j900K410j877
12875a227Q02J537j769J049O76k21N4r67l40k032K36K101r63J869j496J211J001
$$ y = [-328, -861, 2168, 1566, 1844, 1323, 2556, 233, -405, -1625, -269, 487, 989, 869, 1882, 933, 1868, 691, 79, -2241, -3308, 36, -2386, 664, -152, 1753, 2502, 743, 1732, 772, -2668, -47, 234, -1444, -809, -156, -770, 35, 844, 17, -97, 372, 1211, -1543, -1668, -515, 65, -2672, -22, 51, 961, 667, 2734, 1931, 590, 1238, -964, -1359, -1486, -1013, 1386, -963, 2604, 1758, 2679, 112, 1389, -1462, -1723, -1356, -670, -201, 320, 2009, -93, -380, 402, 682, -558, 1761, -1298, -1154, -2649, -1712, -922, -899, 2647, 1337, 1110, 1649, -317, -1055, -438, -2446, -3456, -2477, -526, 912, 1520, 3371, 965, 2859, -155, -1797, -1652, -2381, -3118, -1313, -2104, 355, 2360, 750, 3001, 2689, 692, 207, 140, -1760, 650, -1227, -425, 1112, -657, 392, 1068, 847, 901, -66, -406, -2438, -2202, -101, -1064, 805, -691, 520, 1521]
12892A521o57J7j77l64k218J513j885K122p64L16J726p2l57J725j161k441M05
12909g51j392J538L80l27Q93j276m97K437P56k938K90K312j525k991K349Q1k78
12926i39R58J417N29j430j051R29k418o37J877n34L65J055J221R05j269N03k38
12943A243k042l57j117n57J511L08J106k95J761L37j51k541J542j911O08o81j216
12960b452J794J594j090Q57K178j087l029J151j356k2J524l09l93J545m3n23J123
12977A462J74q14j819J228j158j386J656M33J4M39J485q30Q01j316j90O5l141
12994b897J576L97J794k352L050j368J163M86j027j639j84n51j63J449m12J894
13010A216j825J406O37j879O75r23K697l186M03L57q16K131q41K374p19p29Q7
$$ y = [1521, 864, 881, 704, 340, -1878, -365, -2250, -128, -892, -576, 1150, 1078, 721, 2446, 1285, -1156, -751, -2143, -605, -225, -552, 341, -935, -1432, 1005, 1761, -1177, -887, 1425, -100, -3091, -742, -661, -939, 19, 1436, 1965, 535, -516, 413, -2005, -2642, -765, -1299, -934, 121, 1342, 2247, 978, 1481, 1243, -799, -1156, -2273, -2830, -1319, -1011, 95, -200, 1561, 1898, 1747, -794, 748, -1163, -555, -1236, -2452, -658, 936, -154, 703, 2881, 1794, -1235, -84, -1440, -1462, 62, -247, -640, 905, 862, 339, 1462, 1636, 822, -997, 231, -927, -2313, -657, -224, -210, 229, 1714, 884, 1685, 369, 179, 244, -2897, -1321, -924, 870, -1482, 1568, 200, 1363, 1849, 822, -817, -1001, -1552, -1715, -266, -678, 1216, -609, 797, 1434, -445, 230, -693, 2004, -1182, -779, -422, -1238, 893, 52, 2426, 1707, 978, 1065]
13027A065o98k81J58j031j263K615J25K08p62J644l89k328P45J000k493K61J180
13044b44j25N79o13J002J586M43p37R52k894N10j917n35K685k382L234m3q12Q51
13062A540N19k056m52m74j599K281j519J104l04Q18J864J652j755j605j88p13
13078h87O32N7J335l36Nj883J226L228l518j78R26j555j183P96K426j944L125
13095B272j561M69J126k302r29K29K46j407J162j323M146j379Q78L9q65M20j114
13112A07k30r99j327J403L20j482J222N66J656K04K8j85j860j274J461L8N70j255
13130a037J381p9J649j119M71m35j066p41p13J14P36J606j616K150K13M07K45
13147B166k077L53m29j41k186K895l450K209J738Q26j041L47Q83j397k967O22
$$ y = [1065, 367, 86, 244, -787, -2050, 565, 690, 898, 136, 1780, 1391, -937, -192, 808, -1685, -1424, -244, -369, 210, -403, 599, 2185, 2628, 1891, 2843, -51, 459, -1458, -1993, 692, -1690, 1544, 1501, 689, 1540, 2059, 3, -449, -923, -2522, -241, -1760, -656, -960, -142, 1722, 3374, 1619, 14, -174, -887, -255, -198, 1137, 801, 806, -1077, 149, 3377, -141, -319, 607, -948, -2131, -1335, 1091, -853, 2272, 711, 1180, 2306, 4, -925, -696, -450, -1857, -695, -2018, 2128, 749, 1627, 1666, 801, 1221, 107, -123, -1122, -2449, -1046, -726, -2208, -986, -420, 1236, 1440, 1468, 1283, -577, -1851, -390, -352, 218, -1037, 344, 265, 1914, 795, 1266, 831, -235, -976, -1689, -1575, -839, 767, -849, 1301, 1514, 1921, 2166, 89, 442, 13, -128, -2314, 581, -2869, -660, 1078, 1904, 863, 1210, 2093, 696, -2271, -1649]
13163a649j18j142L184q34J661K58j71q22J838m1l124n43n94Q28l74K251o07J348
13181A349L96p74K335l689m68L72j453j404J807k05q15M384p45J60J65j786J081
13198G10j724l28l155M131j318K061J561j847J599m24k852K759j848n51j562J405
13214a383K090p17o23J503J577L67k922M96p38p65J086j462K84J674J608q33N91
13231A833m95j665j17J98p62j522J620O28M08J487M88j307j137j76m17J707k314
13248a543L08J587l103M350j630L0R35q49p25J244j069j807Q2K169k914L761j430
13265f04J825k257J690O86n24j663k23J609o44J049RP32q45P73l74M91k60j807
13283c37j943J41R56J612l80k47K797k967P02J287j378P56o65k495Q84o64N54
$$ y = [-1649, -1767, -2909, 275, -559, 1102, 1360, 1189, 367, 2205, 2164, -960, -1503, -2097, -1269, -1643, 608, 1, 1349, 1745, 971, 3306, -383, -851, -479, -1932, -3336, -1529, -1734, -2549, 1835, 1090, 1250, 1415, -371, 710, -1014, -1342, -4497, -366, -1684, 377, 1938, 91, 1690, 1266, -1586, 1173, -675, -1226, -2788, -1383, 707, -10, -633, 870, 2447, 2814, -108, 388, -350, -1115, -29, -1491, -1207, 467, 2075, 1242, 1833, 1338, -327, -444, -246, -1008, -2530, -910, -282, 126, 1613, 2101, 794, -343, -519, -936, 771, -1543, -1235, 352, -2751, 1599, -31, -1, 934, 85, -640, 604, -465, -2272, -2190, -21, -2935, 826, -604, 1221, -1036, 654, 1340, 816, -847, -1070, 539, -105, 944, 953, 1685, 840, 1613, 1239, 1730, 1470, -337, -2280, -2139, -1183, 429, 49, -198, 2599, -368, 334, 1621, 243, 999, 334, -2161, -1277, -1941, -1387]
13300a387J916j442L210j930R85r31j010j199J077r8K775k230q8J829m80J23l96
13317G24r72R54n29q61o70L77l7J85L76J193K88j383N01J90p34j559O90J481P33
13336I47j193N15J358j808K545l104J052q49p03m8p98J477J539J91O70Q4p87j884
13354g96n09R84j810n98J652J088K2J052J92M01P62k712k228J595M71o38j671
13371b743K608j384K33L541j44O40m266l97R22J389l379L59N10K142P22J964l38
13388B379j444q11j167Q71l43k71q4N06K50R91J338n62m6j684K245k919J00q50
13406a501K684j822L191j147M28p06n98J081l013J303j034J441k226K72J263J230
13422H46l15J32L66L18n38j097O54j093J89q51K57J596O35j351k95J828j025j4
$$ y = [-1387, 529, -913, 2297, 367, 1352, 421, -589, -1788, -711, -809, 1966, -264, -352, 1477, 997, 1120, 724, -248, 706, 177, -684, -1354, -977, -1014, -829, -453, 740, 1028, -355, 146, 336, -398, -1957, -1267, 214, 947, -246, 269, 1627, -181, 2364, -740, 312, -537, -1240, -1288, -2086, -609, 930, 1121, 1791, 1875, 1088, -796, -1305, -321, -2131, -2729, -1077, 11, 33, 1085, 1277, 1678, 2440, -272, -2500, -905, -434, -1072, -2743, -135, -1519, -1286, 2255, 2111, 2751, -1515, -1912, -990, 399, -2980, -2621, -2111, 31, 753, 2717, 2379, 935, 124, -1043, -172, -515, -786, -870, -364, -114, 877, 2215, 1653, 1607, -77, 2168, -751, -651, -1501, 1183, -639, 2552, 1405, 1833, 1127, 529, 1610, -1403, -100, -1134, 307, -1919, -1647, -384, 846, 531, 663, 1029, 1347, 809, -288, 366, -727, -538, -1389, -1132, 464, 1099, -252, -547, 1281, 256, 242]
13440B42j635j669J620r40Q28Q45J893j389J695R6O07k769r65J4m46L10R99K712
13458B048m56J486k305j63K39j643J289k458P92j8J865L37l727K679K255m18l031
13475a229J288p52N62l108K155L86l07J012J883j594nQ85q22k70K03j407N05N96
13493a9j165K104O60k21j02M4n63j328o49J354k045j68L030n04J765j872j04J339
13511A556k81l288J873P13l878J132J188K681j55M79p15J715k117j678j640J764
13527f51N74j673Q14K97K182L95j217p8m26J04J471j276j444J001l36J539m05
13544H71j395K924j967j231m19P55j704J204r9l51J035J68L161r18j069p05Q96
13561A156j968l82n28j811R44M143l14j25m79K70O64l202l5m72J636j77j207J689
$$ y = [242, -1393, -3062, -1442, -2382, -1554, -709, 1184, -205, 1490, 1586, 2193, -576, -1541, -1527, -1973, -1663, -664, 2048, 1592, 3078, 773, 610, 849, -794, 495, -1963, -1171, -1189, 676, 1013, -2714, -35, 2220, 1802, -1229, 59, -693, -131, -3239, -1084, -698, -1005, 7, 1890, 296, 291, 1176, 354, 84, 287, -1120, -615, -19, -1184, 920, 1580, 1359, 1257, 1301, 738, -590, -1239, 115, -1930, -2098, 932, 428, 2193, 321, 217, 1556, 1275, -2013, -140, 573, -3305, -2173, -985, 1696, 1541, 2020, 1305, 3020, 903, -775, -2415, -651, -77, -1750, -936, -639, 1543, 1938, 721, 643, 217, 321, 1792, 516, -928, 73, -263, 1276, 871, -524, 2400, 433, -798, -1217, -462, -2166, -962, -1061, -1412, -377, -209, 2952, 2034, 965, 260, 1156, -812, -1194, -1722, -3533, -2589, 1554, 1240, 1115, 636, 906, 1570, -1632, -1667, -2139, -503, -680, -1887, -198]
13579a98J330M58q81J245l59l440M88R40n25N39r83J718j516J288r64P41J322
13596A203k004n26J502j784J93J20J994M4m16Q60j060L43m24p82Q79k974K988
13613A56j638O79K858j749L051l951J756p29j062j065R19Q0r66J40K230j079K658
13630B288r13M11j350k08j317n72M67J061q71J327j39J690K44j740j891K024l734
13647c223K651o99l27k5J560J036k581J950J797j694j947O63j100j62K553m09
13663D3n63R20M90J192j566L19j397j660p3K172m87J373k360K884j205K98J325
13680A705o41r81q48n34l59J198J3P84j009J244N27q30J519j738r01j471K709
13697C87j462j14J027J342l46J579L85j944k304O78J454k815K458j468K341j786
$$ y = [-198, 1132, 1590, 709, 1954, 1595, -1845, -1357, -417, -942, -403, -1386, 332, -1184, 104, -860, -119, 1203, -801, -1327, 175, -1609, -1416, -1296, 698, 742, 326, 1186, 126, 469, 45, -737, 142, -2832, 156, -1482, -803, 2055, 306, 3357, -594, 1162, 433, -629, -1694, -775, -695, -1661, -1521, 709, -370, 2288, 1375, 1786, 436, 228, -1089, -1661, -1194, -133, -1004, 323, 184, 1874, 2118, 378, -1513, 511, -3223, -572, -1271, -1598, -1623, -63, 973, -1608, 342, 2139, 445, -1502, -839, -1939, -2101, 452, 43, -520, 400, 890, 2082, 516, 835, -562, -2222, -2295, -123, -610, 763, -1597, 1287, 82, 380, 1705, 1064, 83, -765, -1299, -1658, -460, -447, 337, -672, 572, 1099, 269, 1788, 50, -851, -2322, 387, -1075, -1189, -162, 1180, 834, 2413, 2798, 854, -1450, -772, 682, -2133, 325, -1143, 1198, -588]
13713e88K937k416J522p13j80J14k648Q47n34J48Q95k19N68J571j847J497j536
13730e82r78J867m30j228j094J929J138j912J289J561l177J624j798J076J12Q02
13746A99L02k008J143J355L22p14K5j368J302R61k960J058K151j010j537J653
13762H74j602J251k651K627j414j779K966k898J045J088O26m63Q48J254r41o05
13778B26m74k45M72q12j233K506l78Q58O64j024Q3k500J210k9Q13k12j394P23
13796g46N34J011r89M12P56r82r16O60j500o68J502J019J130j363J374k2p84k36
13814A92j8j602o30J174M38mN84J128J671k486Q25J58k403j049J035n96J97J533
13832A47J170k091j50L355k398K91o79M13j118j85R49j34L10P67J014k8k891J225
$$ y = [-588, 2349, -67, 1455, 742, 562, 676, -1972, -1125, -1659, -1511, -616, -835, -267, 1304, -543, 954, -582, -1560, 307, -123, -1351, -2445, -516, 622, -1290, -1, 1560, -1617, 7, -1791, -715, -603, 199, 501, -1507, -364, 991, 1313, 599, 624, -744, 558, 1519, -1441, -383, 1768, 758, -779, 874, -728, 523, -2128, 499, -915, -2694, 272, -2626, -1581, -493, 133, -330, 518, 1772, 831, 226, -248, -493, -21, -833, -2066, 440, 62, 920, 1584, 560, 643, -1857, -647, -676, 137, -75, -1469, -746, -212, 799, -190, 222, 978, -4, -920, -260, -1760, -2428, -926, 93, 1223, -140, 1234, 1212, 428, 192, 174, -1428, -2058, -884, -446, -450, 134, 1262, 2933, 447, 1272, 1430, -973, -2022, -987, -1583, -1386, 147, 1317, -774, -924, 2431, 33, 324, -355, 58, -1060, -1245, -296, -430, -120, 647, 1661, 1633, -1258, -33]
13850c3n48R20p34k104K199p3J362j858J416J103j304pJ06K79j023j60r97k41
13868a697J721q19K12J642J357j288n02j942n33j120K482k538J493J268O82m67
13884d9R63j478K118j642k562K018k093J329J208M95m90J465k74m57O57j406O74
13901D76n33k550P3J237K113j437L38K093P02q96j643L21J08k982K705m8L23j81
13919B19J121j660J509j677q06J390j363r2J616O39j052Q6M00P91j343M33j095
13936h84p66K099k908K204j75j099K661n81l43J637N0J65k863r67J703p49K8J129
13954C41k070L585N16m30k589j419K513j600J114P45m22j058J025J620l11k82
13970A278m84j666J242k825J440j453L277n99l28J178K182k11j767q75Q85k076
$$ y = [-33, -581, 339, -395, -2499, -300, -373, 989, -869, 547, 1650, 346, 339, 445, 724, -299, -459, -1456, -1697, 24, -795, -583, 1059, 2416, 1128, 626, -1316, -1849, -2969, -487, -3025, -1532, -264, 418, -49, 914, -564, 1554, -88, -2650, -632, -2725, -1396, -188, 307, -183, 1282, 1008, 551, 1208, -198, 476, -57, -2607, -2534, -1297, 816, -621, -283, 1810, 2512, 1616, -27, 294, 402, -2580, 125, 77, 400, 219, 1340, -320, 1189, -488, -1294, 96, -1267, -1359, 257, 896, -156, -70, 330, 1121, -222, 211, -884, -1650, 449, -2459, -255, -430, -1529, 1132, 551, 208, 1845, 1895, 2060, -803, -1770, -67, -816, -788, 341, -1729, 1856, 2372, 1942, -647, -2066, 447, -1153, -39, 706, 284, -774, 251, 1871, 1560, 1278, 794, -872, 370, -2455, -1015, -2468, 809, 210, -118, 1060, 3242, 3031, 1264, 389, 1274, -802]
13986h02j241J329m83K830O01k840K616j874L66j54q87R47k425J950k83R5J223
14003I68J507k340P56j000J249r37j546J003j444R32K84k51J413j403K372O03
14019B166l673J118j104K409k277o17K485o1o70O25L00M69j036M83j334o19J796
14036D60k918J548n0J037j23k2J970r71j379M15p48n19J001J76j954L683k746
14053a140K753j96k121M12r70m36J508j239l2K200j372Q71O74j426J537l58k058
14070a393l52j111J593L063p15j673K209O22j713J564j898J81j509k03J187M9
14086i9J170N34j403m64QO52Q35n41j177J081j361J57K011l86o23J803j639j217
14104f59J256J7k311j162O30Q03K014J08K013k052J454j665R05j036j206R52r87
$$ y = [-802, -2043, -714, -1197, 1633, 2234, -606, 2010, 136, 502, 348, -539, 408, -2017, -67, -350, -255, 968, 2475, 135, 891, -109, 1140, 203, -1343, -340, -1784, -852, -568, -819, 594, -809, 1563, 2166, -1507, -389, -1493, 916, -1361, -1978, 507, 446, -224, 401, 701, 1170, 134, 617, -717, -1336, 460, -2458, -910, -960, 77, -46, -68, 1902, 931, -448, -33, -781, -1300, -299, -123, -2077, 1606, -1140, 1613, 1417, -704, -292, -1262, -1698, -190, -1429, -1461, 739, -633, 238, 912, -514, 1023, 665, -1393, -1745, -2856, -1263, 1800, 1085, -588, 1621, 2243, 530, 2094, 196, 377, -1132, -1335, -148, -99, 1071, 1605, 202, -262, -254, 398, 1233, 692, -485, 596, -765, -608, 1403, 1017, 394, 2197, 558, -659, 597, 614, -1697, -2859, -2229, -1426, 588, 696, 2709, 657, 2111, 446, 1351, 315, -891, 61, -926]
14121i26J616j226J365j27P67m11L88j875l75j44r94K735j377L31L03K253j739
14138E64N6k500L402k623r02k00j081J337M39m18L896q25j665Q61J058j197k378
14155b176K148p59N27q44o34M741k633J507K71k958J523k37j848J175k215J995
14171d17L86J652l11M48j113l7j433n34j490J741O12o00M81J485j106M05P27j171
14189b75L78q99j431J889r32J742M91l18R09k118J948o89l50j819J030k25L92
14206b77P53k326Q00J995q59J388J992k270j272j751J717j514m32K441J295j306
14222C74K332k75k445K673l574M78j024K899k539j4J191J000R03j158M94j959
14238f44k78J73p97J5J130M53P3J198j895J140n29M1k2n31j687J466P28L84k423
$$ y = [-926, 690, -536, 829, 702, 1469, 1058, 1446, -429, -804, -948, -1942, 793, -584, -253, 50, 2303, 564, 620, -1880, 1522, -1101, -2003, -2203, -3284, -1947, -1508, -1926, 1970, 1145, -520, 341, 1399, 202, -2176, -28, -787, -260, -1104, -1738, 3003, 370, 1877, 2148, -810, 713, 476, -1372, -197, -2412, -417, -31, 1621, 1310, 1758, 645, 608, -825, -1359, -2849, -1108, -496, -1096, -615, 870, -236, 169, 896, -275, 103, -796, -2227, -338, -1270, 472, 963, 645, 1554, -564, 1384, 695, 345, -1474, -444, -669, -277, 476, -1850, -1050, 945, 86, 1474, 3466, 1196, -76, -1827, -110, -1624, -2056, 385, 1680, 374, 2706, 2431, -14, 2659, -915, -437, -1461, 1438, -1101, -1115, 76, 1076, 1979, 821, 1315, -644, -922, -749, -1546, -1531, -401, 52, 125, 1323, -572, 568, 39, 80, 58, -473, -2160, -694, 34, 418, -2005]
14257b005M304K77l5q49k16r12m041L748k345K877k834J494J53J421q03J625k011
14274a52L27j33j914O91o22K563o24j012J649J89j572J89J654j796J502j282j725
14291b068J744J040J263j315N93k42j263j09j521Q31q6K79J219m49j194P09K260
14308A691k929PJ388m55N11n92j23j281J268P83K06r7Q09J5p71k002K073k841
14326b340R48N58J482j23j315J916k6O09k457k11k945L505q41R78P22O37L53Q45
14344B295r72j806J008q07L7p14n79O81r47M173k553p53J274P76j115p87r98r9
14362a886k51J092L018k401p10J398M79j352J702j001j014l97N12m76j79K052
14378E86R6j039J277j5L26j417r14N76r28p3L529r14L49j842K05J187L08j466
$$ y = [-2005, 2299, 2576, 2541, 1692, 1476, 564, -3477, 271, -2074, 803, -2031, -537, -384, 1037, 234, 1859, -152, 175, 42, -1872, -1181, -1803, 760, 136, -876, 773, 962, -610, -421, 1233, -563, 939, -343, -2068, -324, 716, 1979, 664, 1257, 1015, -248, -357, -1878, -1047, -1133, -854, 365, -84, -1278, -569, 1691, -1238, -1231, 157, -298, 213, -379, -502, -1783, -515, 268, 474, 377, 1186, 1201, 430, -1572, 501, -2340, -1392, -834, 648, 525, -790, 1126, 1100, 1709, -748, -959, -3904, -399, -1240, -262, 460, 1097, 1450, 2295, 1323, -483, 525, -282, -245, -959, -1538, -857, -1804, 2369, -184, -937, 337, 1113, -2, -789, -1787, -1886, -2137, -1045, 1973, -428, -1138, 260, 739, -613, 1089, 88, -926, -1323, -811, -1287, -1466, 586, 682, -357, 920, 905, 1231, -186, -1100, -524, -1452, -1525, 2004, 1090, 1439, -403, -198, 989, 1297, -169]
14396a69J47L14l470K658j69O10q0R98K790m223q28J877j195L48r27p9P67J480
14414H49M04j373O69M66k410K151j616K594l312n59J705J92j85R54J53K14j291
14431c95n59P97n12l69O41k38k37J050P34j186J447q69o73L24j465J882j080l39
14449a047J275L19M75J72l95N72m177L300j266j317L033M98l296J508K022j262
14465D14M24J60o09j077L07k267L525j129L29K080l050J412r95J40J008k58J132
14482A546l534J791p85J520J489p77M66j091o12j82j003k71K136j659J070N97
14498G01j328O76J339j205Q45K16p29j409J264k67r50L8l28L117j267Q06K40r66
14516G93k178J946j354k196K823k114K957j092J019M67j344J42J693k203J024
$$ y = [-169, -22, 292, -3178, -520, -689, -79, -159, 839, 3629, -594, -1422, 455, -740, -392, -1319, -1398, -631, 849, 1253, -120, 549, 1015, -1395, 756, -860, 1734, -1578, -2137, -432, -240, -425, 529, 682, 896, -395, -954, -157, -669, -1038, -397, -635, -872, 178, 912, -274, 1173, 304, -369, -45, -1510, 372, -708, -1047, 228, 547, 1022, 1194, 799, 1371, -2806, 494, -772, -2089, 944, 1442, -1854, -346, 1676, 414, 838, 998, 389, -688, -381, -2648, 877, -252, 77, 2157, -893, 519, -476, -336, 672, 414, 1546, -1988, -197, -982, 538, 2027, 1250, 1716, 625, 13, -169, -1172, -1443, 693, -966, 104, 701, -627, 49, 1388, 183, 1028, 1244, 515, -894, 370, 103, -847, -809, -1137, 1980, 713, 1519, 1759, 793, -1385, 561, -793, -2989, -166, -2280, 677, -415, 604, 1071, -273, -131, 1562, -641, 383]
14531C83j891J249J109l58l6J044q75J414p68j555k83l17j085Q32j465J672J830
14548I00j578L821k192j648J859n67K43m22j498K77J466m5m03j47j181K711j332
14565B64o2j739j46J035l12rJ566J178k239K789k580q13J729j692j250K916j727
14582a092L63J408J404O53p91L78j629q71j713J608j022o44K439J1j11j260K547
14599A678J48j884Q00j082p99R75M30r36P92O72j91R58j286o59J114l102K102
14616b70N91j144K61M55J071J405m66j13j284j020m44p2m5K98P90L66N77k243
14634a287L945j353j732n3j86o1N02J520k536K112j525Q3K8K521j167j300P85
14651B96m51o13j10J345o40J769p82Q95O67k441R6Q98j593l63N19L27j30K23J766
$$ y = [383, -1508, -259, 850, 492, 456, 1500, 625, 2039, 1271, -284, -567, -884, -1969, -1137, -2602, -930, 900, -678, 3143, 951, -697, 1162, 595, 838, 416, -1082, -805, 661, 616, 213, 66, -1115, 1596, 264, 202, -1537, -1683, -648, -960, -969, 597, 1775, -464, 2325, -255, -1068, 661, -1031, -2281, 635, -1092, -729, 679, 2083, 2736, 1945, 2323, 694, -177, -1890, -282, -1304, -1948, 491, 502, 391, -869, 1678, 1826, -58, 742, -340, -1139, -164, 266, -670, 122, 794, 603, 1561, 275, -384, 730, -2372, -270, 321, -823, -562, -107, 964, 2369, 1903, 1790, 506, -514, -958, -1030, -1075, -777, 13, 379, 956, -1287, 2658, 1305, -427, -480, -666, -727, -225, 1295, -1241, 871, -654, -571, -543, 1978, 811, -489, 296, -155, -768, -878, 467, -173, 1596, 814, 1709, 2376, -65, 31, 929, -664, -1027, -508, -181, -311, -88, 1678]
14670A678p03q48j713J789j607J536j673M1k70J833p0k48J434M52m67N20r97k392
14688a705j509J982J179l59J635R26k463J775j397Q41k691K649j438j08J52P06
14704A75L99N07M40j519K059l724K665k502j94j37K286N79j23p47J255J5j948
14721e14P08j53l44j285r24L224j617J627j541K057J658k086j733o47J368J996
14737A794k917J503nL98k960K641J445k411j262J363J325k649l17M26K089j426
14753i63N49j39O98J045m74j121j208Q44J140L08p18k71L69P33J884k499o75K42
14771b56o55R61k111N75J293K051k991K874k435K109m19k308J421k083N21o25
14787b078K326O14P97l252P80J350J38K64j728j147K3j74N49M47K293p40J78J683
$$ y = [1678, 975, 127, -1586, 203, -1404, 132, -1541, -1500, -1770, 63, -7, -255, 1179, 1631, 1164, 1684, 687, -1705, -3214, -1232, -53, -412, 1223, 2149, -314, 1461, 64, 905, -1786, 863, -575, -683, -531, 175, 574, 1081, 1521, 2, 2061, -1663, 1002, -1500, -1694, -1831, 455, 1034, 911, 164, 1419, 1434, -514, 194, 41, -303, -1588, -2512, 712, -905, 722, -819, 1238, 2896, 810, -923, -1570, -202, 1794, -1123, 380, 375, 773, -2187, 454, 1899, -512, -1774, -411, 914, -1735, -2052, -1626, 463, -963, -414, -553, 145, 1190, 716, -405, -1613, -769, 371, 679, -39, -310, 59, 792, 2676, 177, -498, -256, -911, 50, -2061, -1486, -193, 1858, -1133, 1741, -694, 1415, 996, -1312, 109, -1974, -1453, -2078, 248, 862, 1659, -1593, -813, 537, 675, 939, -789, -1936, -1913, -2087, -1538, -1091, 1202, 462, 640, 2323]
14805B323j269k561m6J310j781J935N35j605K129N19o1k739L462o74k456J235
14821B56j232L19k14l51Q09k01J649j338q76J858l80q2R34r31j810j44L868j194
14839I40M40J221j148r76k33j310n69Q79J62m77J184J118J227j618N80l94k044
14856a018k49J117j414P69R76m8K42J344j902L84J405j668J226n35j528J780j920
14873a039j178L214k677K133j42K140k749J712j869l26L30P68k085L065l30P55
14889A722K47k239j210J476j042j034R55j393l8L277j168K503J60k772j04n75
14905a235K16n38J022N93j162J680J264p36N01J00k228p42M69O1m86J127L48P32
14923I86j362J420j547J787k133R84j43j438K939k716K259l58p1J093j702J404
$$ y = [2323, 1054, -1507, -1553, -243, -2024, -89, 446, -1159, 970, 1489, 1428, -1311, 2151, 1477, -979, 256, -976, -657, -871, -1222, -413, -614, 1035, -303, -1179, 679, 299, 217, 1151, 220, -1590, -1734, 2134, 940, 1380, 2601, 1453, 477, 244, -1066, -1635, -756, -594, -1071, 113, 1231, 2458, 840, 1420, 1026, -1018, -1267, -150, -1564, -795, 181, 133, 375, 1719, -183, 201, 1606, -62, 1164, 629, -899, 881, -1039, -2217, 997, -1680, 453, 311, 2451, -298, 1414, -455, -781, -451, 317, -1768, 1297, 967, 1722, 1969, -270, -1480, -4, -1046, -2080, -1125, -2518, -2556, 721, -447, 2056, 2216, -556, -660, -1235, -1019, -1557, -535, 58, -1104, 576, 1840, 1104, 1605, 1705, -523, -1265, -796, -735, -1221, -94, 254, 986, -376, 1044, -503, 1284, -849, 135, -8, -1446, 1493, -1223, 1036, 678, 607, 1700, -2, 1402]
14939A402k039j169K468k571J874L78K09j348P91J962j264O25j85j437j3l91m38
14956a146m23J477m53P32k25R60K07J14k372J17n48K126j748j52J681j368J347
14973C26K26p22K757l157o48M02r92j031K357J432O44j230l24n20J874r87k32
14990A75O99p52r11J578J33Q37o92k375K264q38J87j021N8Q4j043J26J487J346
15008A342q78N52j231j59J957m505L053j822l93K245o12R45J16J384K6j044j071
15025i5j143P23j996L76M56J982P91j524J193N47k26l78j036o0l37j550J749N16
15043a2K275l21k53k535R94K95j425j619K227o68L85K44R40K004j775o12R93m0
15061A097j637K132k122O72j628J357l21M35N64J656l41m079K602q51J9O39j491
$$ y = [1402, -637, -1806, 662, -1909, -35, 343, 552, -796, -5, 1957, 693, 1318, 1133, -304, -317, -708, -1146, -1569, -92, -545, 187, -38, 922, 1129, 1243, -1129, -1012, -1560, 566, -1182, -1334, 347, -1021, 326, 552, -170, 2587, -570, -1218, -816, -1808, -2839, -482, 950, 1594, 364, 40, -480, 1394, 407, 175, 874, 122, -789, 789, 922, 1759, 1067, -1308, 956, 118, 305, -716, -658, -574, -1617, -1491, -4, 1342, 464, 1016, -215, -374, 1583, -2922, 131, -1691, -2084, 161, -451, 494, 610, 1994, 2020, 976, -95, -1238, -515, -2511, -2135, -1679, 303, 1094, -430, 763, 1310, 1084, 706, -330, -390, -727, -2277, -528, -12, 2263, 1942, 1689, -846, 148, 443, -982, -2601, -374, -1042, -657, -413, 527, 2531, 756, 144, 1137, 1097, -540, 1592, -530, 142, -1486, -129, -450, -15, 549, 2205, 1864, -2215, 387, -464, -445, 194, -1297]
15078a297M8K779o49n80J628L44j480n74r28J68J105k582j116L589O19J008r85
15095A097j966P05J82j280L60j441N3K772q45L6J182M39p11J818k753J099k458
15112a711l44J077l29P88J108O34p88P07j026k28pj715J41K20K320p52j75l04
15130c84K49J010j488j10jj325R07J274k231K501r60J722j318Jk90N1N90m44p87
15149a033j32Q16n39M01J231J247q12o89K04j085j360R97mm3J878k71l60j570
15167a124L909j946j552m65j86O19O65J132q13N11L13J296k100J748r87k748J881
15184A53j221K16l48J48J154q29L91J340R99K92k115p19l26q80O07j088K019J179
15202I72j211o7m03O71j85Q10j38K49k336N79K255k366L403j649K4J358j722p77
$$ y = [-1297, -1249, 1530, 881, 301, 1929, 2273, 793, 219, -709, -541, 564, -2018, -3134, 455, 1074, 2082, 1097, -869, -164, 18, -1262, -902, -2343, -2290, 482, -363, -327, 855, 1294, 583, 2401, -352, 747, -1711, -2055, -978, -1307, -519, 589, 1223, 435, 1142, 116, -112, -119, -1834, -1693, -1473, 847, 95, -80, -384, -135, 875, -613, -723, -724, -2049, -1142, 132, -2099, 402, -558, 1164, -154, -153, -443, -392, 198, -246, -1033, -1165, -349, -888, -487, 744, 1991, 1179, 490, 694, -391, -1751, -754, -758, -801, 1077, 806, 446, -1124, 2785, 839, -713, -1178, -1364, -745, -80, 1052, 239, 750, 1063, 2359, 259, 2007, 1020, -1728, 153, -1068, -852, -1200, -1052, 102, -727, -336, 1004, 2003, 2295, 180, -539, -865, -1745, -1138, -2226, -207, 972, -239, -306, -709, -38, -223, 587, 449, 698, -1638, -1059, 1196, -1170, 2233, 584, 608, 1966, 244, -533]
15220e33n74p62J552j958J342J097j94J566m83l65O57k976J542k23p75K181r61
15237A33m2P53N95p14k071J025j103o79O09n38J592J100M52j377M80J438r95K26
15255H84j929N15l56l88R8O03Q93R01k518L377j022k054J332q23L00j406J860
15272B67j939L350k410N56J944j255q17J297j658k534J673K775j375J9J251j070
15288G4J542k131J85p85O05O03p83N38j113K83N57O43R47m04j425o3o05J70K921
15307A759k511N28O85l84J832k442J959p69q71J358k955K228j135J516K10o3N00
15324A445j900R28j599m38r1R25o75K749k65j512q04J377J648p69k093J224O92
15341H42j690q7j61J724L11k405L088l08P96k200n61J276k023R12R22m25L19J71
$$ y = [-533, -1107, -1869, -317, -2275, -933, 164, -30, 1536, 1053, 688, 1345, -1631, -89, -312, -1087, 1094, 133, 91, 844, 1439, 725, -1346, -321, -1424, -2103, -1494, -2032, -440, 660, 1112, -265, 215, 1653, 658, 884, -1045, -530, -886, -1274, -1176, -573, 320, 1221, -1297, 2080, 1058, -996, 336, -487, -187, -1593, 267, -1672, 1678, -732, -176, 1768, 513, -304, 993, -665, -3199, -1526, 1249, -126, -107, 1144, 74, 1616, -515, -330, -1115, -510, 93, -690, -152, -1265, -982, -425, 218, 1165, 761, -664, -727, -1332, -1162, 1759, -752, -224, 461, 77, 1909, -533, 1426, 657, -214, 1144, -1811, 417, -718, 798, 1008, 945, 1445, -455, 473, -1126, -1564, -1655, -730, -1405, 1344, 1079, -433, -1237, 140, 1788, 1019, -1074, 150, 842, -848, -935, -1096, 628, 939, -1466, 1622, 1314, 2110, -90, -651, 625, -1398, -486, 436, 11, 330, 501]
15359E01J942k735l35L51r64J208j533K266m022M043j757K447r89J781j203k8
15375I73n19o11l43o49O11P63m52N89Q0J43M04Q01k441J914k124K043k398N34
15393f82M43p95K79J567m02M77k05r13J90l15p14j004K047O1J420k4o81j50K80
15412H79r99j827K57N34j449J270o9J738L02j52j090J214j479J481p41j285p68
15429b184K427k215Q33J023J848k533J884p29J053j099j486L071k831Q39L19j5
15445B05R84j303M39r92J502n70r30j658J156k76J595O46J188m66l42j594j708
15462b124M58j201K595j142L64R90j468R82J644j233o21J031o05o91n34O61q70
15479a764L045r10j969K229j140K054l106J422l498L335k929M551j827K464r48
$$ y = [501, 2443, -292, -627, -276, -1240, -32, -1565, 701, -3321, 722, -1035, 1412, 423, 2204, 1001, 973, 454, -157, -500, -1149, -538, 225, -227, 362, 442, 585, 989, 1790, -651, 1263, -861, 1182, -1216, -682, -239, -1034, -755, 812, 410, 887, 682, -231, -41, -356, -1070, -2074, -27, 34, 1454, 1430, 749, 599, 879, -120, -1947, -1690, -1156, -2605, -1335, -1404, 334, 636, 484, -606, 608, -871, 610, -131, -1416, -2184, 243, -1972, -1139, -116, 1732, -801, 1083, 354, 1407, 308, -1178, 1893, -938, -99, 220, 205, 1189, -114, 325, -667, 835, 265, -665, -2323, -1167, -1443, 152, 798, 1986, 1520, 1178, -416, -2124, -1666, -2867, -272, -1414, -1050, -60, -1528, -546, 1098, -135, -756, 275, -330, -1021, -1555, -894, -1764, 1281, 371, -1598, 631, -509, 1545, -1561, -139, -3637, -302, -3231, 1320, -507, 1957, 1009]
15494A009N93j958J398k163m62J787j94l2K18n47Q37L60M52j705j51L75P55j490
15512i18R16j049J78J389J734j080K23j953J56K51j023n80J729N32j687K225q42
15529B01J090J87l48m05R43k117o5J322j690k14K273j668P76N46n18k016J200
15546e03Q49k116p7Q28L84K33N11O33n26K82Q78j673j500J744j797J650R59r60
15564b01M82l78l69O16m02j227K243p51j929o6J956n25L52K576j402J290k737
15581d72p57Q01n92n85J278J052p47M0J466N40o32k234Q40k18P34j825r45K820
15599E64n83J96l34j96J294R08k875k24R6k263K701m79n99J799L90K89J373k005
15617E2K74m4n6k392J492j811K962q16K93J326L29r83j489k92J798L88k382K247
$$ y = [1009, 1602, -356, 1042, -1121, -1583, 204, 10, -22, 196, -351, 486, 846, 1298, -407, -558, -183, 572, -918, -2, -1051, -873, 516, 2250, 1170, 1393, -560, -404, -153, -1176, -1756, -27, 505, -1182, 1043, 201, 1291, 1478, 1130, 725, 1668, -449, -514, 808, -882, -1096, 1177, -491, 285, 831, 313, -1703, -503, 346, -1770, -1847, -1019, -635, -402, 109, 742, 216, 498, 1376, -297, -1797, -53, -1850, -200, 759, -201, 281, -97, -466, 150, -252, -1479, 764, 13, -1916, -1982, -26, -551, -199, 2377, 975, 2265, -472, -1229, -428, -1020, -1605, -327, 725, -22, 18, 1484, 2024, 1392, -842, -2, -220, 514, -1311, -2256, 564, -19, 177, -157, -353, 941, 1849, -1026, -1250, -1154, -3417, -716, -1195, -1794, 5, 395, 684, 2057, 52, 326, 282, 226, -2166, -674, -2485, 477, -339, -46, 1280, 1609, 626, -863, -1155, 643, 1031, -1351, 896]
15635H96k729n91K150p23J683m01k43k129P37M08j613L917n00O50q96p08J353
15652A261M42l1k942q5P94l10j56J624n87k12N29j079O21k12Q0M67k016K115K098
15671B401k990J897J006p14m06o38j036J147m81n86j602l75K396j01R12K823l436
15688B17J81N43J74k778P97o46J284l2P20j093J961L50r63j75k87p94k712O45
15706b608J502J469N75r45M28L46M32J23j682k05p83N71M23j126N02L74J896Q53
15724B145k20o37j327j027J558Q49l526N61K054r54K426n70j457J058j253O76
15740C56r0j232J148k390K142m41Q18k61J370p70j20l80j590M89j571J561q80
15757a841L334j172J069P59l553K299j877J509k598O04N69P21J733j307o78R05
$$ y = [896, -1833, -2424, -274, -997, 686, 285, 42, -2087, -1350, -942, -2555, 1362, 862, 1512, 616, -92, 1261, 1703, 1672, -1270, -1355, -561, -871, -1027, 597, 10, -202, 327, -752, -131, -343, -263, 204, -1812, 303, 2401, -589, 1308, 2314, 1600, 1194, 556, -480, 667, 186, -400, -2002, -2377, 19, -82, 830, 3653, 217, 398, 941, 1115, -1663, -866, -1512, -228, -260, 460, -633, 1328, 1678, 715, 540, 253, -541, -3253, -2608, -1106, 363, 938, -7, 421, 767, 1199, 1322, -360, -565, -1348, -777, -354, -1480, -978, -604, 1292, 2145, 1925, 1288, -39, -1066, 492, 1341, -2185, -1624, 430, -524, 1902, 1332, -125, 933, -320, 356, 266, -966, 182, -2208, -66, -507, 311, 50, 1420, 650, 530, 150, -1440, -951, -2522, -961, -1841, 1493, 321, 1390, 2149, -1404, 895, -982, 527, -2071, -1467, -898, -177, 1556, 249, -429, 476]
15773D76R55q40n93p32q85J458q39N44L3j37N86J298j60P20k708J1P63r94J009
15792c5j549J403q47K931j703J341k041J204q18k036K206k460J347J440J27J076
15808A586p26O19j540r92J399j77l70q0o08J372m20J037N50j40o4r46L48N97j179
15827B66m95J586j589O36M64R97j068J104k192K70L89J033j596o07P31Q80J81
15844I90l66K65M45o01k441k4Q55j425L338J22j144l29k45P79R96k150J77Q24
15862F6r51J299n70J034j482K714J57L98j949n5j241M4N33n56K123k600K099k979
15880a916M070j551q05J33M24r29j76n40q64L424o42J18j290Q03J157k016J892
15897A292k324O38j167J851J90k11J780k175K973j604M1j940Q69J116k432J407
$$ y = [476, 1431, 591, -2, -734, -1619, -161, -1000, -456, -423, -560, 26, 1324, 1164, 1884, -824, -813, -50, -1044, -35, -1584, -181, -1028, 1903, 200, 1541, -500, 704, -114, -2150, 56, -2404, -1057, 383, 510, 1586, 860, 1479, -61, -1053, 346, 169, -201, -281, -889, 483, 63, 1100, 1650, 1510, 1446, 500, 848, 1445, 266, -229, 1357, -232, 404, 868, 1865, 797, 1901, -291, -21, 368, 1401, -195, -802, -71, 809, 990, 624, 889, 1334, 733, -1708, -1732, -877, -2302, 1036, 1158, 14, -315, -560, 219, 1215, -935, -758, 66, -885, 414, -156, 878, -604, 2110, 2267, 2665, 716, 661, -580, -536, -3, -559, 1564, -1036, 1063, -1916, 2154, 603, -202, -69, 355, -574, -750, -1290, -2154, 1270, 628, 746, -544, 259, 1416, -600, 1292, -1032, -394, -1561, 290, 480, 269, 2049, -126, 2847, 1243, 1284, -656, 213, 1329, -1103, 304]
15913C04k14N19P7P66q37J64q67j077K456j656o50K94j28K063k48j871J777o59
15931B13L56l204J740J032j650l27K608o81PJ531j415L06L99N65j691j066P21
15948e56J299k159L186k076o67L12J384j289J18m73J859j903L12J087J11o64p35
15965h54K833k65l589J112K573j793j6j437K453l296K306P25J019k7j681j822
15981a759J449q63J03Q33o60k82j136J998K44N91j386P04J23j322J634L02q78
15998c05Q93j258K759k80o84j446L18m05J22L17q23J07k32P02J57m58J152p96
16016a60J528r04J32p0k143J464m34P45l50K621k099k99j003K323j160j37L95
16033D49r37j64R4J149l55J568j425P47l757J638J52M9j366J449J571j895P20
$$ y = [304, 90, 609, 686, 1452, 615, 779, -88, -1165, 1291, -365, -1015, -721, -849, 1214, 966, -905, 872, 213, 569, -2635, -895, 137, -1513, -1840, 768, 87, 94, 1625, 210, 516, 915, 1480, -211, -1277, -556, 743, -1416, 1770, -306, -973, -661, 723, -566, -448, -921, 938, -965, -653, 434, 545, -119, -854, 1979, 1714, -1875, -763, 1810, 17, 1, -1436, 1017, -2279, 27, 752, 1771, 1744, 63, -1759, -310, -1173, -1070, -237, -897, -1179, -2315, -317, -73, 518, -868, -164, -41, -1363, 271, 573, -305, 588, -670, 2089, 1809, 1125, -321, -3, -408, -286, 31, -792, -685, -917, -215, -58, -516, 636, -160, 1368, 464, 596, 526, -1617, -153, -587, 158, -192, 2429, 330, 31, -972, 1351, 191, 54, 449, -488, -652, -558, 591, 236, 1804, 379, 1126, -2631, -993, -841, -792, -2158, -709, 862, -1033, -313]
16050c13J000O93j085k636J057M23p26R16Q70q10N75m09L241j637J430k006n54
16067B9k429K661J48N60j002r74K388k77M59q09j412J990j187j191m99J170n06
16084h81K000R8k020J636n51j56O15j419P0M60L024q67j159R65j289P30j900K630
16102A986p39n42j978n20K893j370Q83n92r9O38j312J03J221r36M52j470M9K03
16120a130M33K07M83R8L04q83L17m37l51J003p48K11N4L130k344R50j582Q7K28
16139C0p7P81l168L336J097l359L189j796N05p4j3j47r51J16K1n38j411P36J903
16158A80J710L84q00o52r19j050K374j806K92p65J430l94l56J385J083r77p58
16175C61Q1r86n12n11J186J88N77p6J272j429k33P48r81J175j476Nj514L296J431
$$ y = [-313, 687, 1380, 295, -2341, -1284, -861, -1587, -671, 199, -611, -36, -445, 2796, 1159, 2589, 583, 29, -2400, 261, 409, 969, -33, -1007, 1381, 1104, 1563, 754, -658, 1332, 145, -1046, -1545, -375, -881, 1119, 1217, -803, 833, 282, 126, 741, -678, -608, -148, 2876, 2009, 850, 1815, 526, 1256, -644, 1986, 1247, 705, -1273, -1793, 1100, -270, 613, 21, -78, 560, -752, -649, 572, -364, 88, -1382, -1333, -1130, -697, -490, -7, 91, 395, -488, -171, -608, -959, 44, -704, -493, -439, 2691, 347, 1297, -285, -198, 30, -47, 734, -2434, 902, 1999, -1360, 1829, 33, 538, 464, 451, 304, -647, -531, -510, -1048, -2459, -1723, 180, 1890, 2274, 1474, 822, -97, -1147, 1227, -579, -287, -1052, 378, -16, -372, 1013, 2096, 1119, 361, 442, -544, -1056, -1567, -381, -193, 384, 308, 1580, 151, -82, 666, -315, 860, -616, -611, -2125, 1171, 2602]
16194B602k325J794l09j803M37J64j63j63r97j379K424j186j57K114m86r22n28
16211h83M47k35L47j874J528j16J72M17J634j295N20j85n32k22n89l43L13K079
16229A183k615J252M00J891l195P02J432j810J11r27J802q82K002n20m18Q10p72
16246D46q19J643j042N59j687K45K172l275N19J087J571K21n97q11k221J477j376
16263a888J833p87R30l69J662j290m56K5l46m38N69O70O6j282Q03M16n0J186J08
16282A362p31j855K348j954j56J862k111k00K010K97J98j180n57J392j177j733
16298b185n18K638P39o63j472J723J961k600M79m46q45k49L087k083p22Q04K324
16315A972j334N66p95l9k116k64L51r04J356k7j97J801N23j616J77L93O41P26
$$ y = [2602, 277, 2071, 1762, -41, 396, 560, 397, 234, -763, -2142, 282, -904, -1061, 1053, 567, -355, -883, -436, -671, -324, -2198, -670, -786, -614, -197, 1437, 142, 662, 477, -55, -277, -866, -1209, -896, 1183, -1432, -180, 220, 2111, -1084, -382, 1050, -760, -649, -1576, 226, -656, 1346, 826, 408, 1218, 446, -373, 1270, 228, 787, -900, -655, 1517, -1758, -1239, -152, 1419, 1640, 1043, 232, -1989, -512, -1888, -55, -842, 88, -281, 1381, 91, -365, -340, -686, -1124, -555, 115, 181, -1101, -298, 118, 68, 1254, 1362, 631, -1224, 1124, -830, -986, 876, -1235, -1435, 575, 872, 1070, -110, -667, 725, -452, -2185, -2703, -65, 674, 11, -1461, 262, 2223, -377, 102, -344, -1189, -1438, 1649, -434, -1156, -352, 1972, 638, 1204, 409, 370, -1746, -2010, -1659, -2563, -1207, -1234, -1431, 370, 893, -723, -546, -153, 488, 1214]
16333A214j604P1l11N83j71j067K482j036J733j853J835k186o8Q34q71j076J331
16350a60J597j750J394j814K157j919J070k071L79J39J136R47k623J135P07o6
16366B58j306J592j239j09j8K503k574P82j19J246k893K103K682j568n42l81o03
$$ y = [1214, -390, -319, -630, -47, -218, -1285, 1197, 161, 1894, 41, 1876, -310, -378, 456, -415, -1491, -160, 1437, -313, 1081, -733, 1424, -495, 575, -1496, -1117, -978, 158, 1105, -1518, -383, 324, 258, -1048, 544, -695, -804, -822, 1681, -893, -111, -230, 1016, -1877, 226, 2908, 1340, 798, 417, -186]
16383a86
$$ Imaginary data points
##PAGE= N=2
##DATA TABLE= (X++(I..I)), XYDATA
0@%%%%%%%%%%%%%%%%%%%%%%%%Nj3J8k2K5k7K9l2L6m2M8n3N8o3P2q1Q8r9J11j24
44f6J37j51J66j82K02k23K46k73L02l31L71m15M63n24N95o82P90r35J138j444
64h16J973l137J7475j1211k4350j2408r268M551J2906K1033K2637J5585N543k855
78C7658j4854j7952k2427j5819p146K949J3185K0645J9307J7643P656m564r264
91B7017k1883j9387j5706p619N59J1809J9235J7038J8624Q890q31r513j9799j9732
105a1298j7845q807j369J0993J8147K0634J7978P495K494r871j7402k0365j4791
118b4007j2135K18P342J6378J8015J9036J4088k693q482j3192k0022j9652r527
131c4633l140N668J7738J8747J5724J2881O512q634j4610j8938j8953j1443n144
$$ y = [0, 0, 0, 0, 0, 0, 0, 0, 0, 0, 0, 0, 0, 0, 0, 0, 0, 0, 0, 0, 0, 0, 0, 0, 0, 5, -8, 10, -12, 13, -14, 15, -17, 19, -23, 25, -28, 30, -33, 39, -42, 46, -53, 58, -66, 71, -80, 86, -96, 106, -117, 129, -144, 158, -173, 198, -217, 246, -278, 317, -365, 425, -510, 628, -816, 1157, -1980, 15495, 4284, -20066, -32474, -41742, -37191, -24285, -3252, 19385, 34970, 40513, 37658, 22804, 4852, -17575, -33394, -40540, -37591, -24406, -3761, 15546, 33189, 40845, 36281, 27017, 5134, -14253, -29959, -37578, -37019, -25210, -5975, 11063, 29687, 38577, 37746, 28233, 8434, -11298, -29143, -37950, -39319, -28326, -10179, 10455, 28433, 35928, 38422, 28551, 11149, -9216, -24007, -36142, -35924, -28582, -12204, 5811, 24847, 38935, 36242, 27760, 14568, -5454, -25106, -34633, -37773, -32105, -14367, 4380, 20104, 32985, 39497, 30863, 16253, -2685, -21638, -33081, -38225]
144c8225Q006J4100J8395J9875J0310O552q184j3634j8637j8963j2293m652O543
157c0807J2319J7263J9027J4974M506n473j3204j7132k0453j2069m723K257J4464
170a9051J6406J8908J5093N062m064j1756j8418j8149j3675p052J313J3094J7561
183d728J8615J4371P608l049j0751j6906j7011j5549n802k94J1896J4923J8372
196A1695J3662R505N9j2551j5651j7865j3058r839L370N271J7802J5444J8364
209B6208Q000J701j1487j6242j4695j8787r095N36Q886J4095J7701J8481P258
222C2560N64p486j5232j5841j5912r810k286Q428J3876J5116J7166R839J035n117
236B6900j3914j7141j5451j1734j921N222J5762J5694J5162R889L539m898j3279
$$ y = [-38225, -30219, -16119, 2276, 22151, 32461, 39013, 30829, 17195, -1442, -20405, -32698, -37350, -30807, -18488, -1225, 17802, 32776, 37282, 31809, 18605, 1473, -18980, -31049, -35772, -33515, -19051, -2645, 16263, 31356, 36418, 32354, 20598, 2180, -15969, -29644, -36696, -35383, -22289, -4728, 13887, 28258, 35866, 32817, 22066, 5160, -11851, -27400, -33202, -33496, -21600, -6677, 11695, 25357, 34862, 34921, 22370, 6719, -11146, -24204, -34043, -30673, -25402, -7600, 7844, 26208, 34208, 35909, 24422, 8180, -6515, -25302, -34397, -33861, -24975, -10880, 6821, 25302, 32560, 33124, 25638, 10406, -5435, -21347, -31157, -33443, -25015, -11139, 3977, 21143, 30982, 32017, 26900, 12986, -4155, -19606, -31340, -33261, -28039, -12277, 3417, 18579, 28468, 32007, 27109, 13830]
249A3830j7055j5253q755m608M468J2033J5772J7289J0660K759l316j3353j2751
262A720j7980j2764m704O862J0897J4637J6594J1640N317l188j2524j5538j4642
275a3673j2759m350L198J2185J3074J5998J3150O478m424j2731j5684j3241j3556
288b6335n153J075J3074J4784J4228J5013L293j645j0285j1849j9105j2116p170
301c2191K969R337J4219J4735J3439Q625l355r038j4625j3382j3815o892P83Q629
315b0562J3999J6775J2053O542l085n007j2741j8028j1938o099n0P674J4098J4635
329H266J2953P601p92n932j4600j5551j2523n717j340O098J2860J4873J2086Q965
343B7247L302p196j5436j4917j1302r223r40O309J3009J3775J3372Q320J762n469
$$ y = [13830, -3225, -18478, -27233, -31841, -27373, -15340, 432, 17721, 28381, 31140, 27824, 14471, 1720, -16260, -29024, -33728, -26866, -15969, -1332, 15262, 26902, 32219, 29031, 16507, 969, -13673, -26432, -30782, -27584, -15399, -2325, 13673, 26823, 33301, 28877, 16146, 462, -12779, -26335, -31488, -30413, -17339, -2555, 11673, 26686, 29979, 28334, 18049, 6200, -12905, -25021, -32191, -29222, -19885, -5666, 9069, 22508, 31133, 27778, 18740, 4115, -9267, -23082, -29974, -29191, -20562, -6563, 10212, 22265, 28807, 25722, 20715, 7974, -10054, -21992, -28091, -28141, -20467, -6369, 8266, 21219, 28820, 28028, 22096, 7496, -8055, -20578, -26295, -27635, -21537, -8677, 6196, 18282, 27247, 30549, 23353, 7917, -7000, -18302, -27525, -28465, -22156, -9147, 4628, 18000, 26320, 28082, 22613]
357B2613j2127j3024j5639j0081k63N516J2971J3581J3768R093M212p214j1698
370A1708j4906j4558q182k483M834J4014J1362J7168P439L645n825j1854j4305
383a943j3377r301l466M331J2296J2507J1960J2966J992n011r156j2768j5320
396a4290j2123m70L795R180J4688J4429Q875L531m144q612j5278j5514q966k511
410b7410L510R700J4654J2185J1130N600l152j2049j3251j4325j0934l577L103
423b4816Q581J4719J3317J1562N458j663r480j6666j3145j1826m507M787O780
436a6899J5111J3443R846Q418m010j0408j2740j4031j1136l988jJ0409J2287J3476
450I777J2797N298l223q521j1182j5519r525r404M867P603J2412J5601J0119O394
$$ y = [22613, 10486, -2538, -18177, -28258, -28521, -23005, -10034, 3547, 17315, 26408, 30620, 23406, 11708, -3198, -17756, -25938, -28421, -23587, -9573, 1789, 18957, 26396, 30041, 24216, 12362, -1943, -15320, -24621, -28087, -23756, -11460, 1047, 13007, 25973, 27965, 22954, 13798, 1030, -14290, -26413, -26883, -23088, -13908, 780, 15209, 24084, 27615, 23471, 14859, -419, -15933, -24899, -27410, -23900, -14200, 454, 12639, 23769, 29369, 26217, 14168, 917, -13408, -24342, -27919, -24816, -16235, -1516, 11801, 23363, 28821, 27158, 17678, 1012, -12133, -23959, -28466, -23679, -16899, -1788, 11655, 21501, 29919, 25909, 15501, 2761, -11270, -22406, -26394, -26395, -15986, -3699, 9777, 22574, 27872, 24649, 16128, 4946, -10573, -20098, -29502, -24635, -17032, -4620, 10981, 21100, 27494]
464B7494k465o375j1383j5652j3387m199j987P976J2472J4571J3106P893j937
477B6127p166j3714j3816j5396m503J735P791J0378J5560J2955P917O39p203j2112
491I192j6833j1553r584L75O165J3078J6878J2073O662J848n645j3964j4655j4008
505a9971n479j284M265J2542J3353J4289R623J222n991j3046j3551j1394j0575
518b5997l183M916J2847J5018J4753R773N83l831j4453j3567j3051j2073j767
531c0032P998Q468J5600J4375J0390K166m582j1896j6252j1782j1827j564L875
544b5063J1332J4159J5527J2206R25k609j2111j4676j5510r445k606R71J1463
557a5437J6494J1975J1602N443m659j0059j3333j5653j1178p374O201P843J7099
$$ y = [27494, 25029, 18654, 7271, -8381, -21768, -25967, -27954, -19978, -7506, 7065, 20171, 28064, 26127, 18961, 5247, -8569, -23965, -28468, -26733, -18942, -8564, 6996, 19951, 27868, 28507, 21304, 9192, -7641, -19194, -28778, -28403, -22238, -9160, 7718, 19791, 26453, 28301, 22656, 8692, -5963, -19971, -25450, -26734, -22469, -9927, 3426, 17715, 27338, 28560, 22569, 9523, -4028, -15422, -25997, -29180, -24264, -11417, 3601, 18354, 28127, 28710, 24879, 10426, -3141, -16192, -28265, -30032, -22034, -13566, 2034, 16409, 26799, 28965, 24383, 12487, -3765, -15547, -27374, -28938, -25063, -13731, 428, 15955, 28161, 29086, 26477, 14366, -310, -15820, -25265, -27871, -26900, -15437, 1057, 13032, 24634, 30077, 25418, 15359, 2026, -13627, -24805, -32179, -25978, -18135, -1036]
570a036J4654J1886O721m124j0078j6204j6198r476p252L214R498J4712J4346
583A0663J0697Q410k503q224j4659j6011j0492o819j126J0344J3419J5436J3808
596B2943O560r44p852j2618j6447j3571o510K0N161J5573J7833J3942N988o86
610B9392q473j2718j5262j3459r020N62O016J2106J8706J1045J1887q61p226j1033
624A1662j8477j4788r824K157M705J4027J4063J4766J0912K088p766j1743j5457
637c675j5304r265j308L490J3229J5393J5211J0909L759o667j1716j5626j7145
650a8715r306m791N549J3684J3938J6907J3169L291p525r944j9582j1675j3226
663b8226l391L117J1571J5801J4213J4136L634k285j1962j4111j4946j3620o449
$$ y = [-1036, 13618, 25504, 32225, 28101, 18023, 1819, -14379, -23855, -31107, -27893, -18395, -3683, 10663, 21360, 29770, 27267, 19043, 4384, -11627, -22119, -28938, -30064, -19720, -6301, 9135, 22943, 29503, 28559, 20707, 8089, -8358, -21929, -28439, -28419, -23258, -7685, 10148, 24090, 30078, 29392, 20919, 8201, -7061, -20520, -29540, -28978, -22962, -10856, 7850, 18895, 30782, 29921, 22695, 11662, -6815, -21603, -31427, -29270, -24565, -10538, 3525, 18291, 29203, 31291, 23525, 11782, -3675, -18979, -28244, -29552, -26062, -12833, 2560, 17771, 28680, 32439, 25772, 14056, -1570, -18715, -28021, -32812, -27263, -13579, 359, 17266, 30435, 33726, 26201, 16257, -3325, -15000, -28226, -31617, -28500, -16929, -1128, 13085, 27221, 30855, 28570, 16608, 2497, -12449, -26069, -32518]
676c2518M458R051J5172J7699J2648N184l231q106j6613j7714j1674n494J727
689b9411J0426J3997J5512J5225R010n006r383j3104j7930j4072p980J507R610
702b1599J5098J7161J2159Q382J961r862j2977j6593j7244p354N29P484J4280
715h575J7586J2818R507m55p272j4192j5284j6732r093M46Q803J1009J7174J3973
729A9713J0498K338o326j3660j8083j2566j1199k770P736J2248J5988J3975J0445
742B8337K955o817j0722j6441j6144j0720k547N286J3327J5292J5793J0161L120
755C0880l411j2703j5584j6422j2887l176N121J2951J3529J5460J3173M770k332
768B9369j2066j3432j8890j1733m578L221R405J7204J4446J3552L557k729r337
$$ y = [-32518, -28060, -19009, -3837, 13862, 26510, 31694, 28463, 20357, 3744, -13970, -25644, -31138, -29411, -18985, -4988, 10524, 25749, 34759, 29753, 20370, 7266, -10664, -24736, -32716, -31209, -21599, -6501, 10660, 22819, 31201, 33162, 23300, 10323, -6270, -23514, -30868, -30339, -22855, -8575, 9011, 21829, 31336, 30881, 23609, 9417, -5867, -22599, -31692, -31246, -22443, -11434, 5740, 19713, 30211, 32549, 26223, 12563, -5520, -18086, -29285, -32055, -24319, -12071, 3917, 17892, 28337, 31292, 24475, 13753, -2688, -18832, -29552, -32099, -26813, -13486, 1806, 17599, 27760, 30880, 27469, 14766, -818, -17240, -30127, -33303, -28182, -15231, -1702, 13758, 26931, 31701, 29369, 17303, 3871, -15019, -26752, -31330, -28109, -18704, -1500, 12946, 26498, 30055, 27326, 17989]
781A7989j3832j6608j2994n727K916J0098J5365J3582J3800N458k269r847j1744
794F187j5419j5219n724J311P967J5176J5742J2191Q591p83q043j5516j2341j6169
808b2049p419k481R528J3512J4647J6081O588J527p633j3265j4258j4975p271
821b7468l971P087J2966J4801J5490J1594o30m685j2881j8956j1504r791k860
834c0808O174J3235J5909J3778R961J736o785r273j7738j1327j3516j401N321
847b4734J3102J4560J4229R629L145l199j2185j6359j4935j0270l747P085R820
860a3859J3970J2626J1936N843n455r138j4967j6097j1808k015K809J0730J4356
873a069J4619J0717L310j686r657j4180j3072j3420m512L519R591J1671J6554
$$ y = [17989, 4157, -12451, -25445, -31172, -28256, -18158, -2793, 10789, 24589, 30047, 27778, 17931, 6187, -9232, -24451, -30175, -28864, -20897, -5721, 10021, 22212, 30803, 30020, 21977, 6461, -5880, -22049, -29468, -31949, -22421, -8909, 5738, 21819, 28407, 29934, 22301, 9036, -5222, -20197, -27468, -31439, -24352, -11386, 3415, 18905, 30499, 29869, 25184, 12303, -6653, -18157, -27948, -30808, -24634, -11399, 4510, 18288, 28249, 29985, 23200, 13927, -3811, -15138, -28654, -30055, -24734, -11632, 2928, 17157, 26786, 29931, 26732, 14547, -1812, -16747, -27017, -30764, -23679, -13859, 111, 12737, 24673, 30516, 25061, 15923, 956, -15141, -26949, -28964, -26155, -15425, -1069, 13550, 24267, 27577, 25891, 16234, 2054, -11018, -24438, -28950, -25431, -15840, -4169, 12385]
886A2385J2000M005J42j0117j3559j5782j2133n216J025J0275J1343J4284J3756
899B2408N110q41q087j3347j3039j1870q581K284O394J3925J3550J2658N875K517
913B8956q864j2328j5228j0955p950j348P404J2927J3813J1377Q452j12o982j0738
927H424j3074j4679o700j100M928J4220J2950J1793R769r30l180j3198j2178j3154
941a6109r609P15L645Q879J5724J3518O616M710q062p876j4749j5781n955k029
955b6363N359P437J7084J2773P329J633l274j0070j2953j2404j0140m172N678
968b2083J0737J2402J2143J0316L658o093p633j2723j2988j0451l927L476R325
981a3841J2527J2387J0199M613m196p192j2372j5138q146l153J750J0486J2044
$$ y = [12385, 24385, 28390, 28532, 18415, 4856, -10926, -23059, -28275, -27250, -16975, -5632, 8652, 22408, 27518, 26677, 18590, 5243, -7796, -19666, -28247, -25963, -19569, -5644, 7906, 20564, 26439, 28956, 20092, 7764, -7464, -18419, -26369, -27717, -20313, -7386, 6427, 17804, 26256, 26144, 19162, 8424, -4650, -19329, -26029, -27129, -22201, -7981, 4969, 16762, 26531, 25601, 22421, 9223, -2955, -16109, -25718, -25003, -21358, -12479, 3245, 16763, 23379, 28089, 20027, 12151, -2598, -18379, -24334, -26363, -21004, -13567, 3517, 16290, 23619, 25252, 21978, 11908, -1045, -13449, -23589, -27761, -22083, -11346, 1056, 13199, 23515, 27173, 21080, 13447, 724, -12264, -22715, -26642, -23166, -13841, -1314, 11073, 21272, 25885, 21689, 14497, 2125, -13013, -21159, -24312, -22562, -12076, -32]
994c2J3098J0472K150l794o889j1711j2449j1621l405K044O807J1600J4604Q730
1008A9604O087k133p698j4215q865j2645m415L147O411J2711R184J2630L708Q30
1022B4341r144j0830j0601j1052o192n20P638J0415J3021J1149N429J069q131
1035A6592j0140j2449j2073m674k543Q710J0293J3905R667P865q60o212j1727
1048F354j4003r805m362k523N904J1002J0597J1832O955J282m672j1889j3146
1061f474r131p624j789O491R276J4321J2004P434j227o649p413j3819j1183p051
1075b2834M44M509Q964J2620Q838O860L670m488r091j3777j1165p293j522O891
1089a7374N908J3229J2636Q987J469n346q577j2477j0397q857k183N431N528J2166
$$ y = [-32, 13066, 23538, 25688, 21894, 15005, 3294, -9155, -20776, -24181, -22137, -15330, -3730, 10874, 19604, 25691, 23558, 15860, 1645, -7220, -19865, -24280, -21133, -14722, -2011, 7173, 19803, 23511, 24341, 15197, 4367, -6234, -17286, -23478, -23998, -16360, -5945, 7076, 18225, 23654, 24723, 16592, 6452, -5997, -18070, -22744, -25287, -16577, -6284, 7621, 17288, 25153, 24293, 18081, 6354, -7649, -17454, -21816, -24339, -18435, -7433, 3164, 14996, 21951, 23233, 18561, 6672, -6474, -15605, -23229, -25018, -18527, -9251, 5070, 17074, 24508, 23281, 16632, 9219, -4600, -15783, -22834, -22390, -17881, -8917, 3703, 12541, 19401, 23071, 18583, 9492, -4285, -15450, -22743, -24265, -17374, -11466, 1763, 14399, 23386, 24855, 19509, 10932, -1545, -11942, -20799, -22982, -17551, -12023, 143]
1103A43J4929O334J380k803r023j3651r500q125l059K610R193J3843R097Q915
1117B0283L147j358j0931j1721r201j1804k324K635Q988J1176J1793P778N085
1130B3546j749p567j4058j1886p170p152K697Q777J2261J4255P506M784j120j0199
1144A2925r021j3767r530m675L302O057J0415J4032P746P065l481n690j2149j2297
1158i068q998n547O74Q066R999J2597J0641N191j984m995j2671j1391j0240o197
1172b3923J808N308J2413J1830R252P959j704p726j0062j0694j1483o078j289
1185b4389P666J0618J2906R780N600J408n474r660j4698r279r308J567O636Q092
1199h535J5218R577Q210q19n080j1481j2373j1860o923J039L827J0915J2314R213
$$ y = [143, 15072, 21406, 22786, 19983, 10960, -2691, -12191, -20316, -23375, -20765, -11572, 2271, 11368, 20283, 23430, 22072, 11141, -580, -9781, -21585, -23909, -21274, -12286, -1110, 10683, 18461, 23546, 21797, 14230, 172, -11714, -18884, -26036, -23339, -14562, -2301, 11954, 19460, 24244, 23124, 12925, 3904, -9863, -19393, -24068, -20766, -14709, -4294, 9738, 17484, 24549, 21068, 15378, 3229, -9068, -18066, -23613, -22939, -14873, -4874, 7723, 18364, 23555, 21571, 16576, 3905, -7486, -17726, -23923, -22115, -16807, -4394, 7436, 16688, 24647, 22943, 15217, 5155, -5539, -17022, -23100, -24389, -16723, -6105, 6801, 16581, 22181, 23589, 18115, 8455, -6243, -15522, -24830, -23263, -16627, -8535, 6683, 16260, 24470, 23651, 18571, 7090, -5283, -17143, -24066, -23027, -19200, -8285, 4029, 13242]
1213A3242J1379j84m308j1334j2231j2600p848j536M490R770J3185J1074R186
1226B2285J924m565r237j2441j1310j0090k086M776J0411J1401J3978Q576O40
1239B4262l785p518j3038j2171r814l981L380R145J4272J0948R458M694m906q265
1253A2681j1505j3633q390m197L378P843J3152J3530Q251N042k914q553j4174
1266E11r818j3635k511J385P035J2069J2592J1942N655k625o120j0839j5616j0495
1280b0470o707L543P406J0788J2628J2513O207m10q728j1742j4259j2339m095
1293b5665J763N868J1303J3847R969P448n81n799j2365j0850j3129q116J551O041
1307a8715J0309J4013J2689O941j171n074j0789j3408j1668q935L289K710J0815
$$ y = [13242, 24621, 24437, 20129, 8795, -3436, -16036, -23884, -25420, -20930, -11160, 2025, 13099, 22285, 24209, 19644, 10407, -2034, -13344, -23434, -25520, -20744, -10333, 1068, 15046, 23622, 24262, 20477, 12959, -79, -12250, -22064, -26045, -22665, -13520, 752, 11700, 21158, 25852, 20946, 12681, 1176, -12457, -20847, -25044, -21666, -13823, -671, 12859, 21110, 26152, 23238, 14685, 511, -9307, -22942, -25453, -24068, -17033, -4964, 7628, 19570, 25225, 22600, 16480, 5641, -9975, -20470, -27177, -23634, -16228, -5440, 7188, 19701, 25908, 25498, 16770, 5028, -9231, -21570, -25665, -23902, -18034, -6731, 7116, 17085, 24533, 23952, 18153, 5788, -5062, -18191, -26307, -24756, -18715, -8406, 5607, 18296, 25237, 24066, 18992, 8203, -5205, -16873, -25808, -22519, -19809, -8994]
1320h994J5412Q302J0381J421n952j1067j2546j3931q166r05M148J0713J4442
1333C258J1902Q932J978n575j0637j3270j0229j1395k684N230J1335J2103J1898
1346A2846R406K372k657r786j3950j2712p619l730L643R148J3881J0915J0654
1359B2411L234l469j0710j0449j2812r056l621J475Q170J3430J3112J0203K133
1372B4051N07j0371r874j5015r393m599J889P724J2571J1169R628P861k260r718
1386A4170r096j3225j2094n547J419P003J1878J5091J0537N706j358p654j2700
1399D130j0240j3493m904n47O526J1182J2202J4216M867R72o185j2841j2145j1618
1413a7878n953n2M722J0426J3920J2937M559K243n391j1050j2702j2242o455k329
$$ y = [-8994, 6418, 14720, 25101, 26522, 20570, 9503, -3043, -16974, -25140, -26045, -21897, -11184, 3258, 15160, 24092, 26070, 20495, 9858, -3412, -13641, -25036, -27720, -22490, -11155, 948, 12846, 22252, 24624, 21967, 12181, -1769, -14481, -22100, -25830, -22187, -13039, 842, 11757, 22411, 25645, 22176, 11466, 1017, -11795, -20851, -24472, -22997, -14827, -1397, 11715, 21918, 24051, 24558, 14187, 4313, -10702, -20095, -24694, -22805, -15081, -2510, 8659, 18287, 26148, 23888, 14170, 5074, -8151, -20245, -25792, -24373, -17370, -5492, 9599, 20136, 25842, 24484, 16830, 4130, -6110, -19603, -24507, -25054, -18528, -7346, 4856, 19072, 23939, 24911, 18726, 5885, -6260, -17878, -23831, -23883, -19161, -8735, 5185, 18122, 22681, 24924, 19533, 8483, -4219, -16461, -22916, -25245]
1427b5245M196J1966J2211J2385P848J384l716j1776j3202r727r522l587N754
1440b1031R764J3370J2477P402L474m477p290j2548j4648r639k824M474Q836J2940
1454B80J3175Q110M073j919j1706j1042j3366j1293j789N110N965J2615J3667
1467A1880R232L153j217j0181r541j4145p916n610K384P529J1529J4425Q468M619
1481B4609k853o303j1448j4461q954o157K287P922J1340J0955J0412N955q7o919
1495A6298q995j2553j3551k692k76O105P553J4795J0855M878K894p511j1233j2289
1509e722j2762l490l783Q742Q456J3609R918N074N914q605q889j3196j1105o529
1523b2368J80M001J1266J0979J1345O341K160n382j1040j2648j1104n265k872
$$ y = [-25245, -21049, -9083, 3128, 15513, 23361, 24745, 21029, 9253, -3949, -13676, -23198, -26785, -21031, -11267, 2103, 14580, 21982, 25456, 20979, 13689, 1141, -13507, -23146, -25970, -21496, -12660, 280, 13455, 21565, 25638, 23719, 12013, 971, -12395, -23688, -25477, -20367, -14402, -1787, 11880, 21112, 24265, 23048, 12867, 3326, -10819, -18735, -24345, -21961, -14432, -2903, 11522, 19990, 24609, 21756, 15453, 4005, -10456, -19410, -25567, -23280, -15358, -4018, 6937, 17349, 23304, 23217, 16298, 7303, -5250, -18801, -21493, -21769, -15664, -8111, 6684, 17539, 22417, 25311, 17800, 6567, -5722, -18484, -21974, -25757, -17015, -8559, 5050, 14968, 20042, 25956, 17351, 8462, -4734, -15839, -22368, -22188, -18187, -6921, 4058, 15403, 21744, 23904, 18522, 7482, -5166, -16270, -21535, -24407]
1536b4407N976R149R283J4066P138L030n206r354j2070j0596p991k849L572Q900
1550a1359J4031J0321P889K481l703p789j3038j2500q156j938M920Q227R669J2026
1564A1081R383L118k850r177j1691r882p762l065J552Q885Q930J1916P218M497
1578B2153k331o843r264j3141q331n167J474O990J0129J2811Q354L285J407p721
1592A3805j1329r052j0852m292J002P955R569J1629Q249M788L47p745r818j1440
1606g184q920n184P33M979J1815J0349J0262N001j467n103j0102j1491j0220n970
1620b2502K211N856Q918J0318R901O055p37n141j0723r666p832o510o49M649Q586
1635g266J1279R320O699M66o208o987j1361j0143n202j738M273Q956J0540J0577
$$ y = [-24407, -18431, -9282, 1, 14067, 21205, 24235, 19029, 9675, -2395, -12991, -20982, -23831, -20259, -11359, 2672, 12993, 20882, 23363, 19660, 11871, -1167, -13667, -21823, -23761, -18841, -10614, -945, 11081, 20464, 23582, 20732, 11555, -136, -10018, -17780, -20845, -19293, -10408, -1478, 10438, 17656, 22153, 19822, 12979, 3715, -9426, -17757, -22924, -21450, -14460, -4331, 8480, 16834, 20119, 21526, 13805, 2476, -6576, -17428, -21720, -20718, -12763, -3194, 8435, 16684, 21472, 21819, 14074, 4256, -7184, -16104, -21288, -20555, -15576, -3761, 6588, 16850, 21851, 20384, 15281, 5179, -6312, -16532, -22502, -20291, -14435, -5517, 4801, 14702, 20757, 20020, 14879, 4156, -5510, -13342, -19852, -20501, -15852, -7266, 4013, 13333, 20032, 20498, 14290, 7303, -4058, -14201, -19403, -21141, -16868, -7912, 2628, 13205]
1649A3205Q287l72m737o789j3370r377o864L22K932O902J2243Q642J0162k160
1663A9026k177p294j2057r444r454J332J061J1218Q460J1655N717R96k718n938
1677A0383j0957q837o169m671L306O645J1032J0483O048K681p64q099r846j0662
1691i427o321m743J785P313R700J2612N510K278j529n850q841j1960n307m330
1705a9110l63O531J2957P557R127L319j200q468r274q920q380l338J901O257R250
1720b154J0677P946L339k671o392n243j2504p752o026R67P342J0050J0019Q727
1734A6325K001m42n819q714q859r066l854r51O451R120J1918P042K706L48p021
1749A1185p214j1096p424m072j524N910Q946J1837Q759M102n25m592p182j4920
$$ y = [13205, 21492, 21120, 16383, 9594, -3776, -13153, -20017, -19695, -16763, -9861, 2382, 11024, 21186, 19026, 16849, 9555, -2502, -11946, -21400, -20068, -19007, -7789, 671, 12326, 18043, 19039, 16321, 10383, -574, -9411, -15580, -20251, -16945, -10300, 732, 11215, 17263, 19944, 19180, 11081, 1235, -9427, -15748, -20491, -18706, -11393, -1693, 10919, 16429, 18707, 17178, 11328, 2487, -9473, -14780, -19110, -19473, -12942, 15, 7572, 16699, 20018, 18818, 10350, 1076, -7844, -16224, -19562, -17661, -11404, -2154, 8523, 16469, 19808, 17137, 10745, 5502, -7002, -14754, -20780, -19813, -12471, -2421, 7598, 16325, 18326, 17884, 12065, 3351, -5508, -14574, -18428, -19379, -12928, -3808, 8110, 15152, 17858, 18206, 11185, 3971, -7125, -14549, -18621, -20145, -14235, -5289, 6548, 15307, 19409, 18884, 14292, 7110, -7810]
1763g810o312m007l54N077R863Q276R350M366N0l045j0512q110r824n904m12O181
1779a3127P183J0189Q375N640Q77k753r325r578j1174m366j419M386P662J0171
1793B741R757P759j3l992o333j2415r643l684j994K768N487J0806R633N591L977
1808B0445n323o209r878q282p217k178J979Q563J0638P971O994O44k314n780q981
1823A072r764o804l216K397O112J0289J0555Q028K35k874n825j1926n981p642
1837a5344k796K02R589P509R063Q587N464l489p117j0726q858q551l625J587O055
1852a2450R644R813R815J987l62n310q868j1745p486o720L625N375P359J2967
1866G644Q060L242m42m105j0996q963q985l100p86O025R256J1625N368P349k178
$$ y = [-7810, -14122, -18129, -18483, -13406, -3543, 4733, 14083, 18449, 18499, 15454, 4942, -3168, -12992, -18896, -19308, -13127, -5944, 4245, 12620, 18260, 19137, 16384, 7059, -2519, -13693, -18059, -19478, -15092, -7430, 2741, 12498, 20257, 20244, 16252, 9919, -2496, -12139, -15823, -17817, -15049, -9562, 1244, 10877, 16468, 20445, 15122, 8913, -965, -9247, -16464, -18642, -16663, -8100, 2538, 10509, 17503, 18147, 15833, 10053, 1072, -8692, -15496, -18712, -16315, -10203, 86, 10641, 18669, 18904, 16030, 10205, -1721, -7702, -15344, -18140, -17938, -8349, -840, 8223, 16810, 22274, 18785, 11668, 942, -7916, -16467, -20092, -18505, -12450, -2806, 7007, 16822, 18809, 18447, 13137, 4269, -7476, -14962, -21682, -18057, -12682, -5323, 7644, 15704, 18946, 18504, 14399, 3403, -5560, -14545, -17645, -18431, -12406, -3150, 8475, 13843, 21192, 19014]
1881A9014n344q456r140j1488o151M598M294O665J0780J0444L544K174o868r123
1895D943j1182n056q413O51L027J1078Q056J0369O769K30l579q738r585j2186
1909a3616n099j998N541Q108J0298J0373O046J751m768q524j0626r124r435P40
1923b0333M421O210J0852J2925M075L319l868r604j0036r625p558j955N568O095
1937i514J3252P266Q266K033k932q181j0525q331q391m010K788P840J0153R667
1951I381P848L423j208p315j1629r023r767l783K929P328J1029R691Q961M189
1965B2054l300n689j1437j0179r159m627K471P982J0442Q529R531N156j449o260
1979A4065j0898j1367q688n388K091N927J0669J0129J1643J578J20n043j1794
$$ y = [19014, 13670, 5214, -3926, -15414, -21565, -16967, -12673, -6008, 4772, 15216, 18760, 20934, 14066, 4943, -6239, -11295, -19708, -19057, -16030, -4952, 3104, 13473, 20242, 20472, 16893, 8155, -1430, -13616, -18715, -20713, -15172, -7064, 3234, 13607, 19653, 21404, 16636, 8112, -2514, -11638, -21073, -20333, -15912, -9702, 1150, 14075, 18150, 21469, 17601, 7997, -2039, -11664, -19222, -21177, -15609, -9514, 3738, 11004, 19270, 21303, 18371, 10190, -335, -8666, -17057, -21067, -18279, -10439, -286, 9381, 17229, 20652, 19444, 12129, 500, -8523, -18290, -22073, -19144, -11816, -787, 8904, 17865, 22054, 18754, 13065, 1628, -8551, -17710, -22337, -19866, -11884, -1442, 7087, 16618, 21774, 20325, 14065, 3167, -8200, -16888, -22276, -20185, -14258, -3589, 6540, 18183, 19761, 19881, 14838, 3044]
1992C044j1463o743p042K718N037R096J2470Q750N891j668n085r113j0457j1537
2006a6102k581j894O025Q716J0243Q709P735k8m458q959j1277j0733m719j965
2020b1288O350J0157Q186J0616M316L752o370o783j1064r274p348j721L985Q316
2034h170J0128R581P619K796n934o201r286j1760q374k238M361M995J3195J1063
2048A1775N875L773k363p241j3408q430p911m623M746O227J1347J0801O273N599
2062B2440j669j0291r813q281j0274l141J039P401R630J1490Q756L073j1q370
2076A1979q900j0300r673l701J048O432J0675J0720P732M226O04p346p918j2558
2090f980p566m716j583R136N146J2326R011N949n76n173p885j1260j0987n806
$$ y = [3044, -8419, -15162, -22204, -19486, -14449, -5353, 7117, 15867, 21758, 20090, 15005, 5892, -4565, -16102, -18683, -20577, -14552, -5836, 4407, 13116, 20851, 20823, 16365, 7406, -3871, -14604, -19323, -21288, -14938, -4781, 3405, 14021, 18337, 22089, 15719, 8936, -2128, -11402, -18750, -20471, -16486, -8170, 1958, 11539, 19158, 21954, 16020, 9819, 533, -11227, -19601, -21839, -17478, -12483, 712, 11775, 17650, 21423, 19060, 11819, -1589, -10019, -17930, -22553, -17807, -11580, -233, 10568, 16841, 22440, 20771, 10480, 667, -7614, -17888, -21029, -19990, -12589, -2959, 8531, 17287, 20360, 20349, 11979, 3079, -7221, -16894, -20595, -19547, -13115, -2440, 8280, 16012, 20238, 20842, 13496, 5578, -6980, -14546, -19262, -20845, -11709, -6563, 5763, 14774, 20723, 20147, 14974, 7089, -4171, -15158, -20964]
2104b0964m16R606M216J2440O843N888L363n742p508r616j2657n398j354N281
2118a6018R502J0063Q999N964J268j824j2063r555p098p588k02J764Q010R998
2132A220J0984O039L05k977o183j0037r656p004k524M216N655J0528R561O967
2146A7094K763k140p584j1322q537o673k892L011P442Q014J2561L373M429q31
2160A8708q143r365r358q185k378J137Q357Q143R417Q465J399J345p063j1396
2174A083p629q236l136L072J225J0156J0309Q922M854l478m825q671j1017q339
2188a5710k221J327N780P198R382P055N292J85n605o704j0633r283l567L67M718
2203a2419O521R326J0125M650q63l592p714j0104q885o469L324L098P210Q795
$$ y = [-20964, -21380, -11774, -7558, 4882, 11725, 17613, 20976, 15234, 7726, -1890, -14547, -19945, -21299, -16018, -6516, 3547, 12546, 18510, 19778, 17954, 5891, -3664, -10762, -18350, -18552, -16788, -8778, 1220, 12204, 18243, 18548, 15571, 9388, -649, -10305, -17309, -19833, -15617, -9962, 566, 10127, 17094, 19857, 17717, 10133, -1189, -9726, -16399, -19291, -16280, -8838, -824, 11737, 15110, 19539, 18708, 10565, 1200, -8158, -16343, -18721, -17584, -9227, -1084, 8333, 16798, 18197, 19542, 12479, 1083, -6546, -14782, -17918, -14846, -13621, -3465, 6844, 15766, 20620, 17142, 12317, 3646, -7371, -15710, -17931, -16604, -10824, -3626, 5756, 12811, 18103, 18288, 12683, 5979, -4654, -13937, -17504, -17137, -12419, -5898, 3428, 13553, 18203, 17340, 13748, 6034, -4070, -12955, -19424, -16100, -13002, -5792, 3003]
2217C003R009N312j69n973m929q971q814n247k992N688O744J0054R394K287L682
2232A8078m905n915q054p839q399o9L540O646R278O616P440R84l277q959p044
2247a879o216p723j199K722N808R612P004O124K620l259l624j0639p322q027l36
2262a6334J398O661R599O633O230M539k949o099q410r981o040k841L727M172R087
2277f08P119O544L378j016n115q174j0158o163l243K720L698R265R864N699K996
2292A6806j839m578q670q224r166j237R48M793P703J0633O174K996j206l920q028
2307C185q652o670m305O62L590Q466P882R303K305P01n615o020j0345p663l352
2322a6528K20M132Q274Q221P609N667j763m052p014q175p671n033J64L709O750
$$ y = [3003, 12012, 17324, 17155, 11182, 6253, -2718, -11532, -16779, -19771, -14083, -7339, 2715, 12109, 14396, 18078, 13173, 7258, -796, -8635, -17034, -17103, -13563, -6917, 2361, 8977, 16417, 17401, 14124, 5165, -1879, -8095, -15818, -17017, -14295, -8487, 1125, 8129, 14253, 16873, 13614, 9990, -649, -7971, -15998, -16334, -14936, -8275, 1324, 7957, 14187, 18726, 15777, 9678, 1268, -8713, -14753, -17594, -13867, -9695, -608, 6511, 13055, 16433, 15417, 10302, 2128, -8030, -14193, -17436, -14716, -11018, -1753, 8111, 13810, 16806, 14967, 10389, 1719, -6505, -15671, -16908, -15960, -11167, -3464, 7169, 13343, 16339, 15133, 11213, 3185, -5467, -12137, -16442, -15780, -12190, -3724, 4158, 13461, 15766, 16467, 10852, 4832, -5513, -13176, -16528, -16308, -12176, -3902, 4319, 11928, 17595, 15832, 11780, 4766, -3409, -11080, -16113, -15949, -12240, -5490]
2337e490Q540O924M727J315m563o793q633n652n393k285M947N759J0538M365O724
2352A5030J947m634n745r460r366m099n40M905O256O830Q365M327J414j700o936
2367F594q651o947o531k06J635P534P190P875N314L60k219l514r191q830n102
2382a4689j435M470M429O358R359M327M305m691m622q279p697n832l205L858O744
2397f600O972P622N281L196k322o092o967p928n558m194K184M993Q397P831P207
2412A4022J225j558m312q747o376q160j710J590L241R384Q016O494L408k393n148
2427H976p389q838o884k1n99M754Q731N982Q093L403k820l123o284r839n575o026
2443a7459K681N342P882O942N934L439P16n731n705r472o669k421p66L877R127
$$ y = [-5490, 3050, 9974, 14701, 16016, 11453, 4660, -3973, -9625, -15018, -17303, -12356, -6597, 3941, 8306, 15030, 16977, 12343, 6598, -2862, -12228, -16327, -16867, -11962, -5706, 1124, 9489, 13816, 15230, 13530, 6594, -2057, -9004, -15535, -15741, -14106, -6572, 618, 8493, 13807, 14167, 11948, 8434, -757, -9587, -14689, -16124, -11654, -7225, -867, 8492, 12819, 17124, 12433, 7811, -468, -8165, -13997, -17202, -13344, -6600, 372, 7994, 13275, 16471, 14149, 8057, 1090, -6838, -12396, -16590, -14406, -9413, -1016, 6815, 14022, 15247, 13689, 9377, 630, -5746, -13906, -15616, -14026, -10785, -1401, 6615, 13109, 16517, 14124, 8976, 1587, -7251, -14135, -14156, -14755, -10001, -1270, 4712, 12805, 16208, 13388, 10265, 3981, -5858, -11433, -17459, -14778, -9436, -1554, 5388, 11322, 14761, 15477, 9746, 4041, -5431, -12100, -14521, -15287, -11410, -2283]
2458b283O944P187K728J550m963r122n809p556n035M66N000N783J1273L765N259
2473A5187P62l663r723o144o505n522M93K678Q777N106P007N992J10l746m877
2488E932r061o513m708k578L580O732P838P821M568L389l732p311p425q081k694
2503a2243m306L611N152Q624P333O397K411l473m316r818r071q192L394P97N665
2518h035Q584J0253L067K302j323q433o382q333p293N04J050N915O286J0513O209
2533A4884J140l36q547o610q680n271k915M652K005P964R969L165N562k526m705
2548I751r971o521r201o09J937M025R193O904Q259K158q97l242r167q976r035
2563a5392r54k50O610Q840P636O219K609P12o751m083j1710n526m250J099M194
$$ y = [-2283, 4661, 11848, 14576, 16126, 11163, 2041, -3768, -11324, -16359, -15893, -10893, -5110, 6163, 9928, 15187, 15949, 12286, 2563, -3581, -10086, -15608, -15115, -12437, -3660, 1446, 8453, 14445, 14555, 10809, 5932, -3129, -9642, -14350, -16928, -13348, -6616, 1222, 9043, 13611, 17000, 13268, 5957, -1468, -9549, -12243, -16549, -12938, -7786, 838, 8171, 14568, 16979, 13506, 9190, -628, -9699, -17891, -14497, -13700, -8035, 549, 10802, 13869, 16171, 14848, 6415, 33, -8300, -15593, -15089, -14039, -8124, -1838, 8675, 14884, 16024, 15688, 7141, 531, -8149, -13420, -16335, -11683, -9678, -1714, 8255, 11420, 16982, 14456, 9751, -220, -6741, -15942, -16551, -14614, -10589, -1396, 5508, 13767, 15925, 15028, 11786, 2619, -6357, -15392, -16346, -16596, -9986, -1146, 6490, 12709, 15318, 16030, 9279, 5196, -6514, -12040, -16290, -15191, -10997]
2578a0997P731Q863Q655J830o40m571p332q024q311l014j147M824Q218Q509P051
2593A1645M088p14m259n560r276p290l917j290M738O010P945R126L863J933l980
2608A3062q243o740q512n547N92N86R079R485O855L665J034j094n723r760q169
2623i430m838l416M049N687R132R021O745m94k299o757q993p076m505m486O006
2638a1654L902P416Q106P161K547l854n201p386q793n084m266J546N856R451Q927
2653H674M631L556k173n963o459q899n223m378J448N846P704P699O291L825j93
2668A6386p190o449q217p965j424o07O218O236Q489O508M511m38m107p846j0354
2683f249m475q410J890N220P283R969P480L259J270o535o293q641p367m616L85
$$ y = [-10997, -3266, 5597, 14252, 16082, 15442, 10871, 3539, -4485, -12796, -15810, -16957, -12133, -3915, 4594, 11645, 15733, 15019, 10760, 5200, -4076, -11366, -15283, -16573, -11835, -5825, 2120, 11246, 15109, 17042, 13062, 4819, -1921, -10433, -15980, -15388, -14802, -5723, 3762, 10617, 14282, 15316, 14222, 8499, -1261, -9430, -14268, -17684, -13635, -7948, 1184, 10205, 16950, 16456, 14157, 7400, -1593, -8669, -13174, -17660, -11654, -7752, -336, 7770, 14931, 17478, 13624, 8423, 1037, -7756, -12840, -17106, -15560, -9704, -253, 8674, 13305, 16861, 14688, 8725, 2266, -6633, -11856, -16234, -14786, -8940, -1236, 6463, 12754, 16579, 16386, 9196, 2747, -5470, -13435, -14859, -15466, -9248, -3012, 5477, 11985, 16496, 16058, 11951, 4105, -6249, -10724, -19134, -17244, -12024, -4741, 5228, 12708, 15967, 17237, 10702, 4409, -4232, -11599, -16215, -15830]
2698a5830L020P387R422O288N608K16n084n918r579o548n146k618N428O769R872
2713C287O311O428n32k359o499j1447n784o512k27L788M573J0527Q640O075j862
2728A4407o77o751o694j0451n841j099K719N680Q055Q304O624K512k062o657o684
2743A385q086p819l645N617N244O531R050O959J980j251p360q803o328p821k022
2758a6369p07P934O603Q319Q525K899k199n658p077q182r910J040k222O146R356
2773a502R268N488M845j873o352n922r215p768j928n85L905R396P474P090L363
2788A5684J140o152p529r633n903l413Q90K821O602R754P010L013J430l972p918
2803C824p996p980m414k04N828N942J0909O109M616K52n303n542j0403o419l926
$$ y = [-15830, -12810, -5423, 3999, 10287, 15895, 16111, 11027, 5109, -4470, -11018, -16164, -18782, -13354, -6585, 3287, 9598, 16026, 15494, 13135, 6636, -4811, -10595, -17107, -17334, -13546, -8973, 1554, 10194, 16269, 14407, 13730, 6979, 285, -10166, -16007, -17106, -14387, -8707, -652, 7652, 14276, 16788, 14726, 8069, 1385, -6701, -14520, -18165, -12548, -7304, -773, 8277, 15236, 17216, 15965, 8605, -198, -6526, -14347, -16369, -17076, -9142, -2539, 5780, 14305, 17204, 15005, 9347, 2270, -5912, -15822, -14782, -17004, -10858, -1502, 7766, 13254, 18099, 16226, 9874, 3952, -5263, -13031, -14959, -15544, -11639, -2243, 5231, 12321, 15684, 16824, 10672, 3143, -6490, -12393, -15806, -14916, -12095, -5493, 4261, 11271, 14284, 15714, 11742, 3824, -4172, -12152, -16566, -16770, -10942, -5000, 5909, 12018, 16634, 16886, 11583, 6041, -4362, -10781, -14707]
2818a4707o71K400Q090O407Q214M809O25k812o414p705q052n238p04L114N566
2833g078R882N208O444K460l955q062n966q600l734j696J171N837R539Q619N180
2848A5249J169p18q358p668o862p233j165J722O215O397P490O250L461j835o472
2863G642p787p152m018m772J743M411O911R881O724K548p95o099o995o055p683
2878a1496l601J127L443O830R563O373M021l850l314o677o432q602k836K564K326
2893a0561Q279N584R226L257k440l328o371q752m764n450K441L690O611P014N836
2908A0272M425p06k977p456o167q565j88k497K474P588O239Q316K430K663l254
2923A2597r324p402n724m438j733L317O243Q129N871O144r12n25n702p655p294
$$ y = [-14707, -15378, -12978, -4888, 1519, 9733, 14542, 15167, 12355, 5941, -1764, -9816, -15054, -15758, -12644, -7078, 2804, 8012, 14456, 16916, 12961, 4899, -1067, -9667, -13401, -15097, -13926, -8089, 1450, 10069, 15249, 16418, 15700, 7342, -326, -7188, -14421, -15586, -13864, -7649, -1252, 6238, 12488, 15949, 14114, 7642, -145, -7297, -11315, -16087, -14344, -9933, -3022, 6859, 13583, 16131, 15336, 9237, 2242, -3813, -11496, -15097, -13970, -10527, -3697, 5866, 12239, 16260, 12410, 9096, 2419, -4013, -12615, -15451, -12887, -10561, -2282, 3302, 12528, 15785, 13345, 10017, 3646, -5106, -9870, -15320, -12879, -9189, -2578, 4436, 10272, 14697, 13991, 11014, 3558, -2609, -11174, -11362, -13859, -11385, -3797, 2442, 10758, 13188, 15851, 12597, 3273, -4129, -9853, -14291, -16024, -12707, -6464, 1665, 7536, 13680, 12768, 12243, 6541, -1114, -8408]
2938h408n301J42L100M717P641O619L541J437k055n196p333p407m491j249M14
2953a3829P111O989P617K069L458o34n821r319l342p071n69R83O717N715O827
2968F901M985K605o15p059n214p707n101k883J014O936O746M586O184L386j828
2983A2936m502q136o186p159j076J211M304Q152M747P651L8r8m302o261o120m361
2999i162m411K86N844N226O692O642J283l00k684o150o533o454m324J03N502N962
3015b478N707N577K387J080k027n794p647q277P1p83M665M174O116O391L370R30
3031A3462m611o442n297p120l308l4M394O688N213N956L211q05p82o944n962m370
3047f751n364N09P13P586K994P882N806k70j989n760q466o106l509j162M427L288
$$ y = [-8408, -13709, -13567, -10467, -5750, 1891, 8510, 12051, 13488, 11433, 6237, -1096, -8503, -12994, -14243, -13829, -6718, 271, 7888, 9957, 13415, 12781, 6960, -2359, -5701, -12772, -13341, -12358, -5641, 74, 6901, 11886, 14491, 13876, 6817, 1603, -6104, -11205, -14088, -13074, -6138, 608, 5194, 11378, 14764, 12936, 8434, 298, -5888, -13047, -14123, -12912, -8608, -456, 4291, 11942, 11980, 11882, 7580, 1319, -4801, -9162, -13573, -13287, -7443, -2217, 4475, 11117, 12400, 12100, 9416, 3266, -3267, -9721, -14045, -13942, -8440, -2478, 3229, 8806, 11193, 12273, 10246, 4452, -3195, -11472, -11401, -12184, -7519, -3345, 2771, 9162, 12532, 13462, 8851, 2409, -2888, -10008, -13316, -13350, -8956, -2268, 2945, 8901, 12112, 11307, 10525, 3581, -2381, -6751, -12115, -11606, -10893, -3307, -313, 7569, 13375, 13105, 11116, 5356, -3110, -9216, -12725, -13887, -9460, -6172]
3063f172P957O407L959q27m42n084o645o529m762q1l73N262J0322L253L414K091
3079A1750l490m531m932p325l549j135M181M420M699O819N296P46k960m014n591
3094C84p551m278p22N46L470O825R968K347K667j47p610n884o223n553n35Q86
3110a1410M758M308J0665J963K729j596m231n188p029n516l173J432L993Q552
3124B57O322L553K462j414l472o919p054l515l243J902L872M734O902L656M539
3139A2582j226k518p037n773o263j913M57L947M437P146O596J123K697n902n657
3154B696o386o818l015M02N165M932O016N339L400L68m537m157q264l181m659
3169a2699j41L675O798M961N919K747M30j054n909p643m834l299k220L096M506
$$ y = [-6172, 1785, 8192, 12151, 11324, 10882, 5798, -847, -7376, -12138, -12219, -12592, -7330, 2992, 6245, 9659, 11750, 8260, 3729, -1203, -8528, -12077, -13212, -9031, -4611, 88, 6907, 12203, 12949, 9989, 5975, 384, -7167, -11445, -12167, -11621, -8151, -1326, 8642, 10989, 13656, 13509, 5899, 15, -6208, -11761, -12296, -11410, -6652, -2344, 8321, 10284, 13013, 11417, 7186, 1998, -5031, -10547, -13720, -12288, -8295, 257, 6579, 10132, 12594, 11180, 7708, 789, -6265, -9780, -13023, -11121, -7249, -2515, 4387, 8043, 12582, 11356, 8838, 1801, -3972, -10235, -12148, -11691, -7744, -3307, 3839, 10435, 11558, 14255, 8353, 2696, -3690, -10508, -13523, -13121, -7956, -3024, 2992, 8331, 11731, 12099, 7562, 3405, -4859, -8040, -12699, -12840, -9165, -2367, 2594, 8513, 11260, 11690, 10636, 4727, -2916, -7750, -11049, -13269, -10173, -5667]
3184e667R959K370M957J318m657n185m925n637m785j625L755M535O678O721L393
3199A1205J415j537n948n605q051k603k775K464N362N424P334N366J026k317m218
3214F542p993p071l017k15J464L207P344N701O114K131m641k808p833n925l430
3229a0430k361P94O216P784K889O589K316k249n225n732p013n106j801j46O053
3244g422N983P294M042K611p32n472m589o328o600k020R08L256O645Q256M390
3259A0222K135L88m999o571n558n604k087n82L768O224P973K085O922j863l323
3274I130p776n856n522k475J65L104O934O873O149K507m34m562k413j0352l499
3289h027n153K643O53O361O372N885N676N63m111n820q050o652k910j648L359
$$ y = [-5667, 4292, 6662, 11619, 12937, 8280, 3095, -1830, -7467, -12252, -13877, -10122, -5587, 1091, 7812, 11205, 12620, 11083, 5135, -470, -8521, -11124, -13899, -11435, -6073, -649, 6685, 12051, 13077, 10760, 6542, -1451, -8522, -11539, -11754, -10290, -7083, 261, 5962, 12076, 14207, 9566, 6758, -1075, -7000, -10430, -12791, -11997, -5781, 2003, 4892, 11481, 13797, 11548, 6323, 591, -6422, -11528, -13329, -13475, -7422, -1439, 5855, 9897, 12508, 11776, 6304, 1715, -4613, -11213, -13233, -12325, -9069, -2424, 5832, 10222, 12357, 12745, 7746, 1175, -4383, -9987, -12074, -12656, -8888, -2664, 5309, 7394, 14316, 12453, 9130, 1354, -4502, -10024, -12499, -12334, -9230, -2296, 4577, 10726, 13233, 12799, 8237, 5824, -4528, -8027, -13180, -10537, -9884, -3523, 2849, 8734, 14410, 14973, 10862, 5042, -3008, -9660, -12570, -14218, -10859]
3304a0859N711P260P042L426K142m984m916o187n840n340R4K469M652P271O351
3319H292L716O40k344k910q387n951m848k587K875O318M447J0180K815J675j290
3334A2641n977n230p836n258k500L212L959O109P954M582R87q40n278p432n346
3349f253n144k339L703K377O801P444N289K586j745n406q194m043o027k065k288
3364a5304O027Q228P457L608L166J01o423m956o418n079l122Q23L647N392O699
3379C846P287J266Q90n646l658r095o812n07M6J983P942P099N136K799p19k794
3395I063m947p366o134m627N77M883N827N288N936M524o95l429m709m458r360
3410i627l546j031M169N180O538N386M103L591m505o725m719p109n765J151J947
$$ y = [-10859, -5148, 2112, 9154, 12580, 14722, 9738, 4822, -1365, -7205, -12545, -12451, -9982, -5330, 1941, 8292, 12008, 12648, 10304, 7394, -993, -6944, -11792, -14379, -11504, -5186, -739, 9441, 12256, 13931, 12641, 6664, 1434, -6402, -11660, -14160, -10948, -6989, -880, 7074, 11656, 12643, 11803, 6525, -907, -6253, -11397, -13736, -10033, -7656, -855, 6589, 11878, 14464, 12719, 7313, -881, -4924, -10951, -13016, -15304, -9277, -1049, 6408, 10016, 13182, 13283, 6860, 1904, -4514, -9593, -12715, -11892, -8245, -2853, 3846, 11133, 12399, 13289, 7643, 3985, -5110, -11922, -12429, -12383, -10400, -2458, 4641, 9777, 12576, 11857, 9063, 4116, -3250, -9384, -14011, -13434, -8551, -2724, 2564, 8500, 13024, 12329, 8900, 4191, -267, -9627, -13173, -14204, -10035, -4855, 1683, 7069, 11172, 14763, 10258, 3533, -1186, -8295, -14060, -12909, -10962]
3425a0962N551O683P936L280J070l890n326m824p685l403k128K660M265O367P722
3440G316L957K289k033m632p453n757m774j330p53O562O462P106O519O26j796
3455A2309l502p626p826l460l158K130M382M414Q557M212K001j439l622m999p752
3470e379m615k688P17K367O826Q202N470K856o73n814m796p434o238k550r6N905
3486g940N671O658M962L886k9m583o710n779n512k767p84L625M067P631Q261L39
3502A0996J940m443o023m609p258m033M6L734N988O330O983L295j876j48o035
3517D887p751n686m795m79M620M701M126Q295N513r19j591n903o329n002o088
3532a2401j787P43O819O974P671K202L299l736n503o533n119m379o2J274M039
$$ y = [-10962, -5411, 1272, 9208, 12488, 13558, 9668, 4342, -482, -8167, -11570, -13698, -11038, -6773, -406, 7316, 11273, 13562, 11529, 6897, -556, -6313, -11087, -12417, -13170, -6608, -146, 6960, 13479, 14105, 12309, 8807, 1181, -6645, -10105, -13263, -11133, -6751, -2337, 6220, 10432, 12433, 10994, 7372, 2373, -5379, -9994, -12682, -11965, -9598, -2772, 5430, 10900, 13756, 13083, 7269, 2473, -4961, -11199, -13749, -13845, -7940, -2269, 4389, 9351, 13237, 13208, 8625, 1915, -3864, -9376, -12143, -12927, -9302, -5235, 2396, 10657, 10996, 12936, 8493, 2470, -2139, -9397, -13430, -13384, -9650, -3662, 2668, 9651, 12946, 11070, 10922, 4887, -2864, -8550, -13345, -13824, -9204, -4503, -377, 7918, 13431, 12512, 10921, 5018, -1311, -6313, -12401, -14188, -13445, -6626, 348, 8019, 10221, 13520, 9784, 4281, -2252, -7371, -11750, -11812, -10538, -6499]
3547f499N104Q644N170m1k663k926o062p601n991r39M260J614Q064N967N001J661
3563A2763j824k775p070m624p607n94J52N240N001N136P674J51j075k969n860
3578A719p580m229j253J560J044P812N469L349K449J284m887n594m324n248k138
3593a0567j548N045N225Q125K036L066J411m493o096o572l209l695J092K322M863
3608b995P331J733O764j816k373m217p823l570l879j555N168L523M853N480M469
3623A1093p68j090n363n394m678n685l3L970M291O486M945M985r43k502n754o333
3639b773m155l807j470L563L308O508O989K909J837k824l549o566m245o351j227
3654a1853L039L223P049M219M450Q78J43m583p494m283o747K108k34K836P468
$$ y = [-6499, -1395, 7249, 12419, 12378, 9715, 6789, 727, -6874, -12865, -13804, -9544, -7930, 134, 6101, 11102, 12763, 10939, 8164, 1094, -3530, -11137, -11731, -11579, -6339, -1338, 3798, 11472, 11623, 10548, 7579, 1719, -5861, -10090, -11343, -9783, -8739, -927, 4542, 7891, 10340, 11624, 6737, 1143, -3181, -8429, -10567, -12115, -7070, -1845, 6280, 8316, 11382, 12793, 8300, 2204, -4368, -7577, -11272, -10180, -7858, -2995, 4336, 6069, 12833, 11017, 8644, 4427, -3396, -6966, -10845, -12400, -7232, -3709, 1144, 6624, 11093, 10325, 9235, 3872, -1522, -6200, -11885, -11918, -7948, -3657, 2829, 7774, 12759, 11816, 9314, 3560, -2773, -6928, -10735, -12205, -8642, -5334, 1174, 8163, 11072, 12909, 10085, 6536, -30, -4275, -10626, -11853, -8814, -5591, 1458, 5677, 10127, 11005, 11148, 6565, -929, -5212, -11959, -9851, -10085, -7249, 219]
3669B19M787L941J446J31n054n658n100n160j88K358K204P584N159K119K342l18
3685A0812m908m231p509m444J76J038L411L285O811N346J022j561k339o473n831
3700e395l952l048K168K045O762N109M386J545q07k145m945n156m646k989Q14
3715a0254L954M318N116P053N24l65l492l764n930o312p72j514N807L234N935
3730C538L510M122R5k449n928o815l999k117q5K427L899O305O101J412P4k225
3746G865m736o337k913l027o69P92L447Q589M233K389R96j923p026l654m007m007
3762i988j450J538L743P377O245J819j313J729p132m076m047m364j824J644O370
3777c729M715M266M154J328P17o188m582n740m613k28J859L790N304M717M052
$$ y = [219, 5006, 8947, 10393, 10524, 5470, -188, -5288, -10448, -10636, -8278, -6074, 1510, 6669, 8788, 11130, 10812, 5904, 1673, -5836, -10280, -10104, -9066, -5655, -2370, 4441, 9787, 10809, 9248, 6909, 436, -5395, -9347, -12395, -10227, -8182, -1420, 3689, 8075, 9620, 8813, 6668, 1723, -3433, -8079, -11068, -10254, -6300, -1982, 3134, 10187, 10711, 10346, 6854, 3090, -2840, -9152, -9924, -11438, -5631, -2397, 3538, 7048, 11170, 11265, 8816, 2888, -3927, -7926, -10043, -10128, -7701, -3802, 2503, 8604, 10016, 10090, 7865, 3129, -3208, -6121, -9148, -9817, -9025, -5578, 3011, 7244, 9633, 10629, 8706, 1680, -1974, -5981, -9988, -11438, -9900, -6157, 1220, 7465, 9284, 7971, 9700, 2568, -1508, -5555, -9919, -11743, -10099, -3729, 986, 5252, 9406, 10734, 11451, 5263, 681, -5059, -9672, -9900, -8041, -4251, 1053, 5770, 9822]
3792I822r4L78m562p499m414l304Q07j154Q410M104J059O115M95j015m579n096
3808e27n481k788q70p72M119N205O159L708Q43j558l141l283m742o094j261K55
3824a0228N646K450O094M969J074M5m252n531m769l273m502K116K371O504P397
3839F111K108K626q31k893l337n862o066l608K025L722K846O075N651K848j754
3854I661j730m370n389n627l649L59K659N165M904O096K822m59k233l923q036
3869c750k588n274J995J309N599N646J868O281K54l060l278p560m192j929j748
3884a0427J862L166P712M849L035K97j393n954m038n032m274j075K939M412O086
3899B165O097J449K549m697l230m814o679l649j97L650L872M234N550M239O41
$$ y = [9822, 9728, 10106, 5544, -1955, -6369, -9673, -8866, -10020, -1610, 2494, 3553, 9668, 10163, 9148, 4569, -527, -6008, -8796, -9666, -10438, -6319, -1114, 5045, 8753, 9596, 8038, 4897, 1614, -3128, -9222, -10483, -10228, -4582, -2132, 3962, 8931, 10005, 10050, 5798, 267, -4502, -7775, -12277, -10161, -7790, -1286, 6111, 8219, 10845, 10014, 7121, 3784, -2078, -8144, -11752, -9727, -6005, -3159, 2916, 8567, 11415, 9661, 7931, 3561, -1828, -7455, -11104, -10745, -8086, -2921, 1983, 8079, 10901, 10442, 8209, 4286, -3750, -6338, -11612, -9617, -8308, -2709, 2937, 4805, 11086, 11340, 8280, 5002, -2558, -6750, -8679, -10427, -8565, -5399, 2313, 7162, 10197, 10494, 9101, 3147, -891, -5923, -10197, -11272, -8333, -3921, 2165, 8262, 9711, 12260, 7563, 4333, -481, -7160, -10809, -11006, -7356, -3484, 750, 6300, 10539, 11180]
3914A1180l124l386n132o998l683J79J516L825N471M494M250Q53M37l267p836
3929a221m617l981j274M99M247N767O103L443K184k257l050o912m192j624k729
3944i614n69L992N715N119M126K127k233k728l386p425j814l678J387J594O423
3959i64M328N076J711M46m800l920o321l323m578K351K078M851N440P003K340
3974A1718r88l831l138o544o367j647j69K289P901L831M597L276J376m707o030
3989A567o118k071m176q28K343N130M764P601M017k292m98m604p603l722l495
4004i985j906L237L230O526O304J202L185j920l965n763n623m252j829K856L723
4019d980O313N086J958J798m84m653m220p087n722O24K153K955N628N746M530
$$ y = [11180, 8056, 4670, -462, -7460, -11143, -10964, -9448, -5623, -152, 4342, 8592, 9445, 9882, 6615, -1221, -5838, -9819, -11093, -10594, -6347, -580, 5523, 8966, 11150, 8893, 5843, -1069, -5261, -6885, -9614, -10183, -6191, -476, 4643, 8769, 10896, 8663, 5935, 2549, -4876, -6690, -10368, -8981, -7387, -964, 3364, 8440, 10151, 10597, 5797, 1877, -4444, -7767, -12345, -9994, -7916, -3065, 2375, 9378, 11718, 10730, 6899, 3761, -2783, -9150, -10797, -10966, -8677, -776, 3055, 7652, 10928, 12304, 7597, 1567, -4551, -6622, -10798, -11626, -9283, -4153, 611, 8212, 12229, 9937, 9439, 4835, -2768, -6490, -9985, -11891, -8654, -5424, 1102, 7406, 8608, 11793, 9873, 5908, 145, -5478, -9730, -11559, -8703, -4980, 1333, 6419, 8377, 10175, 9691, 5038, 818, -6269, -11991, -11367, -9214, -6259, -631, 5115, 9645]
4034I645K621n239q07n565n631m276k525J176L559N526P065M982R57R11n454n937
4050A008m744m947j159J074K313N986N584M316M022m201o73p018o455l496k516
4065a0906K35J944O504N699N855K180j457k835m626o725k663k658j69N14P107
4080b001N986J918M934R7k675n205n644m042j970k781J884O318N209O772Q48Q71
4096A0519k669m171n296n573k879qJ592N209M960O528L371O44m764o303l369l903
4112f112k801j073K197M313N317N116K609j279J101n000n398n835k255j195m10
4127a0705N127O102M850L589J587j002p889k526m749l188r75J290L622M851N992
4142E976J919J980J217n533o130m550k829k075j3M706N489L966M518K164k404
$$ y = [9645, 12266, 7027, 6220, 655, -4976, -9252, -11777, -10601, -7042, -1516, 5549, 10531, 11488, 12399, 6945, 1008, -3736, -8683, -9842, -8768, -6455, -469, 5115, 9431, 13453, 9252, 8579, 1561, -4894, -8390, -10906, -10671, -8727, -2223, 3476, 9331, 11511, 10054, 7219, 2593, -4132, -6795, -9453, -9622, -9108, -2001, 3985, 5903, 10837, 10934, 8259, 3054, -2590, -6632, -8602, -11383, -9499, -3181, 2028, 8800, 9648, 10519, 7850, 3679, -1617, -7190, -10069, -10077, -8485, -3276, 1684, 8212, 11583, 12227, 7463, 1160, -2209, -6112, -8913, -9986, -7789, -3476, 1841, 6957, 9566, 8287, 9388, 4388, -1010, -6845, -9100, -10295, -10705, -5578, 524, 5374, 8963, 10550, 9548, 1659, -867, -5616, -8804, -9779, -8489, -4867, -16, 5976, 7895, 9875, 11092, 5559, -571, -5121, -7950, -10025, -10038, -5332, 157, 4123, 8641, 10805, 8401]
4157H401k427m874n245m250k391K693J823N092N496M703J096j042l395l552m918
4172b790m464j720j435L248N701M787L954J930o98k422m777k377n578l485r09
4187a1035L924M145N959N377J597J296m110l900o051m218l261K73J600M685N784
4202B065N863K542k232j479l554n457l099m952p46K695N665L957M861L070K228
4217A1427m566l415m648p033j405m96K981K971O020M800L419j205j175l264m930
4232e19m633k791l387M242K972N062O863O79J762j751n109l919m887k938j249
4247i603K330L811M661M793K141J598q04l282n591n018l636l586M508J429O992
4262G43L051O178J332k682k540n277p380k802k70j076M709M991M780M792M2p67
$$ y = [8401, 5974, 1100, -4145, -8395, -10786, -8093, -6270, -1178, 4318, 9021, 10117, 9075, 5680, 2128, -2790, -7254, -8974, -10409, -7161, -1460, 3327, 7281, 9211, 8513, 6091, 1314, -1063, -6641, -10126, -11035, -7111, -2966, 2993, 8370, 9967, 11263, 7153, 3253, -2798, -7016, -10277, -10004, -8404, -3719, 2065, 7928, 10470, 8238, 6759, 3205, -2252, -5351, -10303, -11049, -8354, -2689, 1268, 6129, 9199, 11427, 6861, 3446, -1202, -8235, -9640, -10136, -7155, -4184, 1836, 6636, 10055, 8850, 7675, 4411, -519, -5152, -7943, -11330, -7088, -4116, 946, 7809, 8488, 10250, 8499, 3390, -529, -5416, -8354, -9603, -7273, -3462, 1199, 5992, 8133, 9731, 8927, 5645, 54, -4964, -8600, -12186, -7678, -6249, 743, 3794, 9972, 11304, 8622, 6082, 805, -6575, -9377, -9647, -10723, -6014, -1023, 3757, 8549, 8591, 7824]
$$ [...]
16383f43
##END NTUPLES=NMR FID
##END=
