##TITLE=31Pdec_IBIP2501-1
 CDCl3, 24 sc
 8.2.2019
##JCAMPDX= 6.0         $$ Bruker NMR JCAMP-DX V2.0
##DATA TYPE= NMR SPECTRUM
##DATA CLASS= NTUPLES
##ORIGIN= UXNMR, Bruker Analytische Messtechnik GmbH
##OWNER= root
$$ XWIN-NMR		Version 3.5
$$ Fri Feb  8 17:09:22 2019 Russian Standard Time (UT+4h)  she@DPX200
##.OBSERVE FREQUENCY= 81.013821
##.OBSERVE NUCLEUS= ^31P
##.ACQUISITION MODE= SIMULTANEOUS
##.ACQUISITION SCHEME= undefined
##.AVERAGES= 24
##.DIGITISER RES= 17
##SPECTROMETER/DATA SYSTEM= spect
##.PULSE SEQUENCE= zgpg30
##.SOLVENT NAME= CDCl3
##.SHIFT REFERENCE= (INTERNAL, CDCl3, 0, 182.463)
##AUDIT TRAIL= $$ (NUMBER, WHEN, WHO, WHERE, WHAT)
$$ ##TITLE= Audit trail, XWIN-NMR		Version 3.5
$$ ##JCAMPDX= 5.01
$$ ##ORIGIN= Bruker BioSpin GmbH
$$ ##OWNER= she
$$ F:/spectra/data/she/nmr/P31/1/pdata/1/auditp.txt
$$ ##AUDIT TRAIL=  $$ (NUMBER, WHEN, WHO, WHERE, WHAT)
(   1,<2019-02-08 17:07:05.96 +0400>,<she>,<DPX200>,
      <created by zg, POWCHK disabled, PULCHK disabled
       configuration hash MD5:
       00 E9 B6 7A A2 85 ED C7 34 08 36 98 17 FE 4E 26
       data hash MD5: 32K
       A4 B2 FE 58 E5 6D 62 FF 26 1E 6E DF F9 C0 91 98>)
(   2,<2019-02-08 17:07:09.95 +0400>,<she>,<DPX200>,
      <Start of raw data processing
       efp BC_mod = 2 LB = 1 FT_mod = 6 PKNL = 1 PHC0 = -1453.754 PHC1 = 81.19894 SI = 64K 
       data hash MD5: 64K
       4F D9 C7 58 5E 33 3A 7C 8F 4F 65 0B 89 E9 6A 66>)
(   3,<2019-02-08 17:07:33.54 +0400>,<she>,<DPX200>,
      <pk PHC0 = 1.370335 PHC1 = -3.8 
       data hash MD5: 64K
       8A DA 1E CF 91 59 AB E7 29 6B 5D 04 32 35 46 1E>)
(   4,<2019-02-08 17:07:37.54 +0400>,<she>,<DPX200>,
      <abs ABSG = 5 
       data hash MD5: 64K
       8B B6 7B 8C 2D 9B C6 50 F7 AC EF F4 DB 15 F8 03>)
$$ ##END=
$$ 
$$ hash MD5
$$ A3 9C B7 2C F5 4E 36 08 14 A0 58 26 89 DA 88 AF
##$RELAX= 
##$RELAX= 
##$RELAX= 
##$RELAX= 
##$RELAX= 
##$RELAX= 
##$RELAX= 
##$RELAX= 
$$ Bruker specific parameters
$$ --------------------------
##$DU= <F:/spectra>
##$EXPNO= 1
##$NAME= <P31>
##$PROCNO= 1
##$TYPE= <nmr>
##$USER= <she>
##$AMP= (0..31)
100 100 100 100 100 100 100 100 100 100 100 100 100 100 100 100 100 100 
100 100 100 100 100 100 100 100 100 100 100 100 100 100 
##$AQSEQ= 0
##$AQ_mod= 1
##$AUNM= <au_zg>
##$AUTOPOS= <>
##$BF1= 81.014009
##$BF2= 200.13
##$BF3= 200.13
##$BF4= 200.13
##$BF5= 200.13
##$BF6= 200.13
##$BF7= 200.13
##$BF8= 200.13
##$BYTORDA= 1
##$CFDGTYP= 0
##$CFRGTYP= 5
##$CHEMSTR= <none>
##$CNST= (0..31)
1 1 145 1 1 1 1 1 1 1 1 1 1 1 1 1 1 1 1 1 1 1 1 1 1 1 1 1 1 1 1 1 
##$CPDPRG= <waltz16>
##$CPDPRG1= <>
##$CPDPRG2= <waltz16>
##$CPDPRG3= <>
##$CPDPRG4= <mlev>
##$CPDPRG5= <mlev>
##$CPDPRG6= <mlev>
##$CPDPRG7= <mlev>
##$CPDPRG8= <mlev>
##$CPDPRGB= <>
##$CPDPRGT= <>
##$D= (0..31)
0 1 0 0 0 0 0 0 0 0 0 0.03 2e-05 3e-06 0 0 0 0 0 0 0 0 0 0 0 0 0 0 0 0 
0 0 
##$DATE= 1549631225
##$DBL= (0..7)
120 120 120 11 120 120 24 19 
##$DBP= (0..7)
150 150 150 150 150 150 150 150 
##$DBP07= 0
##$DBPNAM0= <>
##$DBPNAM1= <>
##$DBPNAM2= <>
$$ [...]
##$SUBNAM3= <"">
##$SUBNAM4= <"">
##$SUBNAM5= <"">
##$SUBNAM6= <"">
##$SUBNAM7= <"">
##$SUBNAM8= <"">
##$SUBNAM9= <"">
##$SW= 369.568048894756
##$SWIBOX= (0..15)
0 1 3 0 0 0 0 0 0 0 0 0 0 0 0 0 
##$SW_h= 29940.119760479
##$TD= 32768
##$TD0= 1
##$TE= 0
##$TE2= 300
##$TE3= 300
##$TEG= 300
##$TL= (0..7)
0 120 53 12 22 120 120 120 
##$TP= (0..7)
150 150 150 150 150 150 150 150 
##$TP07= 0
##$TPNAME0= <>
##$TPNAME1= <>
##$TPNAME2= <>
##$TPNAME3= <>
##$TPNAME4= <>
##$TPNAME5= <>
##$TPNAME6= <>
##$TPNAME7= <>
##$TPOAL= (0..7)
0.5 0.5 0.5 0.5 0.5 0.5 0.5 0.5 
##$TPOFFS= (0..7)
0 0 0 0 0 0 0 0 
##$TUNHIN= 0
##$TUNHOUT= 0
##$TUNXOUT= 0
##$USERA1= <user>
##$USERA2= <user>
##$USERA3= <user>
##$USERA4= <user>
##$USERA5= <user>
##$V9= 5
##$VALIST= <valist>
##$VCLIST= <CCCCCCCCCCCCCCC>
##$VD= 0
##$VDLIST= <DDDDDDDDDDDDDDD>
##$VPLIST= <PPPPPPPPPPPPPPP>
##$VTLIST= <TTTTTTTTTTTTTTT>
##$WBST= 1024
##$WBSW= 4
##$XGAIN= (0..3)
0 0 0 0 
##$XL= 0
##$YL= 0
##$YMAX_a= 37076
##$YMIN_a= -40325
##$ZGOPTNS= <>
##$ZL1= 120
##$ZL2= 120
##$ZL3= 120
##$ZL4= 120
##$ABSF1= 182.463
##$ABSF2= -187.1042
##$ABSG= 5
##$ABSL= 3
##$ALPHA= 0
##$AQORDER= 0
##$ASSFAC= 0
##$ASSFACI= 0
##$ASSFACX= 0
##$ASSWID= 0
##$AUNMP= <proc_1d>
##$AZFE= 0.1
##$AZFW= 0.5
##$BCFW= 0
##$BC_mod= 2
##$BYTORDP= 0
##$COROFFS= 0
##$CY= -3
##$DATMOD= 1
##$DC= 0
##$DFILT= <>
##$DTYPP= 0
##$F1P= 0
##$F2P= 0
##$FCOR= 1
##$FTSIZE= 65536
##$FT_mod= 6
##$GAMMA= 0
##$GB= 0
##$INTBC= 1
##$INTSCL= 5.30512e-09
##$ISEN= 30
##$LB= 1
##$LEV0= 0
##$LPBIN= 0
##$MAXI= 10000
##$MC2= 0
##$MEAN= 0
##$ME_mod= 0
##$MI= 50
##$NCOEF= 0
##$NC_proc= -4
##$NLEV= 6
##$NOISF1= 182.463
##$NOISF2= 159.3651
##$NSP= 0
##$NTH_PI= 0
##$NZP= 0
##$OFFSET= 182.463
##$PC= 4
##$PHC0= -1452.384
##$PHC1= 77.39893
##$PH_mod= 1
##$PKNL= yes
##$PPARMOD= 0
##$PSCAL= 0
##$PSIGN= 0
##$REVERSE= no
##$SF= 81.0140089999434
##$SI= 65536
##$SIGF1= 159.3651
##$SIGF2= -187.1042
##$SINO= 113.3802
##$SIOLD= 16384
##$SREGLST= <1H.CDCl3>
##$SSB= 0
##$STSI= 65536
##$STSR= 0
##$SW_p= 29940.119760479
##$SYMM= 0
##$S_DEV= 0
##$TDeff= 32768
##$TDoff= 0
##$TI= <>
##$TILT= no
##$TM1= 0
##$TM2= 0
##$TOPLEV= 0
##$USERP1= <user>
##$USERP2= <user>
##$USERP3= <user>
##$USERP4= <user>
##$USERP5= <user>
##$WDW= 1
##$XDIM= 65536
##$YMAX_p= 502629020
##$YMIN_p= -18256349
$$ End of Bruker specific parameters
$$ ---------------------------------
##NTUPLES= NMR SPECTRUM
##VAR_NAME=  FREQUENCY,     SPECTRUM/REAL,   SPECTRUM/IMAG
##SYMBOL=    X,             R,               I
##VAR_TYPE=  INDEPENDENT,   DEPENDENT,       DEPENDENT
##VAR_FORM=  AFFN,          ASDF,            ASDF
##VAR_DIM=   65536,         65536,           65536
##UNITS=     HZ,            ARBITRARY UNITS, ARBITRARY UNITS
##FACTOR=    0.456856943014862, 1,           1
##FIRST=     14782.0589164792, 0,            0
##LAST=      -15158.0608439998, 0,           0
##MIN=       -15158.0608439998, -18256349,   0
##MAX=       14782.0589164792, 502629020,    0
$$ Real data points
##PAGE= N=1
##DATA TABLE= (X++(R..R)), XYDATA
$$ [...]
40376C65757m02571m65569k30815j9872l2840n1072J40916L90501M47578L01817
40366D43830M9988k70419n00132l38793K00351N94821M01078j75143n99335o75816
40356h69570n59924l20348R4576N49442P53194N81800J39253l83374o86460m40656
40346a142067K51553O88159L17089m76396q01607l92906J85079M10122L31966
40337f29008J83342J2814j23716n7646J99149L91737L85832K85521J45765n9441
40327G34349j75255l6641Q3442k31311p21155o11057J89668P81830N55708N3821
40317F23399J1408K16174N2963l68045m89826l39261l67738m83920j85466M12472
40307i17840O21084L24702J66001L87770M06713q9278m90961k74075R0503n8271
$$ y = [365757, -36814, -502383, -733198, -753070, -785910, -836982, -696066, -305565, 142013, 443830, 493818, 223399, -276733, -615526, -415175, 179646, 580724, 405581, -193754, -869570, -1429494, -1749842, -1655266, -1105824, -352630, 229170, 368423, -14951, -701411, -1142067, -890514, -202355, 114734, -361662, -1163269, -1556175, -1371096, -960974, -629008, -445666, -432852, -556568, -614214, -415065, -23328, 362504, 648025, 793790, 734349, 559094, 522453, 605895, 374584, -346571, -957628, -767960, 13870, 569578, 623399, 634807, 850981, 903944, 535899, 46073, -293188, -660926, -1144846, -1330312, -917840, -296756, 27946, 193947, 581717, 988430, 899152, 408191, 134116, 224619, 166348]
40297A66348m42270l48285J23378K19807j90579l97476j1713M42470M05548J17243
40287H4471J22051L79220L93892K4840l37998l75865k19324j42386j74140j60391
40277d05630l1108J43975K72780K97102J89392q214j72308k04718j35571o5142
40267a19442l0118P762O2665R3012P2562K7687q179k5509j8765J2306L8032K7646
40255A39659O13r009l1118j30241l00897m65669n59832n25535k66337K23684O86697
40244a237985P76555M88609K03803J75117J89906m4904l75384l73709L2487M23352
40234B57847M12474N3691l30405m91391l54790j2764K63235K07646r4926k27622
40224c17005L3567L80419L65114p37k91671k45232k0638J27792J63111J49743
$$ y = [166348, -275922, -624207, -500829, -281022, -471601, -869077, -880790, -438320, -32772, 84471, 206522, 585742, 979634, 1004474, 666476, 290611, 71287, -71099, -245239, -405630, -436738, -292763, -19983, 277119, 466511, 458297, 285989, 81271, -54300, -119442, -149560, -141798, -79133, 13879, 86441, 114128, 105949, 80440, 61675, 73981, 112013, 139659, 140272, 131263, 100145, -30096, -330993, -796662, -1356494, -1882029, -2148366, -1924682, -1237985, -461430, 27179, 230982, 406099, 596005, 551101, 175717, -197992, -165505, 257847, 670321, 724012, 393607, -97784, -452574, -465338, -202103, 5543, -89383, -317005, -283438, 96981, 462095, 461358, 169687, -75545, -96183, 31609, 194720, 344463]
40214C44463M7275j98429m66927n33470l01308J24891N45636P61902O37854K06635
40204A168522k90778n74750n54602l48315j18666L9059J00611J10533J49122K12671
40194a06593J79374M86j61182j50160r0673k04386m09450m04329j60574J9459
40184a488028J9981R4139L46443M48494J92369m6687J51621N30028M97699L6513
40174G82572k97314k25564l6851J7988N6864J48678Q7671j82961l65239k76631
40164b90787j32444j16001p5437P1032N9881k11823l08055J34555P19207P54781
40154F04909K27812k33612k75925j53519j33536j06767M3446J22382n3376k84307
40144b42493k20577J46717M44688L60741j615k60205k09178l9154l0449j42784
$$ y = [344463, 391738, 193309, -273618, -807088, -1108396, -983505, -437869, 324033, 961887, 1168522, 877744, 302994, -251608, -599923, -718589, -679530, -578919, -468386, -319264, -106593, 72781, 73267, -87915, -238075, -328748, -533134, -942584, -1346913, -1507487, -1488028, -1468047, -1373908, -1027465, -578971, -386602, -433289, -281668, 248360, 746059, 782572, 485258, 259694, 222843, 240831, 297695, 446373, 534044, 351083, -14156, -290787, -423231, -539232, -614669, -543637, -483756, -695579, -1003634, -869079, -149872, 604909, 832721, 599109, 323184, 169665, 36129, -70638, -27192, 95190, 41814, -242493, -463070, -316353, 128335, 489076, 487461, 227256, 18078, -21076, -51525, -194309]
40134a94309j25270L0086Q1787K0397J32775M14272L91249j16727m98816j49236
40124a3792N52738P02882J61755l04172j95650Q2933k3804l99937n46409l21451
40114c04907k0593R2341L8226j8125J6745P3951J8353j17202r6531J57896L18810
40103A58964O8706l53121m12210m8874K56444K22892R3968R3633N1351j73909
40093d2156l28853j76053N5024O668k39356l01006o3761K24331L45408L06743
40083b13011J78092j1902j94921k53158j36405P6385K26071J78490l6432j88257
40073c75048p9938J72650K62889J13600l4477n863P2678K1230j27221k44518l02477
40062e26495l12347k36016r0334J0272L3129J00249K69075L86487K82511P18k50637
$$ y = [-194309, -319579, -289493, -207706, -187309, -54534, 359738, 750987, 634260, 135444, -13792, 538946, 1241828, 1403583, 1099411, 903761, 986694, 962890, 562953, 16544, -304907, -325500, -233159, -194933, -213058, -196313, -122362, -104009, -221211, -317742, -159846, 158964, 227670, -125451, -537661, -586535, -330091, -107199, -13231, 80402, 131753, -42156, -371009, -547062, -492038, -485370, -724726, -1025732, -1089493, -865162, -519754, -213011, -34919, -46821, -241742, -494900, -631305, -554920, -328849, -150359, -186791, -375048, -454986, -282336, -19447, 94153, 59676, 53813, 126491, 147721, 20500, -224018, -526495, -838842, -1074858, -1165192, -1154920, -1121791, -1021542, -752467, -365980, -83469, -82751, -333388]
40051c33388k90357r0054J73364K17722l0485k77728k20907L3865J80932K08449
40041d28587K92161L17941L8598l25024k64805J44045K31645j90935m56085j07953
40031g48999L52647L17295K8483K5586J71746K2284k33318p5769L14202K33416
40021D07573l60256o96580l63222J31417K20219N8397R8049L70082N56879M57794
40011H80352J00876l46236n74232l23101K18890M76070J64288l30427m77381k78369
40001d89270j37889k12284k29775K4037L26781L07266L017j13671K33979O58630
39991C70821N37615j33631o50532m72057J20210M38797K17641k20358m29235k32141
39981d52870J94935M32015J83535l05999m62512j68671M5156j43632k94826K6765
$$ y = [-333388, -623745, -713799, -540435, -322713, -353198, -630926, -851833, -817968, -637036, -428587, -136426, 181515, 220113, -104911, -369716, -225671, 5974, -184961, -641046, -748999, -396352, -79057, -50574, -24988, 146758, 169042, -64276, -140045, 174157, 407573, 47317, -649263, -1012485, -881068, -660849, -602452, -504403, -134321, 422558, 880352, 981228, 634992, 60760, -262341, -43451, 432619, 596907, 266480, -210901, -489270, -627159, -839443, -1069218, -1045181, -718400, -411134, -408117, -521788, -287809, 370821, 908436, 774805, 124273, -347784, -227574, 211223, 428864, 208506, -220729, -452870, -257935, 174080, 357615, 51616, -410896, -579567, -534411, -678043, -972869, -946104]
39971i46104M09452K16840k80615k43253L77204P00077K62031l16882l21864Q5833
39961e7281L17805K61732K33566L24895K65646j35918o90921r69286o89414n1077
39951a190253L78806K92283L0918O6363K60893J10213l60958n37116j43698L26864
39941g65685L50101N3962j15133k3000J53872K62495K36841N6052j56664j93008
39931a40167m4671Q4433J07780J24497J29363J269j68186j22136J06627J93221
39921B72030O1167j3012N4748j0409k88319m23760j75141K21140M54101M96775
39911F49320L78766N5108k97565l29306p2184M5352p1901k5814K70834L15257
39901I17867q5873l37813J133M37234L14373j81646m44683l86225k78852j15207
$$ y = [-946104, -536652, -319812, -600427, -843680, -466476, 233601, 495632, 178750, -143114, -57281, 260524, 522256, 755822, 1080717, 1346363, 1210445, 519524, -449762, -1139176, -1190253, -811447, -519164, -488246, -421883, -160990, -50777, -411735, -948851, -1092549, -765685, -415584, -361622, -476755, -499755, -345883, -83388, 153453, 209505, 52841, -140167, -184838, -100405, 7375, 131872, 261235, 262504, 94318, -27818, 78809, 272030, 333197, 320185, 374933, 364524, 76205, -347555, -522696, -301556, 152545, 649320, 1028086, 1083194, 785629, 456323, 384139, 429491, 357590, 331776, 602610, 917867, 831994, 494181, 495314, 932548, 1246921, 1065275, 620592, 234367, -44485, -159692]
39891a59692J66920K30552j44280m56275j63199L72103M24719P9754k3896J41711
39881D68417O8174j98937j00379K92985K50983l14023n62114j06465K94025l0423
39871F2243n59705m19064K78944O79091M24812l6199k33111j72471o4323Q293
39861c1490N0245M5510l243k7950M5114J78662J85531p8657m24613m34079l4829
39850e29799K68003M7229l80242l76749P5135L78730K35802k646R651J30796R9712
39839d4378l4975q9859l8529O1655J79641K25766J09794m3573j0310J63024K12489
39828F90745R7021K4869J5313j43565m18774m63872j83985N3820j6665j66949
39818e12042q5248J38336J99845L0646j56997j35666J20820L62754K57264j45107
$$ y = [-159692, 7228, 237780, 93500, -362775, -525974, -153871, 270848, 350602, 326706, 468417, 536591, 337654, 237275, 530260, 781243, 467220, -94894, -201359, 92666, 62243, -497462, -916526, -637582, 41509, 466321, 430122, 197011, 24540, -39783, -31490, 18755, 64265, 61022, 33072, 78186, 256848, 442379, 363722, -60891, -494970, -529799, -261796, -214567, -594809, -971558, -896423, -517693, -281891, -284537, -274886, -144090, -44378, -79353, -169212, -207741, -146086, 33555, 259321, 369115, 325542, 315232, 478256, 690745, 787766, 812635, 827948, 684383, 265609, -198263, -382248, -328428, -345093, -512042, -597290, -458954, -259109, -228463, -385460, -521126, -400306, -37552, 219712, 74605]
39808G4605l09128O7358M63332K22624l48255l40174L11375O39054J33945m82439
39798D32297m33925j5001R8224k0103J22305M45354M40172M0380l46901n00163
39788B62639m75680k37970J99900M38411J21813l91192m01027J20972M88777L05913
39778D32556n5916j11684R8198K31865J42513o8173k55999l27135k74023k01148
39768c88946j99554j95097n7884J66471K88305K15154L8200q3046l6001J59142
39758i3256L08222K21411o617q5822L7447J01634j9085j11254l3171K3883q6227
39747B57165j77589r3180n86l3411j3644J35302J13698k03279l64898q935M58471
39736F9114M29916Q397k73316l33171m41319n01975k12901K12471K77139P5397
$$ y = [74605, -234523, -167165, 296167, 518791, 170536, -169638, 141737, 780791, 914736, 432297, -1628, -16629, 81595, 61492, 183797, 629151, 1069323, 1109703, 762802, 262639, -213041, -451011, -251111, 187300, 309113, -82079, -483106, -362134, 126643, 432556, 376640, 264956, 363154, 595019, 737532, 669359, 413360, 86225, -187798, -388946, -588500, -783597, -841481, -675010, -386705, -171551, -133351, -216397, -252398, -93256, 214966, 436377, 429760, 343938, 381385, 483019, 463934, 352680, 319509, 343392, 257165, 79576, -13604, -14190, -47601, -61245, 74057, 187755, -15524, -380422, -389357, 69114, 499030, 507427, 234111, -99060, -540379, -1042354, -1255255, -1042784, -765645, -690248]
39726f90248J36911M32613L82040r4160l96027k64930j19129j51738J2350M19105
39716c33213M46369j32672n71846k68441K67760K84131j7099L636K12374j8550
39706a27551n81912o78675r3060M48836L70042k5983j76629k5326J57890K65137
39696d67231L04177J85377j00428l06881k40500q4815j25348k72686j86726J51961
39686a143100L41897J44181j30058n6355K72621L82105J18331j49859j02955J14173
39676b09019K29199K58615L02498K14015j38042m71476l91781J604K32010J25444
39666A53067l6323k2813R9458K30214L30077K55222n8360k62397K1367M66905
39656A176417L28398m10977q76583n65612n4121n823j77496m3634J90489J5827
$$ y = [-690248, -553337, -120724, 261316, 167156, -228871, -493801, -612930, -764668, -752318, -333213, 113156, -19516, -591362, -859803, -592043, -307912, -325011, -321375, -109001, -127551, -709463, -1388138, -1481198, -1032362, -662320, -688303, -864932, -890258, -732368, -467231, -163054, 22323, -78105, -384986, -625486, -710301, -835649, -1108335, -1295061, -1143100, -801203, -657022, -787080, -843435, -570814, -188709, -70378, -220237, -323192, -209019, 20180, 278795, 581293, 795308, 657266, 185790, -205991, -204387, 27623, 153067, 116744, 93931, 193389, 423603, 753680, 1008902, 950542, 688145, 709512, 1176417, 1504815, 1093838, 217255, -348357, -402478, -408301, -585797, -629431, -438942, -423115]
39646d23115l37834j89398M12797O66524K26938l17603l65077n7577J46713J45015
39636i2617J07218Q1382N286q8618j09333l3278J05911K25969J76923j03759m09947
39625a34863m42814j69031J86116M41418N11788K66801k89420p32462n55964J15973
39615h02458N67835L92789l0850j46811P9876L24560M12229L41233Q0429k94579
39605I24253m69083k63827Q134o4332l49306l41670N1420L39635J75742j47618
39595a36652j66768Q3940K00638N4297o2195M7486J48246m9562l72711l39513
39585e92794J60690O08011M46285k03737o65582n28500r8648P8118p4212j69655
39575a040024J9070K55613K36602L8517m0829N6241J15187N4492P0436K66998
$$ y = [-423115, -760949, -950347, -537550, 128974, 355912, 38309, -326768, -384345, -237632, -92617, 14601, 95983, 101269, 12651, -96682, -129960, -24049, 201920, 378843, 275084, -134863, -577677, -746708, -560592, -119174, 392614, 659415, 369995, -362467, -918431, -802458, -234623, 158166, 127316, -19495, 60381, 384941, 797170, 1138403, 1218832, 924253, 455170, 191343, 199477, 135145, -214161, -555831, -504411, -164776, 10966, -136652, -303420, -219480, -18842, 35455, -26740, 20746, 168992, 119430, -253281, -592794, -432104, 175907, 622192, 418455, -247127, -775627, -874275, -796157, -870369, -1040024, -1020954, -765341, -528739, -490222, -531051, -474810, -359623, -305131, -234695, 32303]
39565C2303L97953K11140j10934j57780J04662K56854K5826l28597l94071j41911
39555a04555J40425K81085L12968K25689n4935m11087n37906l26484m2659K2578
39545d94881p5246r0668L600J3663q7109m9981K30883M24922J74332l01570l80264
39534f32319J04421N49716L93248p5076j42290K60483M84139J94111j27388M372
39524A013417K87280J49221l02723m63760k09526m0960k05014l04890l4566K44911
39514A33390Q3532k89697k99175P5463K81862O0967k00447j34594N0216k2625
39504b61108k69259l19564j28533J9558N4178K10763N05258N61023J88745k22319
39494C38742k19040O9720J74583r519j76370j67346j24904q3288J34333M88651
$$ y = [32303, 430256, 641396, 530462, 372682, 477344, 734198, 760024, 431427, 37356, -104555, 35870, 316955, 629923, 855612, 800677, 389590, -148316, -474800, -517459, -494881, -570127, -660795, -657195, -643532, -730641, -780622, -549739, -124817, 49515, -252055, -632319, -527898, 21818, 415066, 339990, 197700, 458183, 942322, 1136433, 1009045, 1013417, 1300697, 1449918, 1147195, 683435, 473909, 432949, 227935, -76955, -111521, 133390, 216922, -72775, -371950, -296487, -14625, 46342, -154105, -288699, -238483, -261108, -530367, -849931, -978464, -958906, -904728, -693965, -188707, 372316, 561061, 338742, 119702, 189422, 364005, 354486, 178116, 10770, -114134, -197422, -63089, 425562]
39484D25562O03400K76291k04714m57493m42683l20313j58766l781L5685M231
39474b42581J34985M27766M94803J31728k66023k47821O802K0078j82682j63982
39464A13073J31239K69610O3656j49177j11699k7546j10432j91877o9385J08771
39454B6233J27316R2431J98365L16610J78017j48595l04731j52112N2275L7097
39444D22906j48043k67682k20018r7705N163J06728K16018K12754K654k37959
39434e184j97695J13712K98460J37052n4459N8107K18095k9843m91865m91275
39424d44895P1521M77194K44071j83291j99368M5141L9121j85685k05740j9191
39414c61122n911j51628k0637M10808N66949J58445l28119l67791j23608j1067
$$ y = [425562, 1028962, 1305253, 1100539, 643046, 200363, -119950, -278716, -282497, -246812, -242581, -107596, 320170, 814973, 946701, 680678, 432857, 439659, 459737, 277055, 113073, 244312, 513922, 577578, 428401, 316702, 289156, 178724, -13153, -82538, 26233, 153549, 245980, 444345, 760955, 938972, 790377, 485646, 333534, 385809, 422906, 274863, 7181, -212837, -310542, -305379, -198651, 17367, 230121, 232775, -5184, -202879, -89167, 209293, 346345, 291886, 349993, 568088, 538245, 46380, -444895, -373374, 103820, 347891, 164600, -34768, 10373, 49494, -136191, -341931, -361122, -367033, -518661, -539298, -128490, 438459, 596904, 268785, -99006, -222614, -233681]
39404b33681K8405K68343N11404L15043j87343l45002K6797L13572J5260n00129
39394B12669n55216j29948K05382J42646o5350j26970p7762k7932P4025K37998
39384a10458K77134Q3657j32719j12297P4295J41630K1335m8719J04822L04678
39374F03358K21943j79566n06948l39291K44119O80609N59864Q9828k47906l42023
39364G83987m39969n88219n11167j22168K46674L02406J50294J2267r0712j68096
39354d24703j00507R9316J78220N7594K6621K24048K91643o5546n09708n22076
39344g45098j50208J68049K70619K67697J35028j38896k41284L5113K90184R8985
39334i811j66072J05264N94822M32082l10337n99590j08587K34521j94300o80603
$$ y = [-233681, -205276, 63067, 574471, 889514, 702171, 357169, 383966, 697538, 712798, 212669, -342547, -472495, -267113, -124467, -189817, -316787, -394549, -422481, -348456, -110458, 166676, 250333, 117614, 5317, 79612, 221242, 242577, 193858, 298680, 603358, 825301, 645735, 138787, -200504, 43615, 724224, 1284088, 1373916, 1126010, 783987, 344018, -244201, -755368, -877536, -630862, -328456, -178162, -165895, -256607, -424703, -525210, -425894, -247674, -190080, -163459, 60589, 352232, 286686, -223022, -745098, -895306, -727257, -456638, -188941, -53913, -192809, -434093, -398980, -108796, -9811, -175883, -70619, 524203, 956285, 645948, 46358, -62229, 172292, -22008, -702611]
39324g02611l92372K63285L69872p1540l55792k64347j55105j41579n838K12626
39314a243401K53219J73145K38827L67142K42944q2682k43295j40092J0935J25533
39304b97725K65599L07578R2047j71241j30356J42846K74212J82086O8509p3413
39294F60142l89941o60225m57316J31999M98875L31187m5321k47532k80338k65072
39284g23542j68655J3492J55735K24087K98819L20312J53026p3036q3542M3234
39274A59930m3342l08740k68100K25759O20026M06159j51092l92543j21587K66276
39264C92746L66155J68791p6974j82887j53255q1043Q912J25707J43275j03161
39254F08266m45657m16273R0050M93231K52407l54900o38888m37943j12672J67732
$$ y = [-702611, -1094983, -831698, -461826, -533366, -889158, -1153505, -1308610, -1450189, -1456027, -1243401, -990182, -817037, -578210, -211068, 31876, -50806, -294101, -434193, -423258, -297725, -32126, 275452, 367499, 196258, 65902, 208748, 482960, 665046, 733555, 660142, 270201, -390024, -847340, -715341, -216466, 114721, 69400, -178132, -458470, -723542, -892197, -878705, -722970, -498883, -200064, 120248, 273274, 200238, 116696, 159930, 116588, -192152, -460252, -234493, 385533, 791692, 640600, 248057, 126470, 392746, 758901, 927692, 850718, 667831, 514576, 433533, 442445, 568152, 711427, 608266, 162609, -253664, -163614, 329617, 582024, 227124, -411764, -849707, -962379, -794647]
39244g94647M69489N82874K35072k22547j51774K90385K73454l33040o41326j59438
39234d51498L96633K64627k04849k59183N0768J70566N1050M4635J42078R2648
39224B97475L1835K38407M52636J82679m10219o53441l68483n4172k5498l2817
39214c41598J19924J84514m8184l36759l46849j07606J20388J97931J45281J6264
39204c96694j09833j35769m8819O1179J14007R6072K6357n8375j27571k08570
39194g88016l13266l00129j8407L56105M23607J34721o6602J12218L66594K81770
39184A88595o4961l35332m49014m74696l00397J30321M99809N03862L29993K77993
39174C06173J82296k09198n45278k89107L01286M01359j33661n23011k32314L22996
$$ y = [-794647, -325158, 257716, 492788, 270241, 118467, 408852, 682306, 349266, -292060, -451498, -54865, 209762, 4913, -254270, -203502, -32936, 18114, 62749, 204827, 297475, 329310, 567717, 1020353, 1203032, 792813, 139372, -229111, -283283, -308781, -341598, -221674, -37160, -85344, -422103, -768952, -876558, -756170, -558239, -412958, -396694, -506527, -642296, -691115, -629936, -515929, -419857, -393500, -451875, -579446, -788016, -1101282, -1401411, -1419818, -1063713, -640106, -505385, -571987, -459769, -93175, 188595, 123634, -211698, -660712, -1135408, -1435805, -1305484, -805675, -301813, 28180, 306173, 488469, 279271, -266007, -555114, -253828, 147531, 13870, -509141, -741455, -418459]
39164d18459N20346L39574Q1734j67179l76594l18010P9468M21280L01741j33430
39154C30471m03664l09478n9735Q4701O4718m512J6298J06881O1220k03412l95265
39143g11777j96972K01545L20908J35902J10212L90570N10460J56541k62878k05894
39133D48617K01170L73131O6592l96854n87814l72846M7886L14701K11740r6658
39123B09665k57929j79473o3619o483R9663K32652K15375R8721J17451J73992
39113F40015q3620n12500m69505J32371M79624P9598l70030n4642O02366N78001
39103A021678j26753n23553j94577J86637L5589l18858l15433R642K62150K85783
39093C22305J76688M2682n486R1262J50866o9555m13713m30816n4037K48202J61678
$$ y = [-418459, 101887, 441461, 523195, 356016, -20578, -338588, -259120, 162160, 463901, 330471, -73193, -382671, -442406, -357705, -292987, -297499, -281201, -174320, -113100, -316512, -711777, -908749, -707204, -386296, -250394, -140182, 250388, 760848, 917389, 654511, 448617, 649787, 1022918, 1089510, 692656, 104842, -268004, -220118, 94583, 306323, 209665, -48264, -227737, -291356, -297839, -198176, 34476, 249851, 348572, 466023, 640015, 556395, 43895, -425610, -293239, 186385, 265983, -104047, -158689, 443677, 1021678, 894925, 371372, 176795, 363432, 399021, 80163, -235270, -225628, 36522, 322305, 498993, 541675, 536189, 627451, 778317, 708762, 295049, -135767, -189804, 58398, 220076]
39082B20076o5872j21391r5589j61659j77765K3805K47813K10048j4295j51755
39072h6584j53796j40718r4892N9949K00969J45853l7840j43315j52971j81503
39062e84848j88460n0060J50018K17294J97059K95190M41506K92909k21544o78708
39052a29644o64299k58404J66714M14820M98712L89358N4404l00728l46198n6637
39042b31902K10381J74801k7369j10684n8167n2821j17007r6128L0234J00861
39032a77801P1548Q7665J75774J49334k6573o8722J79055L91664J93982k34319
39022G41607l88022j82951l1639j50229k43155m1283K35412K23598l8704k06740
39012h2106j19915N8837J19461K3241j14803j35379J9291J93444J53864r1690
$$ y = [220076, 154204, 32813, -62776, -224435, -402200, -378395, -130582, 79466, 65171, -86584, -240380, -381098, -475990, -416041, -215072, -69219, -107059, -250374, -403345, -584848, -773308, -823368, -673350, -456056, -258997, 36193, 477699, 770608, 549064, -129644, -793943, -1052347, -885633, -470813, 27899, 417257, 471661, 170933, -175265, -231902, -21521, 153280, 125911, 15227, -42940, -95761, -212768, -308896, -278662, -177801, -106253, -18588, 157186, 306520, 279947, 211225, 390280, 781944, 975926, 741607, 353585, 170634, 138995, -11234, -254389, -295672, -60260, 163338, 124634, -82106, -202021, -143184, -23723, -482, -115285, -250664, -231373, -37929, 115935, 24245]
39002B4245k54069j28212J63526L89500M68619L84951R3061k79570l85102j08984
38992C67965J41706k8467l55878k69039J90205L49814q2831n33006l70608K11309
38982c78830N28854L47029N2022J1243J76394L20013L19926J45176j65273m19691
38972I36863l91420j22215O7640k9159k54338l19241j60516M3000J07600Q869
38962a12917j13784o7983J76329L61918K00648j93638l51334n8574L07741K73121
38952D21527j06168l90165l71081j98844J101K24831L21828P8751l31761m18211
38942g68192o3379K62023K15252Q2733K16404L82252J78492j98599k24706O1861
38932A44141J04099k21012l62131j189L99077K97944j41910l82088k66972l3104
$$ y = [24245, -229824, -358036, -194510, 194990, 663609, 1048560, 1141621, 862051, 476949, 367965, 509671, 481204, 125326, -143713, 46492, 396306, 313475, -219531, -590139, -378830, 150024, 497053, 549075, 560318, 736712, 1056725, 1376651, 1521827, 1356554, 936863, 545443, 423228, 490868, 461709, 207371, -111870, -272386, -229386, -121786, -112917, -226701, -294684, -118355, 243563, 444211, 250573, -100761, -159335, 148406, 421527, 315359, -74806, -445887, -644731, -643630, -418799, -96971, -18220, -349981, -768192, -831571, -569548, -354296, -271563, -55159, 327093, 505585, 306986, 82280, 144141, 248240, 27228, -334903, -336092, 62985, 360929, 219019, -163069, -430041, -463145]
38922d63145J67621L11944K65124m9192l46030k78501J8089J06268n9560q8881
38912d16263J38034K22399q0835l86962k26488K46038M95808L74508K10316J94922
38902G71477J25098j51292m10003l83736j62093j2176K1563P0041J15750K8404
38892A3033j15322q0986J08427J45256n0088j43048N8639K17066M524k71375j04947
38881b18821L29453L79062k0788j94370J66648M58202J39142l83280m39693j69039
38871D6516j68419m07523l21833J36122L70786J25173j68516j67322m3454O0035
38861e38435K92423N51616L99810j16323k88656J38558M18090j2677n23023l04628
38851A6755K36204J56179l89953m06621K17463N21331J20616k18762k2836P9136
$$ y = [-463145, -295524, 16420, 281544, 232352, -113678, -392179, -374090, -267822, -327382, -416263, -278229, -55830, -136665, -523627, -750115, -504077, -8269, 366239, 576555, 771477, 896575, 745283, 335280, -48456, -210549, -222725, -201162, -131121, -15371, 13033, -102289, -183275, -74848, 70408, 20320, -122728, -64089, 152977, 157501, -113874, -218821, 110632, 489694, 468906, 274536, 441184, 899386, 1038528, 655248, 215555, 46516, -121903, -529426, -851259, -715137, -344351, -219178, -387694, -555016, -598470, -538435, -246012, 305604, 705414, 589091, 300435, 438993, 857083, 844406, 321383, 16755, 252959, 409138, 19185, -387436, -169973, 351358, 471974, 253212, 230376, 309512]
38841C09512l86149p37202k66236M73872N12978q339k10771K2785K2990l48351
38831f14911m42233J7665M58061L90754O6910r2412q5996n8092J6997Q9116l9409
38820b93550k79111k27310J64196L91449J64210j34053j03997N8444M2714K1208
38810a95800K15510K99219q3838n05898k42495N26641Q06318J98275n03084m41181
38800G3667J62870M59936J75494j74465j36811R9843Q2490k56608n40820m57345
38790e11749j44453P764j31882k80443j39716K12201M68015M99038M06484K48247
38780F33506j1880k71717k94396n7956J35358O4593r2509o1490P3470J6283k07167
38769g3905k27363O8806K77825P4627k24674j07540K90044L29959r6736l02446
$$ y = [309512, -76637, -813839, -1080075, -606203, -93225, -101564, -312335, -289550, -266560, -614911, -1057144, -1039479, -581418, -190664, -123754, -216166, -302162, -360254, -343257, -254141, -293550, -572661, -799971, -635775, -244326, -80116, -214169, -318166, -259722, -217008, -195800, 19710, 318929, 235091, -270807, -513302, 13339, 819657, 1017932, 514848, 73667, 236537, 696473, 871967, 697502, 560691, 660534, 743024, 486416, -54404, -511749, -656202, -648438, -780320, -1060763, -1200479, -988278, -520263, -21225, 385259, 633506, 621626, 349909, 55513, -2443, 132915, 197508, 104999, 43509, 116979, 133262, -73905, -301268, -232462, 45363, 119990, -104684, -212224, 77820, 407779, 311043, 8597]
38759H597J32252O01972L41555l65357n74083q3496L47623K09306j33149k21819
38749B63401j59148j31503K8842L41702L52068j43881n78075m21148l3141l4281
38739e15164k68163j74579J47444J27872k09363k62183J12581M25306M47791M62300
38729B93842N34642L55538m4106k18283j28674k31985n30692m20605J77200M47951
38719B34828m7023n92081m47224K3836J04903q1527L618K48128J71372r7870m0581
38708e19621K93150L96593K05522P5949J3493k52157n20532k98318K72539M85610
38698A52228J49424j75335j33496j5492p2038j17322l9884l7222j15029q211J89164
38687b23213K7159m14830m36379J11162L89345j17309o36079k36457O85260R78178
$$ y = [8597, 140849, 742821, 1084376, 719019, 144936, 61440, 409063, 618369, 485220, 263401, 104253, -27250, 1592, 343294, 695362, 551481, -26594, -447742, -480883, -515164, -783327, -957906, -810462, -682590, -891953, -1154136, -1041555, -616249, -168458, 293842, 828484, 1184022, 1139916, 921633, 792959, 560974, 30282, -390323, -213123, 234828, 187805, -404276, -851500, -827664, -722761, -804288, -800670, -552542, -381170, -479040, -519621, -226471, 170122, 375644, 451593, 465086, 212929, -307603, -605921, -333382, 152228, 301652, 126317, -7179, -22671, -94709, -212031, -251915, -289137, -404166, -412377, -223213, -196054, -610884, -1047263, -936101, -546756, -664065, -1300144, -1536601, -851341, 126837]
38677A26837M13580j73707k56353j77460k87706l82513k50333r3774o8371O4352
38667a085448M54075P45058N44656M0685k33295j08608P4210j0021k62478l25497
38657a66663k7761L90999M95586J20904m07879o14307m02044r9328J8451L1757
38647f60285J20321K27825J79478N724p8503J3121J39704J64016J14802O3005
38637B89208k2854j93546l68675l84680j91215O5238J74029O7105j02406j03971
38627g71767J11462L24537L02171J16605O1573K17874K98692N9724l15528m51636
38617d6293k75264k5824J30411K03472J59336m8741k17945n2960L20916L95340
38607E42448j790m09822l90903j04313P2880J23056J90868J47375j46957l84947
$$ y = [126837, 540417, 366710, 110357, -67103, -354809, -737322, -987655, -1081429, -1149800, -1085448, -631373, 113685, 658341, 699026, 465731, 357123, 431333, 421312, 158834, -166663, -194424, 196575, 692161, 813065, 405186, -209121, -611165, -710493, -692042, -660285, -539964, -312139, -132661, -126937, -205440, -192319, -52615, 111401, 226203, 289208, 266354, 72808, -295867, -680547, -871762, -806524, -632495, -565390, -667796, -771767, -660305, -335768, -33597, 83008, 144581, 362455, 661147, 720871, 405343, -46293, -321557, -347381, -216970, -13498, 145838, 97097, -120848, -173808, 147108, 542448, 540658, 130836, -260067, -364380, -291500, -168444, 22424, 169799, 22842, -362105]
38597c62105j80873K30254K38863k14036n22279l02577J27630L19915K78013K42691
38587a44504K62796K37794J42353J5341r2156o9733J31312K92013J27769k53285
38577F49700m21417k31436q75K9458K1152J33302J73132n8130l53996l58457p0544
38566d88111J71768J24101j23031k72793j16489K19080L44995Q8251k01037j02484
38556c55750K16577K14207j75691m02791j13923L68768N57659L65835p404l48284
38546C19203m28290j50981J62001P9393k41370k05963K45286M76321J83890j38055
38536C01435r5493l074j50034k16502J8532J27441j54167k91129J21984N00756
38526A59749K10771k90882k38162J12024K6427l28304k54622J12293P7544k37760
$$ y = [-362105, -542978, -312724, -73861, -287897, -810176, -1112753, -985123, -665208, -387195, -144504, 118292, 356086, 498439, 513780, 421624, 351891, 483203, 775216, 902985, 649700, 228283, -3153, -4028, 25430, 46582, 179884, 353016, 294886, -59110, -417567, -488111, -316343, -192242, -315273, -588066, -704555, -485475, -140480, -52229, -253266, -355750, -139173, 75034, -100657, -503448, -617371, -248603, 309056, 674891, 667487, 319203, -109087, -260068, -98067, -18674, -260044, -466007, -220721, 255600, 439490, 301435, 205942, 202868, 52834, -163668, -145136, -17695, -171862, -462991, -341007, 159749, 370520, 79638, -158524, -46500, -20073, -348377, -602999, -490706, -413162, -650922]
38516f50922j10442L41967K95690k27274l40393P6627J64429k62415l18857K78946
38506g52644O01644J59325k31110K9570K70800q3968l64585P7624N76739L05873
38496E89268k47457k04896J43724J0698l70003k48991J84451K22253L2666K31004
38486C42717M62819o8873r11848q10056J85992O84383K14952j19284K95445M98292
38476G74539k52859j022469o57614L35330O06625j7716n29103l68962L2083K12453
38466h87693K29428K01218M4724j85923k32831l8102J67998K42091K57458K35949
38456C4317Q4353j40263j95544L474K08288J24596k26999n23849m82981j52693
38446a267301J53844K21486J59136J85691K91612K93086J61984O4562O9630N7938
$$ y = [-650922, -761364, -419397, -123707, -350981, -691374, -614747, -450318, -712733, -1031590, -752644, -151000, 8325, -222785, -193215, 77585, -6383, -370968, -293344, 283395, 589268, 341811, 136915, 280639, 291337, -78666, -327657, -143206, 79047, 111713, 342717, 805536, 736663, -175185, -985241, -799249, -114866, 100086, -19198, 276247, 774539, 521680, -500789, -1158403, -823073, -216448, -234164, -763267, -1132229, -1100146, -887693, -658265, -457047, -412323, -598246, -831077, -869179, -701181, -459090, -201632, 34317, 118670, -21593, -217137, -213663, -5375, 119221, -107778, -631627, -1114608, -1267301, -1113457, -891971, -732835, -547144, -255532, 37554, 199538, 264100, 333730, 391668]
38436C91668l8556j29853j47265j22847o0891N4383J14756P95j55369j06039R8258
38425a00960J58476K5856k8140P5510O7828j36502j86424J39482M85381L96207
38415H96714k6615l11481k63429q1399K5375J7048q2894k02806k15272j22474
38405c67233j17279k56972k71335K7037L31451K06858k33336m08271m0984M89608
38395f40456O49230L41002j02187l19641k06713P1757K47191J78540l2240j65620
38385B0863j06518P1780J87563R9475j38703k69895j16677J26626R4855k11341
38375b41972l65287j22821K03494K12295p179q4164L4823P2212p8107k02694j35006
38364g14406L7494J83317K87972L34083K33665k1509k76127l53420k16271J3357
$$ y = [391668, 353112, 223259, 75994, -46853, -107744, -53361, 61395, 62190, -93179, -199218, -100960, 57516, 83372, 55232, 130742, 198570, 62068, -124356, 15126, 500507, 896714, 870099, 558618, 295189, 213790, 239165, 256213, 173319, -29487, -244759, -367233, -484512, -741484, -1012819, -985782, -654331, -447473, -680809, -1089080, -1130064, -640456, 8774, 349776, 247589, -72052, -278765, -207008, 40183, 218723, 186483, 20863, -85655, -13875, 173688, 273163, 134460, -135435, -252112, -125486, -30631, -241972, -607259, -730080, -526586, -314291, -321470, -405634, -370811, -298599, -376706, -579400, -714406, -676912, -493595, -205623, 128460, 362125, 340616, 64489, -288931, -505202, -491845]
38354d91845J34406K1028k18083l09388j31570J42769L11847L80728L89937K29303
38344D59132j21116l51025j64511K31793L45762Q0116j59834p4053J57051K08139
38334F11454L3428j85484l04985k98386k15998j56346j65100j40195K7116K32766
38324e61730K63362J09405k8509m1127N559Q3801K37208L66287K63347m5807k47573
38313D04223j45069R4368J97415Q8328j48478l87189m49541k11870J56868K89439
38303a11506Q1460j57458j34346P8177K53076L10210K43107J7441k45539k51944
38293H2678L6474K04353p6288n19737n96229k63485O3839J68922K18264K95217
38283c85992J96529j56390m45742l22665J41764N44517N73393K38222j93700l89889
$$ y = [-491845, -357439, -336411, -554494, -863882, -995452, -852683, -540836, -160108, 229829, 459132, 338016, -13009, -177520, 54273, 400035, 480151, 320317, 246264, 403315, 611454, 644882, 459398, 154413, -143973, -359971, -516317, -681417, -821612, -794496, -561730, -298368, -188963, -217472, -258599, -253040, -169239, 67969, 434256, 697603, 651796, 404223, 259154, 353522, 550937, 639265, 490787, 103598, -345943, -557813, -400945, -111506, -30046, -187504, -321850, -243673, 9403, 319613, 562720, 580161, 334622, 82678, 119152, 323505, 247217, -272520, -868749, -1132234, -1068395, -899473, -681209, -385992, -189463, -345853, -791595, -1114260, -972496, -427979, 145414, 383636, 189936, -199953]
38273a99953j91703K24078M77615L52643k717k60190k33926m269K05940K41110
38263F08628J30072K864r6407k24518l35775k30862J36511M42473L29690r2269
38253F70407l48026k09729N2228R5293p4019k30511k62581j99525o3572J14529
38243d55506K17599J44563m2034j71292j30168P0753L07942L76364J47164k22560
38233B42825l83108k05544M9774J08768M6750P3779J27970j7597l13471m19140
38223f88994j66566K15558M01223K83104m7764m06777n34138k52521K63951N70684
38213c62240M38464J02339q3211n6464J8984M9707N7104N5079N0881P1862Q0824
38202D23329K505p9607K2056K18323J28616l03673n24035j12033M62406L90311
$$ y = [-199953, -391656, -167578, 310037, 662680, 659963, 399773, 165847, 161578, 367518, 608628, 738700, 741564, 645157, 420639, 84864, -145998, -9487, 432986, 762676, 670407, 322381, 112652, 164880, 260173, 186154, -44357, -306938, -506463, -570035, -455506, -237907, -93344, -135378, -306670, -436838, -366085, -58143, 318221, 465385, 242825, -140283, -345827, -296053, -187285, -140535, -66756, 61214, 43617, -269854, -688994, -855560, -640002, -238779, 44325, -3439, -410216, -944354, -1196875, -932924, -362240, 76224, 178563, 95352, 38888, 57872, 107579, 164683, 219762, 270643, 342505, 423329, 425834, 346227, 368283, 586606, 715222, 411549, -112486, -224519, 237887, 628198]
38192F28198k94394p11656l60823K61200M58112K05401p3345j50908n8443J60909
38182F4251M03993M52076K50034K1730j00909k64540m93097m91334j70583L6208
38172b92171j86504m59236k84137J37758K74096J71411K84300N48726M17061j47963
38162D63341m76442j77869L28459N11414L74929J41318j57636m45234m43786j15467
38152C027J44918Q4175l9054K4009N3926j76615l86738k11909J54642K34539k6257
38141a41337k65612k60274p2036K01411M30972L63362p7601n10746m90589q5307
38131i07757K65085L35965K27700M7857j29846j16301J81982M87869M59051J71899
38121A023504n7375j90428l84685n29746l59461L0292K63334K61876K66598K99147
$$ y = [628198, 333804, -377852, -738675, -477475, -19363, 186038, 112693, -38215, -96658, 64251, 468244, 920320, 1170354, 1192084, 1091175, 826635, 333538, -157796, -328379, -292171, -478675, -937911, -1222048, -1084290, -810194, -638783, -354483, 194243, 611304, 463341, -13101, -190970, 137489, 648903, 1023832, 1165150, 1007514, 562280, 118494, 3027, 147945, 232120, 193066, 217075, 271001, 94386, -292352, -504261, -349619, -115080, -141337, -406949, -667223, -739259, -537848, -106876, 256486, 178885, -331861, -822450, -907757, -642672, -306707, -79007, -31150, -160996, -277297, -95315, 392554, 851605, 1023504, 966129, 775701, 391016, -138730, -498191, -467899, -204565, 57311, 323909, 623056]
38111F23056J26331k02015l15649j34624j5599j43854k56147j40701L9792J14739
38101c04671J66520K29219J40299j06480k57508k28175k15950k22088M0273N28498
38091b30063P03648L22747j15881j30484L0601p9727l17345k70695j2075J04550
38081E276J24450L15633N03522K71729k46319m52339j95045K8202j04915k90940
38071d0746j69825J38221L05363K38233L9757j65780k12923K854K74317K43548
38061F53019o2033j93237O1273L27617J86430k43115n22612m56386j72009J55142
38051b65911L85552L76871J21339j69845l02311k97210k10230L3855L95105N31624
38041E98839K03193k77303l87622j38301m7379l21587n05549j60752M65784P74450
$$ y = [623056, 749387, 547372, 231723, 97099, 81500, -62354, -318501, -459202, -419410, -304671, -138151, 91068, 231367, 124887, -132621, -360796, -576746, -798834, -758561, -230063, 473585, 796332, 680451, 549967, 580568, 500841, 183496, -87199, -99274, 5276, 129726, 445359, 948881, 1220610, 974291, 521952, 326907, 355109, 250194, -40746, -210571, -72350, 233013, 471246, 511003, 345223, 132300, 135154, 409471, 653019, 590986, 397749, 459022, 786639, 973069, 729954, 207342, -249044, -421053, -265911, 119641, 496512, 617851, 448006, 145695, -151515, -361745, -327890, 67215, 598839, 802032, 524729, 137107, -1194, -48573, -370160, -875709, -1036461, -570677, 203773]
38031B03773N82594K05676q9388l13370m58679l84642j22889M0677j4605k2140
38021c72993K31114M92603L99642O9874n2803J31454K69310J39165m4980j5005
38011A247381K17394N45687R48542J292388J259162P17796m4700o49515r62018
38002D572117r68872o53633k20368q4844l23677m63338j87601R3735j29331n76904
37992A057284n38514K8391M16216J88877l12663n73824m82939j82118J74583L69840
37982A45133K53033L1331K9679J32498l8559l71204l29440R5117K28868j86213
37972i757m80610j21923L90876L39734p1320j51865J05460J28395j79796l18728
37962c69534q1713J76625K16898J99645J96775K9254k59594l22714q3046J04407
$$ y = [203773, 786367, 992043, 902655, 589285, 130606, -254036, -376925, -336248, -350853, -372993, -141879, 350724, 750366, 820240, 767437, 898891, 1168201, 1307366, 1262386, 1247381, 1464775, 2010462, 2959004, 4251392, 5510554, 6228350, 6183650, 5534135, 4572117, 3603245, 2949612, 2729244, 2644400, 2320723, 1857385, 1669784, 1763519, 1634188, 1057284, 518770, 547161, 963377, 1152254, 839591, 265767, -217172, -399290, -224707, 145133, 398166, 429497, 459176, 591674, 553115, 181911, -147529, -52412, 176456, -9757, -490367, -612290, -221414, 118320, 47000, -104865, 595, 128990, -50806, -369534, -451247, -274622, -57724, 141921, 338696, 367950, 108356, -214358, -297404, -192997]
37952a92997M5807q081J30818K58568J92579Q3384N6210m3637k56918k70116P2888
37941F8505L77928K32962j53766k90789j52564j07127k33208k32096k3210O7973
37931d45392j40372l45591k01780J65262L43895J89763n4183j37567p6780o351
37921g09096O4082K00466L25802K44161n5090k76342j54130J83146L74741K97256
37911D94996J42235M2013q4742k35622j98882O5603J98606r0761n11078n09509
37901f87141l4734L90999L77913Q6614j51652k75406l48529k75991J8321K94957
37891f04649K26995j09748k86765j06128J51335J72854M2402J4175O3253l1435
37881d67711k34871k29614Q7487L75833K93151m0729k40079j71435k5011N6155
$$ y = [-192997, -147190, -155271, -24453, 234115, 426694, 510078, 566288, 522651, 265733, -4383, 68505, 446433, 679395, 525629, 234840, 82276, -24851, -258059, -490155, -513365, -445392, -585764, -931355, -1133135, -967873, -623978, -434215, -488398, -625965, -702745, -709096, -645014, -444548, -118746, 125415, 70325, -206017, -360147, -177001, 197740, 494996, 637231, 679244, 594502, 358880, 159998, 225601, 424207, 333446, -177632, -687141, -721875, -330876, 47037, 133651, -18001, -293407, -641936, -917927, -899606, -604649, -377654, -487402, -774167, -880295, -728960, -556106, -513704, -499529, -436276, -467711, -702582, -932196, -844709, -468876, -175725, -216454, -456533, -627968, -652979, -596824]
37871e96824J36363K53664K86130J61335J3788K406R7321J63548J45542N7809
37861G21082q9714k17889j42870J93546N17732M66428M5979l51749m37748l19447
37851C85350k08045p0578J92282L87779K03715k57295m73766j87169K09296K07628
37841C89197j30122l54713l25488k94517l40220k02040J88374M49696K85397n7250
37831c91686j60303l518J45399J70644J09904o0168k71867k12389K40361N99702
37821A66079L06938l93765o79449k72387K33353K94943R4726L4589P7297k0444
37811a58120j90559j86214j1164J23991J21715L0812p5290p7087J15490L16053
37801I627J85965k19102l93173j14807J74236P1120j28363N3349M54882N41191
$$ y = [-596824, -460461, -206797, 79333, 240668, 254456, 256862, 354183, 517731, 663273, 721082, 631368, 413479, 270609, 464155, 981887, 1448315, 1494294, 1142545, 704797, 385350, 177305, 106727, 299009, 686788, 890503, 633208, 159442, -27727, 181569, 389197, 259075, -95638, -421126, -715643, -1055863, -1257903, -1069529, -619833, -334436, -391686, -551989, -555507, -410108, -239464, -129560, -189728, -461595, -673984, -433623, 166079, 473017, 79252, -600197, -872584, -639231, -344288, -249562, -214973, -137676, -158120, -348679, -534893, -546057, -422066, -300351, -269539, -344829, -421916, -306426, 9627, 195592, -23510, -416683, -531490, -357254, -286134, -414497, -361148, 93734, 634925]
37791F34925K45043m7163j87140l41368m67302l18547K8112K03696J33101Q3151
37781c3492J21812N9570o3801j0800J01893p8491l73229j38303O50214J084332
37771A319705N23662m73536r12788n94269p6839J95259J88707r441k48853k59402
37761c47795K3771K47956J35061m2015R8172L60521K49866k04163m47628k22434
37751a48688J04084J13992j46673l43503k57841P6786M28857N09395K26082j91942
37741C70549m33591l96901j52777J85246L98605K40664j65743k90644J01846M99772
37731C57026L25476j91299l60898o0486K08466J96178J57951J89937L401m32484
37721C93268o34227l11914J37328J87726j11605l03568j34566K48239N09481L88342
$$ y = [634925, 879968, 832805, 645665, 304297, -163005, -481552, -453440, -249744, -116643, -33492, 88320, 147890, 84089, 73289, 175182, 96691, -276538, -414841, 235373, 1319705, 1843367, 1369831, 457043, -137226, -214065, -18806, 169901, 160460, -88393, -347795, -324024, -76068, 58993, 16978, 115150, 475671, 725537, 521374, 73746, -148688, -44604, 69388, -77285, -420788, -678629, -601843, -172986, 336409, 562491, 370549, -63042, -459943, -612720, -427474, -28869, 211795, 46052, -244592, -142746, 357026, 682502, 491203, 130305, 69819, 278285, 474463, 632414, 822351, 825752, 393268, -240959, -552873, -415545, -227819, -339424, -642992, -777558, -529319, -19838, 368504]
37711C68504m1130l19798r3161L51785M26289J06895o0596J08152J41696k15568
37701G73068m92778k63950J37891J87377j6764n7970M7204r391j97287k22190
37691a14790o0220O8271J04755J12133K1915j67709j75539J40951L99283K04714
37681E33764k05916l41546k05957j06470p847K53848L75368r750n02747l78336
37671e95589K09238L73075r7912m33172j84262J30928N9951k1686K81131N95077
37661C16779M30818l514k61294l68601m58792k56157L65607P98331M71803j50062
37651H84918j76091L53930N72743J36032l86399n16320m61196n01571m70941j72297
37641g37192J80946K79420J57908O4878J09928K04890J92592k5446l33204m19099
$$ y = [368504, 327374, 7576, -85585, 266200, 692489, 799384, 738788, 846940, 988636, 773068, 280290, 16340, 154231, 341608, 324844, 266874, 314078, 304687, 107400, -114790, -175010, -106739, -1984, 110149, 132064, -35645, -211184, -70233, 329050, 533764, 327848, -13698, -219655, -326125, -333972, -80124, 295244, 285494, -217253, -595589, -386351, -13276, -111188, -544360, -728622, -597694, -537743, -559429, -278298, 316779, 747597, 744083, 482789, 114188, -344604, -600761, -235154, 563177, 1034980, 884918, 708827, 1062757, 1635500, 1771532, 1385133, 868813, 407617, -93954, -564895, -737192, -556246, -276826, -118918, -54040, 55888, 260778, 453370, 427924, 94720, -324379]
37631c24379j62463J10789M9879j82248j72021P5621K04890J55950J81954K35400
37621A73372j1230m11879l11035M30437J013571P65955R6199j77576k5834n1170
37611A490810l82145m88267j27578K07505M7802l45699l99757n6453K19727J52252
37601C18197j8231J1434J35787O0715j73985k25929j1354J21792m4881j97271
37591b3726K3327L87412M00889J27416J12889M48829N35952M1164m80866l78936
37581A194350J06057K22028j64108m47229k59498L7820L047k22016j93035J78811
37571D56227N55821O30902M22350J71589J07792K68147M36649L27688n5623l38587
37561B982955k14838J12295J70726j13346l07435j47166L4427j46017m45895l59178
$$ y = [-324379, -486842, -376053, -326174, -508422, -680443, -604822, -399932, -243982, -62028, 173372, 162142, -249737, -560772, -130335, 883236, 1649191, 1745390, 1567814, 1541980, 1490810, 1108665, 620398, 492820, 700325, 748127, 402428, 2671, -53782, 165945, 318197, 299966, 311400, 447187, 507902, 333917, 107988, 96634, 218426, 173545, -23726, -399, 387013, 787902, 915318, 1028207, 1477036, 2012988, 2054152, 1573286, 1194350, 1300407, 1522435, 1358327, 911098, 651600, 689420, 692467, 470451, 277416, 456227, 1012048, 1642950, 2065300, 2236889, 2344681, 2612828, 3049477, 3377165, 3321542, 2982955, 2768117, 2880412, 3051138, 2937792, 2630357, 2483191, 2517618, 2371601, 1925706, 1566528]
37551A566528m76J0173l92408m80088J25992P43771O21145Q6250m5815J77323
37541B412395J6544n83527q02546k86425K55190J77144j70158j62293R0580Q2727
37531A029631j91100l13914j49308P7730K12658K38722R9322j53782k33905l897
37521F12157K37462K03134P8884J48443K55374R9498j90410k73723j65636q9868
37511I15315K0728L43379O65849O15320K45442j19640m35376p62949p81462j96637
37501E09969N02239N06540q9744l61113M1481M02242J32885l54443m12409j32062
37491G45585o590r9966j04100O7394K09940J87395M4322j05061j26197J7485J26319
37480I56526R923j29940M2983L66288L42974R13p0053K67777L78400q7538n31746
$$ y = [1566528, 1566052, 1576225, 1183817, 703729, 829721, 1573492, 2194637, 2280887, 2235072, 2412395, 2428939, 1845412, 1042866, 756441, 1011631, 1188775, 1018617, 856324, 946904, 1029631, 838531, 524617, 375309, 453039, 665697, 904419, 1003741, 849959, 616054, 612157, 849619, 1052753, 1131637, 1280080, 1535454, 1634952, 1444542, 1170819, 1005183, 915315, 936043, 1279422, 1945271, 2560591, 2806033, 2686393, 2251017, 1488068, 706606, 509969, 1012208, 1518748, 1429004, 1067891, 1109372, 1511614, 1644499, 1290056, 877647, 745585, 738995, 639029, 534929, 602323, 812263, 999658, 1043980, 938919, 812722, 830207, 956526, 966449, 836509, 879492, 1245780, 1588754, 1589667, 1519614, 1787391, 2165791, 2078253, 1546507]
37469A546507l50385J02536J73723P682J83917O03229O00291N9643l70944k46685
37459B309514J39468L21777K35394N4525j21401k23476j57589K8631J21276P739
37449B715858j64076j68727L6852K62871K66001K1595j85212o3819K85397M66926
37439C473666L04338L3367n3570R2175L55406N56786M70579P8464k10832k257
37429E098122M56874N89271L89108L73211O25134O75530M62945N25007R57062
37420A0152264J115051P66946N92433J017662J509643J628819J789145K289508
37412B0861471K648781K692702L170006M393283N527768O280722P845357J0843946
37404F4264036J3989810J6528483K0201860K6603238L4725331M4074577N7161965
$$ y = [1546507, 1196122, 1298658, 1472381, 1480063, 1663980, 2267209, 2867500, 2927143, 2556199, 2309514, 2448982, 2770759, 3006153, 3060678, 2939277, 2715801, 2558212, 2586843, 2708119, 2715858, 2551782, 2383055, 2419907, 2682778, 2948779, 2970374, 2785162, 2721343, 3006740, 3473666, 3778004, 3811371, 3757801, 3849976, 4205382, 4762168, 5232747, 5311211, 5100379, 5098122, 5554996, 6144267, 6533375, 6906586, 7531720, 8207250, 8670195, 9195202, 10152264, 11267315, 12034261, 12626694, 13644356, 15153999, 16782818, 18571963, 20861471, 23510252, 26202954, 29372960, 33766243, 39294011, 45574733, 53420090, 64264036, 78253846, 94782329, 114984189, 141587427, 176312758, 220387335, 277549300]
37397B77549300P2962614P9164952N9555223J3396931l7882607o8823966p2424584
37390C23497863o0995283m8610655l9311036l1206135k4055145j9138351j5892536
37383H4288722j2708326r598975p625177o714800n897786m915318m135999l509426
37375B9182915k784404k215566k077343j991130j562383j153800j244216j526388
37367A4627685j408702r79550p47875p86167p94707p10424o55196n52593l27120
37358G665351k17401m01994n78872l84316K1509K27369J77683P7299n7926l01869
37348F226833m74730l53215r0526k5594j74846k63206j70976l9227m342q3435
37338D546736k40464l58172k59601N1707L08539L09041J63595M7962p6729k82620
$$ y = [277549300, 350511914, 429676866, 489232089, 502629020, 464746413, 395922447, 323497863, 262502580, 213891925, 174580889, 143374754, 119319609, 100181258, 84288722, 71580396, 61981421, 54356244, 47641444, 41743658, 36828340, 32692341, 29182915, 26398511, 24182945, 22105602, 20114472, 18552089, 17398289, 16154073, 14627685, 13218983, 12239433, 11491558, 10705391, 9910684, 9200260, 8545064, 7992471, 7665351, 7447950, 7045956, 6467084, 6082768, 6104277, 6331646, 6509329, 6586628, 6528702, 6226833, 5752103, 5398888, 5308362, 5282768, 5107922, 4844716, 4673740, 4634513, 4630171, 4546736, 4306272, 3948100, 3688499, 3740206, 4048745, 4357786, 4521381, 4569343, 4492614, 4209994]
37328D209994m21384l16688p1767N7154n88j05357j23251j6499J75888L32457
37318C719959L45488K91308L31973M05945K76787l1521j71312M565J96800J66046
37308E536038J48315M42326Q58518R77964Q06438P75132J127753J634953J950182
37299A4257619K009815K021274K210881K655527L306023M114148N043574N863563
37291D1482424O037072N048469K873913M59k918903n218896o266934n890855m788231
37282C0358518l990087l771666l542253k903922k212494j834817j509750r41939
37274I651590m91968o29220j047359j018082m67269m6681j48914m31675m33913
37265D936509k06108j27438l71333p32558q71073o53406k85562o6674j6546P8284
$$ y = [4209994, 3788610, 3471922, 3400155, 3457309, 3456721, 3351364, 3228113, 3211614, 3387502, 3719959, 4065447, 4356755, 4688728, 5094673, 5371460, 5339939, 5168627, 5173192, 5369992, 5536038, 5684353, 6126679, 6985197, 7963161, 8769599, 9544731, 10672484, 12307437, 14257619, 16267434, 18288708, 20499589, 23155116, 26461139, 30575287, 35618861, 41482424, 47519496, 52567965, 55441878, 55442337, 52523434, 47304538, 41037604, 35146749, 30358518, 26368431, 22596765, 19054512, 16150590, 13938096, 12103279, 10593529, 9651590, 9159622, 8530402, 7483043, 6464961, 5997692, 5951011, 5802097, 5370422, 4936509, 4730401, 4602963, 4231630, 3499072, 2627999, 1974593, 1689031, 1622357, 1605811, 1684095]
37255A684095K33358J88735j13450l24273j91843N7655J24084R7846J83871K61903
37245B201981J16986j32179k35357k35785l04492l50012j91021O5157K05433K79619
37235A420330L96937L84328R4875j67646m1124K63935K72975L7869J8432K44333
37225B925244K28714k21179o76669p13558m10688q7444P6043M5445j15862k21270
37215H28776j43188j1632M753q862O7320Q0072r7970j97280L2383K67569O2786
37204H84727l40018l37578K7203J43947j05492j66271K07639N53104M68651J10261
37194A446173k58087n53684n70307q9885N23664N70598N6875k67961j18756n5501
37184F83129l55641m63316n6315K75699P4515j38204J55805M38231M5315n63255
$$ y = [1684095, 1917453, 2106188, 1992738, 1668465, 1476622, 1534277, 1658361, 1756207, 1940078, 2201981, 2318967, 2186788, 1951431, 1715646, 1411154, 1061142, 870121, 935278, 1140711, 1420330, 1817267, 2201595, 2296470, 2128824, 2087700, 2351635, 2624610, 2662479, 2680911, 2925244, 3153958, 2932779, 2256110, 1542552, 1131864, 1044420, 1120463, 1165908, 1050046, 828776, 685588, 673956, 678709, 669847, 737167, 817239, 719269, 521989, 554372, 821941, 884727, 544709, 207131, 234334, 378281, 272789, 106518, 314157, 867261, 1335912, 1446173, 1188086, 634402, 64095, -25790, 497874, 1068472, 1125347, 857386, 738630, 683129, 327488, -135828, -192143, 83556, 158071, 19867, 175672, 613903, 659218, 95963]
37174I5963m84048J36814L77783L8662k12910r3746o3512l36268m58857j31629
37164a131748K80683L64003K29126J79905K19346J52294p6264l16643l53750j08269
37154e61317J87242J69427j29213k07917J76583N50928L96036n1932j86861N0508
37144C93484K23869J73761J21062J11632k9045k26782k12398l0103K8811l6346
37134E17945J4304J28025L2503j92954k02423l8805r7724l77833l75790J21528
37124d71224O69533P65877L91700j52712n45109n22012q8205L19872K91873L1955
37114F91548L6349K81566L06517L6699j32786q2197j04184k34732j57410J07905
37104G49275J35203j34046k62283j29207j22339l12048k44563J53224K93460o1476
$$ y = [95963, -388085, -251271, 126512, 165174, -47736, -141482, -204994, -541262, -1000119, -1131748, -851065, -487062, -257936, -78031, 141315, 293609, 217345, -99298, -453048, -561317, -374075, -204648, -333861, -541778, -365195, 185733, 581769, 529837, 342976, 393484, 617353, 791114, 912176, 1023808, 994763, 767981, 555583, 525480, 554291, 517945, 532249, 660274, 692777, 499823, 297400, 258595, 160871, -216962, -592752, -471224, 198309, 964186, 1355886, 1203174, 658065, 136053, 47848, 367720, 659593, 691548, 727897, 1009463, 1315980, 1352679, 1219893, 1137696, 1033512, 798780, 641370, 749275, 884478, 750432, 488149, 358942, 236603, -75445, -320008, -166784, 126676, 65200]
37094F5200l22013p3471K28615J02446j61492j32438K5103N1089J41369L76340
37084C00748L11320j75179l69033J43498N81269J69452m68768k66133N02747O73929
37074A403850Q1355l45445k20519r8343j96660l9635L95328M11037j46560m80526
37064G63882j72439J21752j24974l91803j12282K55303K0292n11676n19254J9071
37054f52128L65713J90367p8335l1256K21314L81013L23907P2956k43197l77134
37044A73220j87729J23926K32043R7546n2255r0960j08703j85905k48239j65444
37034d12500R5917L84651M11064L1170m62245n50625j14501L76603M64575K54772
37024D78881J31881J50126N3769k00222l22680j50798P4040M0672j96731l00899
$$ y = [65200, -256813, -330284, -101669, 777, -160715, -293153, -268050, -216961, -75592, 300748, 612068, 436889, 67856, 211354, 792623, 962075, 493307, 227174, 729921, 1403850, 1485205, 1139760, 919241, 820898, 624238, 584603, 979931, 1390968, 1244408, 763882, 591443, 713195, 588221, 196418, 84136, 339439, 359731, -151945, -671199, -652128, -286415, -96048, -174383, -205639, 15675, 396688, 720595, 793551, 550354, 173220, -14509, 109417, 341460, 439006, 386751, 295791, 187088, 1183, -247056, -412500, -316583, 68068, 479132, 510302, 48057, -502568, -617069, -240466, 224109, 478881, 610762, 760888, 814657, 614435, 291755, 140957, 214997, 255669, 58938, -241961]
37014b41961j07743J72476K51523J23814o42l9591r5387j64502p8149J38408J54816
37003A13062j55589l76425r8196M04855N20128J95264m4945M5342J44745L0209
36993G78450o5466N583l6569l50893n59317l18208N9965M1154l18954m84174k28912
36982a477341J28115K54094J96284J95985L50582N18949M63263J18964k42570
36973E06325k73436j3958J44111L2196q8987m0941l6316k05962k39873Q6395L88671
36962B58225J95513k71445m08684j45861O3513P8354K23176N35206N32193J768
36952A061958n22510m60562J2715K71086J01291j43079j43907L955N3696l5007
36942A99636j27939j56260j65811j63095p0382R8469J52355k5360k26196j54912
$$ y = [-241961, -349704, -177228, 74295, 198109, 197467, 157876, 62489, -102013, -180162, -41754, 113062, -42527, -418952, -517148, -112293, 407835, 603099, 558154, 603496, 748241, 778450, 712984, 718567, 681998, 331105, -228212, -546420, -486455, -445301, -764255, -1248429, -1477341, -1349226, -1095132, -898848, -702863, -352281, 166668, 629931, 748895, 506325, 232889, 218931, 363042, 395238, 306251, 265310, 228994, 23032, -216841, -130446, 258225, 453738, 182293, -226391, -372252, -308739, -230385, -7209, 527997, 1060190, 1061958, 539448, 78886, 91601, 362687, 463978, 320899, 176992, 180947, 234643, 199636, 71697, -84563, -250374, -413469, -483851, -385382, -233027, -258387, -484583, -639495]
36932f39495J07754J83049j3218j11217J18543L73314K93533J4497j00044j7528
36922B09188M6029M9125O3650j7421k75581m27381j58175L13306M83243L00021
36912E86004J61661K27468K56281J34755L4682j1634j71940l67551k88101L1290
36902E92915J62230m9716k77644l06049k85200k41796M7824M59185M48115p1395
36892D78469m14551j34827K70263K04097p1279n320K12054Q634m99847o51740
36882f04047l17714k4694j1852O3744L58829M87057J84498k20743l02320r8418
36872d85660Q0387R5659J4258o1500l6129J07185J96049N0236j85157j53981J99135
36861a79518M99287M17774M9688k70055l32097j71229J4513L8624m8830J9770
$$ y = [-639495, -531741, -348692, -361910, -473127, -354584, 18730, 312263, 326760, 226716, 209188, 255217, 304342, 367992, 350571, 74990, -352391, -510566, -197260, 285983, 586004, 747665, 975133, 1231414, 1366169, 1400851, 1389217, 1217277, 849726, 561625, 592915, 755145, 705429, 427785, 121736, -163464, -405260, -357436, 101749, 549864, 478469, 63918, -70909, 199354, 403451, 332172, 326852, 538906, 547540, 47693, -604047, -921761, -946455, -958307, -894563, -535734, -48677, 135821, -84922, -387242, -485660, -405273, -309614, -295356, -356856, -392985, -285800, -89751, -39515, -224672, -378653, -179518, 319769, 737543, 787231, 517176, 185079, 13850, 28363, 66987, 18157, 37927]
36851C7927L20275N03724K48132k14484l84416j87626K0031L8482l6049j66868
36841A79128l64155l81694n090L85368K07236l28230l78954K05224N67910K00960
36831B87703k48725q1885L43428L45506Q0168P9117J60533j88742o84564n71982
36821d79443N9957L57489J11376J3127L20327L57067k18788o46082k33999M75150
36811A16181N23535k8624l44643j58542q981k08641l72493j22519L25179N16099
36801B36551L26555j6579k27471j43205J74175M21815L15901p2044l84220l91346
36791B40132j80007N2458J87860J70427J5519j26482j00734K4568L8509q8277
36781B33973j64522r8184k6946m6827l5318J14540K61837J89735r6261l76696
$$ y = [37927, 358202, 861926, 1110058, 895574, 511158, 323532, 343563, 382045, 345996, 179128, -185027, -566721, -571811, -186443, 20793, -307437, -686391, -481167, 86743, 287703, 38978, -42907, 300521, 646027, 726195, 805312, 965845, 777103, 92539, -479443, -419486, -61997, 49379, 62506, 382833, 739900, 521112, -124970, -358969, 116181, 639716, 611092, 266449, 107907, 98926, -109715, -482208, -604727, -279548, 236551, 563106, 546527, 319056, 175851, 350026, 771841, 1087742, 1015698, 631478, 240132, 60125, 112583, 300443, 470870, 486389, 359907, 259173, 283741, 322250, 233973, 69451, -28733, -55679, -102506, -137824, -23284, 238553, 428288, 332027, -44669]
36771d4669m39763k01271K69420P10651P77231L75632j58026l86118k64812j56328
36761D81947l26960n87513n35130p9491M05937M99816K12832o8805j00880m7237
36751a45484j19325j67237P5258M39369M17645j07448o12810o16494k78020l0776
36741a145322Q7569L30631O55791P17544M25178P7269j20056k83327m87915n32244
36731b74882k57725J55544M01169L72983J65135n2113p5471J55435L30742L8213
36721I59030n85231q34019l34912L74989N41215J78255r5857j6336P8398p4304
36711A91228k58970j97179L2781J84726J81924R8263M191l7562J9321J18211J63543
36700E00477J92100L00507L99572K70400r6221m36929n34112l95663j21504J62292
$$ y = [-44669, -484432, -685703, -416283, 294368, 1071599, 1447231, 1289205, 903087, 638275, 481947, 154987, -432526, -967656, -1047147, -641210, -141394, 71438, 2633, -98247, -145484, -264809, -432046, -356788, 82581, 500226, 392778, -220032, -836526, -1114546, -1145322, -1057753, -727122, -71331, 646213, 1071391, 1148660, 1028604, 745277, 257362, -274882, -532607, -377063, 24106, 397089, 562224, 510111, 434640, 590075, 920817, 959030, 373799, -460220, -795132, -420143, 121072, 299327, 203470, 187134, 265532, 191228, -67742, -264921, -232140, -47414, 134510, 232773, 236964, 199402, 218723, 336934, 500477, 692577, 993084, 1392656, 1663056, 1566835, 1129906, 595794, 200131, 78627, 240919]
36690B40919K53669O6061j30467j3795K39285J53729k28102k86227K02936O12073
36680A110081L76098j57690l15341j04581j3583j21958j20028l5615j93674m82287
36670e8578m02033N3351K85380P9342J4197N14687J092774J037553M24351j08884
36660B932140k90115l59799m63333m54327k90642j62976j54618j26195k7213k4962
36650E77960k01863l52599k35247R2419L04371J49229k62940n22241l38651Q9756
36640f99806K81913R7908q5092L0059J93984N8439j83365q9565K43129K77145
36630A24749n6628j85399J53204M07684Q1426m20491m04332K1466J75100o8239
36620a71460j62250O6977Q3215l59917o21728j23822O41160P41479J47214k91151
$$ y = [240919, 494588, 560649, 430182, 416387, 655672, 809401, 581299, 295072, 498008, 1110081, 1486179, 1328489, 1013148, 908567, 894984, 773026, 652998, 617383, 423709, -58578, -460611, -407260, -121880, -42538, -28341, 486346, 1579120, 2616673, 3041024, 2932140, 2642025, 2282226, 1818893, 1364566, 1073924, 910948, 756330, 630135, 602922, 577960, 376097, 23498, -211749, -119330, 185041, 334270, 71330, -450911, -789562, -699806, -417893, -319985, -405077, -375018, -181034, -122595, -305960, -395525, -152396, 124749, 68121, -117278, 35926, 443610, 525036, 104545, -299787, -278321, -103221, -171460, -333710, -266733, -183518, -543435, -1165163, -1288985, -647825, 93654, 240868, -50283]
36610e0283j14551K16604J80954o7155j17133L3967J18485P3009J2074m0483o9241
36599A76247O8851L59151M08714p9557p25111q06126j90353M70042N63051J86521
36589D31430j51655j96957q7680k5546n0845r3762r8451r1393j53059k77287k92127
36578a087332m8955L21825N09291L95263J61251M583n1426k4687J05323K39470
36568E24606J62861j23108k81223o6832K87670L62339J08114j52573k22660k33868
36558C65326l20281l61342j89579J15093L04070K62260R9365l1801q7350q6156
36548F9605k1454R8282J75505J07871m7288j14335n5291n4575k42827m57277m40144
36537i81928j90843P2651K44590L92316M98974M04559P4795k80256m44810l93317
$$ y = [-50283, -164834, 51770, 232724, 165569, 48436, 82403, 200888, 273897, 285971, 245488, 176247, 245098, 604249, 1012963, 933406, 208295, -597831, -788184, -318142, 244909, 431430, 279775, 82818, -4862, -30408, -81253, -175015, -273466, -364859, -517918, -795205, -1087332, -1136287, -814462, -305171, 90092, 251343, 255926, 204500, 179813, 285136, 524606, 687467, 564359, 283136, 216304, 503974, 866313, 974427, 821854, 599194, 365326, 45045, -316297, -505876, -390783, -86713, 175547, 274912, 243111, 155761, 69605, 48151, 146433, 321938, 429809, 382521, 268186, 212895, 158320, -84507, -541784, -981928, -1172771, -1100120, -855530, -463214, 35760, 440319, 515114, 234858, -209952, -603269]
36527f03269k02805M0285J96542J49242p347o2373j7457o5224j85073r5381K53459
36516e99401M95303L79950J48134R3219Q4384j05752k98821j98142K9207l3768
36506e687l56575m80254k23121J05094K44527K96952L86389M03559K49219K3311
36496F43414j66001l14226l51531j61672J21911J53017j36192l63324k00967J81506
36486e94065L69956K09382j12956l29310k95948p0911J18809J17644O8055K01712
36476c17632M16496L62790M9k80457k12206R241J05141Q0679J6443j37225k94091
36465b50772j32890L83428P17156M05774k50582n88639m49758j76170O0312L51778
36455F9637N60726L62413j29182l49852r7800J46634j2014k56596r0956L37176
$$ y = [-603269, -806074, -765789, -569247, -420005, -427352, -489725, -507182, -572406, -757479, -852860, -599401, -104098, 275852, 423986, 517205, 601589, 495837, 197016, -1126, 28081, -5687, -362262, -842516, -1065637, -960543, -716016, -419064, -32675, 370884, 620103, 643414, 477413, 163187, -188344, -350016, -228105, -75088, -211280, -574604, -775571, -594065, -224109, -14727, -127683, -456993, -752941, -823852, -705043, -587399, -519344, -317632, 98864, 461654, 461703, 181246, -30960, -21719, 83422, 164101, 180544, 43319, -250772, -383662, -234, 716922, 1122696, 872114, 283475, -166283, -342453, -282141, 69637, 630363, 992776, 863594, 513742, 415942, 562576, 550562, 293966, 203010, 540186]
36445E40186M29403Q250m54456m85279j29942K45988L95434L05494Q2781j15818
36435H22041j51471m6621j056j49285l51733l57553j49542L5863O6592J10686
36425a72079L40122N79887M81114K1968l95502m25852j82266l8715j53157l31068
36415b75548l07631m1730K61143L44116J28032k02881l55870k00992J20214L51345
36405a79802L51314J85002L9321L8716J10520Q9353j2308J3643K01736K32365
36395A069860j16713n10007m34080L7497L15020J51398p0454l7401L7682p6623
36385C66179j72535m1943N8771j46524l90805k61862J05525K70952K04705J96090
36375A88553K14975j1616l56699l67776j9290K13551J25412L9045J49940J98591
$$ y = [540186, 969589, 977839, 523383, 38104, -91838, 154150, 549584, 855078, 937859, 822041, 670570, 623949, 622893, 473608, 121875, -235678, -385220, -349357, -282765, -172079, 168043, 747930, 1229044, 1251012, 855510, 429658, 247392, 208677, 55520, -275548, -583179, -624909, -363766, -19650, 108382, -94499, -450369, -651361, -531147, -179802, 171512, 356514, 395835, 434551, 545071, 634424, 622116, 635759, 837495, 1069860, 953147, 443140, 9060, 46557, 361577, 512975, 442521, 405120, 442802, 366179, 193644, 151701, 210472, 63948, -326857, -588719, -483194, -212242, -7537, 188553, 403528, 391912, 35213, -332563, -351853, -138302, -12890, 26155, 176095, 374686]
36365C74686K0298j33016j08584j65938m18938m61415j2174M73001L79519j43588
36355a96149m03220j62996J35542J41508M9557J36699K72861J73291j05953k35520
36345a94380j08123M420j30796l21931j87117K77901O22953N22574J83484k0613
36335F48372q1693k08879l34081k02656J00142J85165j8454j27126Q0421L36976
36325C78187L59268K39434J39343j3802k53161l57462k19908j04890k18351l42859
36315c94201k39577p9808p8930k8538L23817O97896O27787K04867p8701j02826
36305H51786j61904l08267k71757o3719l9298k25927j90776J95594M38139J99042
36295D22913j12393R768L28629K39409k40231m61809j23424K86942K07306k33765
$$ y = [374686, 394984, 261968, 153384, -12554, -431492, -892907, -905081, -432080, -52561, -196149, -599369, -762365, -626823, -485315, -435758, -299059, -26198, 147093, 41140, -194380, -302503, -298083, -428879, -750810, -937927, -660026, -37073, 485501, 668985, 648372, 566679, 357800, 23719, -178937, -78795, 106370, 87916, -39210, 41211, 378187, 737455, 976889, 1116232, 1102430, 849269, 491807, 271899, 167009, -51342, -394201, -633778, -713586, -792516, -821054, -497237, 200659, 828446, 1033313, 954612, 851786, 689882, 381615, 109858, 46139, 6841, -219086, -409862, -214268, 223871, 422913, 310520, 320288, 648917, 888326, 648095, 186286, 62862, 349804, 557110, 323345]
36285C23345m54574k00929K16178L88860K43003k8394k28262k43527n5666J73087
36275A33121J67240j03901k61696J3137M39998M41784q714k95687n6424L00982
36265G69840K75009K8888J5092J71736O7299l12609n16159l52495j23248n2978
36255b9625J297J20304Q3020j89813l47836r4604L06188L42529o6568m81904m77967
36244h34979p1776L53735M28058J13866k77921l99104j83621J70807M47789N25650
36234B72504L58575M3722j60472r5258P4067R7154M69m2015o6520k05534l29891
36223e3199k24172m4209j10872k80651j03377L37444M13051j5243k56075J20251
36213b17052N15958K20586m42236o08743j71754J93452J44001L8133J54208K37800
$$ y = [323345, -131229, -332158, -115980, 272880, 515883, 487489, 259227, 15700, -39966, 133121, 300361, 196460, -65236, -52099, 387899, 829683, 820969, 525282, 468858, 769840, 1044849, 1073737, 1088829, 1260565, 1327864, 1015255, 499096, 146601, 23353, -29625, -28328, 91976, 174996, -14817, -362653, -457257, -151069, 191460, 124892, -357012, -834979, -906755, -553020, -124962, -11096, -289017, -688121, -871742, -700935, -253146, 272504, 631079, 674801, 514329, 419071, 493138, 590292, 590761, 548746, 482226, 276692, -53199, -277371, -321580, -432452, -713103, -816480, -479036, -65985, -81228, -337303, -217052, 298906, 519492, 77256, -531487, -703241, -509789, -365788, -327655, -173447, 64353]
36203F4353L4678k50689k94203r5364J37083K75692K79262J27909r8182k26814
36193d6275j62395O2008L64027N76843M43653o6024n13999m36891k0395Q7417
36183B87969k95055n97214l32753K13650M63965L65103K97638L68489K81055r2988
36173I59859m34776m16088j32949Q5500J18431R4903R5645N0597n3238q0463K2660
36162C10081P5792o8204k18384p9148K35536K56637j55110n08564l21182J96397
36152b76149M34210J96186j63889l28762l08037j32976K68170P23707P67060K34756
36142A414276l70428m53621q2054J76776N0636j84359k33566j72734j69806j45777
36132a70657K3190J68281K8826k62360k43926K22917O68327N98391J42511j86944
$$ y = [64353, 99031, -151658, -445861, -541225, -404142, -128450, 150812, 278721, 180539, -46275, -208670, -146662, 217365, 794208, 1237861, 1171837, 657838, 220947, 200552, 287969, -7086, -604300, -937053, -723403, -259438, 105665, 403303, 771792, 1052847, 959859, 525083, 108995, -23954, 61546, 179977, 274880, 370525, 421122, 367884, 287421, 310081, 385873, 317669, 99285, 20137, 255673, 512310, 357200, -151364, -472546, -276149, 158061, 354247, 190358, -138404, -446441, -579417, -311247, 412460, 1179520, 1414276, 1043848, 590227, 508173, 684949, 735585, 551226, 317660, 144926, -24880, -170657, -147467, 20814, 49640, -212720, -456646, -233729, 434598, 1032989, 1175500, 988556]
36122I88556k31985k81784m47878m19536k6228L66964L48341M6958j38173j62118
36112D3117k52545l57583j83747K17301L94529J56178j35186j14110R4434J61551
36102B3939M3477p0777q1077j786J56192L02596K30157j08556m23798m14431j50937
36091d95001Q1973J86498K38320J99075k6386k79849k42620Q7811L08460J37721
36081A96002k02873l15788j56629k869Q357L2741J72953K39334L8492k51295k61879
36070e03454J9650J79441k3420k63233j31713J83310J26753l39457n61695j03158
36060a416976N75285P03881K24894k04505j39412J59596K28243J9416j75912j86520
36050b12010r6336k6686N402K3404L2438N2881J27219K54321L52370L15185J06607
$$ y = [988556, 756571, 474787, 26909, -392627, -418855, -51891, 296450, 343408, 205235, 43117, -209428, -567011, -750758, -533457, -138928, 17250, -117936, -232046, -137612, 23939, 67416, -3361, -84438, -86224, 69968, 372564, 602721, 494165, 70367, -344064, -495001, -413028, -226530, 11790, 210865, 184479, -95370, -337990, -250179, 58281, 196002, -6871, -322659, -479288, -482157, -473800, -441059, -268106, -28772, 9720, -241575, -503454, -483804, -304363, -327783, -591016, -722729, -539419, -412666, -752123, -1313818, -1416976, -841691, -137810, 87084, -117421, -256833, -97237, 131006, 150422, -25490, -212010, -308346, -335032, -329630, -306226, -273788, -220907, -93688, 160633, 513003, 828188, 934795]
36039I34795j92220m18885m33124k29720K5496J03357p5997l18135l15275N032
36029i14676L58598M30299K56216J23584J26701N6190k05623m23066l15846M1304
36019d66319L32873L93546K72300K3980k89719m53564k71974P7331J63974j23508
36009c41080m01025l23414l5410J06634L3926o1727p2031q312J65647M21004M84609
35998c1179J40555l15717l31278J23556M41763K26526j45123j07963K66565M35654
35988G03359J77257k13840m30911m35077k49819J02648L92444K98298j29721m40205
35978b25567l46414k7223K46657M33020M97273K68794j89727m20546j59040J92738
35968B69965J10623k51894l08338L4526K48911K5007k83285k37758O9570K44419
$$ y = [934795, 742575, 323690, -109434, -339154, -313658, -210301, -286298, -604433, -919708, -914676, -556078, -125779, 130437, 254021, 380722, 436912, 231289, -191777, -507623, -466319, -133446, 260100, 532400, 556380, 266661, -186903, -458877, -381546, -217572, -341080, -742105, -1065519, -1100929, -994295, -960369, -1022096, -1094127, -1102439, -936792, -515788, -31179, 109376, -206341, -537619, -414063, 27700, 254226, 109103, 1140, 267705, 703359, 880616, 666776, 235865, -199212, -449031, -346383, 46061, 344359, 214638, -225567, -571981, -599204, -352547, 80473, 577746, 846540, 656813, 236267, 77227, 269965, 380588, 128694, -179644, -145118, 103793, 128800, -154485, -392243, -322673, -78254]
35958g8254J54460p654o5877k9645J1983K891n8356j34240j87440j92014q4463
35947f68609J95398N20176N77622K49158j41890k12720m8385m2589k80066m35254
35937b87159k94432k2361J58777K36016K64645K42763J99444J60381K2873k51135
35927D29812l86805j45199J46064m3391n32797n40988J11764O11084L05243l98962
35917d44175p53357o61894l96691P6602P57574J081266N94177j37556j80981L70029
35907C04994N59569P8639l46597k20513Q51j84766m99263m72730k42685j96561
35897a219062k56735r4254K28952L59535K33187J08343J10282J16403N4446P294
35887c51609K0643K8001k4087j08000j45044l8481K22440M37576L43845k0862
$$ y = [-78254, 76206, 68552, 2675, -26970, -14987, -12096, -70452, -204692, -392132, -584146, -668609, -473211, 46965, 624587, 873745, 731855, 519135, 470750, 428161, 148095, -287159, -581591, -603952, -445175, -209159, 55486, 298249, 497693, 658074, 680947, 429812, 43007, -102192, 43872, 481, -532316, -1073304, -961540, -350456, -45213, -444175, -1197532, -1859426, -2256117, -2179515, -1421941, -340675, 253502, 115946, -65035, 304994, 864563, 943202, 596605, 376092, 376943, 192177, -307086, -779816, -1022501, -1219062, -1475797, -1570051, -1341099, -981564, -748377, -640034, -529752, -413349, -358903, -351609, -330966, -302965, -327052, -435052, -580096, -618577, -396137, 41439, 385284, 364422]
35877C64422k92841k42097n1564J2976j4274L4763J13708O7961l0561L6377K48711
35866B47581L32133J73834Q234O7583K21500J45895k05298m81771l58859M0169
35856A91001K86228J70258q9716j96028j22955j7137M8169M8925o5093k01902
35846E1750q4176L30730N77674K28193m07398n84669j14397M27232N28750K88252
35836A241941l807l07685n88606n79865j72931K58671K89213j8911l03721m12397
35826e98098m14907l13491p4535J81938L17571L85234M53034L75192L6455l00151
35816D8242k29325K33510O01296M58672j15933o67126p74338l85657J51068M23737
35806b55854L50756J47765m3031k29958k92561l1801L68348L73135j39803n63682
$$ y = [364422, 71581, -170516, -222080, -209104, -223378, -188615, -74907, -6946, -37507, -1130, 247581, 579714, 753548, 761782, 829365, 1050865, 1196760, 991462, 509691, 150832, 191001, 477229, 647487, 557771, 361743, 238788, 221651, 269820, 318745, 253652, 51750, -32426, 298304, 875978, 1104171, 696773, 112104, -2293, 424939, 953689, 1241941, 1238134, 930449, 341843, -238022, -410953, -152282, 136931, 118020, -185701, -598098, -1013005, -1326496, -1401031, -1219093, -901522, -516288, -63254, 311938, 348393, 48242, -181083, 52427, 653723, 1112395, 996462, 329336, -445002, -830659, -679591, -255854, 94902, 242667, 199636, -30322, -322883, -354684, 13664, 386799, 246996, -316686]
35796c16686l70181J42878L48852K00776J16614K05473J88610l4301k87230n07180
35786c12375p08148o33962k9369P34975R05319L34072l01763m27132k10952p4177
35776g23512m0100J02505L34316M43685L43260J20269q6652j35771K3711K27281
35766F08992K48848J06037r051q0632k42133m09602l29072m3162R7816j1342q5957
35755a49258J5134O5115l9446m0728J61741K23418o5242l39295k13863R7036J74512
35744a10876P4625R8721J62109j9042k81673j85686K08449L47920N8439j69132
35734A83854L2412L36031K63548p6876k01376L981J59197j2632l03944l53289
35724C0906j42907K7189q572p0667M5319K09997J28875j87218l71783j82785J86621
$$ y = [-316686, -686867, -543989, -195137, 5639, 122253, 327726, 516336, 482035, 194805, -312375, -1020523, -1654485, -1683854, -948879, -43560, 290512, -11251, -438383, -649335, -723512, -763612, -661107, -326791, 116894, 460154, 580423, 493771, 358000, 381711, 608992, 857840, 963877, 954826, 874194, 632061, 222459, -106613, -149775, -51959, -63301, -149258, -134124, -69009, -108455, -149183, 12558, 235976, 170734, -168561, -382424, -285388, -110876, -36251, 62470, 224579, 205537, -76136, -261822, -53373, 294547, 352986, 183854, 216266, 552297, 815845, 738969, 537593, 541574, 700771, 688139, 384195, 30906, -112001, -84812, -93384, -164051, -118732, 91265, 220140, 32922, -338861, -521646, -335025]
35713c35025L92904L46898J83785j103j89912l23425l38021k71182j92759r0205
35703h18045O7242K29146L29591L58292K85565O0621k11134k70975m7744J71413
35693A53972R6918j87525l92988m07690k97975r0808J88453L81207L48083J65064
35683d3289k7436k19259l68262k72112R5047L43276J47476k20519k68688k0599
35673h54365J20949R9328J98556L72555K50053j18508k05657J07188K60818n9081
35663A71836l72958j99609J82095K68983J24457O4423J11k56639l96186m6815
35653d60302M32739L56824k07994n20887k94427J6872J11361K25659M22516K82549
35643C64910l04310p11693m38350J31241L42492J94351R9848J17654L6557o2609
$$ y = [-335025, 57879, 404777, 588562, 587459, 397547, 74122, -263899, -535081, -727840, -818045, -750803, -521657, -192066, 166226, 451791, 512412, 301278, 30303, -17441, 153972, 250890, 63365, -329623, -737313, -1035288, -1126096, -937643, -556436, -208353, -43289, -70725, -289984, -658246, -930358, -835311, -492035, -344559, -565078, -833766, -854365, -733416, -634088, -435532, -62977, 187076, 68568, -137089, -29901, 230917, 171836, -201122, -400731, -218636, 50347, 174804, 239227, 239338, -17301, -413487, -460302, -27563, 329261, 121267, -399620, -694047, -677175, -565814, -340155, 82361, 364910, 60600, -651093, -1089443, -958202, -615710, -421359, -321511, -203857, -167300, -229909]
35633b29909K8531J11608j39571m81548l58173J59335L78350L9692k99091j60726
35623i51502J89747L15445K92572L83655M58666K53345p4447j40070Q4377L03653
35613A115441L67801L09012O7894l74567p03587n88046k50264k26895n33628n84711
35603a401550q5156M92339N85931K91078Q3939J02378J05146j5786q6852l828
35593F7639R0880O1576j287P0203K57832L51883J99913j06851l46501m34783m67314
35582b56810m75743l35215m8192R9849o1544k16755K2356M43869M72247Q6430
35572b69508o9435L23860P22941N26699n4065l87142l13453j42656k3973J32722
35562D45990K59940J81659n071n1371M761m9230j42704m9063J13103L7342j54971
$$ y = [-229909, -201378, -89770, -229341, -710889, -1069062, -909727, -531377, -491685, -790776, -951502, -761755, -446310, -153738, 229917, 688583, 941928, 867481, 727411, 811788, 1115441, 1483242, 1792254, 1860148, 1485581, 781994, 193948, -56316, -283211, -816839, -1401550, -1486706, -994367, -408436, -117358, -33419, 68959, 174105, 158319, 71467, 67639, 158519, 220095, 218808, 289011, 546843, 898726, 1098639, 991788, 645287, 210504, -256810, -732553, -1067768, -1115960, -1016111, -1077655, -1294410, -1272054, -828185, -355938, -269508, -338943, -15083, 707858, 1234557, 1180492, 793350, 479897, 337241, 313268, 445990, 705930, 887589, 882518, 831147, 835908, 786678, 643974, 594911, 708014, 745356, 590385]
35551E90385m8127K89750L10084q9886l09436L640L66039K26891k16172m47336
35541F75832m21096l79358k54198J33936N16276M34851l0189l38199k61343r0128
35531a3616p0808j10327r6573r0126j03338l4590J03577J90217K41696L27646
35521C43758K74951j22747n85749n41560K6426M28006K13406j98524j96050J28331
35511b29752K31789O771j24975O7100K95617K40386O742p3685Q6802K25850O6789
35500G99434l02207m50932j10828L89567M34125p6628n34473m16373M3804K73226
35490D8715J70143Q2368J58966K02158J12054K0363l9843j78019l22072k68412
35480a3579j04800j31486k80731j30021L35597N29722J39842l26408k90669O1623
$$ y = [590385, 542258, 832008, 1142092, 1052206, 742770, 746410, 1112449, 1339340, 1123168, 675832, 254736, -124622, -378820, -244884, 271392, 706243, 676054, 337855, 76512, -13616, -84424, -194751, -291324, -381450, -484788, -519378, -415801, -225584, 16112, 343758, 618709, 495962, -89787, -631347, -604921, -176915, 36491, -162033, -358083, -229752, 2037, 8808, -116167, -49067, 246550, 486936, 493678, 419993, 506795, 732645, 799434, 497227, 46295, -64533, 325034, 759159, 682531, 148058, -268315, -224511, 48715, 218858, 301226, 460192, 662350, 774404, 794767, 754924, 576905, 254833, -13579, -118379, -249865, -530596, -660617, -325020, 204702, 344544, 18136, -272533, -210910]
35470b10910K04467J29574J73642K83149J35042j59760j63643J11118J98259p860
35460F93078r2815J00090J89599k1483j70633o642J30776q8401l86172l38026
35450I371m3651J26249J20345Q5894k4496k35915k39448J53369M95320K55785
35440G02823k86506l74244P2305L39398L5245l76557l87526j66786j18809k09635
35430g70292j53551O5160K54714L66457M40723L90575J47703j27762k50825k78715
35420H4187l32024l14886q5634K29976L75724L12467J68703m2365l54974n76148
35410e34974m23028L4584L63439K89172J0822j01331N0785K52205K58495L7100
35400B37269k10086k45630p8086J2318j42811k80611k2229N06932P09453L09445
$$ y = [-210910, -6443, 123131, 296773, 579922, 714964, 555204, 391561, 502679, 700938, 693078, 600263, 700353, 889952, 868469, 697836, 691194, 821970, 733569, 347397, 9371, -34280, 91969, 212314, 298208, 273712, 37797, -201651, -48282, 447038, 702823, 416317, 42073, 114378, 453776, 489021, 112464, -275062, -441848, -560657, -770292, -923843, -858683, -603969, -237512, 203211, 593786, 741489, 613727, 362902, 84187, -247837, -562723, -648357, -418381, -42657, 269810, 438513, 396148, 41174, -534974, -958002, -923418, -559979, -270807, -259985, -361316, -310531, -58326, 200169, 237269, 27183, -218447, -296533, -284215, -427026, -707637, -729866, -222934, 486519, 795964]
35390G95964k07553k37097J00300J74643j83971m32409j63954K59055K68259m7998
35380C25239j32317J36940K77155k937l58194l86140k17200j81177k16976m6282
35370h01889K67419L91304K69556J64283J65716P8801j53000l06685k70889k23984
35360d19368k80309k79584r6605J23971K19922K42070K61475K02741N4140j3490
35350A4963N2748K3219k33485m45452l05313M8956K33785J59588N8039O7576R7520
35339b27856N9043l0348j36178j84416l0905L11024N17718L21033n4310j54479
35329C90326L9698R4392j83819m35337l02850L8289J77576P0611K1304J59852
35319G0042K61743J33013q0455j18961O772O4011n542L3467L34640O53271N95445
$$ y = [795964, 588411, 351314, 451614, 626257, 442286, 9877, -154077, 104978, 373237, 325239, 192922, 329862, 607017, 604080, 245886, -140254, -357454, -538631, -755607, -801889, -534470, -143166, 126390, 290673, 456389, 535190, 382190, 75505, -195384, -419368, -699677, -979261, -1075866, -951895, -731973, -489903, -228428, -25687, 28453, 14963, 67711, 90930, -142555, -588007, -893320, -844364, -610579, -450991, -392952, -325376, -227856, -168813, -199161, -335339, -519755, -550660, -239636, 278082, 599115, 544805, 390326, 430024, 524416, 340597, -94740, -397590, -359301, -181725, -111114, -89810, 70042, 331785, 464798, 384343, 265382, 272154, 336165, 330623, 364090, 698730, 1352001, 1947446]
35308A947446J02405m96566q50480q12505l95959J97069N36029L18991j59931
35299C86499k65643J32226M56775K57524j71740l13352j68560o0094j3124J55006
35289C95517L19328J54573k96553o19355n89927l68156j50044K4847J48730K42616
35279g38424M06205N76825M13507j92344p04603n55969m156K24591J9670q8042
35269f42740O7066P1143j65011j47461K62015M72453J64341j05603J36943M22736
35259E35882J37996l93142m33132l1992J34490j13842l10821k00982k802J43598
35249e34747L04874L41411L7198l27826k09325L02063M79533L4630m46506m03516
35239d22211n0548J20737P9992Q2753J35496O6378j04040k08351j81555l8154
$$ y = [1947446, 2049851, 1553285, 702805, -109700, -505659, -308590, 227439, 546430, 386499, 120856, 253082, 709857, 967381, 795641, 482289, 313729, 253635, 240511, 395517, 714845, 869418, 572865, -46490, -636417, -1004573, -1154617, -1129770, -981040, -738424, -332219, 244606, 658113, 465769, -238834, -794803, -798959, -574368, -554698, -642740, -575674, -504531, -669542, -817003, -554988, -82535, 81806, -23797, 113146, 535882, 673878, 280736, -152396, -184388, -49898, -163740, -474561, -675543, -678345, -534747, -229873, 111538, 148736, -179090, -388415, -86352, 393181, 427811, -18695, -422211, -472759, -352022, -272030, -189277, -53781, 12597, -91443, -299794, -481349, -519503]
35229e19503J94215L49730K14984p9858j12310J71107K71581o0050l14730k2721
35219I2445L71741J34141n28326o84705r5391M35558L07837p2988j21590R472
35209a51806q9060k37847k7464L11075J78771l52363n36595q4528L97153L49202
35199b43462M6681N0616L30591M25136K06206j2684k8000J7188n1553k00262k90054
35188B50403k20026k82J65047R100l73948m51562O0030O35316N50990n2022l17687
35177B55359O3756M04572R9705m56129n16711r7646J73423P6772J2715K09061
35167B24877L21651K6322m20778n17010j88110J44839J04796k24828m39990k79665
35157a247896J05384L57712L39613K44187K58917K85760J33262j41782k94820
$$ y = [-519503, -325288, 24442, 239426, 159568, 47258, 218365, 489946, 429896, 115166, 92445, 464186, 598327, 70001, -614704, -710095, -274537, 33300, -39688, -161278, -151806, -240866, -478713, -506177, -195102, -16331, -368694, -905289, -989817, -592664, -243462, -196781, -146165, 184426, 609562, 815768, 803084, 775084, 792272, 740719, 540457, 250403, 30377, 30095, 195142, 204242, -169706, -621268, -561238, 74078, 625068, 573046, 255359, 319115, 723687, 823392, 367263, -149448, -247094, -73671, 3101, 15816, 224877, 546528, 572850, 152072, -364938, -553048, -408209, -303413, -528241, -968231, -1247896, -1142512, -784800, -445187, -201000, 57917, 343677, 476939, 335157, 40337]
35148D0337k49844j78088j95491j83029j0703K02511K17145K8585p4831J03014
35138c00394L37687K39982j59469l48229k0912M21633L89888l9088k34442L9533
35128C26189L02840J45978j58120j49095J05088J98055K9781j57433k26721k47445
35118A69117k51863k15312j77006j08278J63740N86382O68513Q2427o88278q24398
35108e94956k34783L77558N08630L57800K50357J33583r8796k54773j58963P489
35098B93146L657q3135m5845M8597j4639j95032k09902N9088L70291L82636M1108
35087F49970l38577m08224k09119j12033k53214k74767J14683N56294M48401j71950
35077A464o41018n55695j56876K15236N01917O18805L39749k20616m96206j96947
$$ y = [40337, -209507, -387595, -583086, -766115, -776818, -574307, -357162, -328577, -403408, -300394, 37293, 277275, 117806, -230423, -251335, 170298, 560186, 521098, 286656, 326189, 629029, 775007, 616887, 467792, 572880, 770935, 800716, 643283, 416562, 169117, -82746, -298058, -475064, -583342, -419602, 166780, 835293, 917720, 229442, -594956, -829739, -452181, 56449, 414249, 664606, 798189, 699393, 444620, 285657, 293146, 296803, 213668, 167823, 216420, 201781, 6749, -203153, -144065, 226226, 608862, 649970, 311393, -96831, -305950, -417983, -671197, -945964, -831281, -274987, 173414, 1464, -639554, -1195249, -1352125, -1136889, -634972, -16167, 323582, 102966, -393240, -590187]
35067e90187K51299L35950J30998l4319j73485m27166n75538l16851J58093L90933
35057h50273L34613L18353M18149L58333M2201k68876l68555l27983k44931j01890
35047f90859N6824R9970L7859L6095J52560K72823L18214L01638J90788m0347
35037G35565k31315j70569O5168J61615L824j76735j61290l2296M323o9129p3002
35026E6159J09571L23103K44556k08964o30054n27720j4378K77236J11128J2250
35016b47113L64666O44799J82157o55710q44497j78722M56061L90627l4195k35582
35006a57509k07450j55192M4644M64647O81817L18068k81471m79017k35336k7942
34996c4741m4334k5846J39466K23460J25005N5611J22094J20125p5577k40422
$$ y = [-590187, -338888, -2938, 128060, 93741, -79744, -506910, -1082448, -1399299, -1241206, -850273, -515660, -197307, 220842, 579175, 621376, 352500, -16055, -344038, -588969, -690859, -634035, -534065, -496206, -460111, -307551, -34728, 283486, 585124, 775912, 735565, 504250, 333681, 398849, 560464, 564288, 387553, 226263, 193967, 198290, 129161, 56159, 165730, 488833, 733389, 524425, -105629, -633349, -647727, -370491, -259363, -247113, 117553, 762352, 944509, 288799, -555698, -734420, -278359, 112268, 78073, -157509, -364959, -520151, -475507, -10860, 670957, 989025, 707554, 228537, -6799, -34741, -79075, -104921, 34545, 258005, 383010, 438621, 560715, 680840, 605263, 364841]
34986C64841j39143J01575J88726P5378m0338m0069p682m6868j37493k02735k09230
34975i3038j54628l8053R1244J21334J4472q1740p32J67163J55264o4090j84767
34964f7571m5463O2375j42097l95022k54939J34383J97155j49150l26737l3552
34954a020618K58432R4930k07588j05488K81866M16005K14098O8446J23299J27276
34944B50658j7490j03126m8170J543L9297J89492L03505Q6693k97004l22213L7434
34933A20619J59230k35267n57391k69817K29439K52774o5301l6468M19570O61549
34923F78937L80355L3522L0001J08629j15818m49873m09114M4510M61267M88915
34913A251331J79696k20123m96375m95550j98597J59520K35749m3937l60398l55529
$$ y = [364841, 225698, 327273, 515999, 591377, 551039, 510970, 503288, 456420, 318927, 116192, -93038, -247666, -285719, -194475, -73141, -58669, -140409, -141141, 26022, 181286, 117196, -67571, -113034, -50659, -192756, -587778, -842717, -708334, -511179, -660329, -987066, -1020618, -762186, -667256, -874844, -980332, -698466, -282461, -68363, 83, 123382, 250658, 233168, 130042, 81872, 83415, 122712, 312204, 615709, 702402, 405398, 83185, 120619, 279849, 44582, -512809, -782626, -553187, -300413, -365714, -402182, 17388, 678937, 1059292, 1092814, 1122815, 1231444, 1115626, 665753, 256639, 301149, 762416, 1251331, 1431027, 1210904, 714529, 218979, 20382, 179902, 415651, 371714, 11316, -344213]
34903c44213m2706K45597K88513K08668K13246K49479J10762j61689k53716n3728
34893D60213J08540p2569l75767l44001K5231K67362J38268q7730j26882j01201
34883a08536k04083k78725p1022K98009M62505L09325L7167j99265l91444m70669
34873f16738l29175p1070N6454M2450J47080M64675P11404N98798K23679q1736
34863A145821j60449j37581j89019l26502m01474k83626m7326O5735n7489k23139
34853f15049j86234N22R5424N5444N0039J12112Q7165k6019j2151J67946K32282
34842c8519j40l05693l68645j75915P9361K68936L23868J82752n9020j59724o8935
34831c21674j6957r8297q0407J35225K24785l0789k72790p8356L27788M02359
$$ y = [-344213, -386919, -141322, 147191, 355859, 569105, 818584, 929346, 767657, 513941, 460213, 568753, 496184, 120417, -223584, -198353, 69009, 207277, 119547, -7335, -108536, -312619, -591344, -662366, -364357, 98148, 407473, 444640, 245375, -146069, -616738, -945913, -1016983, -960529, -918079, -770999, -306324, 405080, 1003878, 1227557, 1145821, 985372, 847791, 658772, 332270, -69204, -352830, -400156, -334421, -391910, -615049, -801283, -800761, -705337, -649893, -599854, -487742, -400577, -426596, -438747, -270801, -38519, -38659, -344352, -712997, -888912, -809551, -540615, -216747, -33995, -93015, -252739, -321674, -338631, -436928, -517335, -382110, -157325, -188114, -460904, -539260, -211472, 190887]
34821A90887J24510o3605k8894m6848j69024j27623O8427O7235j61107k09458
34811c55500J4302N0535k82584m40236J295N66716N36327J6869k69314n7435K20455
34800A430K05522M1700l5308n5360j02609j07692l3058r252j16411k14697j47010
34789e72745J5501O9202m5538j70165j21734R3706K89865L25527K64582K33001
34779C81202J83409j2081k44339k11060J16721L43128J63578k01300l46417k50123
34769g7282j72962j49345L235K12609J44647k24295m32036j53007L12266M56614
34759g9556K54642R4042J38551J43245o5295k88688l08788k51051l13816l28442
34749a005156K0809N71395P10888J96449m11839m26705J03059N34797M60444L3482
$$ y = [190887, 315397, 251792, 222898, 176050, 7026, -120597, -52170, 15065, -146042, -355500, -341198, -290663, -573247, -1013483, -1012188, -445472, 90855, 107724, -161590, -219025, 1430, 206952, 248652, 213344, 157984, 55375, -52317, -85375, -94627, -211038, -425735, -572745, -557244, -488042, -533580, -703745, -825479, -731773, -441908, -116381, 148201, 381202, 564611, 552530, 308191, 97131, 213852, 556980, 720558, 519258, 172841, -77282, -250244, -399589, -396354, -183745, -39098, -263393, -695429, -848436, -536170, -79556, 175086, 269128, 407679, 550924, 485629, 196941, -111847, -362898, -676714, -1005156, -984347, -412952, 297936, 494385, 82546, -344159, -241100, 293697, 754141, 787623]
34739G87623m02556o07303m30098N8927M13295K21682k75458m34640j44820K6401
34729g86947k01344l22561J01605O43302O26226J55312j15883j7105J9477j87032
34719h4950k63904K3393L27528K47272o4076j41024J10944K63752o8363o54652
34709c04080q06456k05796N81877P31856K37559j15601M9605J59696k73293p10956
34699f55589l80285M31018P31910K89125j53463j09064P4583L7248j6875J14202
34689C62810J85809J8470j30792r1451j18568l06640k34646K94205O79142L21339
34679I79678l88793n74309j26996K38292R4862k08034k39326p4044K5040P2205
34669b01425K19928M11007M34245K29499l6228j80412k04906k48317l42609l02522
$$ y = [787623, 385067, -222236, -652334, -593407, -180112, 41570, -233888, -668528, -813348, -786947, -988291, -1310852, -1209247, -565945, 60281, 215593, 99710, 82605, 102082, -84950, -348854, -325461, 2067, 249339, 185263, 44239, 155183, 418935, 350572, -304080, -1110536, -1316332, -734455, -2599, 234960, 119359, 168964, 328660, 55367, -655589, -1035874, -604856, 127054, 416179, 262716, 153652, 228235, 265483, 248608, 362810, 548619, 567089, 436297, 344846, 226278, -80362, -315008, -20803, 658339, 979678, 590885, 16576, -110420, 127872, 222734, 14700, -224626, -298670, -273630, -201425, 18503, 429510, 863755, 1093254, 1057026, 876614, 671708, 423391, 80782, -221740]
34659b21740J7226M16554N31569L29946J47167J68204K00517Q7895k3813n0494
34649A603031k05523n47976o73502k95400J80996J93323j04017j09771K09076
34640B50237K61220j56542m76063k40519K02604K76617K3732p7313J07768K36027
34630D07768P0925j83315j96560P6329L93114N06201L69663J19906q8108k05963
34620A269960k61682k61599j86063n8003N4874R5780L2893j28506k83768k67297
34610F589o7835Q2120j1584k07662k11524j0126J10852K274j35851o8922J36421
34599c75248K25673R3187j16468j96433r5566L9170L8819n6037k7625J81204L12441
34588B3117J67173j2560J38878M68493M02661k05196p48496o57237j65562R6303
$$ y = [-221740, -204514, 212040, 743609, 1073555, 1220722, 1388926, 1589443, 1677338, 1653525, 1603031, 1397508, 849532, 176030, -119370, 61626, 254949, 150932, 41161, 250237, 511457, 354915, -121148, -361667, -159063, 117554, 141286, 63973, 171741, 407768, 478693, 295378, 98818, 175147, 568261, 1074462, 1444125, 1564031, 1475923, 1269960, 1008278, 746679, 560616, 502613, 557487, 653267, 686160, 557654, 273886, 6589, -61246, 20874, 9290, -198372, -409896, -420022, -309170, -306896, -442747, -511669, -375248, -149575, -56388, -172856, -369289, -464855, -425685, -386866, -442903, -470528, -289324, 23117, 190290, 177730, 316608, 785101, 1187762, 982566, 234070, -423167, -588729, -492426]
34578d92426K6780O2045L30769L70066j15910o68739o34627o7775L62081L00333
34568e27403J00502J72842L47005K05097j89744l31092k2665L11550K34891r2054
34558B08929j88313L9923K12614P5845j48134j48556j0649n1849k77211l11170
34548e98571M5281M51519M49022R6759j25962k3045Q0071p7525k45259r2562K12944
34537A72672K70628R7584L5673J05742l394k81097l11932j0994J24084k05273
34527f307n69367m60916n5079J41547O7695L7415J40008K07598K09162K14686
34517g3558J25060j11307j91268J33246M99230L47880k10755n43961m43526k74992
34507g43951j78097J46745O87150Q76492M32264j67501m15985m34107m85862l90324
$$ y = [-492426, -465646, -403601, -72832, 297234, 181324, -487415, -1122042, -1189817, -827736, -527403, -426901, -254059, 92946, 298043, 108299, -222793, -245458, 66092, 300983, 208929, 20616, 60539, 273153, 348998, 200864, 52308, 41659, -10190, -287401, -598571, -553290, -101771, 347251, 444010, 318048, 295003, 375074, 297549, 52290, -40272, 172672, 443300, 540884, 576557, 682299, 678905, 397808, 85876, 74882, 198966, -6307, -575674, -1036590, -1091669, -950122, -882427, -845012, -705004, -497406, -288244, -73558, 51502, -59805, -251073, -117827, 381403, 729283, 518528, -25433, -468959, -743951, -922048, -775303, -88153, 788339, 1220603, 1053102, 637117, 203010, -282852, -673176]
34497f73176L2070L71087J41168l77015m61295K538M04329L31490M2716p4008
34487b60096k3585j007n2160j47799k91132l42350k6532O01138R34224M55362
34477H46063m73564q88933m06365K65540K75463k24893l65884J46445O41226N24066
34467C39164R3925o6440m394j24945l54986k77395N2578J42797q1061j52254R6472
34456c36539K53085J00773M869J94605K80491n8964m33156l14481J40916L94020
34446B25619L40266K77988K83088J65630o8781k15100k73476m19785n89985m86999
34436g61535l9394M41517O00599L52871r1757l65098k24128J48374K97359Q7612
34426D46420j22236p4229j3728j96058l72464k02543J32414K23578J00780R0407
$$ y = [-673176, -641106, -270019, -128851, -505866, -967161, -964623, -560294, -228804, -186088, -260096, -283681, -284688, -336848, -484647, -775779, -1118129, -1144661, -543523, 390701, 846063, 372499, -516434, -922799, -657259, -381796, -606689, -972573, -826128, -184902, 339164, 433089, 366649, 362255, 237310, -117676, -395071, -342493, -199696, -280757, -433011, -336539, -83454, 17319, 22188, 216793, 497284, 438320, 5164, -309317, -168401, 225619, 565885, 843873, 1126961, 1292591, 1223810, 1008710, 735234, 315449, -274536, -761535, -800929, -359412, 241187, 594058, 502301, 137203, -86925, 61449, 358808, 446420, 324184, 249955, 236227, 40169, -332295, -534838, -402424, -178846, -78066, 12341]
34416A2341K01830J86039N8104L0418M5214r7691k65141j97129p4252k63258n65723
34405i29248m04014K05936N61194L02566j03523j40924P4904J74097J05605L5392
34395a18015M3340J43461K83162K25555j67672n00102k29853M15189N71633J6124
$$ y = [12341, 214171, 400210, 458314, 488732, 533946, 436255, 171114, -26015, -100267, -363525, -929248, -1333262, -1127326, -566132, -263566, -367089, -508013, -433109, -259012, -153407, -118015, -74675, 68786, 351948, 577503, 409831, -90271, -320124, 95065, 666698, 682822]
$$ [...]
##END NTUPLES=NMR SPECTRUM
##END=
