##TITLE=31Pdec_IBIP1701
 CDCl3, 24 sc
 18.1.2019
##JCAMPDX= 6.0         $$ Bruker NMR JCAMP-DX V2.0
##DATA TYPE= NMR SPECTRUM
##DATA CLASS= NTUPLES
##ORIGIN= UXNMR, Bruker Analytische Messtechnik GmbH
##OWNER= root
$$ XWIN-NMR		Version 3.5
$$ Fri Jan 18 14:12:25 2019 Russian Standard Time (UT+4h)  she@DPX200
##.OBSERVE FREQUENCY= 81.013821
##.OBSERVE NUCLEUS= ^31P
##.ACQUISITION MODE= SIMULTANEOUS
##.ACQUISITION SCHEME= undefined
##.AVERAGES= 24
##.DIGITISER RES= 17
##SPECTROMETER/DATA SYSTEM= spect
##.PULSE SEQUENCE= zgpg30
##.SOLVENT NAME= D2O
##.SHIFT REFERENCE= (INTERNAL, D2O, 0, 182.463)
##AUDIT TRAIL= $$ (NUMBER, WHEN, WHO, WHERE, WHAT)
$$ ##TITLE= Audit trail, XWIN-NMR		Version 3.5
$$ ##JCAMPDX= 5.01
$$ ##ORIGIN= Bruker BioSpin GmbH
$$ ##OWNER= she
$$ F:/spectra/data/she/nmr/P31/1/pdata/1/auditp.txt
$$ ##AUDIT TRAIL=  $$ (NUMBER, WHEN, WHO, WHERE, WHAT)
(   1,<2019-01-18 14:11:22.79 +0400>,<she>,<DPX200>,
      <created by zg, POWCHK disabled, PULCHK disabled
       configuration hash MD5:
       00 E9 B6 7A A2 85 ED C7 34 08 36 98 17 FE 4E 26
       data hash MD5: 32K
       D1 AE 32 1F 7E CA 9D 79 2C 9E 58 C6 E1 60 24 DA>)
(   2,<2019-01-18 14:11:25.35 +0400>,<she>,<DPX200>,
      <Start of raw data processing
       efp BC_mod = 2 LB = 1 FT_mod = 6 PKNL = 1 PHC0 = -1486.069 PHC1 = 90.19898 SI = 64K 
       data hash MD5: 64K
       40 A8 A7 6F A7 A2 4A E8 8C 58 79 4C A4 6E 09 EE>)
(   3,<2019-01-18 14:11:54.12 +0400>,<she>,<DPX200>,
      <pk PHC0 = 59.28344 PHC1 = -85.39999 
       data hash MD5: 64K
       E5 34 21 38 80 29 0C A9 EA 99 F2 D9 2E 91 98 EE>)
(   4,<2019-01-18 14:12:00.76 +0400>,<she>,<DPX200>,
      <abs ABSG = 5 
       data hash MD5: 64K
       49 33 E0 76 BC 8C 1A F8 12 B8 BE C1 1F 44 A8 70>)
$$ ##END=
$$ 
$$ hash MD5
$$ 63 BE 85 09 61 F7 4C 14 9C 31 EB E1 78 AE 95 4B
##$RELAX= 
##$RELAX= 
##$RELAX= 
##$RELAX= 
##$RELAX= 
##$RELAX= 
##$RELAX= 
##$RELAX= 
$$ Bruker specific parameters
$$ --------------------------
##$DU= <F:/spectra>
##$EXPNO= 1
##$NAME= <P31>
##$PROCNO= 1
##$TYPE= <nmr>
##$USER= <she>
##$AMP= (0..31)
100 100 100 100 100 100 100 100 100 100 100 100 100 100 100 100 100 100 
100 100 100 100 100 100 100 100 100 100 100 100 100 100 
##$AQSEQ= 0
##$AQ_mod= 1
##$AUNM= <au_zg>
##$AUTOPOS= <>
##$BF1= 81.014009
##$BF2= 200.13
##$BF3= 200.13
##$BF4= 200.13
##$BF5= 200.13
##$BF6= 200.13
##$BF7= 200.13
##$BF8= 200.13
##$BYTORDA= 1
##$CFDGTYP= 0
##$CFRGTYP= 5
##$CHEMSTR= <none>
##$CNST= (0..31)
1 1 145 1 1 1 1 1 1 1 1 1 1 1 1 1 1 1 1 1 1 1 1 1 1 1 1 1 1 1 1 1 
##$CPDPRG= <waltz16>
##$CPDPRG1= <>
##$CPDPRG2= <waltz16>
##$CPDPRG3= <>
##$CPDPRG4= <mlev>
##$CPDPRG5= <mlev>
##$CPDPRG6= <mlev>
##$CPDPRG7= <mlev>
##$CPDPRG8= <mlev>
##$CPDPRGB= <>
##$CPDPRGT= <>
##$D= (0..31)
0 1 0 0 0 0 0 0 0 0 0 0.03 2e-05 3e-06 0 0 0 0 0 0 0 0 0 0 0 0 0 0 0 0 
0 0 
##$DATE= 1547806282
##$DBL= (0..7)
120 120 120 11 120 120 24 19 
##$DBP= (0..7)
150 150 150 150 150 150 150 150 
##$DBP07= 0
##$DBPNAM0= <>
##$DBPNAM1= <>
##$DBPNAM2= <>
$$ [...]
##$SUBNAM3= <"">
##$SUBNAM4= <"">
##$SUBNAM5= <"">
##$SUBNAM6= <"">
##$SUBNAM7= <"">
##$SUBNAM8= <"">
##$SUBNAM9= <"">
##$SW= 369.568048894756
##$SWIBOX= (0..15)
0 1 3 0 0 0 0 0 0 0 0 0 0 0 0 0 
##$SW_h= 29940.119760479
##$TD= 32768
##$TD0= 1
##$TE= 0
##$TE2= 300
##$TE3= 300
##$TEG= 300
##$TL= (0..7)
0 120 53 12 22 120 120 120 
##$TP= (0..7)
150 150 150 150 150 150 150 150 
##$TP07= 0
##$TPNAME0= <>
##$TPNAME1= <>
##$TPNAME2= <>
##$TPNAME3= <>
##$TPNAME4= <>
##$TPNAME5= <>
##$TPNAME6= <>
##$TPNAME7= <>
##$TPOAL= (0..7)
0.5 0.5 0.5 0.5 0.5 0.5 0.5 0.5 
##$TPOFFS= (0..7)
0 0 0 0 0 0 0 0 
##$TUNHIN= 0
##$TUNHOUT= 0
##$TUNXOUT= 0
##$USERA1= <user>
##$USERA2= <user>
##$USERA3= <user>
##$USERA4= <user>
##$USERA5= <user>
##$V9= 5
##$VALIST= <valist>
##$VCLIST= <CCCCCCCCCCCCCCC>
##$VD= 0
##$VDLIST= <DDDDDDDDDDDDDDD>
##$VPLIST= <PPPPPPPPPPPPPPP>
##$VTLIST= <TTTTTTTTTTTTTTT>
##$WBST= 1024
##$WBSW= 4
##$XGAIN= (0..3)
0 0 0 0 
##$XL= 0
##$YL= 0
##$YMAX_a= 24135
##$YMIN_a= -23775
##$ZGOPTNS= <>
##$ZL1= 120
##$ZL2= 120
##$ZL3= 120
##$ZL4= 120
##$ABSF1= 182.463
##$ABSF2= -187.1042
##$ABSG= 5
##$ABSL= 3
##$ALPHA= 0
##$AQORDER= 0
##$ASSFAC= 0
##$ASSFACI= 0
##$ASSFACX= 0
##$ASSWID= 0
##$AUNMP= <proc_1d>
##$AZFE= 0.1
##$AZFW= 0.5
##$BCFW= 0
##$BC_mod= 2
##$BYTORDP= 0
##$COROFFS= 0
##$CY= -3
##$DATMOD= 1
##$DC= 0
##$DFILT= <>
##$DTYPP= 0
##$F1P= 0
##$F2P= 0
##$FCOR= 1
##$FTSIZE= 65536
##$FT_mod= 6
##$GAMMA= 0
##$GB= 0
##$INTBC= 1
##$INTSCL= 5.30512e-09
##$ISEN= 30
##$LB= 1
##$LEV0= 0
##$LPBIN= 0
##$MAXI= 10000
##$MC2= 0
##$MEAN= 0
##$ME_mod= 0
##$MI= 50
##$NCOEF= 0
##$NC_proc= -3
##$NLEV= 6
##$NOISF1= 182.463
##$NOISF2= 159.3651
##$NSP= 0
##$NTH_PI= 0
##$NZP= 0
##$OFFSET= 182.463
##$PC= 4
##$PHC0= -1426.786
##$PHC1= 4.798996
##$PH_mod= 1
##$PKNL= yes
##$PPARMOD= 0
##$PSCAL= 0
##$PSIGN= 0
##$REVERSE= no
##$SF= 81.0140089999434
##$SI= 65536
##$SIGF1= 159.3651
##$SIGF2= -187.1042
##$SINO= 113.3802
##$SIOLD= 16384
##$SREGLST= <1H.CDCl3>
##$SSB= 0
##$STSI= 65536
##$STSR= 0
##$SW_p= 29940.119760479
##$SYMM= 0
##$S_DEV= 0
##$TDeff= 32768
##$TDoff= 0
##$TI= <>
##$TILT= no
##$TM1= 0
##$TM2= 0
##$TOPLEV= 0
##$USERP1= <user>
##$USERP2= <user>
##$USERP3= <user>
##$USERP4= <user>
##$USERP5= <user>
##$WDW= 1
##$XDIM= 65536
##$YMAX_p= 280242012
##$YMIN_p= -2465530
$$ End of Bruker specific parameters
$$ ---------------------------------
##NTUPLES= NMR SPECTRUM
##VAR_NAME=  FREQUENCY,     SPECTRUM/REAL,   SPECTRUM/IMAG
##SYMBOL=    X,             R,               I
##VAR_TYPE=  INDEPENDENT,   DEPENDENT,       DEPENDENT
##VAR_FORM=  AFFN,          ASDF,            ASDF
##VAR_DIM=   65536,         65536,           65536
##UNITS=     HZ,            ARBITRARY UNITS, ARBITRARY UNITS
##FACTOR=    0.456856943014862, 1,           1
##FIRST=     14782.0589164792, 0,            0
##LAST=      -15158.0608439998, 0,           0
##MIN=       -15158.0608439998, -2465530,    0
##MAX=       14782.0589164792, 280242012,    0
$$ Real data points
##PAGE= N=1
##DATA TABLE= (X++(R..R)), XYDATA
$$ [...]
42953 177859 146732 103383 106591 117608 82471 46804 100613 230506 304073 219130 24791
42942 24791 -133930 -171609 -130698 -97950 -96024 -92860 -92476 -152009 -289399 -422050 -436548 -302841
42930 -302841 -100683 45442 47663 -86591 -244670 -289112 -187866 -51421 -17761 -118847
42920 -118847 -274076 -380888 -389161 -322491 -251667 -212406 -137979 62362 332550 470130 368854
42909 368854 177055 110814 177237 214968 161883 113721 112612 57637 -105743 -259841 -288857
42898 -288857 -267124 -339434 -479042 -505972 -332763 -77006 81480 71279 -48858 -160130
42888 -160130 -163517 -59180 40409 36868 -14751 29880 195524 339596 342293 240614 119918
42877 119918 -13941 -158484 -216478 -122352 -6385 -59620 -245370 -324674 -205228 -87474
42867 -87474 -174429 -389137 -513236 -496500 -471635 -516789 -555200 -486810 -311310 -116371 -10809
42856 -10809 -45222 -141710 -158343 -87309 -92738 -248512 -363079 -241818 -19075 11027 -161740
42845 -161740 -271820 -232479 -265071 -480071 -636372 -502667 -210623 -20114 73679 242606
42835 242606 471090 569496 479215 329791 223359 160524 146452 179331 164904 34115 -79741
42824 -79741 21277 294883 484611 450109 280357 77452 -158040 -388190 -492835 -442886
42814 -442886 -357823 -323348 -295545 -236374 -193307 -192586 -202442 -243573 -368851 -490136 -424057 -187252
42802 -187252 -38713 -114987 -227665 -174198 -54986 -81719 -226632 -296758 -261305 -267746 -369846
42791 -369846 -453769 -439845 -386139 -372891 -417183 -509823 -618541 -655695 -558708 -403955 -332225
42780 -332225 -360109 -369249 -283442 -152802 -55505 -14528 -23445 -61266 -62122 46253 243167 408213
42768 408213 430347 291936 66200 -118532 -145204 -11578 146464 187644 90031 -94327
42758 -94327 -318468 -481507 -402286 -34466 343657 374837 83710 -116977 43007 351098
42748 351098 436266 269200 137419 199809 289356 191626 -50507 -209191 -165347 -28197
42738 -28197 21038 -71847 -209126 -265696 -200695 -65649 55457 110097 111723 115612 134643
42727 134643 91532 -86376 -319354 -407378 -263828 -50806 -4480 -166758 -369194 -450444
42717 -450444 -398286 -288273 -177829 -80607 22584 162716 316049 362812 195512 -111788
42707 -111788 -327620 -304737 -135237 -14229 -10452 -47695 -69861 -111218 -181359 -186263 -55553
42696 -55553 100961 90806 -83035 -166640 25744 323673 378010 102997 -213091 -264773
42686 -264773 -53794 196677 310212 245096 35760 -219119 -372311 -350699 -234194 -138684
42676 -138684 -73165 14229 118669 197662 244131 252662 184067 55662 -17479 20773 61682
42665 61682 8518 -42564 39266 171516 163367 5354 -152968 -264530 -388254 -450190 -267463
42654 -267463 135143 467247 520424 383053 231534 107495 9396 14378 152903 287169
42644 287169 259200 83693 -106392 -229857 -291149 -316582 -321689 -284426 -138084 113173 283317
42633 283317 169890 -146044 -348694 -291486 -161492 -161584 -234175 -227612 -150163 -98430 -79997
42622 -79997 -62211 -68122 -80420 17094 253920 460715 493341 431618 396664 327137 138567
42611 138567 -38180 -22026 109837 127843 9141 -49224 49116 191325 268841 302197 338907
42600 338907 388696 462021 536015 513399 357250 208166 201159 237908 141937 -28739 -64673
42589 -64673 43602 106095 76010 101334 197410 173601 -6304 -73754 161484 495672 591667
42578 591667 398357 127639 -58659 -144463 -119964 59318 367745 676334 838987 772905
42568 772905 494210 126662 -159712 -265559 -211245 -86831 -3408 -55102 -223490 -333334
42558 -333334 -228517 -857 86064 -73141 -297919 -358061 -218179 -12188 106588 53643
42548 53643 -131348 -281738 -261480 -133869 -53212 -13146 115795 306362 370274 281136 244838
42537 244838 342517 360272 140921 -125543 -177065 -58648 9636 -6206 16841 72330 37693
42526 37693 -69761 -101848 -41639 -30818 -108413 -122531 37847 274251 403276 342458 134982
42515 134982 -112430 -280476 -304777 -225528 -130507 -62154 -25606 -39372 -99130 -135603 -97577
42504 -97577 -35534 -12108 17612 123625 245019 249617 129291 6924 -41937 -45296 -14304
42493 -14304 90239 232990 267117 90604 -227670 -522826 -683548 -701214 -627475 -525941
42483 -525941 -442968 -396140 -378847 -359438 -284376 -130575 37094 118548 98180 40508 -32068
42472 -32068 -143727 -235170 -187954 -35352 29418 -46667 -64314 89872 199856 43806 -212257
42461 -212257 -237730 -44271 54914 -52386 -151244 -97317 -15957 -23576 -43512 -17568 -40344
42450 -40344 -141929 -171534 -58942 17827 -92943 -255747 -258605 -135748 -69060 -77397 -21589
42439 -21589 140862 303932 389392 406103 346492 180134 -34807 -156287 -100330 99040
42429 99040 365767 632816 820528 854245 733759 542100 373374 274626 244368 253204 266630
42418 266630 260313 209578 85668 -95665 -242762 -270284 -197533 -89871 66174 309742
42408 309742 543832 589554 438626 291971 281982 314714 276600 232463 282633 361467 340621
42397 340621 234304 143812 82469 17708 10961 134979 301622 359363 337731 398344 530914
42386 530914 500991 181271 -217091 -363051 -185293 61429 86882 -138691 -386177 -438837
42376 -438837 -322126 -222273 -214233 -193536 -103742 -67076 -171844 -273505 -191093 -6207 53207
42365 53207 -19763 -4630 174384 323406 303197 237630 255998 237252 24941 -238389 -243469
42354 -243469 55960 375095 484100 455770 449922 437984 300518 88244 -11510 45843 93700
42343 93700 7752 -126818 -186800 -210791 -291129 -370483 -327588 -216005 -215948 -341724 -395139 -259509
42331 -259509 -57706 51657 56124 -14948 -177728 -351986 -334592 -92981 96767 20375
42321 20375 -131525 -51426 190077 247615 21808 -253116 -414717 -520216 -567355 -433946
42311 -433946 -195854 -153121 -371481 -518096 -371731 -199943 -340721 -648100 -703701 -439091
42301 -439091 -188053 -167748 -240661 -212839 -77666 102517 307489 451830 372738 57431
42291 57431 -254740 -320961 -161081 9664 32223 -93020 -282559 -453338 -550770 -554878 -468367
42280 -468367 -305056 -117689 -9940 -49822 -178096 -278394 -328500 -384255 -416569 -303656
42270 -303656 -41839 163890 128427 -67413 -167512 -39919 204113 362841 332348 161642
42260 161642 -1921 -33489 37754 44079 -98749 -231550 -141627 107774 217249 74233
42250 74233 -54458 101483 399448 468401 241525 41456 101258 254098 223031 12970
42240 12970 -167267 -223920 -206821 -118213 68528 234952 201994 10908 -95334 -20512 59395
42229 59395 -8463 -137882 -191339 -185002 -154043 3459 335413 612811 540789 152301 -214814
42218 -214814 -319433 -214325 -58464 64633 109424 36123 -105670 -185615 -143205 -30889
42208 -30889 109509 276516 386290 289603 -2102 -250222 -259609 -106364 10855 39272
42198 39272 65762 133095 208173 277574 333949 305938 144545 -38274 -58575 105843 295326
42187 295326 388309 407974 388286 286344 102369 -41904 -57932 -41796 -149148 -358073
42177 -358073 -473260 -367871 -132393 34327 16904 -152618 -363989 -522336 -596459 -607986
42167 -607986 -583389 -522817 -417050 -275788 -125910 538 67555 55745 -1581 -43007 -63505
42156 -63505 -119802 -212393 -237338 -135296 -15551 -8548 -50310 15617 135954 62969 -261650
42145 -261650 -552171 -551899 -381152 -311977 -336431 -226325 33325 165410 5123 -268838
42135 -268838 -414459 -431564 -446853 -460996 -382522 -208505 -10390 186646 366178 435367
42125 435367 337303 197894 189083 263749 200007 -73588 -360851 -456167 -380032 -285390 -244743
42114 -244743 -220284 -164701 -62686 74069 178987 148181 -35169 -231181 -279747 -186978
42104 -186978 -97222 -90263 -98786 -52631 -17629 -114348 -333100 -515144 -534612 -435479 -347153
42093 -347153 -314200 -280474 -220688 -191719 -219717 -217749 -94578 88490 154531 16998 -209506
42082 -209506 -336178 -307824 -243373 -263675 -316546 -230451 46094 336136 441297 398600 400001
42071 400001 473171 420835 141996 -161155 -236804 -116628 -20927 -14639 39357 206810 361080
42060 361080 369020 241514 56715 -131088 -262012 -277485 -210633 -165090 -166911 -146660 -91758
42049 -91758 -76448 -97131 -38662 112781 181513 51027 -130806 -145704 -7901 89039 68599
42038 68599 47434 124961 237664 253937 134175 -25763 -80409 15311 127199 81617 -91407
42027 -91407 -170186 -58820 53542 -23584 -179869 -174343 -9595 88649 21961 -84529 -140936
42016 -140936 -217139 -352158 -439944 -395959 -288460 -228274 -257622 -393032 -615847 -761012
42006 -761012 -610282 -212389 67308 -28090 -315879 -433852 -299896 -115198 -17784 22722
41996 22722 5577 -146524 -383985 -493563 -367805 -167905 -107377 -168155 -144839 69028
41986 69028 331084 397057 187178 -107482 -208916 -61625 91944 7797 -239523 -344222
41976 -344222 -161772 115308 207237 62867 -129967 -166670 335 246429 379865 307385
41966 307385 126822 10918 1094 -55 -35415 -29296 40211 57961 -38971 -121317 -51383 98999
41954 98999 166763 146213 146387 168597 129054 72809 143220 316277 382138 259913 137141
41943 137141 197440 376866 502396 516047 430664 215313 -98633 -305419 -217457 74335
41933 74335 298855 333013 282713 272296 320340 414000 534181 585301 461636 228765 91108
41922 91108 113993 113812 -82599 -377892 -519590 -413861 -209004 -84520 -62773 -63357 -69388
41911 -69388 -144145 -265437 -247395 39005 390541 407139 -9621 -462619 -515452 -198747
41901 -198747 134573 318213 453420 562016 511408 319970 197179 175616 25920 -306789
41891 -306789 -503234 -337748 -60418 -15863 -112483 -23879 236486 328239 116976 -165115
41881 -165115 -303778 -332059 -329625 -274769 -172207 -96525 -40826 72927 191462 159705 123
41870 123 -71570 22172 108362 66646 4807 20804 28379 -36974 -63467 13596 38196 -119333
41858 -119333 -312119 -317387 -144161 56382 246640 452515 578669 507615 306557 129641
41848 129641 -5258 -140414 -179989 -11573 245316 369196 367784 416762 509237 468162 308742
41837 308742 257184 343226 311363 73989 -73405 91898 325889 264679 -34912 -221758
41827 -221758 -194760 -178274 -283839 -335567 -208165 -57439 -66049 -156605 -129123 38815 192914
41816 192914 227765 161789 36560 -104507 -154023 -21088 190831 239361 63069 -81609
41806 -81609 59335 362807 454729 201328 -115197 -177691 -21783 89667 57538 25436
41796 25436 106947 222117 245969 180693 110110 72962 47112 -907 -96898 -230463 -308959
41785 -308959 -213763 41352 273530 322520 232607 175466 231731 322530 330877 218340 38094
41774 38094 -99969 -94649 38931 135042 37522 -194686 -331461 -251804 -89057 -37272 -100087
41763 -100087 -132991 -77417 -17505 -9686 -854 33904 7910 -115264 -175694 16143 403592
41752 403592 723354 815532 743992 596628 357346 66728 -72898 67240 303425 331892
41742 331892 120443 -79761 -104767 -58266 -72058 -80134 42592 241978 333808 238010 44388
41731 44388 -126449 -222508 -233430 -168657 -88069 -81065 -170830 -270570 -265785 -127822 68627
41720 68627 224675 289099 254228 121081 -85127 -273514 -331407 -250037 -153846 -146409 -173060
41709 -173060 -115138 17678 97787 74538 37016 50322 41285 -86190 -298775 -464397 -486815
41698 -486815 -367918 -192872 -87112 -114226 -173755 -86628 156906 327887 228483 -45958
41688 -45958 -225420 -192816 -77642 -54478 -162209 -310967 -366211 -233718 41504 266771
41678 266771 288325 180779 150446 257599 353134 299926 128415 -56321 -186012 -196155
41668 -196155 -28825 233079 359712 232084 12400 -81055 -78892 -159421 -300899 -270583
41658 -270583 5021 284501 335490 231574 176752 189217 160609 118048 172132 239132 97620
41647 97620 -216771 -339836 -50139 398218 605742 524660 399152 338548 235859 70523
41637 70523 -4936 65418 132515 94773 47739 71399 62858 -74934 -236204 -264087 -180036
41626 -180036 -109656 -81694 -49230 -17751 -4048 41782 122089 101084 -90193 -252628 -145060
41615 -145060 144797 298911 222340 136685 181420 192633 8246 -222456 -225586 11522 209925
41604 209925 116834 -245140 -607603 -674210 -372657 46174 223343 66951 -150458 -123833
41594 -123833 132332 337297 280176 10755 -265671 -392872 -366058 -291430 -264521 -285325
41584 -285325 -297599 -277918 -233154 -144579 -5989 102339 94774 32698 56654 148396 127578
41573 127578 -52249 -178434 -64809 185061 344046 370245 384301 426833 420726 336275 231034
41562 231034 138403 51970 6335 45073 117370 125098 63178 4078 -31574 -62968 -35170 125037
41550 125037 329218 362818 155835 -102039 -176781 -31713 187329 319213 294331 151722
41540 151722 844 -72844 -73145 -28105 87432 261477 330077 128226 -229877 -402681 -223654
41529 -223654 97282 255176 191280 57906 -14688 15809 155471 338047 412165 309325
41519 309325 168365 159660 248294 282826 260479 311164 426407 412299 178542 -90828 -159920
41508 -159920 -28645 100398 70925 -97404 -274946 -339404 -262697 -141869 -110759 -173617
41498 -173617 -174922 3632 264168 393699 317604 160579 56629 -4172 -99916 -221999
41488 -221999 -269118 -180556 -22740 73759 50153 -20096 -18538 67816 115351 21813 -130189
41477 -130189 -145006 34918 235137 267466 172343 141797 234498 299141 209564 50869 -17103
41466 -17103 888 -44809 -211929 -369449 -370975 -241270 -133184 -143140 -225729 -276585 -254425
41455 -254425 -212076 -225790 -305757 -383176 -390381 -335273 -266414 -176302 2839 280437 532893
41444 532893 603361 464373 236569 52807 -45916 -77526 -52919 8393 43726 6170 -44723
41433 -44723 15916 221290 457971 607738 685988 774591 864777 863019 742237 584988 455642
41422 455642 327148 179524 75888 61547 60982 -18896 -119477 -79576 136186 351568 361512
41411 361512 150029 -105337 -212996 -128998 33509 128059 103743 13121 -86607 -192406
41401 -192406 -305433 -384774 -395373 -356661 -301937 -243564 -221598 -300102 -429074 -404277 -111768
41390 -111768 242277 324449 92131 -162834 -218372 -177636 -236131 -375346 -439886 -400123 -363690
41379 -363690 -376216 -365104 -274676 -138081 -4248 119568 238094 338304 393408 364654
41369 364654 227415 34605 -93641 -104345 -90247 -160373 -273402 -291343 -177820 -45511
41359 -45511 837 -13152 8667 102005 193735 165380 -26379 -276558 -415432 -394702 -338416
41348 -338416 -365091 -430421 -422708 -340610 -259904 -176478 -31138 121610 132628 -13171 -133153
41337 -133153 -93600 -4553 -53895 -215757 -258389 -45636 273956 430964 336012 148966
41327 148966 54239 50253 24714 -25043 15332 150198 196626 34333 -187031 -234566 -108585
41316 -108585 -11322 -46941 -129854 -176911 -202446 -199453 -114180 2275 -5750 -157839 -256280
41305 -256280 -157495 13121 46308 -66329 -171580 -183382 -123820 -8660 148774 257184
41295 257184 220257 80860 -29074 -71314 -118361 -196966 -233965 -171039 -35309 118543 255447
41284 255447 345730 381625 406148 453671 479503 429399 347385 308926 278057 167224 26305
41273 26305 6647 109532 145322 16993 -122024 -113396 -56132 -155808 -393595 -528659 -418228
41262 -418228 -182916 -30522 -32727 -112517 -163349 -139374 -85776 -100909 -215842 -313670 -247719
41251 -247719 -47508 93464 71558 9343 69447 230832 355233 397656 412011 392788 279491
41240 279491 125858 89823 193677 253394 144162 -13578 -69810 -101965 -252290 -407149
41230 -407149 -303606 50638 330945 337004 235052 239138 279047 172216 -48274 -197548
41220 -197548 -216025 -169425 -66957 91021 154829 -26222 -314155 -394452 -197332 34877
41210 34877 132302 184608 269478 275132 143842 45423 109588 188669 109934 -9574 44542
41199 44542 211135 257112 172173 158281 246869 235919 62885 -43159 95280 328987 398802
41188 398802 267268 87864 -32780 -94055 -107120 -79830 -52375 -43816 6526 169015 423123
41177 423123 672129 814309 775626 555325 286239 159239 220929 324030 334913 292642
41167 292642 290066 309090 281725 221435 175475 128067 71855 91253 237185 400467 466026
41156 466026 512842 671682 849414 824659 595522 382662 265523 84353 -213529 -402206
41146 -402206 -316240 -138685 -137019 -272547 -305557 -179772 -55159 -10207 43059 138665 168383
41135 168383 66534 -85766 -200717 -286926 -353537 -345566 -253096 -172822 -169691 -162171 -41901
41124 -41901 146229 234257 121374 -123919 -333208 -371170 -228087 -22113 103328 103663 39706
41113 39706 -26935 -86667 -128548 -118287 -64715 -30370 -28356 8047 83560 59068 -168443 -457592
41101 -457592 -546174 -392832 -251688 -341788 -556057 -609491 -416831 -189714 -148744 -260001
41091 -260001 -332473 -298872 -272782 -326218 -344682 -192026 63250 219584 220484 216656 313689
41080 313689 401516 337404 187755 131786 172539 121189 -105431 -330480 -342096 -160205 22178
41069 22178 82207 35668 -80809 -252835 -415953 -478807 -465735 -525519 -722200 -900887 -863789
41058 -863789 -637157 -452772 -459511 -545892 -489293 -227533 67283 175092 61389 -91651
41048 -91651 -103140 -23478 -73394 -327923 -570458 -568008 -400087 -333310 -402513 -348423 -32696
41037 -32696 313185 399252 255065 104513 4435 -152923 -353300 -433517 -339959 -193462
41027 -193462 -81257 5637 12576 -155727 -387393 -392499 -108658 150451 120248 -49361 -67824
41016 -67824 38796 22786 -142067 -224681 -132139 -45530 -92218 -136168 -30144 109385 57798
41005 57798 -178201 -344537 -256604 -19498 103598 -8584 -214842 -295331 -210493 -109441
40995 -109441 -92000 -82455 1331 84153 71216 46807 146829 284053 223166 -53007 -274338
40984 -274338 -256952 -145203 -156986 -259424 -268036 -149248 -31065 27030 82130 133011 74760
40973 74760 -124113 -329274 -390249 -293631 -113008 101473 299047 368018 232101 7233
40963 7233 -62731 110770 329099 347970 187406 74465 108639 156835 119085 106794 226311
40952 226311 344720 277873 122508 156099 412655 602622 521913 325197 270397 361788
40942 361788 404163 298465 119884 -34638 -123399 -108305 39115 260817 423207 429348
40932 429348 293770 122618 37613 70802 105140 -15867 -278156 -475313 -460317 -337374
40922 -337374 -309511 -401006 -452145 -366926 -247118 -254286 -413785 -594629 -653590 -570107 -433485
40911 -433485 -313295 -197812 -92619 -87223 -202312 -244579 -17421 330712 415190 144147
40901 144147 -118616 -69195 104671 38959 -258527 -469093 -449689 -346807 -279515 -216033
40891 -216033 -166309 -209490 -289938 -244294 -83634 -3274 -55127 -67670 22984 29752 -159402
40880 -159402 -354508 -342821 -196049 -102262 -59851 39607 146714 112413 -41956 -128450 -69268
40869 -69268 -2192 -73864 -234536 -284595 -96168 215084 358286 173433 -154345 -313742
40859 -313742 -287166 -349001 -598375 -752180 -563427 -215541 -59534 -123657 -159016 -67007
40849 -67007 10362 -18026 -93507 -202702 -406751 -634753 -685624 -504228 -259115 -89481
40839 -89481 30365 120241 105870 -463 -33045 77391 148607 -11109 -331423 -592392
40829 -592392 -701442 -712216 -653626 -501617 -289922 -117409 -41849 -41988 -74064 -114492 -169250
40818 -169250 -272300 -435279 -584792 -617450 -530444 -408085 -272604 -82655 92133 77680
40808 77680 -127800 -261365 -130904 105163 174661 80042 30646 76772 65808 -57935 -157802
40797 -157802 -146295 -111363 -139651 -190462 -212367 -228555 -241309 -200671 -130461 -128578 -168554 -70427
40785 -70427 223156 502070 557340 455471 386221 359602 248116 52641 -81944 -94466
40775 -94466 -65702 -46957 -1669 57458 31387 -113557 -280656 -378513 -417672 -436434 -437875
40764 -437875 -434151 -437913 -374364 -139076 195490 379783 294267 119867 73737 111311 71286
40753 71286 2413 91334 289159 284221 -66735 -497160 -655683 -512819 -293687 -142322
40743 -142322 -48973 -32951 -169519 -413691 -578247 -554164 -430619 -334868 -260639 -129887
40733 -129887 58640 222508 286056 226432 87847 -12124 24046 121715 83105 -126761 -265304
40722 -265304 -121624 167801 302774 244035 218016 320289 391911 351543 365847 534042
40712 534042 648106 492681 203680 70238 103458 79597 -59885 -142183 -78815 36837
40702 36837 165145 363287 533248 427469 34909 -308771 -363893 -291628 -318840 -348130
40692 -348130 -178975 78761 149472 40519 -2075 53733 -24702 -290828 -464600 -349872
40682 -349872 -127717 -61621 -127883 -134057 -42418 35329 68844 135912 256114 353682 375581
40671 375581 336537 263310 183264 142995 154434 145475 41168 -121896 -222333 -179413 -18802
40660 -18802 145426 168280 -10631 -259541 -347558 -210736 -31914 23564 31737 138501 278854
40649 278854 265703 106106 8985 65734 134109 102018 71312 161844 286230 276737 147195
40638 147195 67568 110889 169876 135052 38735 -18495 -5285 25740 12247 -74828 -232120
40627 -232120 -419917 -565418 -609606 -559462 -471538 -382594 -285494 -177347 -84949 -14230 76227
40616 76227 195395 256092 178321 39073 13066 148636 308931 370429 365879 370402 367661
40605 367661 329192 318002 379721 413535 304736 127303 45929 51324 -19777 -201143 -331811
40594 -331811 -319938 -283569 -339334 -409739 -356641 -187138 -11815 103862 136593 48648 -138214
40583 -138214 -278289 -236711 -53712 115278 170863 98228 -89171 -306572 -367981 -160989
40573 -160989 167521 343643 278832 120078 4800 -73274 -136618 -135313 -59813 -9804 -60411
40562 -60411 -152659 -193921 -185630 -181111 -194185 -217333 -255157 -276557 -217661 -99353 -43993 -91635
40550 -91635 -111671 -13257 76247 13704 -76872 45419 336057 468182 287191 24553 -50684
40539 -50684 16386 22093 -60606 -107104 -92431 -100365 -133598 -122891 -109755 -215522 -406188 -482843
40527 -482843 -366395 -217662 -186889 -201432 -123891 7135 50348 2486 3245 112281 218275
40516 218275 200747 88367 7758 26876 102322 173303 259825 417446 593401 611902 384486
40505 384486 78706 -52432 5681 28244 -107177 -256061 -258463 -177193 -157046 -200529 -242406
40494 -242406 -307554 -399075 -350861 -39573 320872 363874 45333 -317869 -501037 -589252
40484 -589252 -674978 -633354 -368870 -50514 123852 235468 475114 769603 838954 607980
40474 607980 326539 233394 285228 300141 226710 153180 128118 99058 22201 -67737 -138140
40463 -138140 -240681 -430942 -626226 -651206 -465491 -241739 -130240 -43696 181716 482104
40453 482104 618504 523581 383310 326823 250675 58770 -117573 -99456 80432 262088
40443 262088 383439 450085 392568 168003 -57565 -58327 117799 175684 -15310 -214116 -109596
40432 -109596 286362 657299 746166 610542 502452 540941 573121 409570 133568 24929
40422 24929 161606 291001 202991 38336 34726 123252 47194 -191965 -306713 -160577 41421
40411 41421 80868 9809 -15460 5924 -21400 -96260 -132912 -94688 -11893 75324 118478 67286
40399 67286 -66851 -214067 -344613 -482059 -595665 -594522 -472396 -335377 -228835 -72983
40389 -72983 146022 259234 112354 -219419 -529542 -700878 -715471 -553553 -246989 28931
40379 28931 93832 -6807 -40784 127165 386891 522352 420394 145995 -119237 -226094
40369 -226094 -207694 -252278 -463955 -704882 -769783 -662042 -559524 -526566 -426021 -168996
40359 -168996 88778 113701 -106049 -342561 -408705 -361617 -373062 -455309 -426237 -176770 133446
40348 133446 253954 155054 16884 -65756 -175652 -329789 -357570 -158280 85874 136629
40338 136629 28188 -23317 43233 99993 92150 111337 194352 247707 214298 145208 64143
40327 64143 -71050 -218392 -234226 -85036 78159 147820 211060 359018 487308 439613
40317 439613 252720 96840 28140 -42603 -152738 -200344 -79791 179766 429952 511857
40307 511857 368600 108032 -62270 -16065 181252 360593 404236 297899 113173 -14530
40297 -14530 12096 100892 32019 -226522 -395161 -240704 53924 109228 -117982 -293322
40287 -293322 -211911 -55784 -40995 -81771 31 139835 147577 29454 -52810 -63588 -89940
40276 -89940 -104266 10474 194853 232072 89171 -7125 64921 120391 -8995 -159706 -75285
40265 -75285 172283 260743 74014 -162961 -226915 -159304 -111842 -98671 -20251 159493 364096
40254 364096 486423 453391 255313 -24520 -239347 -297353 -248219 -226625 -318060 -486890
40244 -486890 -614432 -602035 -458521 -284207 -152056 -37667 88386 151448 63285 -87112
40234 -87112 -65013 230332 610365 794083 698138 467145 276434 186969 162790 147666 114795
40223 114795 81552 84462 136823 229293 357207 489459 519717 349978 57038 -131617 -101116
40212 -101116 3724 -14896 -144985 -234894 -252935 -303628 -396410 -384126 -199938 -9782 -6766
40201 -6766 -128603 -113883 161323 507302 627908 448855 176139 42734 70826 116611
40191 116611 80732 -12352 -112385 -201089 -229696 -120560 92635 219832 115239 -132733
40181 -132733 -315978 -364535 -368746 -372169 -297724 -121184 15447 -36252 -222046 -335771 -267010
40170 -267010 -118064 -51080 -76690 -57453 83839 232079 212059 14592 -190586 -260237
40160 -260237 -203658 -87931 74567 283770 482996 607143 637969 558391 342899 68479
40150 68479 -75965 -15434 67944 -26867 -206250 -192994 71709 331325 346562 156534 -39053
40139 -39053 -107105 -32157 116607 189724 49265 -253413 -481666 -472956 -317663 -221286 -278678
40128 -278678 -446287 -634594 -740933 -681538 -492288 -329096 -276795 -230685 -67693 145113
40118 145113 246647 228325 223227 264831 233849 93398 15931 160594 422945 547004 451043
40107 451043 301562 246624 212640 50476 -211106 -385651 -370949 -245076 -118643 -20532
40097 -20532 33300 -10342 -140293 -230459 -186681 -66887 29293 96371 143080 81917 -146870
40086 -146870 -408548 -495267 -378324 -195344 -37091 89746 140840 75882 2149 72032
40076 72032 236047 297536 212882 118286 50634 -103990 -335084 -442745 -336581 -157471
40066 -157471 -12025 152260 297474 221687 -79840 -260333 -71797 261486 378111 278767
40056 278767 204975 200902 119184 -51095 -170079 -186846 -129896 44756 321038 448348 218529
40045 218529 -159472 -294998 -171628 -116300 -243934 -322468 -225454 -124760 -127878 -86306 82685
40034 82685 201710 132515 -7803 -95555 -195781 -333978 -346006 -170329 -42927 -158095
40024 -158095 -345703 -340456 -189376 -124970 -189915 -269328 -367919 -548823 -672412 -510606 -116278
40013 -116278 198897 284062 299096 394973 481202 417482 255523 155645 169621 221270 236580
40002 236580 194336 80963 -116027 -353260 -516591 -504485 -335211 -137804 -5383 101962
39992 101962 247522 367131 351741 253832 240718 318466 295878 103461 -47645 35219 234094
39981 234094 300980 200989 88385 44019 34887 57730 117425 110903 -64339 -306480 -398878
39970 -398878 -292276 -128365 927 138969 309990 450874 513691 496705 382624 187639
39960 187639 39494 42774 107666 99906 104027 292194 565725 632806 476595 417544 597808
39949 597808 722804 508420 119941 -70333 38722 277046 506099 665307 650425 419751
39939 419751 154882 77705 153867 186530 141219 143473 192511 131548 -75176 -253869 -253489
39928 -253489 -94004 135284 344028 390742 171024 -184678 -386810 -335543 -229827 -259089
39918 -259089 -364400 -406081 -395569 -417866 -453639 -429990 -356918 -276030 -153935 33243 173442
39907 173442 125312 -76483 -248670 -275390 -187190 -43711 140335 334919 455636 426513
39897 426513 251169 27047 -90694 1460 215185 296481 92398 -238901 -390094 -262433
39887 -262433 -53483 10323 -93314 -249614 -388096 -509060 -586190 -540482 -336291 -74732
39877 -74732 50536 -60500 -264946 -284666 -16710 326786 464612 366644 219913 137077
39867 137077 63054 -34328 -63185 36945 176183 234807 201373 120060 4746 -110481 -134374
39856 -134374 -38176 59512 32480 -82038 -148869 -122107 -67388 -37983 -34479 -67018 -156830
39845 -156830 -273774 -345959 -331659 -234484 -79676 63347 83334 -52868 -209757 -217234 -91508
39834 -91508 -20802 -117561 -284599 -368389 -362319 -385036 -489294 -563230 -447778 -133785 191024
39823 191024 310727 176349 -91533 -350728 -518980 -549768 -451138 -335026 -318301 -350392
39813 -350392 -282468 -140229 -138666 -340204 -508994 -461146 -362230 -456855 -660876 -686219 -468603
39802 -468603 -200100 -5827 133759 185083 82063 -63778 -67154 3676 -97439 -357920
39792 -357920 -463576 -270004 -4288 111250 124455 108206 -20829 -237451 -265861 37910
39782 37910 401116 495824 380901 321282 362245 376607 379361 482854 630112 652920 535946
39771 535946 393220 261586 134995 99643 199597 273141 167949 8748 -10067 22687
39761 22687 -107965 -333353 -382380 -215364 -46870 23080 67754 64342 -69491 -181234 -14889
39750 -14889 327045 440144 208802 -34997 -30997 113494 253306 423443 568412 462937
39740 462937 125474 -61507 108726 356237 395345 357912 433378 462150 279750 140515
39730 140515 338465 647968 624040 291663 57028 52733 59776 14966 96035 288924 339969
39719 339969 206754 134129 199567 190080 34438 -46146 39900 67461 -95794 -255887 -268864
39708 -268864 -299579 -462897 -536016 -325627 -50255 -33612 -226646 -354364 -363121 -391748 -432023
39697 -432023 -359904 -228986 -206990 -254034 -171184 30658 101459 -67277 -285664 -353457 -295236
39686 -295236 -243860 -268624 -375910 -522019 -582558 -459473 -246861 -138565 -159274 -160188 -90020
39675 -90020 -60315 -102223 -86101 33265 107342 37379 -76064 -143265 -228893 -338262 -290487
39664 -290487 -18288 207566 120440 -124731 -167527 29252 181533 157331 106532 102365 -13
39653 -13 -240234 -389022 -278419 -71303 -18670 -114563 -166311 -78682 91133 255466 331011
39642 331011 248855 58011 -75388 -84414 -103000 -234067 -354816 -307256 -147245 -18015
39632 -18015 96224 264687 364332 216828 -65329 -153060 44971 250247 205452 -16254
39622 -16254 -181894 -196768 -130113 -85313 -138174 -294158 -443281 -463071 -397739 -401357 -479455
39611 -479455 -465668 -317262 -239062 -391712 -633644 -695692 -499345 -177524 110303 252625
39601 252625 177608 -76552 -332067 -428873 -377861 -290380 -228771 -201300 -216521 -250445 -237037
39590 -237037 -174822 -160751 -240415 -320036 -309618 -249336 -207607 -169839 -122810 -121319 -166518 -160921
39578 -160921 -98813 -124395 -243142 -177535 247929 740915 857024 585107 312952 265869
39568 265869 302667 266536 202878 153031 32071 -156014 -220808 -55365 170388 220275 62051
39557 62051 -170083 -347197 -390826 -281197 -113103 -29881 -32580 23397 183738 292911 220208
39546 220208 57204 -4931 103581 299332 439695 414948 262023 192858 347116 516182
39536 516182 349176 -111811 -382381 -164771 238849 355885 160073 -10123 18674 117450
39526 117450 168442 215294 294860 354711 366996 349578 269190 86192 -110159 -175017 -118159
39515 -118159 -92172 -175683 -308141 -415060 -440584 -289491 65406 417431 477049 233965
39505 233965 -14200 -44198 64128 140582 165307 183823 156941 55259 -8397 97533 320575
39494 320575 470332 436189 268812 81946 -42703 -80106 -63195 -47480 -41880 -10265 43123
39483 43123 62674 44426 54805 95835 63958 -69380 -148751 -38454 149547 193553 84190
39472 84190 35050 171359 373933 466669 405253 221757 -66342 -387299 -570372 -500278
39462 -500278 -259853 -22313 133934 203718 136671 -93254 -330517 -336480 -87504 173930
39452 173930 247046 195088 175886 184609 104856 -64519 -191552 -203489 -167452 -164519 -178662
39441 -178662 -137245 -8158 147860 192450 22060 -281009 -479754 -453793 -359974 -393601
39431 -393601 -478227 -396243 -181901 -117002 -287342 -415593 -274595 -34463 1496 -173325
39421 -173325 -338965 -418382 -505272 -582054 -496061 -249288 -68216 -98869 -218113 -246213 -193342
39410 -193342 -181416 -240741 -309431 -356810 -390325 -389788 -342687 -315854 -386043 -494286 -458855 -178744
39398 -178744 210261 425610 299390 -49781 -319717 -315952 -127974 9274 2798 -16545
39388 -16545 92636 269871 323318 178334 -27524 -113729 -54224 44744 119447 209183 327817
39377 327817 373364 249280 24065 -132585 -153660 -110130 -56400 19902 70217 -27620 -264080
39366 -264080 -423280 -344708 -147191 -43375 -34906 16495 86836 -408 -252265 -424628 -342431
39355 -342431 -122402 20828 39638 14395 -13529 -28451 41559 233183 417053 402547 170355
39344 170355 -106109 -266109 -287010 -207927 -50424 136999 252013 241939 192854 234779
39334 234779 365872 442220 359125 179584 43187 1337 7608 29857 73212 99533 43169
39323 43169 -57291 -63974 48568 105299 -19713 -158411 -30478 355681 664252 629645
39313 629645 345521 98038 38078 105205 182601 219371 230849 251509 285144 283765 204704
39302 204704 89466 27871 36698 49720 47429 101532 235157 325439 239608 29323 -104471
39291 -104471 -48036 86572 91668 -88697 -281371 -280990 -99173 57069 69282 55686 147683
39280 147683 231210 88363 -243027 -458546 -378373 -170738 -99153 -191462 -271172 -212082 -43717
39269 -43717 131364 225391 212372 157130 156487 210164 214819 122994 18324 -19537 -24370 -46185
39257 -46185 -45330 21589 90834 66700 -47790 -171502 -238454 -218110 -130192 -91907 -227422
39246 -227422 -453382 -505031 -295739 -87086 -122722 -245690 -129898 202225 386676 235088
39236 235088 -36922 -158314 -127733 -78652 -30529 65794 169523 195012 145045 83041 28624
39225 28624 -24674 -40907 18752 126626 234468 349038 483176 563679 479946 228875 -60486
39214 -60486 -267177 -387847 -476073 -526687 -493058 -404541 -365299 -386509 -317385 -57390 231825
39203 231825 298233 166463 119438 257515 309114 30835 -402391 -621595 -537451 -353860
39193 -353860 -216499 -118202 -95617 -222449 -391057 -376924 -180370 -56596 -127507 -200332
39183 -200332 -77746 167728 350483 406401 344592 158358 -67663 -139591 -7461 121896
39173 121896 88704 30513 134196 299228 298269 164201 138485 273373 360014 280040 182461
39162 182461 221483 305766 237063 -2343 -216332 -223469 -59149 59525 -25796 -219265 -274976
39151 -274976 -109800 89121 123174 23803 -68959 -143816 -274174 -427000 -499840 -498632 -502842
39140 -502842 -497691 -426271 -366225 -437531 -549409 -480520 -238128 -84891 -133746 -171383 -20371
39129 -20371 158306 126020 -46073 -91195 47281 165146 129567 47625 65335 163525 229882
39118 229882 231610 229431 257485 258261 155987 -24332 -153128 -148743 -102183 -169544 -340637 -418615
39106 -418615 -276216 -42846 39184 -106157 -315312 -356610 -141343 186083 343361 168022
39096 168022 -181282 -356960 -198271 106059 271415 229577 123053 93994 169227 273593
39086 273593 279754 126534 -59349 -81960 27977 19656 -168971 -241773 10098 319500 309236
39075 309236 77158 27373 202520 230902 -28566 -245034 -171046 -25127 -76591 -200434
39065 -200434 -158141 -46372 -108364 -284569 -315647 -181097 -85066 -69630 9959 134873 87687
39054 87687 -174172 -401131 -399534 -258099 -136396 -50727 19558 11608 -100862 -213198 -230447
39043 -230447 -184738 -133879 -76966 -46275 -130440 -307009 -398589 -311580 -183838 -168478 -198932
39032 -198932 -116762 71109 220148 256597 206044 73650 -148634 -382857 -508469 -498182
39022 -498182 -414455 -298521 -157841 -29901 41635 73297 106934 144993 186847 262391 345031
39011 345031 314571 119401 -103516 -197706 -195409 -214779 -243854 -212462 -191530 -279246 -337291
39000 -337291 -129534 255455 427514 239806 15378 57058 203028 130157 -107944 -182075
38990 -182075 -34230 32411 -153203 -356484 -288797 -3411 239692 352161 453274 600329
38980 600329 696056 677699 617727 568831 457545 247620 96114 175670 382443 413372 173209
38969 173209 -70739 -38114 204854 375582 353866 250557 161816 65096 -32685 -43183 41037
38958 41037 90032 28444 -41533 125 115451 188751 194095 186107 199267 250624 371239 534306
38946 534306 614510 524663 343106 206075 131064 61785 29007 112959 264807 325872 244377
38935 244377 126407 36508 -94576 -285343 -379306 -246213 -10072 89766 22562 -21392
38925 -21392 55676 120557 58764 -10057 77307 233737 228914 63605 8886 206266 434275
38914 434275 416686 208882 83506 124309 157925 69583 -38169 -52404 -26358 -58495 -138482
38903 -138482 -210725 -272277 -308212 -241861 -69591 46064 -41016 -234350 -286906 -104695 156747
38892 156747 302115 302064 264276 272812 302125 273309 173201 92944 112681 168270 118787 -36049
38880 -36049 -115029 -1257 165766 152398 -67511 -284843 -309115 -151098 48229 183103
38870 183103 247835 284652 302399 254189 103692 -104602 -282259 -387572 -419827 -353893 -187779
38859 -187779 -40700 -54745 -174750 -191790 -60551 11344 -111950 -271721 -264693 -142698
38849 -142698 -76715 -67196 -1928 107914 166925 185821 225652 234803 148826 60208 65722 49929
38837 49929 -120221 -291580 -224138 -7572 76698 50198 176599 404105 342258 -89910
38827 -89910 -457396 -454398 -321456 -346162 -363274 -127167 157850 132656 -108882 -164883 40252
38816 40252 198874 151587 76683 129530 234369 289591 304789 283489 197792 101888 62270
38805 62270 -7145 -208099 -389450 -293904 25998 231136 169485 32382 -20971 -80346 -203478
38794 -203478 -215807 12201 300849 374197 195817 -60848 -246821 -310199 -258300 -167850
38784 -167850 -130961 -119507 -34786 65881 -6326 -241581 -365921 -247599 -127708 -244216
38774 -244216 -448570 -458933 -321646 -313506 -480056 -580066 -470013 -275893 -164673 -167418
38764 -167418 -253419 -382153 -451731 -372041 -222168 -183202 -293000 -407465 -410507 -318993 -184367
38753 -184367 -47705 8281 -69368 -169420 -120812 51922 143307 50267 -133402 -312750
38743 -312750 -475491 -552558 -431228 -186684 -71961 -161657 -218374 -52604 190545 277067
38733 277067 229868 221118 268027 265365 218883 216617 232421 178780 117295 201273 413615 556502
38721 556502 519579 392633 292678 232745 190398 170842 167584 164495 185612 243822 262110 174196
38709 174196 81044 147407 335499 407418 232800 -50104 -226534 -228188 -120605 4737
38699 4737 74090 75970 96596 203343 288259 178633 -78394 -229157 -171453 -101529 -194259
38688 -194259 -322034 -253794 -605 210517 226563 85948 -89481 -193195 -178146 -99935
38678 -99935 -54436 -11248 168658 463088 605914 434365 167194 127299 303274 420841
38668 420841 362234 253438 183118 113043 66335 127518 219809 155436 -28480 -65610 103488
38657 103488 183399 -11461 -217167 -105341 195752 276967 33936 -239947 -309545 -237435
38647 -237435 -140004 -10054 103232 7437 -335679 -605706 -463155 -18149 272065 166577
38637 166577 -109374 -219381 -117190 19363 91424 136870 166297 134756 74368 91782 199250
38626 199250 281843 276405 257125 287166 313331 289787 284939 354834 411249 344547 200226 96523
38614 96523 28350 -93605 -239276 -251802 -58589 225441 420839 428264 268771 72519
38604 72519 861 81068 154589 93442 3226 60921 210238 221105 41788 -124532 -128402
38593 -128402 -48183 12435 97168 254311 384448 359465 180142 -80679 -374228 -625898
38583 -625898 -719017 -639157 -527942 -493248 -472279 -377479 -258440 -206185 -208662 -221707 -277948
38572 -277948 -397637 -487719 -460611 -367566 -290733 -197147 -35102 117366 151392 99451 63300
38561 63300 45610 3878 -5834 91796 229092 281474 259641 243783 192211 25159 -140456
38550 -140456 -80280 192768 393375 330350 122222 -13754 -10214 87992 240483 384827
38540 384827 424077 346220 258801 226972 187204 106562 102822 271748 477233 471225 211009
38529 211009 -68607 -126146 26482 173316 151861 7413 -102320 -103147 -58460 -43885 -41655
38518 -41655 5157 94406 180454 242724 271308 226007 95937 -23247 -7642 131738 240324
38507 240324 192195 18671 -142295 -179490 -88088 45077 127591 139292 107722 31369 -87341
38496 -87341 -137431 23210 319747 450055 256350 -28180 -78209 89743 193600 118267
38486 118267 23022 30616 59888 20869 -32339 -24725 22476 66493 99744 84821 -28645 -181832
38474 -181832 -246102 -222691 -247261 -351477 -391041 -276969 -108159 9595 108516 219903
38464 219903 250112 123910 -73040 -213409 -279230 -295005 -238697 -130987 -80106 -111107 -87792
38453 -87792 44932 83610 -163195 -525478 -632416 -396179 -108317 -25928 -69767 -22653
38443 -22653 132322 214130 118976 -38366 -74202 49492 207842 279173 261225 208388 133805
38432 133805 47471 30977 150265 301000 271687 3994 -304950 -406112 -236835 57650
38422 57650 251038 174840 -147470 -459422 -474971 -186735 109430 139862 -78465 -316325
38412 -316325 -371156 -194700 102946 328104 375006 340794 365200 381912 212519 -90108
38402 -90108 -236380 -115136 31202 -17743 -138574 -104939 41462 83533 -38675 -200691
38392 -200691 -303162 -318205 -212387 -6828 154988 163566 103785 121263 211208 272571 273693
38381 273693 234883 167526 159483 352266 659052 700285 273838 -265810 -390097 -54291
38371 -54291 316082 407487 276249 83493 -90990 -159235 -50690 128550 202616 197738 264840
38360 264840 356110 270236 20870 -154383 -188740 -271036 -468537 -581744 -478179 -277764
38350 -277764 -98129 91556 246084 185225 -79369 -249825 -158140 -3855 12345 6266
38340 6266 132190 266238 248578 200937 289585 372344 219769 -64617 -191473 -138815 -106038
38329 -106038 -100471 46870 271353 272550 -8156 -253930 -234368 -97532 -51182 -32854 92492
38318 92492 226536 186864 37446 18204 188695 358081 374679 302150 267500 287919 321822
38307 321822 368430 410207 341243 92058 -198827 -283427 -110148 93899 117779 27881 16285
38296 16285 82312 42269 -167279 -383224 -453278 -416376 -369705 -298830 -154751 1955 65891
38285 65891 45617 46893 124956 243972 361542 466537 535667 525064 425250 291043 200721
38274 200721 181798 167135 49179 -177195 -355084 -331762 -171076 -89256 -167717 -261051 -237474
38263 -237474 -170021 -189631 -259953 -231433 -64474 117951 176033 68311 -147753 -353975
38253 -353975 -439181 -398733 -342340 -350883 -370010 -310475 -204337 -167941 -223054 -243351 -107178
38242 -107178 141171 322293 321189 231832 245899 383722 436461 261128 23001 -25065 70661
38231 70661 35739 -186423 -338728 -273742 -188561 -277761 -404001 -340960 -149544 -50197 -55620
38220 -55620 -3302 130152 216414 232744 272688 312990 220258 7717 -149715 -195944 -266491
38209 -266491 -419764 -507135 -404059 -192010 -8641 125763 223389 215355 56643 -157341
38199 -157341 -305773 -398666 -503478 -583656 -540932 -389768 -266271 -252362 -287427 -290291 -296684
38188 -296684 -406142 -610748 -751776 -689641 -476910 -294630 -231280 -213504 -168241 -140204
38178 -140204 -183626 -238706 -219997 -161984 -168066 -259196 -373721 -472379 -536368 -505048 -337594
38167 -337594 -109851 67158 195436 330894 411267 304938 36166 -198410 -272024 -242896
38157 -242896 -186132 -60180 177648 436064 566188 515994 357937 217885 192336 255434
38147 255434 244413 50805 -168142 -131200 162494 358932 203620 -98504 -167587 27619
38137 27619 173871 98420 -19325 18584 127639 127681 56537 87616 225989 316270 333082
38126 333082 420466 583252 580354 277566 -87789 -207291 -121631 -81899 -97640 39816 292366
38115 292366 314350 -14183 -329965 -278601 10002 196992 243193 318369 384833 258024
38105 258024 6030 -96108 -15576 -7503 -162360 -260631 -190392 -171295 -370202 -572595 -485211
38094 -485211 -176121 38107 23278 -85138 -144132 -131531 -48410 105382 247137 257553
38084 257553 137672 8746 -55906 -94127 -136401 -133761 -51810 44464 68318 33912 34230 104867
38072 104867 174157 172329 132151 120980 112560 22092 -133996 -222422 -165697 -23053 134620
38061 134620 295003 392946 305195 77359 -23151 140052 334102 297500 152677 175570
38051 175570 288735 179879 -117614 -212674 -3751 109092 -144024 -456663 -418867 -115746
38041 -115746 85976 103468 110376 107871 -66034 -343202 -418610 -188965 94131 187949 142256
38030 142256 131029 191573 236206 195356 64713 -103386 -209199 -181797 -62639 62572
38020 62572 198785 401330 621140 736877 760110 856348 1099390 1330890 1349687 1148858
38010 1148858 880153 662721 527320 491906 563445 659725 641310 476789 306926 269236
38000 269236 296731 188161 -116229 -432270 -552767 -474556 -322739 -143618 84881 285601
37990 285601 300024 99255 -157611 -310228 -328563 -244368 -95521 22053 476 -110340
37980 -110340 -118240 43422 199990 183759 60374 -15493 -42533 -112439 -194807 -154682 40290
37969 40290 259483 349079 254757 40964 -144453 -178877 -101880 -74355 -146862 -178525 -67634
37958 -67634 73650 105830 90226 147435 187729 11587 -345984 -592732 -542235 -331341 -213766
37947 -213766 -264176 -359807 -371975 -300096 -236922 -233036 -210608 -52594 211087 383449 319246
37936 319246 94667 -101411 -171568 -139127 -59776 8775 23907 28445 123720 294502 366478
37925 366478 237700 37789 -61505 -70256 -73885 -40182 78947 171238 112490 5052 29339
37914 29339 120560 57253 -150562 -240926 -102807 61914 62120 -19927 -572 143742 298233
37903 298233 365237 314463 191173 133861 266867 521812 678375 622867 449664 282504
37893 282504 141987 33485 9611 69758 125781 132712 128353 91773 -80664 -371784 -570258
37882 -570258 -525475 -357829 -283623 -324196 -328845 -224726 -103174 -75061 -147891 -244602 -268495
37871 -268495 -158208 50892 217582 207828 40965 -106958 -74405 111691 258840 228912
37861 228912 104246 68217 139096 143453 -13275 -196874 -259753 -264480 -343310 -450866 -443552
37850 -443552 -326012 -219627 -142715 -29944 76135 82401 65497 183622 373491 414335
37840 414335 326705 398483 709430 931042 776066 395086 117910 16410 -35939 -46017
37830 -46017 75375 261345 324845 228871 116782 79264 64240 22240 -9308 12892 81248
37819 81248 169233 241513 255394 230787 273844 434222 582782 540990 302356 22495 -178228
37808 -178228 -293557 -344980 -339410 -304659 -259701 -163710 -4845 88342 -23261 -242099 -294749
37797 -294749 -108049 44844 -92578 -379863 -450940 -211935 42671 44439 -110089 -141621
37787 -141621 34388 265764 411523 454276 395973 225166 16187 -93591 -73119 -14379
37777 -14379 49514 179858 332219 316085 74067 -173868 -221540 -157628 -174299 -239937 -191450
37766 -191450 -49760 14276 -17307 4533 109219 147210 54532 -38772 -32208 -10529 -92949
37755 -92949 -249694 -335858 -234071 47308 346477 454239 338970 199742 186488 178983
37745 178983 12293 -202521 -226080 -77390 612 -75344 -153443 -138472 -85917 -13607 101901
37734 101901 153895 34687 -77207 85908 378569 345220 -80490 -401391 -258933 84201
37724 84201 198451 63604 -96100 -236129 -409064 -489623 -334351 -80747 6784 -109667
37714 -109667 -271676 -385180 -429021 -331867 -77284 159638 188151 42904 -102502 -159110
37704 -159110 -128077 -24603 64458 10068 -127767 -91222 183046 375672 203700 -168046
37694 -168046 -371053 -310479 -155865 -30460 26884 -49642 -222344 -246015 23122 337879
37684 337879 364377 159870 47682 115867 163563 91506 25574 56195 134821 238917 392686
37673 392686 516475 486713 358407 318111 402842 457248 384002 266200 222919 274958 354856
37662 354856 358491 229715 64878 36007 141376 193251 143707 189093 388859 453392 176743
37651 176743 -164450 -183020 38326 116377 -21520 -107129 -42801 -18894 -100041 -81892 148086
37640 148086 416428 537877 546244 562374 620959 689469 707075 590607 347694 157485 177792
37629 177792 319316 387273 381183 444677 569217 577104 392065 135456 -42991 -79429 27106
37618 27106 215264 382545 501940 623224 688566 535063 200321 -7393 81332 257578
37608 257578 296987 285690 350035 373590 286449 319762 605509 825737 675686 387659 337239
37597 337239 413909 302451 124297 204246 406171 345953 130502 212901 572059 717698
37587 717698 531558 440113 658722 883917 877805 794541 762913 651869 415683 224042
37577 224042 120189 -31681 -181471 -105348 168930 386284 522710 748439 960571 902277
37567 902277 745954 949305 1472195 1750996 1546910 1214278 1029390 881323 741037 778087
37557 778087 864917 636788 210659 145818 496178 645013 339077 114536 343930 618957
37547 618957 525256 329029 385836 492256 364641 223417 370077 641827 760511 794999
37537 794999 866928 843879 700156 705755 901954 908653 604818 423772 589863 688821 439184
37526 439184 233620 388787 508939 207750 -137150 -16706 351190 467677 378969 393141
37516 393141 424427 287735 223635 465224 682549 513858 256352 370475 685050 765429
37506 765429 695744 805628 964144 840308 565194 474913 487190 358884 246660 386669
37496 386669 546098 419587 227624 291399 385484 179378 -52450 132526 543830 701545
37486 701545 649951 723784 835183 714771 550656 669923 880617 821905 655234 727802
37476 727802 890603 832857 722796 824811 887001 624841 376132 528812 759598 615537
37466 615537 355608 398319 469505 187803 -49566 274193 781654 843894 705159 923102
37456 923102 1227621 1053059 695772 784987 1088276 1013357 793794 968415 1211938 951259
37446 951259 600248 852041 1303595 1179233 834934 1060086 1491659 1313199 920710 1196986
37436 1196986 1738417 1607243 1227698 1596005 2225718 1978389 1343287 1624731 2413157
37427 2413157 2303812 1637079 1900588 2820782 2859890 2285848 2745443 3988940 4207064
37418 4207064 3539067 3874804 5157130 5476740 4963678 5730319 7707463 8686233 8835828
37409 8835828 10638371 13900182 15945774 17420756 22077592 29840351 36870564 43982404
37401 43982404 56880343 75840455 95737830 121009698 166580902 231162532 280242012
37394 280242012 274795965 215830090 144544070 97086473 74239324 58549987 43353997
37387 43353997 33411017 28945702 24133586 17723554 13831433 13224063 12209163 9659941
37379 9659941 8176114 8342485 7717838 5721508 4503100 4644672 4340499 3154460 2706708
37370 2706708 3291003 3308832 2407182 2007488 2415506 2353462 1641859 1554408 2210284 2260790
37360 2260790 1494608 1238763 1810212 1969937 1317482 946839 1273201 1370656 944157 890135
37350 890135 1386544 1408880 703505 354013 787731 1025308 566186 298259 789481 1252465
37340 1252465 1011185 609430 677182 919668 949775 1012886 1239783 1208237 816853 626831
37330 626831 852298 962340 702603 544953 728142 825750 659839 679574 1035697 1216200
37320 1216200 988492 797662 879933 893352 756460 910782 1400717 1634175 1420170 1309114
37310 1309114 1542857 1634177 1397084 1420645 2029113 2672997 2860952 2868184 3059136 3340058
37300 3340058 3735080 4652214 6094929 7446628 8523036 9995669 12288624 14960355
37292 14960355 17718212 21021849 24850395 27721961 27955417 25465819 21576486 17537433
37284 17537433 13926110 10990143 8730232 6858000 5254552 4221862 3858904 3614935
37276 3614935 2973639 2172520 1716675 1574326 1400469 1187712 1116746 1052951 746889 320155
37266 320155 76895 29299 13472 57089 249065 447051 453200 300355 122468 -27576
37256 -27576 -56029 153126 427258 399125 88214 -54316 136093 294263 225928 256328
37246 256328 553673 716287 467206 197866 331374 649918 757563 733228 802140 813809
37236 813809 595013 408570 513345 654185 525197 351444 461618 673477 685288 701070
37226 701070 1042084 1466776 1518643 1272596 1109654 1013619 731050 395158 334231 439085
37216 439085 352146 126581 81906 158363 40786 -205013 -246822 -125271 -145793 -225296 -11302
37205 -11302 381230 431063 66684 -170107 58870 459621 636084 562137 383382 182199
37195 182199 75700 170310 316989 253710 40690 -755 189685 328183 266024 176035
37185 176035 200837 265281 300445 336732 336662 235010 145057 216932 325399 239471 53579
37174 53579 61641 232598 237666 14377 -130529 -38391 102219 157953 239928 369674 345834
37163 345834 106457 -109276 -123150 -49816 -21910 37261 207626 375168 394851 274683
37153 274683 98437 -71545 -159262 -115553 -33023 -62810 -213428 -380377 -515723 -583368
37143 -583368 -447254 -54290 358067 508612 442879 380925 319363 129847 -58751 10144
37133 10144 259266 362769 270565 221750 244870 114828 -139793 -168537 128425 392542
37123 392542 343083 147071 83294 172024 298455 400561 401459 244055 84101 141578 305286
37112 305286 248643 -4296 -60084 187356 350565 190518 5893 117536 379714 512087
37102 512087 551087 636413 665747 513851 341064 349136 440769 422031 340578 335443 347074
37091 347074 262712 169965 187984 214018 105418 -47404 -88545 -72141 -105986 -84972 125721
37080 125721 367492 346797 46518 -273473 -424700 -417031 -308831 -155596 -66920 -119222
37070 -119222 -230182 -255445 -167572 -40379 63018 98111 43682 -24091 391 48925 -63933
37059 -63933 -307394 -408848 -287637 -231626 -445134 -697466 -678469 -459172 -305021 -244737
37049 -244737 -150894 -75149 -152048 -287438 -288660 -227227 -337123 -598344 -746704 -685696 -582313
37038 -582313 -537533 -449577 -259978 -94300 -81452 -200972 -348159 -415040 -318590 -97565
37028 -97565 46302 -42251 -260108 -393835 -408707 -407892 -385674 -256707 -89931 -62302 -171508
37017 -171508 -223307 -133224 -31968 -30406 -73146 -81639 -76873 -101444 -156027 -255663 -422542 -587485
37005 -587485 -616269 -470456 -252219 -78200 10414 29664 35588 98785 211254 269043 234750
36994 234750 227948 330176 405198 286726 60128 -42697 27407 114123 114561 52801 -63247
36983 -63247 -235821 -357896 -330979 -272659 -347253 -412597 -159638 346032 613351 375408
36973 375408 -10383 -39549 289131 561042 528022 323253 161252 87595 51931 35468
36963 35468 35423 26253 -14459 -92766 -211798 -340516 -381856 -248438 18990 269924 398848
36952 398848 431458 435161 400505 273447 84452 -39440 -26999 43969 77720 121931 273236
36941 273236 448014 421003 145287 -130685 -175397 -70444 -56144 -188799 -315304 -313431
36931 -313431 -181617 59960 363479 555497 439748 52079 -322143 -435077 -286634 -46142
36921 -46142 107856 59432 -176028 -395577 -353549 -41863 275504 375875 317858 283164
36911 283164 293558 231772 88264 12928 87087 184105 152054 48094 56430 199329 290240
36900 290240 221344 132529 167597 208894 67457 -150203 -143281 112633 294105 218333 110133
36889 110133 209123 374504 330486 105863 -58894 -107976 -173569 -266482 -271020 -220536 -277814
36878 -277814 -417906 -411031 -190107 8773 -29225 -230137 -387828 -421098 -371592 -281342 -175660
36867 -175660 -76938 30771 170623 277931 241410 72339 -75272 -93885 -39186 -28629
36857 -28629 -109533 -244595 -345662 -322576 -185212 -76704 -102037 -155752 -49443 212789
36847 212789 427421 447546 308905 121186 -16117 -9564 149789 307000 297355 164053
36837 164053 64542 7415 -109503 -236453 -205010 -35549 55070 4353 2846 164918 354000
36826 354000 435286 456515 458546 348518 109457 -82913 -110647 -83724 -112974 -120962 -41787
36815 -41787 5249 -64709 -111471 -16268 71949 -14510 -136021 -56641 139687 158237 -30046
36804 -30046 -127175 51146 328699 429921 297447 79296 -54414 -16214 165736 354878
36794 354878 408859 309604 162686 83906 121294 241676 339284 310066 178107 94405 157101
36783 157101 301082 413662 463498 450615 342547 152303 -24634 -142173 -257371 -361954
36773 -361954 -314509 -81537 108788 46110 -151765 -223396 -158599 -161770 -276199 -312346 -164257
36762 -164257 42261 170187 234434 271680 227055 72292 -93081 -160838 -151343 -155762 -207172
36751 -207172 -272108 -318867 -335438 -302197 -188835 7447 213136 290150 162585 -57315
36741 -57315 -158168 -80285 23683 29096 9701 76018 181476 227819 242170 281505 267670
36730 267670 118485 -34517 14822 225343 352063 307310 248976 277129 274491 140911 -3168
36719 -3168 22857 213574 401487 449134 338523 138192 -46119 -130206 -111517 -56543 -30376
36708 -30376 -65462 -160484 -252701 -245662 -147584 -117760 -260920 -437932 -426169 -221507 -18512
36697 -18512 72839 104899 109086 53793 8886 125238 375806 527060 478043 434215 590543
36686 590543 798756 746902 391116 19303 -104470 -10462 89751 80960 45476 121503 318312
36675 318312 502716 555722 489022 385005 286653 200868 146902 124108 86054 25776 18064
36664 18064 81756 89970 -42384 -163630 -60674 215955 396219 342747 169567 18674
36654 18674 -81470 -126142 -107059 -100942 -192644 -291841 -230883 -56962 11340 -53761 -45133 94947
36642 94947 147360 3357 -113452 -1124 201269 269592 248926 309707 433960 497777 519240
36631 519240 575633 597823 490362 347658 311305 313710 208441 62752 58944 169903 195872
36620 195872 87210 -19460 -61569 -102137 -133323 -68565 60110 112040 49789 -54214 -195090
36609 -195090 -399955 -551552 -502459 -344762 -288362 -284071 -94263 234701 346926 135890
36599 135890 -50271 38871 153871 -17049 -305317 -324238 -84416 43725 -98142 -286587
36589 -286587 -314229 -230824 -135071 -11517 123344 141827 1047 -148569 -172046 -130999 -134602
36578 -134602 -130875 -3990 179776 190097 -71749 -398366 -470784 -206594 143799 276703
36568 276703 174095 89118 188606 324340 251163 -15220 -214715 -198677 -98848 -92043 -150230
36557 -150230 -134535 -35920 14260 -63491 -208813 -318236 -340037 -271626 -142292 -15702 44303
36546 44303 22727 -61791 -197130 -349015 -423863 -345762 -164263 -2514 94903 164610 183676
36535 183676 71695 -119002 -165598 61259 399695 585919 562142 467137 393347 315288
36525 315288 226286 174681 149072 74088 -47439 -112345 -68407 26216 117980 209768 271902
36514 271902 237769 130794 55891 11692 -133430 -396501 -571579 -490738 -261821 -105993
36504 -105993 -68080 -38087 29614 77367 64811 -6825 -128658 -223969 -152037 78875 214166
36493 214166 65959 -173461 -172256 55427 189332 109379 39947 128875 210971 140899 66627
36482 66627 144606 215385 45023 -256542 -356760 -182198 -5390 -46321 -223126 -340932
36472 -340932 -325535 -201394 -12864 136470 103639 -121764 -357634 -442142 -428152 -458559
36462 -458559 -516923 -445335 -199302 54115 133348 30834 -150524 -340941 -481999 -455012
36452 -455012 -206445 66747 54271 -262660 -507005 -349469 60973 292479 185912 -3579
36442 -3579 -19705 71884 64279 -71163 -195200 -228106 -220418 -236550 -276265 -298456 -260441 -159240
36430 -159240 -72453 -105606 -253637 -375509 -356427 -231758 -104483 -22556 2747 -45580 -127426
36419 -127426 -133417 -42607 -7760 -157691 -385818 -479219 -409356 -341905 -381247 -458291 -477100
36408 -477100 -436649 -384044 -350713 -344640 -321154 -189482 44493 190732 83549 -152597 -228706
36397 -228706 -81636 60600 33234 -60888 -76106 -41320 -30077 2666 101300 174188 135596
36386 135596 59492 37026 3185 -122465 -238537 -207135 -105032 -104672 -164261 -87302 114577
36375 114577 175701 -42597 -342078 -459900 -380130 -262153 -199402 -177042 -172482 -172745 -142802
36364 -142802 -66621 18533 84463 153624 229134 252051 189535 104007 74949 109429 179420
36353 179420 271844 336491 267925 38028 -205938 -272895 -128491 105788 301472 385019
36343 385019 313594 118973 -44496 -26990 127612 229055 191152 116805 101789 88720 81
36332 81 -96793 -86530 -3610 11784 -59423 -81860 5599 68618 -24847 -193174 -255895 -192870
36320 -192870 -135052 -125101 -71891 24045 -284 -200437 -353013 -233357 49307 206962 197587
36309 197587 248819 451442 585764 452297 172124 10802 35754 94096 47810 -91288
36299 -91288 -205316 -166051 45761 254835 223028 -58472 -319924 -344294 -221243 -155922
36289 -155922 -162315 -112843 13086 122034 187055 255544 317008 326871 323920 366689 397570 333520
36277 333520 241654 243288 287782 220793 47211 -81360 -117010 -129231 -86372 115935 382550
36266 382550 446185 243675 19978 -34131 -9676 -40142 -80947 -74364 -109458 -237925 -315061
36255 -315061 -211639 -38657 11772 -71882 -160030 -157373 -23567 222340 399144 261129
36245 261129 -147728 -445358 -401712 -252845 -292844 -390166 -238275 87773 210416 9778
36235 9778 -260589 -397374 -444353 -452279 -373149 -254429 -246848 -338358 -332002 -160708 11959
36224 11959 66867 66322 55749 -17896 -108603 -51768 145776 242586 121764 -18513 21315
36213 21315 163336 250666 304225 385141 400526 275381 159137 218797 344462 301998 92891
36202 92891 -74325 -110287 -107744 -115160 -85643 -52786 -125467 -262172 -257536 -34082 222667
36191 222667 315797 279325 256319 259122 203893 115108 120773 236051 308927 250257 187760 260477
36179 260477 343868 174757 -237641 -530446 -424999 -83123 134304 134724 106961 149118 147910
36168 147910 40473 -56574 -60992 -59025 -116690 -132844 -9596 168441 253173 220434 126103
36157 126103 -14204 -181883 -290477 -287933 -246566 -245319 -244285 -179632 -93431 -51877 -16010
36146 -16010 79330 182340 186327 91349 -3550 -31537 2844 60717 64488 -71712 -311698
36135 -311698 -465819 -392954 -179244 -25135 -13211 -71607 -99181 -40859 91574 195551
36125 195551 156299 20311 -17900 114865 245527 207563 78822 30411 75478 126775 172375
36114 172375 217706 179809 34142 -52207 59684 246403 326963 364224 489517 552787 292815
36103 292815 -192285 -499567 -461704 -301680 -210177 -112503 48752 129482 42777 -62027
36093 -62027 -45817 10815 -9662 -75305 -139037 -249860 -381414 -361273 -148616 9608 -100436
36082 -100436 -340318 -423009 -303507 -163829 -117115 -131921 -176304 -244924 -285733 -256522 -213764
36071 -213764 -215743 -197868 -81500 49817 27577 -178238 -430360 -587509 -598347 -478612
36061 -478612 -298195 -158351 -101422 -81732 -74263 -124829 -222980 -234416 -65278 197038 410054
36050 410054 550465 661173 731950 749665 753704 710285 461289 -27737 -482016 -589060
36040 -589060 -385037 -166789 -84198 -50320 -17975 -74407 -211587 -241233 -53461 201435
36030 201435 309672 270314 268972 426364 648126 719007 535986 253679 150525 311087
36020 311087 517455 530963 387150 290442 309697 350000 364847 392602 396029 273927 66256
36009 66256 -36325 52865 201072 249809 191701 107568 55724 69665 146190 201474 159304
35998 159304 96625 151837 274234 257885 80621 -2077 182820 458760 545737 423623
35988 423623 279708 214260 188508 190990 262275 371330 420312 375060 282147 174561 67230
35977 67230 22154 99308 244683 332687 329761 329203 412753 548685 634323 586193 402161 191315
35965 191315 110442 190743 255538 111272 -188294 -381227 -319353 -138351 -56028 -104749 -155564
35954 -155564 -137518 -105453 -93229 -25154 154869 337724 340369 141740 -66171 -99904 19217
35943 19217 145922 210029 237213 225864 138744 14930 -43494 -28480 -48261 -144001 -204196
35932 -204196 -134566 -1545 86156 134532 187651 191700 89891 -8747 63237 259965 331475
35921 331475 148509 -126633 -261416 -221883 -129170 -48636 51376 176067 268447 306853
35911 306853 334984 350336 240558 -81775 -495429 -710909 -551180 -162555 114155 87403
35901 87403 -115051 -227635 -141760 20250 87164 33449 -16022 53697 202467 265745 145041
35890 145041 -60916 -173447 -166443 -178009 -257634 -233572 42808 400552 476446 155450 -267300
35879 -267300 -429939 -290568 -76452 54114 145488 258478 316352 226361 66798 28289
35869 28289 177121 384411 519420 607127 715107 774777 656594 396600 190834 131610
35859 131610 95374 -37474 -194186 -259270 -290615 -414841 -572138 -559040 -328154 -71174
35849 -71174 40466 51643 96543 200282 289123 302353 211567 10951 -224723 -344780 -283298
35838 -283298 -163296 -144064 -209551 -218622 -137479 -89095 -149708 -218190 -158547 6659 135566
35827 135566 165801 181910 273188 400265 453182 401668 321085 272615 225415 129016 11385
35816 11385 -47121 -8542 107014 276943 480159 648179 680947 537689 279001 15640
35806 15640 -151675 -166270 -62963 21295 -31074 -167512 -215569 -106965 35160 67454 -6509
35795 -6509 -87147 -101438 -16440 160404 307974 234361 -74986 -346468 -321254 -104765 -19996
35784 -19996 -139328 -190461 23187 330595 450154 373761 322439 412469 545175 599166 566417
35773 566417 471876 293759 39445 -174466 -208892 -62967 109271 162530 107900 64843
35763 64843 89616 117557 91812 70131 136545 263497 351722 367891 338509 243692 60543
35752 60543 -92233 -27559 236270 437238 400333 265052 263700 403423 522920 562144 590630
35741 590630 622342 589248 487324 383280 273416 94395 -106752 -169430 -35546 154458
35731 154458 230881 159849 10843 -127191 -159109 -29584 183066 308129 270480 165163
35721 165163 114947 133905 151741 85194 -118758 -399549 -547517 -403855 -112749 3462
35711 3462 -137491 -282769 -233540 -94791 -11851 89651 287368 404886 256245 1066
35701 1066 -54148 78864 123025 9485 -42606 57443 115833 11001 -100276 -81021 -52650
35690 -52650 -152198 -274944 -271592 -226696 -311137 -478928 -537481 -443823 -322366 -237492 -145881
35679 -145881 -51563 -24775 -63399 -89319 -86091 -98763 -97253 7719 188228 282226 203018
35668 203018 51622 -31022 -25166 7348 33836 53442 46984 -11965 -116401 -221646 -266028
35657 -266028 -210168 -96883 -40823 -88354 -125007 -27240 126160 144647 26594 -22519 67941
35646 67941 88771 -100636 -268550 -102371 296912 500698 333842 84256 45068 117502
35636 117502 58358 -84008 -54824 174964 348974 318272 239807 282988 345091 228226 -23388
35625 -23388 -156615 -48019 152075 233390 163271 67220 56012 130591 220226 265186 259117
35614 259117 222778 152975 31453 -109525 -187013 -171272 -136786 -156044 -198872 -211986 -240437
35603 -240437 -358239 -505995 -521864 -342933 -74971 138809 211769 88192 -223621 -556510
35593 -556510 -676439 -548224 -386487 -364968 -407245 -365896 -266612 -218640 -191583 -76247 81336
35582 81336 105030 -44448 -198409 -214359 -139645 -90155 -91019 -108336 -137127 -169594 -143211 -12318
35570 -12318 156958 239000 195089 118093 119904 201832 256674 198110 68416 -8230 26866
35559 26866 110504 157954 159363 141145 99099 41072 45944 183103 383443 475738 363565
35548 363565 110382 -148548 -322404 -399948 -429540 -465468 -489570 -405320 -165322 123569
35538 123569 296758 313460 263135 214483 159396 101961 88363 117364 114158 35519 -66939
35527 -66939 -120403 -110518 -69382 -40022 -58101 -108122 -107007 -9389 85292 32863 -151548 -302551
35515 -302551 -321796 -261588 -184007 -89663 -21752 -71036 -202106 -238750 -124141 -33915 -96591
35504 -96591 -160250 -23069 225817 319466 205121 93617 121660 181816 140409 45409 26174
35493 26174 103586 189909 211752 172527 133928 161510 250459 309810 271791 190341 153943 138814
35481 138814 66544 -16114 26447 179121 241717 113349 -35852 4202 192125 314153
35471 314153 279126 180822 100949 12049 -101159 -160730 -101826 22662 106280 103958 34972
35460 34972 -73310 -183007 -229724 -185421 -121286 -132874 -201257 -204687 -86393 69419 167317
35449 167317 216173 236671 141710 -144727 -475926 -562115 -316502 13787 144408 63364
35439 63364 -62252 -173322 -339707 -540157 -613539 -475316 -246800 -95883 -37009 35160
35429 35160 165941 267436 217574 2143 -240282 -325592 -206273 -29908 31204 -14085
35419 -14085 -14964 89322 183373 152319 42118 -25762 -24851 -20067 -34563 -15343 64998 144676
35407 144676 143562 68230 16257 71286 202156 284502 235050 104568 12122 11673 68417 145096
35395 145096 241359 342164 395338 364870 259931 104835 -58206 -131106 -14001 258930
35385 258930 508262 585415 505869 370519 231618 99601 8829 -15710 -14637 -32128 -34820
35374 -34820 17785 58320 -15710 -155996 -177651 -10063 168455 138413 -71015 -209072 -128256
35363 -128256 20301 -6171 -193794 -262523 -45805 244902 269875 20675 -147890 20466
35353 20466 355901 501857 362114 162621 122605 211944 243650 103865 -139614 -307802
35343 -307802 -284482 -144432 -72665 -127639 -161655 -42009 143346 219294 187572 199370 293298
35332 293298 325387 177292 -98266 -356865 -470302 -361466 -76283 172574 194311 74430
35322 74430 68937 216105 267191 84340 -123815 -118841 17973 61043 6359 13310 83026
35311 83026 68163 -25583 -11800 169501 343726 365742 296655 231812 129602 -64509 -252682
35300 -252682 -287206 -177994 -82133 -104776 -183053 -166542 13498 248318 343017 242360 119141
35289 119141 148076 240979 158370 -125332 -359089 -368622 -275595 -253569 -251800 -137854 29048
35278 29048 92731 88721 190428 372949 378953 99899 -208962 -229073 34980 310012 406558
35267 406558 359715 257430 104917 -86410 -202735 -133854 63932 209566 204507 113386
35257 113386 12184 -147419 -430902 -732982 -829969 -643599 -346602 -149471 -64079 46120
35247 46120 241458 424424 462520 319589 74179 -133431 -183222 -65004 110291 224837
35237 224837 262135 262884 216268 79913 -101902 -195296 -126423 26060 124565 119590 74992
35226 74992 76922 141911 195916 134017 -72925 -317302 -423758 -299766 -14945 267257 425542
35215 425542 456559 438564 429985 408530 322736 192105 107471 110089 117464 16473 -192015
35204 -192015 -381495 -420091 -280307 -55413 108976 131039 65607 30945 58814 81784 77552
35193 77552 115282 203568 213921 59875 -151547 -276330 -343196 -441148 -480668 -290322 61289
35182 61289 269550 175991 -43166 -149923 -137918 -145314 -208237 -233564 -152171 -2824 104251
35171 104251 70426 -90862 -229549 -222607 -159826 -237957 -456531 -579510 -447134 -158581
35161 -158581 123435 364330 549003 578654 445389 351949 457396 617367 580996 354981
35151 354981 155853 67244 -18383 -137441 -173476 -71319 72559 189388 322687 458300
35141 458300 445793 214313 -52483 -97626 103394 324813 355100 197586 17425 -37608
35131 -37608 55621 215383 332448 334003 224117 97208 74353 167177 229467 117674 -121762
35120 -121762 -318021 -404129 -448700 -472551 -416248 -326560 -363726 -522076 -551932 -317987 -49057
35109 -49057 -27676 -183613 -231517 -101462 20367 13704 -62568 -148530 -241208 -280789 -187444
35098 -187444 -14099 113941 186915 262714 289646 189290 58925 49757 91957 9100 -134622
35087 -134622 -112043 48478 62133 -147438 -320079 -279842 -152145 -53526 92817 281729
35077 281729 309008 134594 50614 245635 474978 424026 160277 -38784 -88374 -60135
35067 -60135 48216 224570 305084 202999 104191 164591 204096 8253 -252638 -260371 -54884
35056 -54884 74447 86049 166856 284532 193581 -97432 -275330 -212125 -140757 -243281 -397739
35045 -397739 -457520 -478388 -521008 -491619 -338015 -188706 -152176 -158827 -118037 -57639 -10194
35034 -10194 60622 130477 96143 -22319 -49811 73203 172044 97933 -63407 -147540 -113168
35023 -113168 5557 177958 309985 270375 88277 -37134 -14108 31709 8543 5796 70386
35012 70386 59508 -115795 -294438 -294633 -169619 -58345 43855 170433 212836 94339 -24193
35001 -24193 50265 240141 325599 269201 178377 50549 -173382 -371507 -349944 -177047 -129622
34990 -129622 -276262 -373284 -240402 -4663 131769 171050 233866 326394 329025 164623 -101361
34979 -101361 -304347 -307875 -130708 60675 135799 140063 187289 282411 357591 408967 448138
34968 448138 383952 147754 -93897 -77244 181627 367052 285986 99302 30844 52121
34958 52121 18895 -40157 16923 172739 241900 138020 -587 12728 203549 432202 535540
34947 535540 451027 245708 46737 -70737 -128952 -181487 -235121 -265151 -279976 -320426 -387091
34936 -387091 -402677 -284404 -67601 74182 -4622 -221338 -308931 -124908 146853 203529
34926 203529 -4977 -238593 -298712 -250732 -261333 -346667 -390289 -329332 -202066 -52939 85914
34915 85914 127689 -21542 -296195 -452460 -314326 -266 195078 148135 35373 70566
34905 70566 212009 242957 94161 -63677 -73197 1261 -8337 -152416 -350489 -510402 -554510
34894 -554510 -405183 -83082 215225 273754 90828 -143358 -279149 -304651 -247333 -137756
34884 -137756 -75467 -161167 -319089 -347086 -209749 -118550 -217514 -348833 -291252 -111831 -72760
34873 -72760 -232878 -358762 -271556 -101759 -97067 -291169 -487410 -518927 -401083 -225761
34863 -225761 -23111 203682 376615 387430 255758 154653 221079 387600 464885 364707
34853 364707 175691 30860 -27465 -39757 -49952 -67395 -78871 -78702 -96025 -177224 -313798
34842 -313798 -413708 -394477 -288110 -199093 -174844 -180417 -184714 -193099 -196420 -166984 -112655 -63811
34830 -63811 -9753 68178 107066 16030 -166058 -285103 -278400 -245691 -264832 -269662 -193702 -105164
34818 -105164 -77772 -33347 136945 362695 464625 402966 302369 240264 170132 77211 46336
34807 46336 97315 85202 -115565 -401921 -541896 -456789 -289683 -188189 -130379 -15491
34797 -15491 159306 294967 315898 214810 8290 -244758 -394856 -313221 -89983 20227
34787 20227 -72427 -163565 -74273 53679 -22385 -250979 -371442 -336170 -344397 -435617 -378041
34776 -378041 -80557 189063 193300 73245 62187 73750 -111070 -393377 -449444 -234204
34766 -234204 -56551 -115439 -253976 -259539 -155588 -72662 -33578 -12477 -57231 -201095 -342221
34755 -342221 -337350 -168986 55678 223255 283575 260080 230377 244185 249959 169932 33573
34744 33573 -65569 -126649 -214041 -280206 -199677 -15959 46030 -101847 -273430 -302594 -278518
34733 -278518 -327652 -351873 -212069 -34600 -63559 -269822 -381677 -307843 -267006 -427897
34723 -427897 -648167 -694606 -556789 -396868 -295625 -199483 -73456 27035 47463 13642
34713 13642 -9890 -1551 7766 -2477 -4180 25929 38648 -34127 -154188 -198985 -145912 -119350
34701 -119350 -172694 -156179 43745 241664 152545 -183755 -417297 -348152 -134334 16650
34691 16650 106450 171467 105001 -130311 -302402 -184039 86399 179230 36072 -108892
34681 -108892 -129469 -135322 -179533 -141945 -1190 56160 -42892 -70120 154922 416899 365189
34670 365189 12328 -288470 -311892 -158037 -654 101142 98896 -81836 -355898 -455989
34660 -455989 -253791 29493 90369 -74432 -210597 -169175 -63013 -71579 -228026 -423415
34650 -423415 -526627 -475291 -314245 -161208 -96172 -97843 -121215 -180775 -285755 -356922 -317469
34639 -317469 -220411 -159998 -101007 43399 193869 175200 27314 8742 198104 330643
34629 330643 193769 -34796 -73655 22375 4865 -113878 -107651 915 -79398 -387495 -552830
34618 -552830 -345157 -49318 -25072 -164162 -124852 79041 117189 -96282 -268293 -192775
34608 -192775 -16547 58803 58765 88704 139666 184200 263559 334027 221934 -98589 -362029
34597 -362029 -340648 -162007 -83119 -90596 9515 193021 208609 -28555 -296317 -370759 -260771
34586 -260771 -87092 67008 113076 -34544 -299877 -458143 -422357 -372653 -476180 -615122
34576 -615122 -553377 -283128 -35458 19930 -59844 -126596 -128439 -129713 -200800 -317153 -371296
34565 -371296 -304382 -202206 -189567 -246841 -247233 -178576 -165181 -216868 -147068 129970 388024
34554 388024 359171 97802 -123209 -188702 -196172 -199690 -146336 -58101 -30885 -19308 138357
34543 138357 411140 526692 352918 123057 119507 297356 405983 357928 267889 200798
34533 200798 107364 9622 45574 255724 458686 436702 189090 -67748 -132496 -10199
34523 -10199 123536 119971 -11648 -180989 -367884 -601596 -796922 -758694 -443359 -107488
34513 -107488 -46886 -230966 -350923 -233153 -46493 -39308 -207560 -342529 -331719 -264774
34503 -264774 -237706 -188803 -14245 225342 338014 250342 113728 96179 157786 149613 81121
34492 81121 118836 294819 394277 243361 -21311 -123397 -10410 121695 133922 89117
34482 89117 64403 -1936 -173216 -340324 -319224 -89284 165051 252547 154918 3694 -78449
34471 -78449 -92960 -130153 -231530 -317875 -288196 -165912 -78294 -84469 -101966 -42426 52122
34460 52122 81359 54807 98134 279142 490973 551778 403777 176374 39822 26466 42488
34449 42488 42547 95028 217897 257482 79566 -166662 -172959 108702 375414 400087 346113
34438 346113 474585 704197 727178 486418 243179 158409 99349 -46550 -143303 -70777
34428 -70777 3396 -139326 -391024 -437253 -205623 45930 94897 -5927 -97230 -129938 -129029
34417 -129029 -90565 -22104 9811 -33670 -94474 -102672 -65534 -12682 70120 170327 173614 -34878
34405 -34878 -402585 -718701 -807058 -678075 -489105 -378217 -343993 -288363 -165591 -40150
34395 -40150 28202 79977 156752 185217 97829 10986 89736 248525 222399 -12842 -148728
34384 -148728 1033 201932 154626 -64076 -172061 -126432 -98863 -119710 -74365 -3002 -65493
34373 -65493 -202532 -168326 49426 181383 140992 184048 439062 625240 496266 269759
34363 269759 283836 445706 404821 148773 16651 132583 219653 73285 -112222 -64013
34353 -64013 164470 316663 307790 267012 282538 301663 281069 278050 337214 382481 302691 113354
34341 113354 -43050 -72520 -39308 -48822 -79115 -31910 70694 80436 -50890 -179485 -181643
34330 -181643 -127628 -132613 -150830 -62309 120076 278965 358967 361013 251847 49680 -80198
34319 -80198 -22360 60494 -59602 -273411 -238076 92502 356955 307319 133158 94899 121896
34308 121896 26698 -112844 -102065 -18709 -117723 -394308 -554992 -444609 -228984 -99108
34298 -99108 -46245 -22714 -90912 -261876 -364347 -257048 -62841 -15070 -132379 -215383 -147196
34287 -147196 -37551 -39581 -154421 -282436 -375448 -450146 -500208 -493052 -450925 -446127 -480244
34276 -480244 -438425 -232511 44411 183371 77110 -191045 -473361 -693606 -837884 -896982
34266 -896982 -875784 -804800 -689134 -496513 -248743 -65381 -38950 -106520 -124398 -38925 97342
34255 97342 243822 398936 518176 523510 425704 337461 313080 258812 76660 -159815 -266318
34244 -266318 -176049 -27109 8716 -67623 -105781 -20822 97404 136447 146679 254820 411750
34233 411750 389442 99498 -226843 -305409 -147952 5204 28434 8674 34213 79845 117670
34222 117670 162254 167546 49800 -138447 -233926 -224386 -290786 -493015 -622588 -516642 -314620
34211 -314620 -199178 -73590 222337 512875 455162 82159 -175398 -80780 112566 94464
34201 94464 -57083 -82013 17760 8115 -196249 -422790 -500530 -447895 -385808 -388812 -436893
34190 -436893 -433317 -286004 -43419 98722 23878 -123126 -104065 95839 258212 229792
34180 229792 83953 -37403 -100676 -144939 -192830 -274617 -442784 -666295 -774911 -615229
34170 -615229 -247565 90850 223181 179047 95958 31175 -75511 -256755 -403840 -372638
34160 -372638 -191080 -59209 -97260 -191903 -180047 -91402 -66014 -90246 -2947 225437 405796
34149 405796 389315 258950 168941 125334 46036 -60887 -117730 -124105 -159856 -259950 -375338
34138 -375338 -438330 -398046 -227786 24998 227199 276660 211942 148746 141571 164858 179611
34127 179611 144837 15088 -184591 -325269 -310360 -207326 -145364 -122730 -35120 127372
34117 127372 244778 239762 169821 122658 118531 145382 203994 282814 348410 377483 351138 239519
34105 239519 66718 -43735 673 104551 88628 -51548 -139657 -93318 -37977 -78598 -118403
34094 -118403 -24496 143276 208503 115616 -34984 -145641 -195599 -175909 -64940 107297
34084 107297 239704 237805 93977 -107538 -256208 -308877 -332809 -431671 -623054 -818552
34074 -818552 -915762 -863104 -654200 -338140 -32257 163543 269449 355080 384823 269320
34064 269320 71216 -19823 31636 39337 -99626 -230680 -216535 -188506 -305111 -413513 -233534
34053 -233534 182978 459281 373913 91157 -128881 -220540 -233934 -176478 -66214 -4232
34043 -4232 -63881 -188268 -278514 -298924 -237698 -79831 97822 121284 -75057 -320598 -400083
34032 -400083 -306838 -194542 -141068 -91969 -4358 88668 158445 211255 226147 165548 68912
34021 68912 35852 79394 90592 4802 -84955 -64956 16740 21112 -53678 -50879 99015 233300
34009 233300 160332 -64147 -201484 -160497 -112620 -213902 -344430 -267347 8747 198242
33999 198242 104680 -124042 -203103 -78381 49777 34931 -43096 -58583 -48768 -119632 -222995
33988 -222995 -187477 30235 268537 369688 333925 214359 12219 -213312 -276904 -86535
33978 -86535 160191 196647 47497 -43485 -4289 7006 -53634 -13025 176000 276143 132102
33967 132102 -50609 -27192 88807 29421 -172085 -242408 -112699 9954 3547 -32795 -40255
33956 -40255 -122106 -318223 -486578 -514740 -468148 -436311 -399230 -334998 -298106 -295456 -233807
33945 -233807 -87003 23395 7510 -67959 -121310 -175477 -236719 -210690 -71223 28160 -36297
33934 -36297 -156115 -158194 -71262 -47040 -94303 -88898 -18970 -28283 -188286 -371994 -407206 -273167
33922 -273167 -112674 -91037 -233023 -362702 -253942 97563 412131 421707 173196 -64505
33912 -64505 -143800 -154479 -212592 -281805 -258130 -136215 -12911 48291 101876 244647 455008
33901 455008 550910 378819 38573 -179847 -120595 70868 155791 76261 -52998 -125453
33891 -125453 -109207 -8445 125675 188195 116502 -40392 -199920 -319923 -352665 -258129
33881 -258129 -145839 -233829 -518601 -659976 -411763 -17576 100674 -57525 -116532 67364
33871 67364 214839 108063 -84905 -123352 -38118 31770 101624 215440 253477 112153 -61727
33860 -61727 -60172 58083 63454 -84865 -204273 -182868 -92860 -17398 31144 6365 -156834
33849 -156834 -372377 -427925 -257343 -44448 25554 -14343 -39753 -59948 -172915 -354176
33839 -354176 -442117 -353539 -210225 -194156 -323878 -437294 -395506 -246292 -139832 -116791
33829 -116791 -70455 59075 153860 67884 -153818 -318118 -324671 -250810 -191953 -134655 -29603
33818 -29603 104016 204340 230431 157391 -19681 -228491 -343663 -332959 -308042 -354590 -385975
33807 -385975 -269544 -42164 126745 164334 157804 186676 219460 205467 150605 56414 -104228
33796 -104228 -290057 -378513 -330437 -268341 -292031 -310198 -184566 30373 148069 117739 69665
33785 69665 92179 127696 128367 156434 249559 316041 268708 168834 128950 144991 136559 99045
33773 99045 95238 122268 103357 11516 -98289 -188530 -276925 -355376 -362882 -282780 -193129 -160737
33761 -160737 -136633 -27211 156629 298894 333898 327151 354626 360354 227752 -15707 -179877
33750 -179877 -155380 -78850 -148835 -341281 -449617 -385518 -276964 -239410 -215937 -126412 -29372
33739 -29372 -12035 -27443 17721 88151 81436 18836 22687 116484 189327 169680 106223 51439
33727 51439 -13418 -90696 -111045 -40071 27723 -36696 -227091 -381837 -346460 -146619 10308
33716 10308 -70693 -364274 -638143 -689347 -527339 -307178 -153827 -103236 -140289 -204951 -205150
33705 -205150 -109633 2219 47388 40307 14526 -70447 -225575 -317219 -219957 -37202 15728
33694 15728 -67270 -82661 38024 103498 -22327 -172139 -98479 170778 360303 276910 -16638
33683 -16638 -322120 -480243 -434114 -235875 -36363 -2095 -170785 -387134 -434878 -275197
33673 -275197 -119535 -185344 -392280 -431642 -181760 102472 131707 -34077 -127780 -85009
33663 -85009 -66562 -124397 -124208 -31056 -5693 -118682 -190043 -45453 234894 447720 504746
33652 504746 425773 236232 8597 -101900 -5648 187109 270483 145092 -109878 -294473
33642 -294473 -225396 62172 266129 142599 -132791 -159753 116570 326273 245356 105456
33632 105456 152913 234764 112371 -84484 -70066 115834 203435 151947 157791 277652 387613
33621 387613 474890 629526 760895 666187 402487 253349 273544 205963 -53382 -242512
33611 -242512 -143727 83208 176642 148546 169609 259739 315709 325664 349089 357175 270851 117572
33599 117572 10817 -2773 24104 32881 11689 -14701 476 80261 170722 201582 212137
33588 212137 313678 499751 619484 593186 522140 501492 452551 261532 -7054 -168370
33578 -168370 -144436 -28641 49867 49905 35260 124219 377887 682201 794459 581571 183769
33567 183769 -115543 -159065 -18515 126447 154777 70980 -41805 -118602 -156067 -159449 -101132
33556 -101132 10567 76856 26267 -46135 12703 173099 236644 114396 -57910 -132365 -129128
33545 -129128 -126930 -111174 -41379 31511 31808 -21031 -53796 -48435 -32924 -14334 13400 41886
33533 41886 73281 114425 118851 24175 -117116 -157976 -66643 6361 -45915 -118604 -65144 76126
33521 76126 162432 166120 163993 167905 121012 33804 -20010 -34341 -67824 -109997 -77181 34645
33509 34645 104545 42809 -82576 -127508 -40294 89444 133871 55988 -66290 -137735 -142603
33498 -142603 -121039 -88434 -48040 -57627 -172909 -311454 -295688 -84204 148614 231013 188205
33487 188205 138575 103959 41332 -12992 30861 166315 271507 245084 104704 -36420 -59882
33476 -59882 50039 164029 138566 12009 -29253 76923 157006 49918 -151557 -225499
33466 -225499 -96536 128094 308789 337363 145664 -195381 -450100 -446158 -282821 -170353
33456 -170353 -123327 9073 238782 362000 218642 -117083 -435016 -558674 -415494 -88346
33446 -88346 170388 124897 -172869 -408689 -374175 -212513 -209210 -412289 -579393 -496721 -244825
33435 -244825 -80665 -100407 -127746 22364 274352 406435 368150 305717 279474 171102
33425 171102 -62561 -259201 -303545 -318867 -436166 -539180 -448630 -234726 -120093 -154053
33415 -154053 -197936 -167425 -82080 60136 241848 321348 196658 21301 16094 116151 76752
33404 76752 -99160 -149880 1985 111461 5079 -173998 -238647 -219004 -202195 -136963 27669
33393 27669 182951 205864 132339 55938 -14961 -85295 -95705 -29826 27232 27841 18241 -15550
33381 -15550 -169503 -388518 -430338 -219160 -22748 -70281 -186598 -69708 210722 300178
33371 300178 89202 -145476 -156381 -21411 60840 67029 107135 206212 268345 229776 148851
33360 148851 113521 102228 1582 -213997 -391724 -378022 -237075 -158819 -173972 -138676 -19450
33349 -19450 21559 -90768 -192129 -153187 -112117 -236939 -411400 -395641 -206144 -89839
33339 -89839 -155560 -259515 -261281 -187866 -107744 -19660 69690 90939 6275 -122849 -205449
33328 -205449 -203051 -135922 -66997 -66227 -124215 -130655 -20387 100088 85590 -13624 8581 220628
33316 220628 433104 436442 261032 113943 113144 184437 218555 231164 298084 384396 358041
33305 358041 196819 54914 37246 28224 -110878 -280658 -287081 -177824 -176435 -295818 -313506
33294 -313506 -180833 -138032 -297495 -424030 -320140 -142782 -97246 -77581 100044 326646
33284 326646 381245 305816 276144 257902 136572 44753 170983 345374 237852 -76100
33274 -76100 -184081 15652 170205 47165 -162740 -233327 -198905 -117431 77195 299946
33264 299946 258763 -95549 -392605 -363826 -228530 -283994 -415334 -350725 -147163 -38068
33254 -38068 11966 189840 390278 313876 -16100 -227995 -138832 22510 10257 -121744
33244 -121744 -212106 -237595 -222891 -122248 46181 122854 40109 -2649 208181 557094 715014
33233 715014 575349 373983 333799 374708 293220 95529 -25001 10235 75388 65464 24590
33222 24590 -12198 -112617 -262754 -278478 -85387 84699 25360 -66909 118233 426860
33212 426860 375656 -91283 -421228 -210244 245445 427851 303951 209710 266725 310315
33202 310315 277043 282059 339842 331232 254631 236047 280952 268344 196785 184735 214810 138537
33190 138537 -34113 -122085 -113762 -241961 -595376 -898596 -846531 -480737 -79017 177861
33180 177861 284274 299582 318660 439170 613395 640515 446237 247976 269832 406363
33170 406363 387135 205005 127441 277542 455361 458102 363905 355317 417057 388902 234528
33159 234528 75832 -13105 -77598 -135909 -119290 -13055 72430 47836 -42978 -132366 -235827
33148 -235827 -346305 -342345 -158589 42810 63268 -25856 13083 195782 285195 186463 101832
33137 101832 177208 244151 93348 -191903 -373885 -370534 -228707 48464 407007 611055
33127 611055 483930 197711 49978 23940 -122796 -370016 -393089 -68870 311634 468349
33117 468349 481360 538273 577816 418355 93750 -159234 -182401 -18753 178982 252453
33107 252453 134039 -58197 -109083 21829 126670 43065 -113818 -148960 -87143 -92740 -177942
33096 -177942 -195546 -94461 7369 22435 9745 47050 104501 107362 58137 40447 115019
33085 115019 229420 247903 108853 -60010 -68241 81751 180211 99540 -33900 -48821 25468
33074 25468 64492 85457 187985 316602 289311 74357 -132387 -149790 -10317 113937
33064 113937 84396 -112712 -338239 -356257 -41394 439822 758943 761211 575383 389816
33054 389816 259609 170027 133998 130419 58706 -131754 -332348 -389207 -279552 -103286 45002
33043 45002 119560 97108 4482 -55785 1107 130865 216628 229341 251984 331616 386465
33032 386465 313220 150170 69480 188526 421074 559017 505221 373847 320245 320919 211001
33021 211001 -65229 -343661 -426005 -303497 -136187 -62084 -91095 -149363 -158522 -88790 8888
33010 8888 39589 -15490 -42735 70368 262998 349943 252380 91021 13411 13980 -2981 -45183
32998 -45183 -24956 77702 150591 95294 -29483 -78174 144 119968 187646 193277 156977
32987 156977 64590 -84192 -220267 -278439 -296947 -354057 -415334 -349806 -123018 130633 280478
32976 280478 341044 359601 272628 24568 -229684 -233221 33977 287659 279651 73277 -103028
32965 -103028 -147669 -114394 -59780 -15772 -44646 -157279 -217019 -96229 91322 104469 -67596
32954 -67596 -171072 -70231 54818 15812 -82887 -40678 100024 146701 92170 97957 174027
32943 174027 138823 -64742 -254130 -293188 -286518 -372817 -501681 -557209 -556372 -561175 -507976 -309102
32931 -309102 -56907 61567 32837 25879 119050 179843 77041 -108712 -173668 -27219 234029
32920 234029 456700 572643 610861 611879 568631 467046 356652 319788 354241 348482 218952
32909 218952 23292 -120197 -186738 -249340 -348099 -425551 -402520 -279393 -149800 -113378 -151427
32898 -151427 -103082 159690 520855 691972 552453 303464 184164 151799 3392 -264577
32888 -264577 -424988 -345798 -155418 -35700 -9386 -5785 -6760 -33650 -75268 -113684 -166938
32877 -166938 -244779 -303888 -287163 -174522 11136 197230 274455 198675 73020 37742 96666
32866 96666 168722 277219 501112 724094 665645 273366 -113882 -159823 56094 195330
32856 195330 115471 -30185 -82562 -60781 -52284 -74418 -80084 -19669 103840 197598 153420
32845 153420 13349 -38077 70611 177515 143566 78426 126905 176469 34872 -200571
32835 -200571 -257063 -130402 -81854 -165394 -113289 186416 430264 325960 20479 -143246
32825 -143246 -105928 -68016 -117453 -148736 -100272 -44876 -47164 -87848 -115671 -62584 135680
32814 135680 419226 588712 545367 450813 491327 588464 537569 336614 146739 3630
32804 3630 -162155 -259894 -104084 225276 392964 268174 98354 109262 200861 194649 123623
32793 123623 73424 -31664 -236752 -345594 -186291 58693 96150 -9810 41302 240072
32783 240072 228695 -115338 -418263 -320977 20994 188255 66578 -90544 -69372 78937
32773 78937 189719 148419 -104275 -535983 -936640 -1027697 -752671 -368174 -169424 -195025
32763 -195025 -266863 -241602 -124208 18481 137093 187820 143926 61430 64984 214557 424556
32752 424556 559945 579756 540006 490232 436252 396144 418178 513373 608936 596391 419532
32741 419532 130002 -115581 -147585 54394 297668 357275 229232 111057 112534 114349 -11966
32730 -11966 -172982 -186328 -67807 -5448 -52010 -23122 227140 560908 700644 558851
32720 558851 319010 202347 243559 322956 354969 373759 432004 485292 441129 297181 147517
32709 147517 44862 -46700 -124456 -85550 114095 329922 388564 325428 320755 423284 492047
32698 492047 428261 318227 293186 358770 419097 385814 228724 5445 -136604 -91666 44405
32687 44405 63186 -72932 -173175 -101345 36680 90007 105100 223174 429824 565333
32677 565333 540464 410954 266631 156727 98660 65027 -9683 -127687 -177014 -67357
32667 -67357 131648 273433 300086 240623 120658 -18283 -87267 -64425 -68104 -181067 -285874
32656 -285874 -240448 -135595 -173021 -343529 -456427 -457622 -461004 -460995 -305792 -27636 92577
32645 92577 -64969 -236661 -151169 76767 139697 -34187 -262933 -394909 -390165 -220026
32635 -220026 76614 292900 239641 11113 -139435 -167429 -254908 -451448 -545669 -388795
32625 -388795 -146422 -83793 -221027 -340381 -271598 -55638 147472 229763 215897 211947 274161
32614 274161 339058 321411 256057 257420 338723 378242 301506 193931 165969 192951 179844
32603 179844 129342 144766 280390 467667 592500 592703 484050 341489 254412 252080 263317
32592 263317 184636 -2817 -209202 -331717 -351286 -333124 -354165 -432265 -510091 -514664 -453591
32581 -453591 -435986 -551168 -722988 -743528 -493109 -93249 207798 282377 203164 91392
32571 91392 -29050 -187632 -346034 -404073 -320373 -168060 -58597 -47021 -117652 -220953
32561 -220953 -300202 -306935 -224804 -89837 20409 41086 -11387 -38272 29337 124215 122233
32550 122233 41366 54903 240593 424769 393364 174116 -36440 -157237 -251009 -312393
32540 -312393 -254431 -123624 -96820 -199240 -248796 -169792 -123536 -194314 -198957 -12504 155455
32529 155455 86703 -39771 90492 387637 466139 254587 99139 207712 369249 351434
32519 351434 235038 169106 92719 -67271 -162996 -49278 139725 196192 178164 277056 449159
32508 449159 458851 251077 29889 -34976 28983 128432 203115 185657 49583 -83712 -59700
32497 -59700 69997 97161 -35506 -164900 -181164 -164292 -169891 -85675 160341 409417 455317
32486 455317 314786 164680 93299 66468 73080 131927 176134 99797 -55565 -106674 15858
32475 15858 125041 -14408 -378707 -670107 -619684 -266637 81605 155222 -27146 -210055
32465 -210055 -177518 43709 233708 188496 -109238 -468528 -630915 -498229 -246870 -157165
32455 -157165 -303200 -483819 -496980 -381425 -299488 -277094 -210899 -92217 -44068 -101650 -116765
32444 -116765 29914 241113 345310 348230 405175 570939 713737 700192 555333 387634
32434 387634 238878 82631 -75146 -176295 -189656 -155224 -137186 -162862 -211538 -234861 -183744
32423 -183744 -45501 131078 267757 326387 329342 303738 237669 119672 -7073 -82637 -119453
32412 -119453 -193324 -319218 -393502 -321173 -166299 -87353 -116839 -103407 70764 298737 379815
32401 379815 303134 269407 405395 575533 553327 302489 -3921 -199231 -263924 -272066 -291210
32390 -291210 -342013 -382516 -322221 -117410 141172 303994 330309 301230 261990 163554 3544
32379 3544 -96989 -54978 25705 -10405 -141187 -210564 -182119 -200391 -364457 -567934 -640996
32368 -640996 -567181 -468528 -421052 -379748 -285438 -167937 -104535 -110552 -117877 -67492 11801 48503
32356 48503 31926 13927 -1536 -100557 -339631 -632527 -823015 -841824 -730378 -548276 -346594
32345 -346594 -208752 -202474 -271714 -275569 -168449 -53003 -14636 5149 107474 278854 403371
32334 403371 385241 211605 -49144 -258738 -280101 -107022 111837 221689 187217 45342
32324 45342 -170658 -390508 -486921 -403065 -236183 -99143 23089 165636 228243 102181
32314 102181 -98022 -126214 68114 279846 333523 256692 139823 7025 -111932 -153303
32304 -153303 -143276 -191339 -281181 -245480 -55863 52212 -97241 -342158 -422804 -357409 -346697
32293 -346697 -410733 -387757 -251236 -158844 -170818 -165884 -87820 -50500 -118086 -180188 -143967
32282 -143967 -75474 -42815 18828 158356 262159 198634 14460 -134920 -168570 -93014 68762
32271 68762 243637 294780 172087 7997 -51307 -31985 -29976 -17890 82888 204521 192512
32260 192512 43134 -86096 -100531 -52625 -8257 13822 -33634 -193993 -373612 -408016 -302844
32249 -302844 -241718 -297297 -315144 -182492 -37339 -61019 -197267 -252935 -188512 -122918 -96772
32238 -96772 -22924 119300 209994 158955 24987 -90725 -166343 -212675 -202578 -140215 -137650
32227 -137650 -307396 -581776 -732672 -607554 -296807 -35091 27270 -74592 -203787 -247745
32217 -247745 -177875 -52144 24319 -12502 -120852 -214843 -284231 -377865 -460135 -399770 -168076
32206 -168076 60968 119508 68676 75650 137923 105960 -48279 -184069 -237281 -318547 -494272
32195 -494272 -639027 -609123 -433029 -232946 -78780 -14027 -95434 -288641 -439525 -469321
32185 -469321 -482980 -562169 -594473 -478676 -358528 -419060 -545382 -456152 -146012 85126
32175 85126 72837 -14498 -2529 22579 -74210 -203100 -185854 -47577 15073 -97716 -296486
32164 -296486 -440668 -451435 -319745 -112544 41341 57526 -16231 -70680 -62002 -11397 77712
32153 77712 219237 376600 469650 457390 371269 265196 162103 50521 -76683 -176242
32143 -176242 -167992 -35391 109927 135908 52592 -20504 -39988 -68307 -103509 -35837 156932
32132 156932 322337 348998 331893 387268 436363 356861 245792 300688 478350 516224 324757
32121 324757 136480 180765 391796 550121 567438 500845 397476 275506 197906 218904
32111 218904 270208 217915 44481 -114247 -134811 -41696 50419 77889 69684 70984 71814 29844
32099 29844 -54834 -121654 -117680 -57760 4563 40289 47564 18249 -49597 -119274 -143789 -117530
32087 -117530 -57835 36608 144567 175774 73997 -41083 25356 254887 369413 177693
32077 177693 -142288 -254969 -99027 64333 31630 -93405 -100607 25163 137394 177630
32067 177630 223337 291262 262544 85889 -68866 -3959 207823 278134 80717 -169395
32057 -169395 -188361 41987 316481 478315 494508 331037 -31174 -426651 -556429 -326776
32047 -326776 -7255 78797 -69633 -199708 -174034 -96907 -84019 -90056 -36906 22757 -8956
32036 -8956 -93897 -95327 5707 52389 -72523 -256494 -278022 -85759 148828 263504 274744
32025 274744 268821 245800 176522 114822 104141 43137 -165232 -360466 -253602 143099 446278
32014 446278 373971 85008 -99999 -117386 -95889 -50476 79500 183510 76429 -172569
32004 -172569 -292192 -216469 -161502 -230776 -233477 -37875 150869 78030 -171464 -295911 -181679
31993 -181679 19763 150139 192357 198675 229016 333922 472098 491726 323437 133806
31983 133806 138358 311328 439391 418376 319778 196613 29176 -130691 -171778 -123299 -146726
31972 -146726 -267181 -309891 -194490 -96262 -177375 -324906 -326323 -180052 -48476 8041 57033
31961 57033 103396 66646 -50236 -131918 -114798 -49384 24769 140643 294856 378382 280010
31950 280010 15417 -267183 -377376 -214193 107240 291467 148282 -159191 -287456 -148729
31940 -148729 -10248 -98261 -285523 -312390 -170273 -60336 -48104 4608 151890 229697
31930 229697 100997 -126779 -249258 -217250 -118887 -5167 116964 177085 99170 -38779
31920 -38779 -68227 17506 37931 -80093 -148507 9760 265505 343527 208492 84995 100024
31909 100024 119923 10586 -129569 -129435 -10764 60055 14847 -69234 -124661 -146618 -101491
31898 -101491 62905 278032 362185 248826 113336 171457 400721 561925 484100 238516
31888 238516 15922 -88267 -119223 -149587 -197165 -248615 -296839 -327725 -313755 -255423 -198495
31877 -198495 -176991 -169828 -149490 -131778 -123350 -68131 67389 189103 167894 30250 -65945
31866 -65945 -56199 -30518 -35427 21555 181805 306037 272283 179495 189436 258924 213575 29039
31854 29039 -154375 -269202 -374015 -463686 -424070 -224706 9088 174561 294973 390206
31844 390206 399627 318480 274611 363328 503868 552621 474145 319464 124902 -73500 -196199
31833 -196199 -186760 -84495 27500 102173 122584 84015 16446 -46831 -139283 -302212 -450947
31822 -450947 -447970 -341791 -347080 -505087 -566228 -354382 -57015 50522 15058 89250 299220
31811 299220 402383 264198 33672 -91789 -80224 -728 85725 122982 90342 75879 187762
31800 187762 365787 422902 311186 201788 241638 358434 377916 233877 775 -194184
$$ [...]
##END NTUPLES=NMR SPECTRUM
##END=
