##TITLE=31Pdec_IBFP1204
 CDCl3, 24 sc
 13.4.2023
##JCAMPDX= 6.0         $$ Bruker NMR JCAMP-DX V2.0
##DATA TYPE= NMR SPECTRUM
##DATA CLASS= NTUPLES
##ORIGIN= UXNMR, Bruker Analytische Messtechnik GmbH
##OWNER= root
$$ XWIN-NMR		Version 3.5
$$ Thu Apr 13 14:20:14 2023 Russian Standard Time (UT+4h)  she@DPX200
##.OBSERVE FREQUENCY= 81.013821
##.OBSERVE NUCLEUS= ^31P
##.ACQUISITION MODE= SIMULTANEOUS
##.ACQUISITION SCHEME= undefined
##.AVERAGES= 24
##.DIGITISER RES= 16
##SPECTROMETER/DATA SYSTEM= spect
##.PULSE SEQUENCE= zgpg30
##.SOLVENT NAME= CDCl3
##.SHIFT REFERENCE= (INTERNAL, CDCl3, 0, 248.564)
##AUDIT TRAIL= $$ (NUMBER, WHEN, WHO, WHERE, WHAT)
$$ ##TITLE= Audit trail, XWIN-NMR		Version 3.5
$$ ##JCAMPDX= 5.01
$$ ##ORIGIN= Bruker BioSpin GmbH
$$ ##OWNER= she
$$ F:/spectra/data/she/nmr/P31/1/pdata/1/auditp.txt
$$ ##AUDIT TRAIL=  $$ (NUMBER, WHEN, WHO, WHERE, WHAT)
(   1,<2023-04-13 14:19:26.35 +0400>,<she>,<DPX200>,
      <created by zg, POWCHK disabled, PULCHK disabled
       configuration hash MD5:
       00 E9 B6 7A A2 85 ED C7 34 08 36 98 17 FE 4E 26
       data hash MD5: 32K
       96 E0 CA 57 2B 05 65 6F 85 68 B3 C5 DA 05 69 70>)
(   2,<2023-04-13 14:19:31.28 +0400>,<she>,<DPX200>,
      <Start of raw data processing
       efp BC_mod = 2 LB = 1 FT_mod = 6 PKNL = 1 PHC0 = -10974.59 PHC1 = 75.48538 SI = 64K 
       data hash MD5: 64K
       CF 54 BC 89 1B DB 9D 8C C0 0A EA 34 FE 72 8D DD>)
(   3,<2023-04-13 14:19:42.70 +0400>,<she>,<DPX200>,
      <pk PHC0 = -0.2775491 PHC1 = 0 
       data hash MD5: 64K
       91 17 AF BC BE 4D D6 6E EB 8A AF A8 A1 EF 55 2C>)
$$ ##END=
$$ 
$$ hash MD5
$$ 0A 9A EB 90 12 59 36 D9 77 CF 1A 34 7C E3 45 73
##$RELAX= 
##$RELAX= 
##$RELAX= 
##$RELAX= 
##$RELAX= 
##$RELAX= 
##$RELAX= 
##$RELAX= 
##$RELAX= 
$$ Bruker specific parameters
$$ --------------------------
##$DU= <F:/spectra>
##$EXPNO= 1
##$NAME= <P31>
##$PROCNO= 1
##$TYPE= <nmr>
##$USER= <she>
##$AMP= (0..31)
100 100 100 100 100 100 100 100 100 100 100 100 100 100 100 100 100 100 
100 100 100 100 100 100 100 100 100 100 100 100 100 100 
##$AQSEQ= 0
##$AQ_mod= 1
##$AUNM= <au_zg>
##$AUTOPOS= <>
##$BF1= 81.014009
##$BF2= 200.13
##$BF3= 200.13
##$BF4= 200.13
##$BF5= 200.13
##$BF6= 200.13
##$BF7= 200.13
##$BF8= 200.13
##$BYTORDA= 1
##$CFDGTYP= 0
##$CFRGTYP= 5
##$CHEMSTR= <none>
##$CNST= (0..31)
1 1 145 1 1 1 1 1 1 1 1 1 1 1 1 1 1 1 1 1 1 1 1 1 1 1 1 1 1 1 1 1 
##$CPDPRG= <waltz16>
##$CPDPRG1= <>
##$CPDPRG2= <waltz16>
##$CPDPRG3= <>
##$CPDPRG4= <mlev>
##$CPDPRG5= <mlev>
##$CPDPRG6= <mlev>
##$CPDPRG7= <mlev>
##$CPDPRG8= <mlev>
##$CPDPRGB= <>
##$CPDPRGT= <>
##$D= (0..31)
0 1 0 0 0 0 0 0 0 0 0 0.03 2e-05 3e-06 0 0 0 0 0 0 0 0 0 0 0 0 0 0 0 0 
0 0 
##$DATE= 1681381166
##$DBL= (0..7)
120 120 120 11 120 120 24 19 
##$DBP= (0..7)
150 150 150 150 150 150 150 150 
##$DBP07= 0
##$DBPNAM0= <>
##$DBPNAM1= <>
##$DBPNAM2= <>
##$DBPNAM3= <>
##$DBPNAM4= <>
##$DBPNAM5= <>
##$DBPNAM6= <>
##$DBPNAM7= <>
##$DBPOAL= (0..7)
0.5 0.5 0.5 0.5 0.5 0.5 0.5 0.5 
##$DBPOFFS= (0..7)
$$ [...]
##$SUBNAM2= <"">
##$SUBNAM3= <"">
##$SUBNAM4= <"">
##$SUBNAM5= <"">
##$SUBNAM6= <"">
##$SUBNAM7= <"">
##$SUBNAM8= <"">
##$SUBNAM9= <"">
##$SW= 501.771253377433
##$SWIBOX= (0..15)
0 1 3 0 0 0 0 0 0 0 0 0 0 0 0 0 
##$SW_h= 40650.406504065
##$TD= 32768
##$TD0= 1
##$TE= 0
##$TE2= 300
##$TE3= 300
##$TEG= 300
##$TL= (0..7)
0 120 53 12 22 120 120 120 
##$TP= (0..7)
150 150 150 150 150 150 150 150 
##$TP07= 0
##$TPNAME0= <>
##$TPNAME1= <>
##$TPNAME2= <>
##$TPNAME3= <>
##$TPNAME4= <>
##$TPNAME5= <>
##$TPNAME6= <>
##$TPNAME7= <>
##$TPOAL= (0..7)
0.5 0.5 0.5 0.5 0.5 0.5 0.5 0.5 
##$TPOFFS= (0..7)
0 0 0 0 0 0 0 0 
##$TUNHIN= 0
##$TUNHOUT= 0
##$TUNXOUT= 0
##$USERA1= <user>
##$USERA2= <user>
##$USERA3= <user>
##$USERA4= <user>
##$USERA5= <user>
##$V9= 5
##$VALIST= <valist>
##$VCLIST= <CCCCCCCCCCCCCCC>
##$VD= 0
##$VDLIST= <DDDDDDDDDDDDDDD>
##$VPLIST= <PPPPPPPPPPPPPPP>
##$VTLIST= <TTTTTTTTTTTTTTT>
##$WBST= 1024
##$WBSW= 4
##$XGAIN= (0..3)
0 0 0 0 
##$XL= 0
##$YL= 0
##$YMAX_a= 7242
##$YMIN_a= -8234
##$ZGOPTNS= <>
##$ZL1= 120
##$ZL2= 120
##$ZL3= 120
##$ZL4= 120
##$ABSF1= 0
##$ABSF2= 0
##$ABSG= 0
##$ABSL= 0
##$ALPHA= 0
##$AQORDER= 0
##$ASSFAC= 0
##$ASSFACI= 0
##$ASSFACX= 0
##$ASSWID= 0
##$AUNMP= <proc_1d>
##$AZFE= 0.1
##$AZFW= 0.5
##$BCFW= 0
##$BC_mod= 2
##$BYTORDP= 0
##$COROFFS= 0
##$CY= -3
##$DATMOD= 1
##$DC= 0
##$DFILT= <>
##$DTYPP= 0
##$F1P= 0
##$F2P= 0
##$FCOR= 1
##$FTSIZE= 65536
##$FT_mod= 6
##$GAMMA= 0
##$GB= 0
##$INTBC= 1
##$INTSCL= 6.047779e-11
##$ISEN= 30
##$LB= 1
##$LEV0= 0
##$LPBIN= 0
##$MAXI= 10000
##$MC2= 0
##$MEAN= 0
##$ME_mod= 0
##$MI= 50
##$NCOEF= 0
##$NC_proc= -7
##$NLEV= 6
##$NOISF1= 182.463
##$NOISF2= 159.3651
##$NSP= 0
##$NTH_PI= 0
##$NZP= 0
##$OFFSET= 248.5645
##$PC= 4
##$PHC0= -10974.87
##$PHC1= 75.48538
##$PH_mod= 1
##$PKNL= yes
##$PPARMOD= 0
##$PSCAL= 0
##$PSIGN= 0
##$REVERSE= no
##$SF= 81.0140089999694
##$SI= 65536
##$SIGF1= 159.3651
##$SIGF2= -187.1042
##$SINO= 113.3802
##$SIOLD= 16384
##$SREGLST= <1H.CDCl3>
##$SSB= 0
##$STSI= 65536
##$STSR= 0
##$SW_p= 40650.406504065
##$SYMM= 0
##$S_DEV= 0
##$TDeff= 32768
##$TDoff= 0
##$TI= <>
##$TILT= no
##$TM1= 0
##$TM2= 0
##$TOPLEV= 0
##$USERP1= <user>
##$USERP2= <user>
##$USERP3= <user>
##$USERP4= <user>
##$USERP5= <user>
##$WDW= 1
##$XDIM= 65536
##$YMAX_p= 324652669
##$YMIN_p= -27039218
$$ End of Bruker specific parameters
$$ ---------------------------------
##NTUPLES= NMR SPECTRUM
##VAR_NAME=  FREQUENCY,     SPECTRUM/REAL,   SPECTRUM/IMAG
##SYMBOL=    X,             R,               I
##VAR_TYPE=  INDEPENDENT,   DEPENDENT,       DEPENDENT
##VAR_FORM=  AFFN,          ASDF,            ASDF
##VAR_DIM=   65536,         65536,           65536
##UNITS=     HZ,            ARBITRARY UNITS, ARBITRARY UNITS
##FACTOR=    0.620285442955139, 1,           1
##FIRST=     20137.2065510682, 0,            0
##LAST=      -20513.1999529968, 0,           0
##MIN=       -20513.1999529968, -27039218,   0
##MAX=       20137.2065510682, 324652669,    0
$$ Real data points
##PAGE= N=1
##DATA TABLE= (X++(R..R)), XYDATA
$$ [...]
45037 -1913915 -2567790 -3043491 -3040879 -2336679 -1294788 -579632 -115548 643465 1309387 878649
45027 878649 -194948 38563 2101659 3685007 2535594 -283512 -1532891 203419
45019 203419 2922659 3675838 1835797 -423645 -716516 767854 1509873 -129680 -2721496
45010 -2721496 -3608539 -2255515 -457951 435367 909014 1740691 2605416 2812456 2345531
45001 2345531 1575310 690190 -231723 -1218218 -2513907 -3950511 -4411959 -3012973 -685370
44992 -685370 658959 517043 39477 -37234 -132701 -413737 -439913 -629625 -2216729 -4922064
44982 -4922064 -6359460 -4912372 -1923381 82408 265648 -475314 -1294968 -2067862 -2887121
44973 -2887121 -3780384 -4490929 -4225016 -2536881 -781345 -1292635 -4286149 -6859166 -6205198
44964 -6205198 -2845087 442308 1987658 2285593 2388112 2619420 2746375 2527291 2125316
44955 2125316 2301027 3695434 5603479 6251625 4812804 2376708 444466 -617850
44947 -617850 -1086729 -964963 -412496 -132473 -400424 -513894 -2824 533788 608754 750590
44937 750590 1185292 801901 -1118625 -3057275 -2798405 -341910 2193866 3213924 2834396
44928 2834396 1834292 918530 828483 1674562 2110528 566163 -2481305 -4685779 -4540111
44919 -4540111 -2781435 -836816 852176 2273074 2708536 1383590 -1007194 -2474161
44911 -2474161 -1839117 -193565 303355 -1003005 -2560382 -2781578 -2153723 -2288683 -3367853
44902 -3367853 -3835445 -2613502 -290008 2109218 4119793 5179706 4508591 2470304
44894 2470304 701435 -18393 -638958 -1621956 -1607226 69726 1179012 -660573 -3947000
44885 -3947000 -4688508 -1750890 1659654 2313771 546685 -1403239 -2754613 -4297564
44877 -4297564 -6090820 -6719974 -5102761 -2258019 -646140 -1512289 -3178873 -2795160 -12278
44868 -12278 2185555 1186192 -1737820 -3086784 -1726721 -41749 -437454 -2409987 -3760253
44859 -3760253 -3426197 -2088854 -676747 601815 1726247 2213966 1673168 887594 1458523
44850 1458523 3669597 5399671 4473732 1776304 278705 907470 1587942 1024571 781580
44841 781580 2005048 2719393 1050638 -921563 113268 3405071 5238680 4738042 4671699
44832 4671699 6183029 6590840 3716771 -795223 -4115830 -5570722 -5717956 -4536302
44824 -4536302 -2469586 -1267614 -1743818 -2225894 -1073235 687126 1071986 195174 -304095
44815 -304095 139242 856203 1570139 2369372 2637331 1695724 143169 -861802 -1235481
44806 -1235481 -1559467 -1528700 -322677 1607957 2489857 1240842 -1171252 -2521901 -1342434
44797 -1342434 1448586 2962948 1402859 -1232114 -1100983 2355239 5323936 4818110
44789 4818110 2719387 2573410 4279804 4848744 3357188 1979942 2219958 3015855 3113568
44780 3113568 2903782 3050900 3161991 2691838 1763025 501184 -1077293 -2075381 -1165867
44771 -1165867 1275419 2904937 2150476 85140 -1219891 -1124963 -355071 436276 897264
44762 897264 456934 -1173656 -3082645 -3678878 -2381279 -314452 963807 1185979 1342051
44753 1342051 1777313 1089347 -1988143 -5924246 -7394348 -5507338 -3155916 -2900003 -3432171
44744 -3432171 -2256689 -214285 -220234 -2209779 -2903485 -1057146 451837 -802975 -2996916
44735 -2996916 -2956923 -847562 485181 -221058 -1343985 -1120157 49786 376421 -1043602
44726 -1043602 -2997037 -3261657 -1346393 308805 -828431 -3541676 -3892995 -600216
44718 -600216 2908347 3130041 1028625 -85652 497678 690924 -515027 -1720354 -1690720
44709 -1690720 -945625 -243166 730983 2374400 4077372 4882715 4541309 3450174 2049324
44700 2049324 574165 -898008 -2232325 -2975624 -2672347 -1654824 -924770 -911200 -1092259
44691 -1092259 -1189286 -1583087 -1890779 -645029 2248478 4120458 2612386 -673265 -1823471
44682 -1823471 308059 2790189 2565822 -184446 -3101573 -4458321 -4215808 -3385131 -2915853
44673 -2915853 -2636925 -1424722 842959 2239025 1168647 -897642 -1184463 216091
44665 216091 484799 -1392319 -3089454 -2936389 -2592435 -3802284 -4835976 -2877259 1345400
44656 1345400 4128480 3637581 1730750 721319 458237 -473598 -2085608 -2834182 -1788971
44647 -1788971 -13768 560567 -609595 -2033563 -2018541 -645891 713537 1367550 1639431
44638 1639431 1427393 2123 -2257956 -3365919 -1982348 701489 2291213 1861913
44630 1861913 607206 246001 1206111 2012163 554042 -3226753 -6240734 -5347572 -1486810
44621 -1486810 1234675 818379 -656142 -996442 -865584 -1135737 -314067 2566445 4899295
44612 4899295 3886448 1335420 1161370 3032187 2822653 -533311 -3044444 -1745760
44604 -1745760 1064076 1696013 125451 -1233648 -1489718 -1418661 -1197728 -451067 359896
44595 359896 604068 765718 1312867 1164347 -761116 -3121856 -3422113 -1534631 101196
44586 101196 28865 -456985 150042 996036 288872 -1671446 -2663072 -1757937 -749987
44577 -749987 -1512009 -3126677 -3260296 -1899308 -1545540 -3159353 -4215276 -2451871 369578
44568 369578 988302 -359641 -650658 685848 868229 -1284353 -3116624 -2495517 -1210294
44559 -1210294 -1635322 -2653387 -1895376 -81488 286478 -542051 114212 2703139 4384648
44550 4384648 3233129 777444 -644045 -870682 -1003896 -1139560 -467023 1173369 2908983
44541 2908983 3686831 3022339 1254372 -669058 -1880617 -2064700 -1234450 288527 1373396
44532 1373396 708776 -1218784 -2054333 -778929 408915 -724820 -2776243 -2814072 -1131052
44523 -1131052 -580660 -1469698 -895984 2036883 4063334 2674750 157444 263813 3036075
44514 3036075 5460227 5679895 4135613 1728157 -760706 -2171908 -1994496 -1401964 -1650638
44505 -1650638 -2170625 -1800383 -958746 -790106 -1033224 -665691 105385 459558 783772
44496 783772 1746595 2288013 951295 -1235418 -1771658 -452853 414409 -342795 -1437996
44487 -1437996 -1720561 -1526554 -940543 663498 2515813 2448009 172047 -1725504 -1317381
44478 -1317381 297410 1394448 2064208 2715181 2525610 1427125 1476862 3779845 5768551
44469 5768551 4290137 249204 -2510049 -2182992 -329713 1187712 2001027 2112340 1311548
44460 1311548 -62119 -1431871 -2869933 -4170710 -3807969 -889147 2535999 3576044
44452 3576044 2495769 1999458 2794564 2863547 1361742 73994 153455 363269 -235126
44443 -235126 -579522 -9157 265457 -201894 467939 3241488 5559489 4495601 967157
44434 967157 -1680190 -2098563 -1551793 -1055997 -392907 396694 662050 288088 -213135
44425 -213135 -478494 -152072 1177266 2755050 2631424 391422 -1434117 -608542 1454559
44416 1454559 1840957 481150 -286802 352829 1096428 1410532 1988705 2277944 536762
44407 536762 -3031513 -5706943 -5522787 -3111103 -46276 2452440 3082104 1352704 -662952
44398 -662952 -133821 2427617 3600356 2155835 585559 565166 374754 -1380390 -2798516
44389 -2798516 -1912758 -110324 428909 303721 934803 1179757 -704739 -3230764 -3322639
44380 -3322639 -964768 1048897 1508081 1785453 2595305 2792258 1787318 631466 121340
44371 121340 -203768 -786679 -1422347 -1984913 -2263776 -1403164 728671 2138696 873072
44362 873072 -1790053 -2773570 -1670063 -1072761 -2276285 -3592221 -3709016 -3834954 -5075937
44353 -5075937 -6126527 -5402402 -3687602 -2828964 -3044761 -3131405 -2401910 -1083663 404214
44344 404214 1465039 1420268 587534 474114 1921792 3729988 4017747 2458102 522080
44335 522080 -24156 1478329 4031532 5620924 5161772 3805192 3307230 3362249 2228306
44326 2228306 30364 -779408 919870 2879476 2498107 296197 -1124863 -370935 1919574
44317 1919574 4457416 6053410 5814141 3951964 1894158 718257 199137 -8126 494255
44308 494255 1630379 2159087 1377092 253343 -252693 -515774 -607189 831025 4120230
44299 4120230 6586168 5570798 2369925 640738 1584091 3208118 3811324 3477854 2313474
44290 2313474 45002 -2271671 -2761216 -1599205 -1018856 -1731896 -1780593 -94002 1191508
44281 1191508 -201496 -3021480 -4005477 -2173217 323320 1295095 782212 76590 -224753
44272 -224753 -543692 -1210970 -1687172 -1173852 91947 680289 -427065 -2388457 -3271268
44263 -3271268 -2090289 493750 3203794 5074025 5564174 4739274 3488532 2864831 3047070
44254 3047070 3338194 3009239 1780912 -2639 -1144681 -364972 1839250 3076429 2024445
44245 2024445 431800 483144 1296683 456831 -1685141 -2260796 -511229 988843 565516
44236 565516 -129471 582953 1459984 813537 -326804 -110184 675023 -166681 -2448940
44227 -2448940 -3855397 -3754231 -4075259 -5849043 -7144536 -5730607 -2432770 -330766
44219 -330766 -983104 -2707638 -3012747 -1902967 -1621818 -3076237 -4049576 -2222196 1138719
44210 1138719 2570956 1160851 -443093 -78331 1292540 1938724 2056298 2573652 3121302
44201 3121302 2928271 2291791 1571759 205205 -1653437 -2171289 -506844 1139524 454691
44192 454691 -1440023 -1978008 -1378860 -1798370 -3119388 -3075487 -1439328 -625897 -1643377
44183 -1643377 -2679369 -2595452 -2757330 -4054894 -4851496 -3624393 -1460293 -220175 -77062
44174 -77062 -448111 -1532005 -3185430 -3924006 -2895915 -1486372 -1212750 -1367258 -558874
44165 -558874 763746 1395564 1761563 2853704 3663611 2296018 -661452 -2427638 -1841238
44156 -1841238 -566732 -85817 244384 1249586 2045864 1462449 75644 -523889 230392
44147 230392 1582858 2614297 2868542 2328990 1515977 1222306 1582802 1826519 1416480
44138 1416480 851692 758018 852148 656108 676222 1726803 3284371 3737755 2474588
44129 2474588 653956 -469546 -944817 -1241813 -1078652 -293616 -113047 -1911610 -4784470
44120 -4784470 -5994722 -4326396 -1591983 -81618 91251 -12786 -438058 -1805411 -3285664
44111 -3285664 -3182860 -1446137 278910 1213649 2136604 3173786 3017468 1228822 -655555
44102 -655555 -1521475 -2266205 -3458217 -3446741 -1164299 817245 -817631 -4834848 -6413700
44093 -6413700 -3702488 -212084 411533 -934177 -1227157 -46682 667605 207650 -180624
44084 -180624 304272 1108552 1725687 2159619 1984220 710328 -739443 -665866 885819
44075 885819 1888969 1213161 101229 -93490 4020 -678208 -1416338 -784411 830176
44066 830176 1712030 1434149 1062304 793072 -544140 -3074283 -4860680 -4382816 -2605552
44057 -2605552 -1381153 -1001082 -692028 -443653 -603887 -371593 1309060 3528710 4097488
44048 4097488 2737042 1647028 2150202 2606133 963048 -2059220 -4040484 -4214669 -3862568
44039 -3862568 -3695207 -2853458 -946600 625790 480966 -610774 -620484 1084291 3035868
44030 3035868 3587450 2624418 1115521 -231701 -1240321 -1679599 -1324222 -660526 -707782
44021 -707782 -1660427 -2277436 -1308473 792200 2363082 2617403 2317139 2252997 2129917
44012 2129917 1602965 1520614 2992949 5514187 7167707 6908614 5734632 5128202 5057345
44003 5057345 4294535 2397359 462049 -303898 -63687 117602 -214758 -633518 -986271
43994 -986271 -1889606 -3591115 -5013131 -4736345 -2737640 -500052 523268 35900 -1299683
43985 -1299683 -2473740 -2598280 -1529254 -177926 367313 86865 -160015 39121 316609
43976 316609 465017 681561 724271 -14557 -1186798 -1446439 -420329 429757 -109009
43967 -109009 -1046477 -552030 1406712 3087902 3252848 2201420 798953 -250421 -163931
43958 -163931 1592709 4243209 5783450 4805653 2113375 206148 919847 3387402 4679335
43949 4679335 3119440 543029 -72411 1039327 716041 -1914794 -3412610 -1246781
43941 -1246781 1688854 1211975 -1390979 -1265734 1890830 2752897 -1323624 -5755220 -5381848
43932 -5381848 -1819589 -224937 -1368416 -1656064 42384 569153 -1760829 -3810015
43924 -3810015 -2196554 1593040 3298147 1520416 -1325461 -2990706 -3704288 -4175980
43916 -4175980 -3623955 -1305943 1251995 1541675 -508722 -2167394 -1571186 -275104 -920608
43907 -920608 -3429403 -5148975 -4266260 -1386260 2029065 4899849 6097062 4837034
43899 4837034 2208350 548825 501955 407033 -580311 -882366 577383 1973839 1232063
43890 1232063 -607537 -1192730 -751337 -1284292 -2579629 -2236354 151026 1839006 910268
43881 910268 -991358 -1160164 720360 2879945 3870642 3528630 2504566 1709980 1479543
43872 1479543 886688 -1079518 -3401414 -3554859 -781756 2562809 3810518 2942321 1887564
43863 1887564 1987286 3089709 4206641 4202882 2709622 1033353 1107599 2855212 3858798
43854 3858798 2545551 317241 -714272 -777649 -1579355 -3319663 -4403130 -3825068 -2360775
43845 -2360775 -1387870 -1504206 -2219132 -2423402 -1529511 -421541 -367916 -775783 311340
43836 311340 2801345 3868426 2203933 569672 1601496 3191025 1559833 -2390615
43828 -2390615 -3951128 -1607763 1039315 1106502 134056 304259 587631 -738029 -2372608
43819 -2372608 -1748888 1043428 3647637 4696775 4487459 3307037 1230393 -928366
43811 -928366 -2248688 -2892909 -3276405 -2758751 -728208 1645647 2447013 1480000 218079
43802 218079 -410566 -761862 -1212334 -1524669 -1500531 -1292618 -1126494 -1275297 -1770346 -1625823
43792 -1625823 518467 4041692 6007752 4671535 2050266 1167257 1901740 1806865 142970
43783 142970 -1480575 -2028048 -1950439 -1271610 570581 2681288 3052228 1545271 260355
43774 260355 310964 469279 -281024 -1144573 -1428743 -1886564 -2980395 -3706576 -3267244 -2129058
43764 -2129058 -501886 2149444 4964326 5396334 2731286 -193778 -737778 -97494 -1060762
43755 -1060762 -3668625 -5474846 -5099513 -3327829 -1361808 139537 833218 987540 1322971
43746 1322971 1534778 345485 -1788279 -2078786 519931 2792762 1552636 -1456178
43738 -1456178 -2331185 -1173119 -1351750 -3258841 -3368845 -232390 2753201 2265627 -456016
43729 -456016 -2020613 -1355892 165549 1225858 1407880 858905 436140 1048555 2043877
43720 2043877 1703405 70569 -504916 1299088 3624594 3915212 2125200 185636 -511197
43711 -511197 33469 965678 1043937 -319628 -1847155 -1646189 -210232 -233872 -2540300
43702 -2540300 -4422841 -3524633 -1219279 -160715 -377779 -200385 415332 163218 -901067
43693 -901067 -1494809 -1450366 -1536676 -1309207 379737 2698757 3130663 1061157 -958620
43684 -958620 -492834 1692748 2825118 1450769 -1322722 -3375486 -3660806 -2875460 -2407166
43675 -2407166 -2796177 -3433294 -3589474 -3044279 -1675612 499245 2496428 2809880 1416126
43666 1416126 152187 211432 552423 -27292 -592535 451506 2522594 3393370 2188545
43657 2188545 283206 -615973 -116148 853726 842980 -688146 -2104484 -1038311 2024575
43648 2024575 3492587 1580795 -697040 50250 2216749 1748255 -1269953 -2762201
43640 -2762201 -1150997 586825 122050 -947912 -620764 93534 -555748 -1914196 -2312001
43631 -2312001 -1822274 -1650783 -2072498 -2517978 -2589126 -1914839 -292071 1207683 887689
43622 887689 -980516 -2070369 -1465716 -1129197 -2663967 -4766573 -5474340 -4873037 -3796017
43613 -3796017 -1896013 893640 2871157 2866881 2387128 3093136 3777163 2512359 334479
43604 334479 -247303 661093 911366 268482 501177 1759874 2131411 1053514 179393
43595 179393 389627 755570 999782 2113777 3723403 3723082 1767794 475221 1612156
43586 1612156 3462933 3744286 2989941 3007801 3748180 3918394 3416942 3002697 2496259
43577 2496259 1361563 374866 743241 1991018 2507352 1905952 1196020 808983 56670
43568 56670 -1400359 -2848150 -3363139 -2444707 -133187 2457457 3262152 1314743 -1668212
43559 -1668212 -3164628 -2943974 -2725435 -3140843 -3038387 -1855450 -614159 -102923 58305
43550 58305 28440 -664499 -1547327 -1320209 -402589 -1032431 -3500823 -4749551 -2749322
43541 -2749322 -523 21659 -1953764 -2596231 -1384631 -648716 -816442 239340 2712840
43532 2712840 3807769 2460977 1374611 2381351 3232889 1661445 -370341 138849
43524 138849 2020382 1757476 -757932 -2197159 -1112456 445360 882244 1094874 1590566
43515 1590566 761477 -2229759 -5183429 -5505885 -3698654 -2419619 -2937095 -4052843 -4127107
43506 -4127107 -2963733 -1668253 -1228964 -1395906 -1122991 -258498 -22206 -988947 -1612551
43497 -1612551 -399986 1247494 723764 -1499720 -2116115 -82329 1436373 -325783
43489 -325783 -3684903 -5077455 -3778721 -1865554 -890318 -825732 -1327993 -1914013 -1571248
43480 -1571248 -124733 630476 -959924 -3728359 -4981741 -3968853 -2182747 -791779
43472 -791779 51285 -241389 -2242497 -4405349 -3963431 -720846 2221664 2481772 1134337
43463 1134337 325220 199229 -131868 -312594 349664 799173 -483362 -2472210 -2348668
43454 -2348668 354625 2623155 2045031 176771 165358 2247584 3706402 2868278 957894
43445 957894 -340162 -1106754 -1988657 -2490331 -1965505 -1135729 -994173 -1072262 -493897 51299
43435 51299 -587789 -1525253 -834062 1101651 1829647 732193 -66174 519081 758547
43426 758547 -397308 -897573 1028339 3386448 3120821 640882 -1312934 -2123770 -3410878
43417 -3410878 -5234259 -5441544 -3116573 -22243 1937035 2482586 1754015 -402642 -3110488
43408 -3110488 -4340045 -3208501 -1154874 -44242 -93703 -164199 776497 2707805 4294229
43399 4294229 3820865 1394141 -426830 305963 1999060 1751968 -102703 -478540 1451572
43390 1451572 2847768 1633321 -623164 -1660435 -1707959 -1886895 -1720927 -454908 864268
43381 864268 910738 467816 1146738 2610868 3091974 2099648 882391 608502 1452997
43372 1452997 2911318 3782650 2658314 -182562 -2193881 -1367244 1185613 2976909
43364 2976909 3513502 4017566 4574331 3918365 1956228 302325 -41471 250769 435210
43355 435210 683593 1006108 799165 136214 102919 1043440 1673571 874737 -562268 -1005231
43345 -1005231 -194668 619504 526545 26113 30021 370836 -80348 -1719148 -3211524 -2896696
43335 -2896696 -1000597 522130 528798 -14601 280283 1444281 2794945 4046462 4644540
43326 4644540 3326375 -4586 -2999059 -3378947 -2010415 -1484864 -2352645 -3137160 -3561401
43317 -3561401 -4792541 -6297763 -5644505 -2485961 146048 98548 -937522 -637241 242943
43308 242943 -103299 -828925 74303 1793948 1590654 -662440 -2057570 -1083135 502398
43299 502398 1050211 1467035 2756222 3434968 1626395 -1543789 -2855198 -926834 2456720
43290 2456720 4900218 5840537 6113810 6168654 5476801 3501396 778309 -1246364 -1556617
43281 -1556617 -539602 646669 1386243 1772706 1829176 1489904 1218815 1501287 1673155
43272 1673155 637964 -961380 -997883 880691 2052614 493622 -2028939 -2452157 -995502
43263 -995502 -636256 -2392147 -3906021 -3175902 -1164305 308393 1080732 1667549 1574303
43254 1574303 321534 -1082472 -1381795 -924411 -773112 -779682 -122901 902837 1335273
43245 1335273 1361633 1946143 2788314 2421273 599440 -972586 -845297 407696 1172597
43236 1172597 656698 -660252 -1681494 -1486183 -131632 1176904 1358075 821216 741780
43227 741780 1211155 1334677 1073973 1385201 2199203 2024458 419192 -786315 -72574
43218 -72574 1294399 1061661 -633443 -1616563 -1076666 -634053 -1670268 -3258082 -3584828
43209 -3584828 -2300852 -461492 1150213 2525807 3464031 3190211 1397340 -886791
43201 -886791 -2137196 -2006587 -1612903 -1942986 -2543844 -2415074 -1795765 -2020533 -3474245
43192 -3474245 -4771161 -4576279 -3383855 -2609313 -2564302 -2473132 -2173233 -2453223 -3493267
43183 -3493267 -4183286 -3628493 -2473483 -1935455 -2084908 -1948997 -1034153 93173 667425
43174 667425 426177 -518715 -1722951 -2253086 -1419282 -15853 124611 -1504127 -3024542
43165 -3024542 -2477223 -491572 665376 321756 54660 967494 2000154 1719410 430946
43156 430946 -604737 -1113111 -1737333 -2575547 -2923700 -2289715 -916880 474018 1038552
43147 1038552 499688 -77887 826006 2834959 3479461 1529170 -832651 -935033 462856
43138 462856 528742 -1137208 -2206052 -1745489 -1532689 -2475759 -2738306 -1057696 599525
43129 599525 -65010 -1933733 -2084869 -55928 1886792 2149392 1258567 145196 -913132
43120 -913132 -1450625 -724864 1030495 2546377 3046327 2743428 1747945 -138418 -2232627
43111 -2232627 -3027163 -2129717 -977020 -853145 -1265561 -1163005 -697954 -568742 -451879
43102 -451879 406518 1509860 1686715 1232053 1629514 2789541 2610169 409243 -1121556
43093 -1121556 637302 4134059 5453355 3626704 1472715 1158200 1823848 2333830 3378553
43084 3378553 5218020 6008544 4690349 3392452 4274756 5735276 4845244 2247167 1143084
43075 1143084 2074183 2368713 779921 -946003 -1630564 -2243192 -2995117 -2404951 -772180
43066 -772180 -1158983 -4707283 -7907016 -7142802 -3605622 -981198 -336393 -286145 -525818
43057 -525818 -1778483 -3085862 -2467062 -189871 1372900 1276713 945290 1306126 1320736
43048 1320736 85046 -1474313 -1970730 -1424400 -940391 -1228999 -1974883 -2325221 -1850852
43039 -1850852 -1119411 -944340 -1005148 -192214 1298843 1640303 119099 -1237933 -312886
43030 -312886 1976506 2977126 1908770 354354 -270273 52513 835515 1540048 1471892
43021 1471892 719863 679466 2073315 3163670 1886805 -780667 -1810090 -292116 1592489
43012 1592489 1845694 743532 -605163 -1670629 -1967174 -1098005 -54131 -681652 -2990397
43003 -2990397 -4546854 -3491064 -860497 1012881 1290451 851411 634511 798287 1127304
42994 1127304 1503695 1984468 2611851 3142182 3221184 2992817 2966073 2977005 2216885 879126
42984 879126 529751 1775841 2877143 2164168 582879 4913 211170 -172897 -682923
42975 -682923 399633 2861204 4484297 4080585 2426410 505498 -928116 -631720 1563584
42966 1563584 2968569 921169 -2796285 -3820091 -1461394 641975 392164 -502877
42958 -502877 -1010118 -2787091 -5702675 -5967797 -1949437 1994016 1342391 -1931727 -2702511
42949 -2702511 -382723 1216727 347456 -910483 -1050825 -1192456 -2147244 -2717749 -1900295
42940 -1900295 -412692 840119 2026614 3450675 4715189 5227531 4599389 2726225
42932 2726225 466391 -401045 695823 1687642 232399 -2991983 -5153119 -5021727 -3916683
42923 -3916683 -3049018 -1982797 -111749 2013807 3416752 3620930 2575510 695522
42915 695522 -854009 -885685 599220 2517858 3785597 3709290 2020084 -474242 -1980653
42906 -1980653 -1685469 -958502 -1305530 -1969803 -1274589 368956 901360 -191097 -1224411
42897 -1224411 -944020 152493 1336289 2550190 3357811 2850241 1289249 251275 433575
42888 433575 782016 476323 258063 891680 1710378 1789166 1406555 1169567 645393 -841326
42878 -841326 -2669953 -3453361 -2852523 -1836887 -1242942 -937530 -418837 509740 1826195
42869 1826195 3409234 4674507 4496751 2213617 -1050224 -2641071 -813718 3027038
42861 3027038 5377781 4368346 1694718 213989 466805 724423 -65860 -951622 -760201
42852 -760201 170737 737331 641899 383775 159336 -375067 -1280069 -1948960 -1880292 -1522185
42842 -1522185 -1824369 -2839481 -3304378 -2155398 -137606 910236 347450 -594332 -626306
42833 -626306 63579 536121 449250 22492 -589731 -1154314 -1210865 -786013 -697265 -1467448
42823 -1467448 -2512356 -3070629 -3261873 -3418976 -3063231 -1582112 521973 2095772 2798681
42814 2798681 3191602 3532145 3334462 2172886 387269 -1059552 -1308805 -525059 -131325
42805 -131325 -1439018 -3854896 -5267511 -4469520 -2290611 -123921 1499016 2531204
42797 2531204 2937537 3073860 3234254 2568264 171688 -2528351 -2902427 -1283505 -1017011
42788 -1017011 -2978740 -3429288 214875 4751919 5811137 4331798 4169866 5331074
42780 5331074 4556173 1595512 -312969 -221108 -703509 -2569506 -3123729 -1163348 656879
42771 656879 441313 140363 1649699 3248611 2686011 1071043 828689 1834571 2216539
42762 2216539 1412023 179878 -996358 -1595452 -659270 1480544 2619082 1571676 76909
42753 76909 150622 1314945 2219476 2987397 3767827 2992083 -176675 -3232997 -3129516
42744 -3129516 -632033 926334 322285 -994699 -2216547 -3817064 -5041418 -3994291
42736 -3994291 -867943 1561082 1573872 570340 599393 1591686 2043547 1184040 -379333
42727 -379333 -1346791 -693622 1237753 2588738 1907330 108120 -649806 99373 700870
42718 700870 -57775 -1378500 -1728017 -461535 2063903 4810485 6265953 5553716 3703349
42709 3703349 2761661 3362076 4212885 4142636 3361368 2350271 957351 -577986 -912193
42700 -912193 875342 3616598 4998802 4052573 1988415 584003 319237 344411 22921
42691 22921 16757 1439269 4074513 6126939 6016427 3844422 832239 -1834737 -3100611
42682 -3100611 -2110841 654308 3064050 3442600 2507988 2026271 2184234 1853248 967555
42673 967555 691397 1208868 1324627 715020 721635 2061092 3319126 2846203 1011632
42664 1011632 -543759 -1061597 -1042981 -1098519 -1376644 -1805928 -2253952 -2661035 -3221045 -3947676
42654 -3947676 -4102988 -3023748 -1601281 -1577314 -2912480 -3421733 -1970334 -453365 -1069589
42645 -1069589 -2910799 -3288944 -1759551 -593343 -1265421 -2594364 -2928480 -2388335 -1990289
42636 -1990289 -1938062 -1980374 -2502782 -3922593 -5429647 -5553176 -3986531 -1973368 -778316
42627 -778316 -463183 -339251 -28489 249647 100555 -605194 -1486720 -1685435 -466218
42618 -466218 1863381 3798925 3843844 1997742 -175528 -1063664 -408421 874042 1957870
42609 1957870 2837508 3873967 5015680 5688580 5349916 4049628 2519300 1699304 1950916
42600 1950916 2607293 2526735 1366334 214157 611699 2818742 5252912 5849903 3955898
42591 3955898 835657 -1521769 -1932968 -590316 1357909 2574712 2308501 949668
42583 949668 -236095 -393962 -118232 -692650 -2236700 -3393716 -3297106 -2959516 -3694988
42574 -3694988 -4784299 -4224066 -1753761 567337 1354552 1727331 2909971 3568633 1621990
42565 1621990 -2044890 -4023181 -2625678 360864 2521210 3347090 3234711 2126287
42557 2126287 532118 106430 1459595 2748502 2183824 655403 -24939 -104955 -701055
42548 -701055 -873163 962985 3284660 2727631 -563062 -2464046 -871208 1327328 1145504
42539 1145504 80743 977395 2859675 2436495 -528752 -2758555 -2021582 637291 3171274
42530 3171274 4622537 4802989 3969931 3103238 2913673 2615832 1223613 -306954 -160611
42521 -160611 1299811 1689947 -42680 -2398696 -3738092 -3993181 -3579200 -2495303 -1166151
42512 -1166151 -577614 -928576 -1452466 -1869008 -2546300 -3075856 -2480975 -1175302 -802584
42503 -802584 -1595459 -1812019 -448413 1452654 2946151 4498863 6083538 6115284 3844766
42494 3844766 1048672 -301687 -551874 -983295 -1457209 -1221175 -710875 -586238 -51729
42485 -51729 1811968 3812219 3812863 1775193 -207616 -785846 -701764 -1280825 -2845123 -4630506
42475 -4630506 -5345964 -4036212 -1224029 1188252 1904059 1510866 1064238 442698 -707815
42466 -707815 -1448700 -649902 968870 1557150 592080 -862505 -2049673 -3108875 -3871965
42457 -3871965 -3604542 -2161675 -253910 1515628 2844899 3100149 1810628 -22747
42449 -22747 -373035 1490232 3903746 4591530 3161933 1415734 1190749 2100062 1869411
42440 1869411 -655309 -3482113 -3712704 -1489173 193967 -134593 -594832 430876 1337233
42431 1337233 9378 -2481826 -3522074 -2950670 -2611443 -2806833 -2222726 -1058949 -1123174
42422 -1123174 -2435805 -2602868 -515438 1684820 1576258 -376492 -1855762 -1581766 -92357
42413 -92357 1373600 1833017 1022064 -499239 -2042554 -3529973 -4954264 -5590832 -4880848
42404 -4880848 -3697935 -3335201 -3510660 -2917847 -1524576 -571460 -365750 3450 609291
42395 609291 358625 -847344 -1546681 -933876 115384 847453 1658125 2595009 2676861
42386 2676861 1671898 859101 968467 992334 192709 -344622 418867 1479028 1283592
42377 1283592 129903 -575437 -639815 -1006939 -1814939 -2089939 -1339203 -278410 184025
42368 184025 -15430 -161562 469183 1787585 2728451 2240699 425713 -1770332 -3674775
42359 -3674775 -4805958 -4159316 -1251334 2055879 2742004 407922 -1821278 -1169085 1560523
42350 1560523 3775234 4545998 4622648 4183916 2621660 308479 -1062935 -228481 2296325
42341 2296325 4650817 5097372 3436643 1245254 187817 47576 -621327 -1868925 -1929389
42332 -1929389 39022 2453283 3508707 3314023 2615119 983103 -1999152 -4903857
42324 -4903857 -5704535 -4256189 -2057051 -242795 730816 227986 -1984941 -4701156 -6293439
42315 -6293439 -6408709 -5549292 -3894518 -1988872 -1427162 -2783625 -3811326 -2215197 376217
42306 376217 100988 -3496679 -6576232 -6398150 -4606074 -3785894 -3527874 -2060373 206467
42297 206467 1284586 713364 -109113 -81665 908044 2775366 4806958 4959797 1800911
42288 1800911 -2802202 -5027428 -3588962 -983021 366841 1083873 2621939 4049781
42280 4049781 3380107 1148949 99213 1299847 2915781 3389647 3626076 4804088 5901513
42271 5901513 5205277 3059027 1148174 -158108 -1651896 -2899234 -2390475 -403244
42263 -403244 518468 -1047005 -3230444 -3356626 -1377930 504458 821645 120158 -306940
42254 -306940 168064 1263246 2188742 2316726 1826025 1479644 1626422 1937660 2243936
42245 2243936 2801350 3433794 3406148 2673751 2234153 2554508 2719448 1999833 1114364 774053
42235 774053 164026 -1457773 -2575104 -1025839 2388580 4169671 2580163 -55357
42227 -55357 -539683 1203997 2729380 2652936 1922336 1730271 1802851 1303242 333631 -316122
42217 -316122 -336137 27510 732245 1897199 3136285 3846824 4152926 4550598 4585027 3266291
42207 3266291 1172902 430530 1628707 2550478 1560494 494571 1815320 4294309 4605910
42198 4605910 2564452 1392915 2703731 4612576 5446441 5892646 6340375 5519751 3453966
42189 3453966 2460376 3143307 2708568 -133739 -1990188 -11483 2785609 1911545 -1181008
42180 -1181008 -1357337 1651393 2673406 -542533 -3797358 -2982864 342105 2307299
42172 2307299 2079210 1170739 232385 -616200 -309288 1550017 3025279 2228673 211204
42163 211204 -745715 -631270 -1155307 -2489918 -3011251 -2039834 -612957 528888 1676552
42154 1676552 2565793 2032879 53223 -1457692 -990292 473998 860860 -235527 -1384366
42145 -1384366 -1526347 -1075002 -726914 -340414 461624 1401563 1981959 2276821 2574237
42136 2574237 2680359 2350624 1963276 1852410 1478115 475427 8596 1315263 3081739
42127 3081739 2522147 -436099 -2444534 -1378449 638206 684092 -559241 -388155 1360921
42118 1360921 2223664 1022217 -821520 -1843498 -2059037 -1747382 -829337 148224 158849
42109 158849 -794897 -1732848 -2308700 -2898223 -3201735 -2457274 -1041498 -152027 125509
42100 125509 732894 1668344 1907410 1277763 577809 -60984 -906884 -915599 1267376 4460947
42090 4460947 5679109 4135350 2034925 1003107 501113 319236 1410228 3113491
42082 3113491 2892112 608759 -134504 2718562 5925208 5324930 1626475 -1284008 -1947900
42073 -1947900 -1945914 -2224311 -2215554 -2055958 -2618200 -3436704 -3152416 -2004750 -1648256 -2490210
42063 -2490210 -3222338 -3035700 -2542421 -2489684 -3006180 -3884272 -4350582 -3265799 -1019842
42054 -1019842 -189651 -2362529 -5300100 -5590680 -3304878 -1396123 -1106582 -997015 -392670
42045 -392670 -501108 -1461246 -1284570 1068798 3930570 5374027 5330738 4306363 2235675
42036 2235675 -160954 -1075989 -222026 158988 -1453232 -3332799 -3072567 -1170267 -5519
42027 -5519 -349567 -985747 -1075493 -887032 -578434 -80549 75858 -487751 -681377 809437
42017 809437 3057366 3668988 2335083 1511577 2642353 3681995 2076636 -1185214 -2759851
42008 -2759851 -1672482 -418456 -940199 -1859108 -1094107 649288 1174252 449274 366421
41999 366421 1215159 1302446 542804 1315460 4230357 5951058 3787784 187598 -589897
41990 -589897 1300338 2150636 978527 659757 2428893 3559533 2105212 196196 294257
41981 294257 1324670 1316571 1166118 2433115 3517422 1866617 -1292244 -2422032 -1307448
41972 -1307448 -1109243 -2609132 -2652300 367734 3336232 3020278 846272 316022 1827939
41963 1827939 3045410 2974449 2607308 2229919 1069902 -400715 -435596 1309160 3234013
41954 3234013 4387832 5550130 7103158 7837317 6845101 4874078 2767076 279169
41946 279169 -2295332 -3112478 -1290619 855745 282327 -2739251 -5096045 -4976164 -3502627
41937 -3502627 -2371619 -1986543 -2222369 -3017902 -3547329 -2562700 -384740 1002327 715711
41928 715711 313650 1314116 2817415 2956129 1591300 144104 -418813 -119639 740562
41919 740562 1541162 1307907 -38987 -1167774 -1296666 -1642619 -3305862 -4802412 -3920079
41910 -3920079 -1345543 112371 -283738 -499297 528466 1335121 993665 845622 1593061
41901 1593061 1364019 -961019 -2689176 -663145 3566946 5220479 2676727 -692947
41893 -692947 -1476347 -108766 1263385 2222258 3512129 4780719 5035618 4473661 3956175
41884 3956175 3226870 1540452 -228614 -211424 1402561 1995871 187186 -1900482 -1594029
41875 -1594029 420963 1215518 10534 -915419 71620 1685817 2190866 2141934 2925147
41866 2925147 4004407 3875307 3071163 3726676 5983380 7203210 5688057 3217115 2436434
41857 2436434 3213858 3456739 2682423 2610199 4150600 5706059 5243655 2838812 241638
41848 241638 -1298038 -1800354 -1638996 -1007406 -404661 -676252 -1947737 -3000275 -2469636
41839 -2469636 -600337 929810 1151281 1014391 1842921 3193364 3355553 1898949 486568
41830 486568 647987 1746363 2044743 1127021 148260 -60500 50575 -119103 -269314
41821 -269314 134156 800347 938026 357201 -370070 -737323 -730923 -427959 229994 1006397
41811 1006397 1251497 779721 574105 1789491 3881141 4581357 2482798 -840852 -2352984
41802 -2352984 -1229705 69734 -1039230 -3910119 -5449333 -3874876 -613471 1649434
41794 1649434 1865776 1085910 646352 654193 308701 -685052 -1380212 -512016 1812457 3778526
41784 3778526 3692130 1895106 200887 -434268 -743027 -1514201 -2314469 -2575533 -2918019
41775 -2918019 -4116147 -5316443 -4840535 -2784178 -1324118 -1948073 -3639658 -4564007 -4454109
41766 -4454109 -4286175 -4456886 -4615521 -4839088 -5510523 -6034482 -5085876 -2574304 -211772
41757 -211772 557145 282920 320929 658827 156200 -1247212 -1908764 -634974 1441997
41748 1441997 2118965 933706 -369015 -368033 193072 -64105 -737404 -310216 1094401
41739 1094401 1602951 744432 645347 2636316 4439828 3064881 -513439 -2369438 -1172492
41730 -1172492 227528 -546120 -2073470 -2115151 -1416604 -2015671 -3352739 -3000662 -715150
41721 -715150 1023808 702900 -434822 -971460 -1527632 -3128442 -4918291 -5157279 -3836973
41712 -3836973 -2869443 -3704541 -5687134 -6933117 -6264631 -4065862 -1586874 185160 893352
41703 893352 511758 -614021 -1401912 -672864 1233923 2328956 1425026 -7954 189021
41694 189021 1528833 1367954 -1083412 -3211539 -2475237 112168 1541199 978604 570952
41685 570952 2082508 4317621 4710363 2705057 516502 442269 2137593 3172565 2057102
41676 2057102 -174779 -1686285 -2154102 -2413537 -2502639 -1580658 210978 1362572 1086313
41667 1086313 580223 1281348 2671705 2875230 1107421 -1327343 -2469086 -1670739 -136343
41658 -136343 363368 -599388 -1687127 -1671396 -1237094 -1892901 -3417596 -3980918 -2973299
41649 -2973299 -1867943 -1570291 -885151 1042394 2631023 2196245 910964 989814 1901790
41640 1901790 1219131 -1107977 -2375514 -1446710 -470262 -1113805 -1787990 -539190 1385231
41631 1385231 1276165 -949683 -2779089 -2645720 -1301412 125564 1381819 2166986 1761231
41622 1761231 239030 -1146628 -1376395 -619558 474180 1456897 1779313 899526 -778939
41613 -778939 -1997205 -2227735 -2326782 -3019848 -3610715 -2996433 -1286901 435092 1463329
41604 1463329 1806928 1696169 1587337 2184294 3505550 4283763 3298332 1079496 -692330
41595 -692330 -1237641 -1028042 -353912 968264 2309469 2258029 633099 -826044 -636206
41586 -636206 677906 1893854 2920857 4003013 4156004 2247277 -737133 -2328321
41578 -2328321 -1618853 -124471 678647 1089009 1760395 2013537 847809 -1139287 -2159694
41569 -2159694 -1386501 257945 1449656 1806787 1707984 1356588 459372 -1188598 -2951785
41560 -2951785 -3447913 -1805944 1085538 3081867 2919888 1528948 756168 1060885 1155727
41551 1155727 -19414 -1699125 -2197836 -1081105 273608 431365 -397285 -957407 -905831
41542 -905831 -1269837 -2743300 -4379818 -4705111 -3677826 -2677864 -2622509 -2892332 -2334952
41533 -2334952 -761553 876698 1529584 1088858 512140 830641 1871623 2287875 1256120
41524 1256120 -240483 -491487 850848 2553040 3477955 3541845 3068539 2291909 1696369
41515 1696369 1777430 2098606 1595565 249410 -590985 -140371 604972 345665 -750640
41506 -750640 -1607605 -1705586 -1072429 294195 1844872 2112643 363201 -1830004 -2133103
41497 -2133103 -459803 914094 316246 -1459987 -2471640 -1755683 113224 1680990
41489 1680990 1592271 -238455 -2181762 -2370047 -796499 792574 1150801 742825 519556
41480 519556 513106 130593 -936610 -2540994 -4134569 -4688787 -3400256 -934776 859678
41471 859678 1067652 783912 1424018 2684743 3040432 1788730 -247079 -1765605 -1991014
41462 -1991014 -866753 981302 2464976 2754859 1888282 534542 -578517 -879199 -199093
41453 -199093 758184 799053 -283035 -1156126 -607356 804330 1691803 1925317 2506691
41444 2506691 3562387 3925567 2997792 1696234 985291 650698 287463 363284 1171941
41435 1171941 1595612 323928 -2095361 -3794892 -3986560 -3390027 -2288882 56276 3385197
41426 3385197 5517284 4832191 2558614 1014594 379025 -869612 -2685966 -2984387 -981529
41417 -981529 1151239 1264042 176942 -24087 652565 549905 -534058 -1044542 -519310
41408 -519310 -469245 -1684227 -2570512 -1394402 1155477 2961550 3110173 2278827 1207391
41399 1207391 113946 -706998 -889709 -544231 1187 782110 1753066 2085157 850138
41390 850138 -1656940 -3956303 -4582908 -2822087 993527 4957477 6184301 3548425
41382 3548425 -446145 -2175958 -1212890 -361781 -1298926 -2406545 -1835990 -552852 -558578
41373 -558578 -1519940 -1264229 960511 3517417 4465747 3222173 435591 -2369651 -3244868
41364 -3244868 -1464212 1176397 2073842 976754 94769 898959 2360652 2881226 2416607
41355 2416607 1724481 795723 -636660 -1812701 -1582245 -123571 1070140 999149 234909
41346 234909 77488 1060840 2351458 2479295 844770 -1417491 -2454301 -1668883 -163725
41337 -163725 836378 1136540 859171 -271323 -2052588 -3117776 -2353776 -582136 316083
41328 316083 -230111 -971972 -598998 854444 2287882 2529926 1299533 -139983 224889
41319 224889 2768592 5198768 5201700 3623989 3326330 5042396 6404278 5495318 3334235
41310 3334235 1854386 1235480 683375 411445 1043220 1915967 1807640 953027 657124
41301 657124 1045265 852620 -327229 -1127029 -413884 919672 1124245 14952 -656378
41292 -656378 759108 3887041 6634460 7293564 6157131 4899343 4533225 4492517 3849416
41283 3849416 2757546 2096897 2069289 1865394 730097 -1081474 -2450742 -2318885 -621544
41274 -621544 1558211 3032972 3727213 4312756 4638595 3604845 1136664 -902462 -899320
41265 -899320 306620 838044 713436 1522558 3342066 4074476 2519049 319360 -362781
41256 -362781 143258 -148374 -1671126 -2546690 -1198574 1438018 2918134 1987867 -248157
41247 -248157 -1706818 -1446652 -307559 260584 -318753 -1355104 -1626862 -509489 1243213
41238 1243213 1869498 335377 -2228972 -3576668 -2964252 -1673845 -590893 1174836
41230 1174836 4131869 6436202 6097535 4254152 3872693 5426633 6319570 4935852 2866958
41221 2866958 2206300 2717139 2964244 2585297 2039782 1448668 1078649 1813952 3702746
41212 3702746 4999812 4137106 1967005 734379 1391570 3048864 4401370 4540742 3044133
41203 3044133 509271 -1503086 -2072594 -1809793 -1304806 89058 2523411 4008376 2632061
41194 2632061 -242772 -1231953 766262 3496599 4540413 3655453 1840525 62966
41186 62966 -638020 438549 2457427 3590060 3224107 2447797 2166513 2132099 1992986
41177 1992986 1736353 864033 -1137920 -3142852 -3086284 -973649 691668 358625 -561871
41168 -561871 -280742 609013 552456 -232269 -317813 432456 661106 -418554 -1973557 -2589821
41158 -2589821 -1834179 -917339 -1653193 -3997973 -5134359 -2728621 1167501 2041418 -825836
41149 -825836 -3127529 -1909465 140899 -692597 -3251813 -3847755 -2412747 -2028785 -3253060
41140 -3253060 -3320670 -1194613 630903 376020 -408451 68585 943965 591207 -774250
41131 -774250 -2021098 -2907673 -3521292 -3432158 -2733703 -2566408 -3380658 -3929547 -3108155 -1572126
41121 -1572126 -470517 173919 718639 791903 151680 -443178 -414077 -388316 -901216 -1175414
41111 -1175414 -495140 260452 -9805 -549086 271700 2322048 3721009 3464105 2651918
41102 2651918 2811120 3974879 4845405 4354709 2751291 1226120 494730 -12643 -1101808
41093 -1101808 -2234985 -1952902 56108 2342132 3397684 2981620 1570528 -263157
41085 -263157 -1569357 -1460906 -387812 259322 196550 382475 744262 -166152 -2364973
41076 -2364973 -3568641 -2630678 -1638594 -2547660 -3766331 -2734299 -303347 566148 -444109
41067 -444109 -871206 108578 399807 -1230634 -2916781 -2499594 -538063 860096 866614
41058 866614 365803 398114 1136025 2007878 2302689 1804332 857411 -276018 -1571395
41049 -1571395 -2441478 -1784202 373191 2320638 2785822 2504147 2540572 2479782 1850849
41040 1850849 1743767 2852153 3413054 1746929 -461279 -503366 827225 632816 -900505
41031 -900505 -818908 1212839 2302092 1714561 2180040 4330977 4585010 1192141 -1875018
41022 -1875018 -619320 2802509 3637555 1702377 599394 1370694 1468298 -317276 -1914905
41013 -1914905 -1447172 451595 2469216 4284634 5657945 5855855 4833294 3657293
41005 3657293 3216661 3434674 3812532 3811700 2887487 1150277 -297288 -677970 -745230 -1582924
40995 -1582924 -2744155 -2890782 -1911785 -1054892 -1057205 -1273710 -706464 823127 2461670
40986 2461670 2989373 2163391 1407898 2095136 3173834 2343059 -91807 -1051572 576773
40977 576773 1907057 720434 -728403 485438 2808570 2588932 -75222 -1881649
40969 -1881649 -1673445 -1082017 -381901 1841791 4637575 4712499 1594025 -1123735 -1065996
40960 -1065996 5463 123099 290144 1499528 1914753 -41231 -2284514 -1888778 395060
40951 395060 1440893 460088 -409096 318433 1767967 2477933 1963590 491120 -1229552
40942 -1229552 -2107902 -1547528 -212801 804194 1197652 1180258 691565 -266925 -1137355
40933 -1137355 -1506190 -1699771 -1908836 -1462178 88620 1801614 2278262 1386504 270353
40924 270353 -750 774612 1982881 2525630 1685688 143219 -540801 102648 798102
40915 798102 363666 -659037 -873432 179439 1683204 2415352 1635201 -189397 -1425687
40906 -1425687 -980417 81214 -88142 -1238612 -1366890 -79607 735984 302164 410295
40897 410295 2100551 3436487 2652637 1259337 1394546 1905747 200616 -3048100 -4305723
40888 -4305723 -2097271 1299564 3298768 3726244 3692531 3857585 4433154 5291891 5569759
40879 5569759 4434508 2453985 1007963 409900 -102345 -783839 -1332442 -2120537 -3637423
40870 -3637423 -4805338 -3891879 -1335809 392995 320469 402141 2515020 5656762 7297908
40861 7297908 6419778 4228581 2613755 2525925 3224318 2911150 932392 -804216 30401
40852 30401 2702959 3945465 2344949 120340 -398482 76222 -214958 -755014 194220
40843 194220 2079356 2150519 -643820 -3756334 -3926325 -979979 2104769 2565288 654138
40834 654138 -979726 -337895 1933889 3703854 3953320 3562710 3746853 4547447 4995989
40825 4995989 4154462 1932443 -619105 -2021685 -2036647 -2208074 -3757858 -5491788 -5338812
40816 -5338812 -3583749 -2459563 -2450754 -1581009 764563 2055813 506451 -1628984 -1314487
40807 -1314487 396399 -8120 -2745823 -4119197 -2038412 1028720 1963472 1312096 1702983
40798 1702983 3594371 4882990 4144405 2265135 787790 215404 417548 1459776 3099215
40789 3099215 4115004 3284525 1102015 -379693 110602 1574237 2332489 2454829 3255618
40780 3255618 4543215 4240301 1578182 -1005565 -786528 1512713 2896036 2438189 2124740
40771 2124740 3150036 3791996 2210495 -384211 -1092388 992164 3975752 5577985
40763 5577985 5012019 2786654 131717 -1199244 71178 3150805 5307886 4455990
40755 4455990 1437714 -881354 -788119 606012 1146334 475270 170725 1104719 1969152
40746 1969152 1336359 178602 673080 2736174 3631141 1582413 -1834925 -3847216 -3609460
40737 -3609460 -1991420 368065 2999535 4512522 3759919 1982954 1804375 3731084
40729 3731084 5357170 4623586 2370443 859078 1020778 2115329 3118307 3393892 2635761
40720 2635761 1116954 -302127 -1023956 -1248386 -1320147 -1145531 -699087 -426455 -546877
40711 -546877 -547103 10605 706268 910670 762508 921539 1724671 3002813 4254073 4645660
40701 4645660 3509779 1343852 -290156 -353104 747986 2112280 3372864 4370324 4788037
40692 4788037 4686672 4485199 3990417 2637009 1107216 1049183 2403674 2957527 1797852
40683 1797852 1064857 2421912 3973175 3299370 1649327 1802482 3116640 2561626 146680
40674 146680 -744726 1210305 3315557 3255991 2001905 1127031 531555 327999 1775252
40665 1775252 4419290 5292098 3226429 1251549 2132867 4037454 3665751 1631858 1241419
40656 1241419 3150977 4743159 4377264 3108192 2100518 1103923 15564 -288466 507390
40647 507390 1315001 1082338 221610 240154 2312612 5897273 8444010 7442601 3473401
40638 3473401 68832 -343273 1052559 2051883 2607847 3621150 4462130 4233653 4049272
40629 4049272 5181113 6049896 4281911 1104513 155918 1902265 2838861 1015465 -1000692
40620 -1000692 -128605 3007668 5604098 6274914 5359505 3378483 1078871 -81506 833016
40611 833016 3028012 4946953 5810605 5619498 4610732 3446688 3057909 3594064 4239100
40602 4239100 4465615 4616780 4975762 5307755 5600836 6085327 6257943 5311151 3993058
40593 3993058 4455526 7374445 10578489 11598367 10512299 9259563 9136610 10107731 11792119
40584 11792119 13812732 15400590 15679857 14543564 12915269 12118594 12921205 14869854
40576 14869854 16603490 17125553 16572077 15524553 14256386 13124585 12602053 11971047 9345478
40567 9345478 4594169 900449 1156513 3854818 5257446 4819016 5164150 7006601 7940220
40558 7940220 6896917 5979004 6465745 6537147 4894810 3432888 3940535 4920083 4291447
40549 4291447 2908064 2684997 3246821 3159847 2760016 3083019 3554816 3359745 3571895
40540 3571895 5278715 7109969 7376923 7107153 7981873 8833058 7575296 5262447 4497772
40531 4497772 4895915 4203875 3159374 4608535 7815612 8553748 5804371 3643167 4753075
40522 4753075 6528227 6060576 4841064 5191009 5498559 3100330 -438861 -1251318 858700
40513 858700 2491638 2306869 2693444 5320124 8434086 9789554 9600400 9060367 7993710
40504 7993710 5831128 3660012 3396353 5248400 7341924 7865027 6713691 4985337
40496 4985337 3591551 2699300 2220322 2440045 3893032 6550456 9451614 11542815 12683995
40487 12683995 13252373 12932138 10931521 7747574 5561375 5786672 6902022 6157766 3305117
40478 3305117 1060561 1435611 3160829 3852468 3518439 4192752 6488264 8333723 7691093
40469 7691093 5388975 4377986 6463015 10278988 12633770 11886216 9741190 9070122
40461 9070122 10127831 10394543 8740280 7780647 10243369 14513666 16522488 15378504
40453 15378504 14046974 14388917 14858537 14100330 13618343 14945646 16706166 16864257 16060713
40444 16060713 16271559 17486167 18175286 18212605 18992277 21015091 23300935 24988205 25950436
40435 25950436 26125953 25667577 25485825 26447936 28363178 30581283 32797294 34432947 34491811
40426 34491811 33196654 32330850 32582781 32298013 30637265 29858101 31767551 33786616 32102936
40417 32102936 27653359 25077399 26004982 27274932 26192564 23792666 21924110 20604668
40409 20604668 19742406 20359218 22212867 22752750 20444869 17108844 15112463 14126868 12605935
40400 12605935 10842489 10386441 11438147 12738100 13455156 13681029 13500268 12807473 11858239
40391 11858239 11293571 11763691 13508866 15659119 16328193 14717578 12761015 12839763 14167188
40382 14167188 13939267 12125503 11920955 14486957 16622910 15632440 13509308 13627830 15676856
40373 15676856 16910505 16596507 15995015 15261771 13813540 13056998 15229827 19431256 21983214
40364 21983214 21413290 20414007 21865046 25111066 27426940 27525073 26271812 24989501 24316271
40355 24316271 24302564 24698145 25072497 24981764 24264289 23443834 23632475 25192288 26487336
40346 26487336 25366289 22385412 20787479 22098320 23622577 22267268 19182587 17907058
40338 17907058 19044755 20062403 20001251 20706377 22609892 22844017 19541521 15404219 14454684
40329 14454684 16795926 19092505 19383081 18935692 19417124 20436760 20635399 19803026 18901520
40320 18901520 18565423 18414322 17843080 17062033 17101608 18717235 21312093 23087617 22504386
40311 22504386 19878250 17628881 18501234 22821110 27533380 28862675 26297589 23101816
40303 23101816 22445230 24154619 26110417 27460927 28776427 30012854 30574624 31125597
40295 31125597 33018541 35698699 37001151 36678074 37235579 40009169 42661812 42505877
40287 42505877 40538293 39839182 41202507 42960448 44427854 46618160 49459937 51196903
40279 51196903 51513625 52810458 56789657 61556704 63976801 63810005 63701467 65722984
40271 65722984 69602719 73997786 77896988 80860757 83340472 86802254 92192960 98272561
40263 98272561 102936814 106286186 110612347 116832591 122851985 126593380 128935678 131973712
40255 131973712 135669562 138327303 139732435 141637857 145159266 149630440 154347559 159682949
40247 159682949 165865986 172208208 178397361 185311029 193552133 202144077 209780904 216780184
40239 216780184 224761171 234644746 245784572 256973881 267617812 277714449 287028537
40232 287028537 294771692 300562171 305582958 311713287 318795860 323880909 324652669 322727211
40224 322727211 321361909 320240686 315408195 305159590 293117218 283524459 275664552 265507376
40216 265507376 251552634 236246553 222113363 209213090 196711231 184636599 173267660
40209 173267660 162523879 152944831 145918600 141751117 138336241 132997659 125516765 118493214
40201 118493214 114566459 113787376 113978090 113249421 111441378 109036698 105798718 101583024
40193 101583024 97777032 96195436 96575866 97012356 97139792 98648606 101799327 104070573
40185 104070573 104200915 105162757 110192815 117597844 123118574 126592367 132160495 141525630
40177 141525630 151082312 157258064 161130477 165263471 168679209 168131872 162945817 155590122
40169 155590122 147995289 139877773 130686414 121027600 111791014 103481770 96745587 92105887
40161 92105887 88719024 84633436 78945203 72902202 68382161 65902750 64473014 62777285
40153 62777285 60134367 56828105 53884837 52163672 51440691 50777739 49899430 49582024 50344733
40144 50344733 51392030 51518677 50754774 50391119 51327515 52916731 53642591 52656287 50462005
40135 50462005 48238171 46644407 45324231 43608218 41636225 40462879 40826974 42116389
40127 42116389 42986368 42818379 42020156 41003462 39642280 37918934 36320303 35164655
40119 35164655 34182367 33217484 32638203 32475094 31972203 30848755 30144734 30540416 30562747
40110 30562747 28260262 24472526 22392352 23342507 24829300 23851478 20678593 17962812
40102 17962812 17149697 17406542 17649052 17943277 18566333 18852453 17811060 15633046 13930918
40093 13930918 14080132 15459416 15996161 14751240 13123795 12720230 12995651 12482127 11630633
40084 11630633 12317733 14618738 16377015 16432935 15991361 16004720 15638222 14652343 14888549
40075 14888549 17389948 20004511 20166940 18605665 17966810 18962355 20257438 21191520 22148181
40066 22148181 22892576 22887743 22741497 23148926 23025258 21023283 18325701 17406688 18382382
40057 18382382 19106473 18558479 17486408 15976167 13377316 10742623 10266139 11798976
40049 11798976 12819504 12394862 12112947 12342590 10949773 7190240 3767577 3100897 4173749
40040 4173749 5013071 5735047 6933169 7422244 6156446 4566217 4533512 5602105 6421091
40031 6421091 7221095 8411448 8494990 6292672 3823020 3818587 5439296 5786062 4931749
40022 4931749 5738523 8687482 10661322 9733964 7836917 7277241 7483559 6970398 6096886
40013 6096886 5782154 5388672 4153265 3294903 4279107 5920727 5785305 4139797 3862593
40004 3862593 6016023 8038685 7580128 6020709 6160843 7790286 8165401 6561537 5578036
39995 5578036 7127674 9583688 10578842 10698943 11997834 14052255 14461144 13127070 12987148
39986 12987148 15476010 17786375 16467207 12171206 8844503 8964384 11334516 13329488
39978 13329488 13786013 13398942 13256467 13601957 13950966 14154708 14806351 16122831 17043282
39969 17043282 16560189 15543233 15647867 16510795 16082773 14225674 13692046 16260940 19910821
39960 19910821 21590801 21147991 20427733 19834065 18340908 16295390 15574233 16712771 17969133
39951 17969133 17829465 16903243 16708727 17727022 19241402 20302077 20429741 19921841 19650148
39942 19650148 20118323 20784503 20778397 20068409 19389358 19260175 19527841 19530445 18412889 16013103
39932 16013103 13826376 13911891 16003798 17098411 15352871 13050201 13525158 16008362
39924 16008362 16287706 12603486 8135415 6575785 7500087 7888409 6726672 5864691 6681972
39915 6681972 7957124 7721683 5990613 4581070 4676686 5641919 6314655 6427481 6217225
39906 6217225 5612217 4842443 5085178 7019427 9124364 9148180 7267067 5964213 6538382
39897 6538382 7727513 8306097 8803724 9612299 9617119 8250478 6964155 6924229 7010664 5948839
39887 5948839 4669792 4475230 4554993 3670715 2723174 3036567 3517807 2414297 724767
39878 724767 754936 2142220 2529280 1607311 1228736 1855467 2185312 2133017 2863523 3932848
39868 3932848 3819883 3280509 4424147 6228397 5152094 1106765 -1401728 369249
39860 369249 3824655 5613653 5901857 5871842 4846880 2808045 2334092 4672240 6723852
39851 6723852 5399119 2463340 1452610 2056132 1551507 49998 28247 1625437 2554735
39842 2554735 2323516 2703884 3991586 4379908 3444583 3022781 3965307 4810413 4431827
39833 4431827 3601041 3229424 3153770 3186415 3452722 3404251 2424192 1512747 2314105 4437073
39823 4437073 5910801 6207064 6366757 6310742 5046586 3683442 4699343 7387121 7766704
39814 7766704 4605292 1815550 2541169 4447380 4124251 2954572 4257023 6773706
39806 6773706 6147115 2316996 349918 2927924 6336963 5907541 2142593 -1002798
39798 -1002798 -1549273 -565032 651546 1816210 2667324 2831706 2590542 2423092 2090587
39789 2090587 1308788 770149 1222939 2113892 2538146 2913945 4036677 4989605 4045458
39780 4045458 1513658 -478934 -1165448 -1699630 -2109373 -562653 2954242 5030621 3277216
39771 3277216 249261 58895 2552209 4044817 3001527 1538772 1333152 1428155 793788
39762 793788 41500 -484906 -1602550 -2982311 -2572196 2055 1876048 842056 -1287840
39753 -1287840 -1550460 -247057 241381 -265883 293356 2515043 4693520 5792968 6695147
39744 6695147 7987488 8655009 7719305 5575580 3130981 1011669 -27746 548746 1814803
39735 1814803 1979852 824865 132754 1053489 2479952 2872443 2320285 1756756 1388456
39726 1388456 1165031 1718766 3280675 4368848 3295359 846019 -133528 1841035 5087368
39717 5087368 6835224 6149223 4236838 2695992 2230908 2548845 2660466 1537586 -712350
39708 -712350 -2436903 -2027217 75033 1845359 2241500 2147178 2327899 1887679 -13578
39699 -13578 -2041560 -2085800 -246668 1487469 2341019 3346021 4562361 4164027 1484906
39690 1484906 -1108205 -1133756 702950 1970181 2084933 2389599 3433198 4295228 4344708
39681 4344708 3806948 2681052 786423 -1152025 -2059505 -2124354 -2330833 -2547845 -1861534
39672 -1861534 -756326 -874846 -2217104 -2656378 -1015576 1269448 2498865 2854328 2971618
39663 2971618 2206324 100866 -1776054 -1505705 390070 1720456 1758172 1783434 2658856
39654 2658856 3659556 3949969 3637946 2871575 1262253 -1062825 -2886124 -3183428 -2232628
39645 -2232628 -775935 1094552 3308916 4812300 4508479 3041811 2348189 3175044 4159453
39636 4159453 3843402 2539312 1429533 825526 496839 910481 2494231 4037561 3816990
39627 3816990 2553774 3079757 6038914 7978009 5602613 520599 -2568018 -1684121
39619 -1684121 862700 2495524 3251816 3944908 3946688 2497947 708467 383018 1530478
39610 1530478 2566233 2614997 2247249 2068643 1885266 1521082 1439063 1995862 2616776 2263693
39600 2263693 628466 -1416933 -2629593 -2642943 -2353461 -2919052 -4353695 -5336576 -4555373
39591 -4555373 -2119229 446616 1519926 713510 -920019 -1960381 -1965183 -1654505 -1709994
39582 -1709994 -1765343 -945149 917501 3085676 4627657 4752421 2918019 -336076 -2847204
39573 -2847204 -2500882 135923 2041230 1291336 -665790 -1234238 -198410 423034 -358558
39564 -358558 -1045751 119905 2695224 4607800 4546880 3015338 1350175 443363 342545
39555 342545 451147 28929 -955938 -1359108 85914 2893650 4733316 3962908 1733623
39546 1733623 544236 1011834 1434571 656802 -259129 -12252 761432 701478 107890
39537 107890 354954 1344236 1395999 -136973 -1799822 -2176659 -1764968 -1849715 -2472047 -2525861
39527 -2525861 -1389195 371034 1699619 1909958 1071399 -9589 -403088 -14126 290195
39518 290195 -184091 -989930 -1108364 -247882 929497 1815296 2536080 3405837 4131205
39509 4131205 4095793 3357973 2735417 2619249 2322738 1235751 98366 129586 1174976
39500 1174976 1963433 2121237 2355584 2394588 752879 -2444281 -4408490 -3235838 -893901
39491 -893901 -415704 -1373756 -943453 1191153 2260781 1061041 -41170 932728 2311535
39482 2311535 1534885 -684466 -1388494 252485 1831608 1044504 -1446589 -3005366 -2076226
39473 -2076226 275196 1714328 1224305 -42638 -661480 -944335 -2116658 -3964018 -4720826
39464 -4720826 -3405075 -977867 1073600 2082241 1866707 419948 -1514586 -2719269
39456 -2719269 -2903207 -2807847 -2627756 -1676402 -96767 608905 -393282 -1961947 -2537928
39447 -2537928 -1890526 -649109 599883 1029100 -103959 -1862922 -1899915 420626 2592357
39438 2592357 2137254 -62659 -1257430 -582984 521732 938057 990063 1106306 933421
39429 933421 11205 -1509212 -2824387 -2857790 -1323971 283068 -71036 -2138290 -3216417
39420 -3216417 -1666092 981745 2541326 2939219 2856039 1560570 -1509242 -4421164 -4676083
39411 -4676083 -2638467 -631699 523648 1493073 1816234 369068 -1900897 -2814571 -2571361
39402 -2571361 -3392104 -5255841 -5360732 -2795542 -485577 -862533 -2436859 -2702228 -1998952
39393 -1998952 -2038123 -2453750 -1599579 214663 885507 -360934 -2067002 -2738454 -2283711
39384 -2283711 -1240039 -89489 409715 -459179 -2173881 -3000433 -1882581 133873 945406
39375 945406 -203830 -1779319 -1688120 189082 1699983 901231 -1662737 -3686707 -3674022
39366 -3674022 -2035923 14847 1622574 2320280 1908644 698949 -626382 -1544346 -1779985
39357 -1779985 -1195179 -216208 40697 -1026250 -2478770 -2964708 -2495271 -1995625 -1567359
39348 -1567359 -706099 37380 -551272 -2136429 -2812340 -1757992 -258442 474935 828779
39339 828779 1400320 1774736 1727785 2137009 3426744 4342587 3644526 2077783 1299841
39330 1299841 1513871 1426896 166361 -1730097 -2918886 -2230724 403681 3454349 4889089
39321 4889089 4281952 3090302 2534094 2366044 2167404 2228389 2184006 531276 -2896189
39312 -2896189 -5445613 -4663450 -1796398 -140862 -597955 -1184097 -631369 66936 41104
39303 41104 81626 814177 1224841 316725 -1063377 -1386033 -563899 319199 810172 1382558
39293 1382558 2170302 2575284 2355791 2261899 3048695 4197960 4215174 2385131 -103335
39284 -103335 -1274870 -639313 210816 -394702 -2133525 -3241536 -2739301 -1251441 259455
39275 259455 1565821 2719639 3416340 3373592 2756429 1679708 -176359 -2777381 -4982466
39266 -4982466 -5443359 -4169551 -2466330 -1358521 -842695 -680339 -895333 -1138848 -623171
39257 -623171 579378 1051948 -204474 -2215591 -3255177 -2928407 -1869470 -238666 1720688
39248 1720688 2336230 183387 -2914089 -3315425 -673971 1217432 7869 -1710557
39240 -1710557 -679990 1918397 2741527 1702344 1446492 2506160 2845301 2005469 1919262
39231 1919262 3076351 3332904 1578076 -412842 -1036140 -1090223 -1567520 -1677682 -663899
39222 -663899 511837 897934 1152731 1954022 2526858 2142373 1431474 942028 116798
39213 116798 -1090137 -1498335 -887339 -812492 -1816089 -2121144 -779222 420985 293289
39204 293289 735658 3031821 4388403 1988561 -1574330 -1474420 1791054 2852551 -491076
39195 -491076 -4377647 -5032223 -3497543 -2339750 -1335147 847973 3255068 3863871 2743034
39186 2743034 1505685 570871 -777286 -2176401 -2258026 -1075503 -672624 -2486185 -5199309
39177 -5199309 -6106566 -4324718 -1796682 -793430 -1110579 -721209 1009488 2264444 1551816
39168 1551816 94088 106029 1665476 2889081 2651799 1512133 240717 -947650 -1717547
39159 -1717547 -1611491 -840254 35558 1045149 2262650 2750227 1645644 108492 359162
39150 359162 2541848 4210212 3413667 909960 -1177463 -1697036 -1010468 -229767 -289409
39141 -289409 -1020560 -1189979 -283144 270135 -965538 -2774619 -2518083 4657 1975955
39132 1975955 1281656 -1031591 -2659250 -2763407 -2030566 -1328404 -999546 -566215 978663
39123 978663 3483081 4645491 2558992 -1007999 -2248999 -377797 1597428 1648017 1274916
39114 1274916 2118779 3033291 2446656 1061075 -8489 -1466648 -3729080 -4744153 -2901444
39105 -2901444 -440916 -668969 -2901191 -3661791 -2334962 -1871947 -3563506 -4760424 -3110692
39096 -3110692 -64231 1766980 2487274 3837032 5642101 5898043 4140035 2561082
39088 2561082 3130690 4942635 5387318 3345258 261296 -1813861 -2278037 -1737625 -657126
39079 -657126 759859 1795113 1607732 561343 85303 848423 1969744 2396111 2136221
39070 2136221 1712450 1348400 1214093 1559444 2101794 2206379 2030215 2263830 2365522
39061 2365522 809961 -2016913 -3200473 -1242646 1214246 949576 -969646 -846622
39053 -846622 1787254 3317812 1473902 -1519475 -2553797 -1848608 -1556467 -1939547 -1356539
39044 -1356539 672583 2659103 3474546 3656202 3857032 3494571 1992307 412949 450471
39035 450471 2016552 3213561 3010154 2551820 2904204 2819287 535508 -2851247 -4108566
39026 -4108566 -2232674 143753 617279 106857 473827 1041030 23872 -1727947 -1479834
39017 -1479834 889231 2039262 -161581 -3380249 -3847409 -1208801 1424071 1560317
39009 1560317 -238208 -1910483 -2355177 -1794543 -721242 527159 1417873 1380048 604601
39000 604601 87832 424666 1032539 1156741 1115818 1565511 1880170 673889 -1915844
38991 -1915844 -3918005 -4022887 -3021173 -2074700 -1056374 327150 1284336 1375002 1924660
38982 1924660 4054414 6170256 5597432 2362341 -734547 -1710295 -1044290 257454 1992298
38973 1992298 3639117 3982042 2800489 1403360 750672 542497 727841 2019761 3974806
38964 3974806 4583143 3204859 2007957 2647841 3369164 1900476 -312355 -85907 1932763
38955 1932763 1507511 -2687053 -6446380 -5797324 -2405174 -548280 -960780 -1118566 -389142
38946 -389142 -907094 -3141434 -4343619 -2752672 -314707 624365 732534 1506553 1966759
38937 1966759 513619 -1500542 -1421346 304196 815171 -351704 -737634 440828 943621
38928 943621 -156246 -543190 986214 1721612 -606106 -3556053 -3501615 -1296498 -593082
38919 -593082 -1836966 -2038839 -168421 1276715 719493 -55366 711018 1769259 1080113
38910 1080113 -987759 -2538118 -2936194 -3002710 -3102306 -2520838 -781122 1201481 1675177
38901 1675177 -19773 -2162384 -2178501 71565 1787113 1072923 -222840 596628 2753288
38892 2753288 3319214 2037775 1520520 2671232 3390503 2536911 1734409 1888262 1231206
38883 1231206 -1113938 -2625784 -1145573 1223836 1086149 -1020328 -1615006 408764
38875 408764 2639985 3123375 2611873 2469273 2650281 2489273 1873266 1017329 201218
38866 201218 -35590 536869 1118633 833636 204169 365897 981858 485286 -1461191
38857 -1461191 -3264540 -3555246 -2705366 -1681375 -623287 671018 1776997 2061574 1670140
38848 1670140 1500052 2324529 4070554 5689902 5837478 4167563 1859402 312039 -454930
38839 -454930 -1344752 -2405209 -2648996 -1721512 -509315 351379 1412728 3113178 4523284
38830 4523284 4448801 3160244 1856485 742194 -1008851 -3206190 -3940208 -1863935 1580332
38821 1580332 3392972 2344111 71016 -1215788 -1058277 -390103 67481 201274 80016
38812 80016 90101 826564 1840009 1366339 -1192318 -3349702 -2284210 848730 2035930
38803 2035930 146004 -1500108 -490226 966695 90788 -1516874 -546953 2140644
38795 2140644 2529307 -83482 -1844059 -307384 2194471 2776503 2278009 2899833 4078570
38786 4078570 3658653 1726684 389640 390466 541426 325787 620044 1501525 1491256 -172859
38776 -172859 -2065955 -2361328 -1064041 373722 867864 325966 -932645 -2482190 -3666582
38767 -3666582 -3796602 -2636420 -653740 1123955 1692974 947077 -132533 -658376 -976058
38758 -976058 -1820426 -2582110 -1781469 455428 1952877 1383986 155480 78432 542717
38749 542717 -33554 -980293 -226513 1862659 2367717 159030 -2366383 -3113950 -3206803
38740 -3206803 -4145831 -4496318 -2224765 1340839 3140213 3075414 3713675 5613938 6502092
38731 6502092 5535972 4845179 5613847 5920619 4341992 2802651 3413246 4807494 4366003
38722 4366003 2312983 764142 89882 -780845 -1413531 -363407 1812696 3013029 2897446
38713 2897446 2865305 2865487 1474277 -513764 -156183 2725177 4074644 1155405 -3157019
38704 -3157019 -4224086 -1767183 668589 1028364 607817 1111370 2418671 3389219 3093182
38695 3093182 1293948 -835265 -947853 1782785 4698010 4469755 1634532 -54677
38687 -54677 1046273 2433266 1598720 -351929 -892582 153899 1201682 1859686 2843033
38678 2843033 3608423 2658215 376589 -742952 463134 1975573 1397250 -740797 -2022378
38669 -2022378 -1692834 -1377768 -2305254 -3492821 -3378810 -2033801 -662639 355151 1566863
38660 1566863 2761739 2670594 926998 -810892 -736982 718217 1485322 543742 -1122015
38651 -1122015 -2179179 -2323047 -1760150 -603482 558569 615488 -553630 -1360052 -453290
38642 -453290 1191001 1410912 -196666 -1774578 -1662651 -167659 1298812 1766991 1104642
38633 1104642 -185069 -1267833 -1877712 -2891968 -4860557 -6064675 -3940536 926703
38625 926703 4347201 3620015 1305123 1654400 4532579 5823017 3590313 610644 -167976
38616 -167976 208024 -925814 -3356698 -4545477 -3759971 -2897023 -3077856 -2964368 -1462649
38607 -1462649 -35990 -536391 -1952089 -1523955 1087683 2878659 1456501 -1711101
38599 -1711101 -3251640 -2050455 216 851699 310067 -771370 -1802439 -2475216 -2550663
38590 -2550663 -2230597 -2089489 -2287913 -2425394 -2260465 -1870608 -1189936 -348640 -272686 -1587225
38580 -1587225 -3036673 -2745566 -1137925 -474029 -1153841 -1147738 8270 -180564 -2717326
38571 -2717326 -4529997 -3262263 -1692952 -3441774 -6603492 -6488894 -3321923 -1765842
38563 -1765842 -3010837 -3066194 -28664 2497024 1574934 -327597 70713 1602988 1587031
38554 1587031 658512 738201 845122 -928423 -3263156 -3571799 -2595555 -2886618 -3863690
38545 -3863690 -2808134 -250669 264330 -1873915 -3131945 -1746839 -656532 -2425046
38537 -2425046 -4786050 -4156726 -1096595 1027038 1376984 2143937 3876119 3710937 -234138
38528 -234138 -4942864 -5485527 -1360106 2668688 2732599 498560 -191475 726488 243033
38519 243033 -1926672 -2486116 -372574 759640 -1776085 -5057007 -4888426 -2070313 -511835
38510 -511835 -1074209 -1499878 -1251125 -1949172 -3301524 -2923103 -695000 518804 -701783
38501 -701783 -2556566 -3405255 -3597984 -3134762 -997625 1945793 2743416 677365 -1245694
38492 -1245694 -780195 538697 652713 238532 476924 369979 -1032050 -2000778 -553592
38483 -553592 2185462 3647873 3435813 2957391 2855017 3036492 3869104 5130520 5203363
38474 5203363 3536421 2329327 3336286 4689490 3779833 1698119 1351939 2314379 1511662
38465 1511662 -1276506 -2681032 -1124045 787001 595130 -419810 132431 1907183
38457 1907183 2708119 1745546 191285 -621714 -179126 1332482 3021283 3699895 3125916
38448 3125916 2408402 2664685 3760160 4690037 4583651 3100141 620031 -1619877 -2358968
38439 -2358968 -1683591 -914649 -851286 -903689 -369317 236009 -171278 -1669506 -3054746
38430 -3054746 -3088127 -1694013 112590 1343417 1898927 2184001 2212978 1793733 1476237
38421 1476237 2184161 3583256 4116362 3361087 2909038 3745227 4304818 2989631 1313887
38412 1313887 1992319 4492368 5327250 2990561 -83971 -1243467 -842964 -569987 -743196
38403 -743196 -920073 -1457039 -2558328 -2990532 -1704263 51642 172510 -1168353 -1743011
38394 -1743011 -617250 552104 44750 -1641907 -2925364 -3429968 -3936972 -4556073 -4251136
38385 -4251136 -2434143 -138049 1021256 681743 -27561 103412 1276267 2865423 3962485
38376 3962485 3703195 1942747 -32660 -324394 1444148 3525018 4191184 3647868 2986861
38367 2986861 2230968 785763 -840663 -1441926 -1036626 -779174 -911535 -406392 1033101
38358 1033101 2112162 1640841 -78148 -1964615 -3101987 -2709683 -649022 1545140
38350 1545140 1726994 31873 -866233 564977 2381574 1972700 -243431 -1848486 -2082360
38341 -2082360 -2180960 -2508180 -1821856 174554 1642113 1008786 -811398 -1722368 -1114206
38332 -1114206 -174490 3342 -330700 -207384 738544 1710194 1457919 -322631 -2389748
38323 -2389748 -3171354 -2576572 -1974002 -2163917 -2160129 -698465 1543130 2305041 497727
38314 497727 -2254868 -3371697 -2116329 985 1265446 1271611 379257 -1191899 -3000533
38305 -3000533 -3935313 -3258376 -1801097 -1004249 -857195 -66057 1493869 1980066 197669
38296 197669 -2110889 -2079395 536962 2842502 2228307 -737220 -3264318 -3418724 -1689279
38287 -1689279 31123 353810 -686257 -2097987 -2902022 -2595366 -1092409 1153178 2915596
38278 2915596 2886885 1208171 -183956 492578 2812198 4742274 5003496 3924204 2189335
38269 2189335 87640 -1684043 -1862518 -244605 1424347 1352839 18851 -559461 382413
38260 382413 1545060 1704730 1444359 2023779 3241442 3398910 1424672 -1570940 -3258964
38251 -3258964 -2575680 -916179 -481913 -1571102 -2247574 -1015562 1047462 1709910 510295
38242 510295 -970304 -1458336 -1138338 -355793 1216045 3430725 4995989 4854459 3298532
38233 3298532 1042001 -1644285 -4040953 -4636710 -3023193 -958302 -41024 490603 1858288
38224 1858288 2966560 2100532 528001 1154024 3531850 3707986 169895 -3269928 -2591794
38215 -2591794 940827 2974271 1987341 185835 -552921 -713890 -1135924 -1427095 -1061669
38206 -1061669 -462751 -278128 -510601 -763466 -695065 -134745 668487 1008441 487185 -401406
38196 -401406 -911217 -813825 -109987 1195419 2388274 2255114 1068941 1104129 3546898
38187 3546898 6017178 5347509 2138690 17778 512926 1415383 769263 -281403 -10148
38178 -10148 848946 622413 -250517 5754 1307535 1497192 -474698 -2881043 -3507300
38169 -3507300 -2534660 -2040065 -2955040 -3767151 -2882851 -1378144 -1825715 -4307114 -5529460
38160 -5529460 -3203826 263961 656362 -2246992 -4376485 -3041733 -241828 726443
38152 726443 -322566 -1189682 -840506 -167218 48094 51268 155681 284242 482156 828462
38142 828462 909559 371056 -95741 582759 2054961 2475615 795752 -1627148 -2482414
38133 -2482414 -1248026 340153 629347 618 -148936 295775 163095 -746131 -1000519
38124 -1000519 52847 711902 -700324 -2940647 -3380545 -1925813 -1010706 -1484252 -1032668
38115 -1032668 2135932 6023602 6968150 3943289 -709266 -4050781 -4771838 -3314154
38107 -3314154 -1082493 649088 1777036 2994968 4138281 3973288 2255936 621152
38099 621152 264609 88122 -1210870 -2389610 -1210737 1841634 3794723 3171650 1455333
38090 1455333 195872 -909286 -1977139 -1331917 1987214 5562948 5912142 3017790
38082 3017790 275059 -198893 66884 -948872 -2349614 -1896530 221049 1437748 465924
38073 465924 -1116055 -1390485 -547002 33808 -163905 -665867 -954885 -561212 914752
38064 914752 2893223 3824794 3154681 2298368 2454040 2597312 1310674 -491476 -870799
38055 -870799 -192950 -612523 -2421097 -3550793 -3022222 -2294283 -2464421 -2572648 -1738197
38046 -1738197 -777405 -487834 -308840 119191 35806 -594783 -443848 572244 316981
38037 316981 -2139628 -4398217 -4257014 -3169332 -3458351 -4085857 -2605157 37661 520037
38028 520037 -1464428 -2632843 -1319165 235539 -144962 -1284550 -916673 938293 2502939
38019 2502939 2737425 2012549 1272213 1319212 2079857 2348036 1402692 714432 2202406
38010 2202406 4783870 5133119 2550105 385683 1171102 2896934 2374220 185277 -637493
38001 -637493 421603 973116 -1216 -621779 549526 2272769 2815769 2269066 1413684
37992 1413684 152361 -1332966 -1475166 555006 2676237 2141560 -552582 -2362926
37984 -2362926 -2158216 -1824675 -2432284 -2211699 116813 2591441 2949243 2311927 2999257
37975 2999257 4049679 2417432 -1777768 -4766131 -4353317 -2386811 -1128197 -359669
37967 -359669 433273 30667 -2189818 -4274276 -4420136 -3778121 -4161952 -4714126 -3534028
37958 -3534028 -1316833 -539785 -1753490 -3275278 -4087923 -4593209 -4779811 -4022269 -2721889
37949 -2721889 -2084067 -2138642 -1693081 -264439 1407929 2540125 2669643 1522087 60384
37940 60384 661148 4138423 7462438 6956025 3254425 464783 663871 1981242 2197237
37931 2197237 1435958 758058 548460 1003459 2200159 3221711 3044218 2334312 2354836
37922 2354836 2401822 902659 -1205764 -1344923 324243 852655 -556969 -1243734 70039
37913 70039 863622 -780436 -2684557 -1967879 736779 2927073 3768597 3587589 2059978
37904 2059978 -493990 -1911342 -911931 546351 75044 -1519716 -1885066 -945467 -479489
37895 -479489 -999644 -1538999 -1670398 -1539257 -777380 629517 1454843 1117542 1121557 2565766
37885 2565766 3768842 2753070 525464 -773557 -1375354 -2464353 -2849231 -805819
37877 -805819 1845971 1732223 -381535 -321520 2658226 4263741 1797402 -1666367 -2013870
37868 -2013870 245339 1748736 1327835 413253 -137290 -884742 -2028185 -2857706 -2913543
37859 -2913543 -2424533 -1759828 -1226726 -981672 -558514 801636 2702070 3322106 1488848
37850 1488848 -1620513 -3744849 -4038377 -3436560 -2866477 -2115002 -701716 858862 1443833
37841 1443833 1007374 1004112 2247362 2977091 836781 -3076564 -4463665 -1435460 2295961
37832 2295961 2074831 -1567813 -4361025 -4687259 -4874267 -6249279 -6871081 -5416800 -3906184
37823 -3906184 -4384166 -5354415 -4058092 -846575 1121765 -83177 -3237218 -5678417
37815 -5678417 -5586065 -2944558 537333 2629914 2523201 1405223 790561 942588 1358380
37806 1358380 1851309 2364011 2449212 1772672 683224 -238626 -708468 -560587 200591
37797 200591 913233 692282 -419392 -1652812 -2828957 -4123432 -4592776 -2939760 -155154
37788 -155154 930346 -317670 -1233366 -279965 115088 -2367930 -5420806 -5143339 -2180482
37779 -2180482 -905585 -2830598 -4751808 -4068686 -2296731 -1814641 -2200022 -1887856 -1147794
37770 -1147794 -1073880 -1224391 -560922 380643 404172 -139851 -175968 -184239 -1322166 -2693292
37760 -2693292 -2116026 178724 1265707 -199434 -1871832 -1304204 551555 1430619 1535482
37751 1535482 2592557 4196657 4104926 2060783 429240 427784 369094 -1200129 -2954920
37742 -2954920 -3004357 -1762232 -780707 -266529 267857 212360 -1056839 -2307322 -2022262
37733 -2022262 -1098297 -1443979 -2376446 -1289705 1960115 4226666 3362970 780549 -1220391
37724 -1220391 -2193002 -2367705 -1181660 1223077 3007227 3041701 2591128 2699507 1810981
37715 1810981 -1418680 -4483642 -3494364 1206932 5099002 5413486 4092832 4041418 5177983
37706 5177983 5762592 5501077 5256110 4918805 3665257 1859069 901645 1179801 1588051
37697 1588051 1304785 797547 604346 235058 -830135 -1761060 -1162283 880443 2632594
37688 2632594 2878173 2277238 1945784 1585503 125657 -2290984 -4322430 -5365990 -6093323
37679 -6093323 -6765403 -6446005 -4637773 -2459844 -1133793 -285181 988467 2163460 1982613
37670 1982613 741229 200237 1081583 2206329 2604287 2979346 4073753 4759476 3308882
37661 3308882 172569 -2088719 -1976521 -877990 -883433 -1720350 -1258755 1150441 3489573
37652 3489573 3926673 3466611 4258923 6006765 6092896 3539732 868246 806030 2517700
37643 2517700 2833879 591858 -2168482 -3471441 -3998150 -5366161 -7053976 -6694374 -3309607
37634 -3309607 1106201 3706914 3605631 1997926 336820 -593354 -330548 1065687 2288943
37625 2288943 1594020 -1048521 -3620073 -4507040 -4218068 -3863163 -3192743 -1530960 324761
37616 324761 905289 324594 75868 823007 1939942 2941184 3657117 3261373 1156845
37607 1156845 -1140565 -1181544 969298 2588849 2146971 1090197 961794 1069703 368517
37598 368517 -406440 -182159 471689 445874 -140322 -690673 -1300800 -1836210 -1320402 342634
37588 342634 1576325 1499517 1338645 1877824 1574255 -634118 -2721483 -2517659 -1469554
37579 -1469554 -2300651 -4360766 -4856532 -3733201 -3481379 -4470945 -4440862 -2864738 -1935535
37570 -1935535 -2430368 -2306053 -654400 426044 -412739 -1293068 -440343 731311 127814
37561 127814 -1714838 -3171009 -4382537 -6053195 -7008971 -5726577 -3348504 -2515289 -3538577
37552 -3538577 -4083235 -2773339 -1141131 -1372763 -3344592 -4653972 -3260105 211672
37544 211672 2936670 2875914 916718 -686032 -1383581 -2268297 -3266158 -2781365 -757032
37535 -757032 369588 -796407 -2216812 -1463964 568549 1288625 540277 562283 2248200
37526 2248200 3840845 3604609 1933562 238974 -908007 -1770664 -2334077 -2000351 -501694
37517 -501694 1161171 1363409 -2340 -793492 621825 2476458 1635819 -1558617 -3268349
37508 -3268349 -1750752 84098 -573313 -2108701 -1619490 104273 235310 -1037658 -941731
37499 -941731 1016751 2312268 1628888 505267 228852 80434 -479564 -511288 468851
37490 468851 1456250 1807719 2067461 2107966 688292 -1953498 -3249648 -1703498 579810
37481 579810 616492 -1428497 -2817679 -2096802 -560697 -71764 -931512 -2174416 -2942607
37472 -2942607 -3024880 -2456975 -1230641 264999 833986 -571472 -3151434 -4532528 -3540758
37463 -3540758 -1730795 -1128625 -1613280 -2018705 -2513976 -3607452 -3788355 -1182505 2630182
37454 2630182 3689822 1164394 -1285862 -830335 711757 122020 -2567845 -4819135
37446 -4819135 -5198626 -4105577 -2188795 -67431 1219557 1168341 627817 580501 976975
37437 976975 1564437 2464275 2951761 1411838 -2094944 -4965607 -5397040 -4854796 -5316547
37428 -5316547 -5867312 -4473506 -1696424 83633 199275 -154205 -513964 -1264026 -1751657
37419 -1751657 -935045 453786 867701 606675 971026 1372774 317053 -1129320 -374186
37410 -374186 1972819 2125737 -1126089 -4181233 -3706047 -835766 1586797 3067752 4370306
37401 4370306 4808369 3477027 1608338 991508 1063633 18606 -1905386 -2571681 -1100717
37392 -1100717 1044789 2088945 1655422 613174 288100 1447455 3209811 3720386 2772301
37383 2772301 2497857 4106729 5374135 3455466 -812817 -3877657 -4268141 -3871902 -4356369
37374 -4356369 -4896034 -4226420 -2774759 -1522187 -349435 1117836 2101819 1508889 -290630
37365 -290630 -1571911 -1073760 752047 2121400 1437874 -1026328 -2802948 -1354312 2957974
37356 2957974 6608815 6294132 2394358 -1400203 -1823020 958209 4010900 4878711 3734975
37347 3734975 2342162 1655385 1350711 1309129 1915915 2375803 571930 -3776281 -7139520
37338 -7139520 -5787702 -1060551 1564453 -646330 -4063723 -3512299 978398 4455253
37330 4455253 3457186 -187332 -2531353 -2596997 -2690831 -4393936 -6261816 -6169006 -4392027
37321 -4392027 -2803855 -1837148 -375874 1342902 1223775 -1196834 -3042511 -1881025
37313 -1881025 502887 649435 -1434756 -2640552 -1737467 -706904 -769393 -362677 1667651
37304 1667651 3639129 3565293 2005763 613998 -320529 -1047011 -803720 783082 2123042
37295 2123042 1698091 592004 741421 1609572 1130108 -574220 -1144195 240045 1615843
37286 1615843 1455733 903649 1614988 2986131 2999871 1066597 -1158594 -1637866 -59413
37277 -59413 1902314 2378082 1409160 839329 1798821 3125821 3171084 2350025 2485529 4037276
37267 4037276 5528635 5636976 4406999 2402937 163088 -1347078 -1255163 -147283 382073
37258 382073 -102932 -395266 395866 1716384 2713406 3138600 2746517 1268589 -495201
37249 -495201 -1032078 -178914 616760 673418 1024106 2168948 2749977 1807387 712281
37240 712281 1203158 2815769 3985671 4533815 5165529 5483683 4641044 3409300 3449979
37231 3449979 4683708 5330061 4566981 3320623 2342470 1421737 847291 1672982 3670677
37222 3670677 4680036 3229384 709876 -297887 789322 2139014 1928582 261465
37214 261465 -1287264 -1389017 -104402 1373652 1956653 1599356 1017795 772871 915479
37205 915479 1210963 1221364 454595 -926680 -1806745 -1359828 -433386 -621348 -1819581
37196 -1819581 -1915405 431061 3674052 5102258 4189739 3066266 3611763 5182211 5824259
37187 5824259 4985289 3937359 3648983 3517460 2849884 2502635 3691355 5675764 6311517
37178 6311517 5047534 3703827 3693386 4151045 3872414 3485251 4019798 4531573 3265870
37169 3265870 676611 -802557 -20734 1630387 2371426 1789186 191394 -2040589 -3798844
37160 -3798844 -3477129 -873102 2067814 3233875 2419748 908180 -270951 -1085172 -2043205
37151 -2043205 -3423317 -4622434 -4317140 -1922689 1216756 2945431 2528943 917162
37143 917162 -862763 -2270004 -2518421 -1116089 649958 637361 -1182647 -2458727 -1840954
37134 -1840954 -700052 -441969 -133969 1502415 3324610 3061747 510347 -2353945 -3847672
37125 -3847672 -3638963 -2053662 -25370 741753 -675576 -2782696 -3043636 -914087 1713773
37116 1713773 3031767 3055543 2757193 2561201 2076449 834202 -773510 -1238773 633462
37107 633462 3631050 4622160 2155111 -1453422 -2928079 -1986315 -866459 -680657 -291162
37098 -291162 1259485 3094598 3759806 2898448 1275883 -59033 -512328 -393357 -374931
37089 -374931 -164396 1311639 3722555 4880263 3841081 2708499 3212151 3285547 215327
37080 215327 -4074957 -4945736 -2031161 58680 -1119389 -2362275 -466530 2584713
37072 2584713 3076289 1184648 -306939 -769514 -1558438 -2425910 -1806484 -230443 -65261
37063 -65261 -1670962 -2753865 -2091117 -1258302 -1669856 -2121091 -747024 1944043 3442148
37054 3442148 2082000 -1364937 -4599492 -5777006 -4844400 -3185989 -1855306 -413157
37046 -413157 2012891 4859614 6255889 5247875 3264295 2861790 4986065 7637269
37038 7637269 7659921 4275459 386616 -601900 1058537 2018745 570090 -1321302 -1531248
37029 -1531248 -933645 -1201594 -1519864 -175732 1881467 2132470 603721 -195253 497009
37020 497009 598734 -1016199 -2548190 -2390538 -1684462 -1989168 -2402160 -1105471 1495645
37011 1495645 3226869 3061875 1885668 764175 -76463 -730114 -1263789 -1875969 -2638930
37002 -2638930 -3244081 -3520577 -3768239 -4039988 -3714518 -2467054 -1038069 -258400 111838
36993 111838 765849 1621850 2028225 1676745 555480 -1346885 -3400132 -4150262 -2967932
36984 -2967932 -1301761 -957628 -1527824 -966756 1451511 4198048 5514791 4965042 2869124
36975 2869124 -260702 -3273839 -4771937 -4630801 -4053058 -3621396 -2596268 -799308 367792
36966 367792 50590 -249125 1234373 3477138 3801729 1870506 356262 1072320 2398584
36957 2398584 1831044 -299220 -1387572 -273998 1328279 1326987 -159644 -1361066 -1188428
36948 -1188428 -201794 458568 416876 247062 648558 1571700 2116768 1385868 -473111
36939 -473111 -2224289 -2747671 -2213277 -1839658 -2499815 -3795898 -4583260 -4193526 -2956560
36930 -2956560 -1648480 -720100 -132545 330939 865812 1627333 2537926 3072142 2651334
36921 2651334 1509300 804349 1394819 2644218 2964196 1604452 -543364 -2056052 -2435090
36912 -2435090 -2151481 -1615806 -685583 704406 1832410 1603408 -125140 -1918512 -2031666
36903 -2031666 -449433 892530 341168 -1509186 -2702633 -2352134 -1346097 -881024 -1267200
36894 -1267200 -2129493 -2758373 -2189859 -31188 2596437 4047212 4258338 4542347 5055425
36885 5055425 4324382 2130323 845630 2242780 4592236 5047499 3741209 3105604 3836435
36876 3836435 4158897 3002842 1386849 315560 -397217 -672386 259321 2040385 2956483
36867 2956483 2408266 1727718 1688394 1300080 200601 -5864 1567936 3169849 3181246
36858 3181246 2875125 3969757 5165052 4165617 1986576 1716075 3288731 3152357 -194785
36849 -194785 -3716887 -4322180 -2936737 -2090619 -1817265 -605834 1039167 932174 -1226684
36840 -1226684 -3114503 -2939973 -1405808 -1196 937789 1543569 1196114 -602491 -2767181
36831 -2767181 -3440077 -2293306 -1010862 -1184398 -2438406 -3048317 -1966449 142367 1583367
36822 1583367 1131980 -735425 -1933815 -784275 1673421 2366217 107533 -2220798
36814 -2220798 -1096074 2682215 4779241 3189209 693860 466176 1845932 2454162
36806 2454162 2242216 2557509 2657009 631058 -2571136 -3522595 -1289155 1079155 1108649
36797 1108649 122288 348449 1390996 1680700 1330409 1088147 117688 -2388597 -4546245
36788 -4546245 -3824365 -1284612 -599012 -2632132 -4189885 -3137582 -1702045 -2721066
36780 -2721066 -4997230 -5072637 -2315921 552561 1603856 1752766 2346186 3006365 2898356
36771 2898356 2483601 2677073 3236602 3229724 2515592 1697150 1046233 493826 334982 884478
36761 884478 1649857 1915555 1973621 2552652 3113756 2302011 462317 -75940 1690105
36752 1690105 3389296 2247722 -867627 -2379486 -636077 2370074 4049664 4052169 3444506
36743 3444506 2791254 2128458 1590416 900454 -799175 -3417903 -5000071 -3667495 -86812
36734 -86812 3139035 4230760 3348578 1394953 -883337 -2592535 -2895571 -2036082 -1260191
36725 -1260191 -1267076 -1453563 -1081821 -503920 -707653 -2039319 -3701245 -4245936 -2635600
36716 -2635600 531253 2862057 2258149 -440133 -1919785 -250701 2627939 3328383
36708 3328383 1215827 -1210576 -1853306 -1296076 -1170820 -1770120 -2340866 -2748568 -3420856
36699 -3420856 -3979102 -3392394 -1754158 -645325 -1044986 -1896578 -1796041 -1324840 -2139188
36690 -2139188 -3918949 -4149463 -1745042 824862 721233 -1028490 -816197 2115791 4105513
36681 4105513 2073650 -2004785 -3682582 -1866756 427885 853886 603230 1680002
36673 1680002 3519777 4040631 2806813 1290500 508884 72962 -545499 -1292590 -2131797
36664 -2131797 -2926711 -2544979 282508 4545961 7008323 5922591 3471805 2920118 4234145
36655 4234145 4546258 2655570 739394 934153 2250718 2329866 935087 -75612 315555
36646 315555 1109062 1109285 535541 375277 1037659 2092130 2749159 2345376 944165 -319068
36636 -319068 -104826 1616392 3429893 4079295 3632837 2832788 2020174 1188225 473024
36627 473024 -51138 -655735 -1457020 -1970853 -1705577 -887328 -96754 469817 848836 780138
36617 780138 -70914 -1599436 -3384735 -4908373 -5290406 -3653977 -560847 1791490 2003555
36608 2003555 1327747 1564787 1867094 -96664 -3848848 -5599605 -3079622 1188339 2953537
36599 2953537 1123438 -1907800 -3601724 -3282748 -1621898 196821 1077225 981869 1032050
36590 1032050 1868133 2633691 2457429 1895829 1689842 1237614 -62846 -970545 117673
36581 117673 2522416 4111852 4186777 3487177 2058887 -304067 -1945495 -728072 2302939
36572 2302939 3721364 2735943 2200781 3640412 4699787 3335907 1320616 1081654 1798404
36563 1798404 1517230 800749 1019422 951551 -1216991 -3774153 -3290338 -100199 1770258
36554 1770258 325679 -2136411 -2952665 -2128858 -737623 736740 1468824 413774 -1561862
36545 -1561862 -2162150 -1233147 -1174116 -2707246 -3333053 -1747934 -616211 -2284544 -4516261
36536 -4516261 -3945665 -1744113 -1818269 -4378403 -5541703 -3489629 -1055982 -1042617 -2316914
36527 -2316914 -2428132 -1527939 -1388168 -2176413 -2527596 -1950873 -1156561 -460944 376669
36518 376669 1008332 889402 761121 1984663 4032728 4381584 1870171 -1216098 -1843904
36509 -1843904 -162866 945158 -39980 -1486343 -1354202 -4811 907913 1114662 1628427
36500 1628427 2491924 2436312 1018997 -410501 -547826 178717 583674 543077 844244
36491 844244 1691742 2364923 2276668 1604066 807964 97458 -524256 -1104687 -1729161 -2329328
36481 -2329328 -2424608 -1383706 828518 3266634 4577672 4141596 2723041 1803707 1979047
36472 1979047 2147028 796957 -1831370 -3543993 -2607380 126744 2190053 2309671 1381971
36463 1381971 602578 -301441 -2208030 -4611221 -5677357 -4402432 -1769203 623987
36455 623987 2220259 3188520 3397139 2850602 2513885 3197024 3865418 2787241 471982
36446 471982 -541303 521229 1266432 -68233 -1463836 -378 3547316 5691325
36438 5691325 5113954 3764094 3147710 2367139 555085 -1201873 -1617016 -1142042 -972974
36429 -972974 -1407456 -2073843 -2578915 -2226471 -389447 2146935 3521775 3124435 2261558
36420 2261558 2017412 2049481 2040361 2409516 2784798 1909765 174267 -84936 1713416 2887803
36410 2887803 1705281 517080 1876964 3856214 2901047 -229491 -1589739 -447355
36402 -447355 -134684 -2119058 -3477799 -1722301 1407698 2937283 2652561 2017308 1391303
36393 1391303 560104 283519 1096736 1810059 1151627 -158939 -763061 -1033989 -2211747
36384 -2211747 -4028739 -5138162 -5298025 -5214936 -4669998 -2826749 -305900 1018710 575975
36375 575975 -220388 -196698 233252 381149 381196 315918 -259360 -1024615 -556327 1480583
36365 1480583 3006699 1951513 -824554 -2709964 -2859198 -2628722 -2783100 -2543313 -1836613
36356 -1836613 -2172180 -4068311 -5528673 -4712359 -2590133 -1127122 -267066 979679 1648784
36347 1648784 -3436 -2867611 -3731695 -2037796 -790831 -1794480 -3042904 -2431551
36339 -2431551 -1178328 -1250158 -1750940 -678743 1356061 2082795 1228514 474362 417230
36330 417230 200416 -243775 -166633 -80040 -1364401 -3584435 -4366144 -2332588 1498028
36321 1498028 5221150 7270346 6500069 3171376 -272003 -1547857 -1517705 -2595408 -4511735
36312 -4511735 -4559679 -2251015 -542863 -1451380 -3292984 -3609259 -2327865 -600109 1149777
36303 1149777 2449282 2224581 709247 4818 1134173 2355713 1923263 570586 -388034
36294 -388034 -1348858 -2843324 -3674124 -2927658 -2115600 -2825345 -3733025 -2647468 -361615
36285 -361615 394203 -825699 -1785197 -1199181 -290137 -533888 -1755518 -2659748 -1980003
36276 -1980003 511904 2929257 2217938 -2058241 -5932177 -5243405 -838207 2775135
36268 2775135 3206142 1902023 570414 -946277 -2815334 -4061101 -4201407 -3928787 -3459564
36259 -3459564 -2151150 -312875 605013 232649 -256289 -431221 -1237774 -2661034 -3007085
36250 -3007085 -1569955 64059 577095 778537 1526121 1797202 673918 -384865 570011
36241 570011 2774839 3464121 1358308 -2124200 -4778124 -5402820 -4052883 -1804940 -178436
36232 -178436 130131 -200718 -346007 -491803 -1062336 -1616732 -1599495 -1574262 -2488711 -4056119
36222 -4056119 -5041976 -4998661 -4617195 -4365226 -3821202 -2627596 -1348544 -980025 -1915747
36213 -1915747 -3540932 -4667228 -4442826 -3085093 -1671057 -1063602 -1151243 -1185127 -625125
36204 -625125 399156 1211904 1196481 554293 269718 903345 1768446 1965613 1755047 1817984
36194 1817984 1565911 -204200 -2887241 -4078289 -2640776 -242034 955519 670643
36186 670643 -317628 -1748658 -3272479 -3658188 -2337693 -823790 -912544 -2178365 -2876708
36177 -2876708 -2637242 -2430668 -2370675 -1619344 -395465 -10643 -616859 -897894 -598759
36168 -598759 -1365758 -3863685 -5711532 -4148519 -58879 2506050 1015575 -2646056
36160 -2646056 -4607343 -3529819 -1713822 -1787326 -3405492 -4108776 -2875903 -1337683 -1135848
36151 -1135848 -1574536 -1048463 232556 553621 -673680 -2206975 -2942906 -3084919 -2989494
36142 -2989494 -2254334 -708789 713036 979430 269439 -370755 -200951 847804 2367296
36133 2367296 3433377 2931546 701191 -1884359 -3123095 -2684992 -1698444 -1344933 -1842841
36124 -1842841 -2688792 -3380059 -3801538 -4183063 -4734738 -5198479 -4902472 -3543052 -1829812
36115 -1829812 -951613 -1236612 -1637154 -894301 867957 2148184 1827212 443670 -759054
36106 -759054 -1597074 -2799060 -4185914 -4310994 -2554000 -472060 24818 -872960 -1452396
36097 -1452396 -964381 -94755 777621 2078690 3480715 3459051 1281656 -1623411 -3156782
36088 -3156782 -2651084 -855250 1246079 2716841 2642400 1060023 -449847 -219299 1546253
36079 1546253 3123671 3468269 3155526 3099367 3249132 2948292 2007786 927753 223624
36070 223624 -135483 -521754 -958935 -901088 -5449 1073044 1278397 554271 -133892 -352016
36060 -352016 -766782 -1677328 -2164819 -1727083 -1682788 -3389380 -5734784 -6284910 -4757919
36051 -4757919 -3334138 -3186454 -2842149 -1024097 842456 759941 -514864 -492405 1184866
36042 1184866 2161266 950515 -935060 -1436021 -984537 -1564849 -3513039 -4920560 -4254776
36033 -4254776 -2217896 -516655 215589 524217 853917 1158490 1575755 2501650 3763098
36024 3763098 4445072 3935341 2664348 1476618 737069 418628 536173 925320 1000559
36015 1000559 393943 -411863 -676892 -368453 48938 416202 727503 565773 -356614
36006 -356614 -1405010 -1865538 -2259155 -3411861 -4447438 -3597913 -1244441 18325 -855865
35997 -855865 -1856863 -1606595 -2098702 -5200960 -8323024 -7118541 -1901337 2245923 2161586
35988 2161586 73400 -615857 235699 1123474 2087006 3589697 4188438 2399997 -156134
35979 -156134 -501800 1247605 2144264 1203624 856662 2648641 4313068 3091548 60323
35970 60323 -1247903 324542 2380419 2537867 1218098 296772 408634 621724 139336
35961 139336 -681787 -1027368 -730764 -357679 -335159 -353711 101672 790120 810892 -150955
35951 -150955 -1209202 -1390307 -927559 -689395 -571146 441054 2321717 3255125 1778750
35942 1778750 -950765 -2197901 -825304 1635405 3154153 3291334 2735623 1979624 1381712
35933 1381712 1618446 2788514 3547335 2519359 453256 -445860 442949 1177771 -74604
35924 -74604 -2598105 -4277504 -4272684 -3437282 -2637265 -1842420 -792941 341943 1079413
35915 1079413 908527 -397641 -2290822 -3555014 -3463645 -2547131 -1684709 -922111 14935
35906 14935 522464 -379604 -2377298 -3758188 -3208757 -1050932 1222139 1879672 -177953
35897 -177953 -4108776 -6735853 -5174420 -443956 3060627 2589863 135934 -621319 951878
35888 951878 2518173 2652722 2463703 3326280 4871952 5788571 5331205 3514781 886465
35879 886465 -1374931 -2118035 -1551833 -1062486 -1178366 -687917 1445268 4173842 5437839
35870 5437839 4634556 2981366 1705861 905132 193993 -393697 -408797 509469 2143118
35861 2143118 3514364 3628160 2794895 2523055 3370892 3774841 2273345 100168 -306201
35852 -306201 1014292 1686613 1006108 1064960 2810301 3821497 2219781 403838 1688956
35843 1688956 4680697 4795506 1108921 -2190191 -1980885 -195419 135221 -411692 339231
35834 339231 1788283 1644491 276263 452256 2693651 4068120 2575136 144760 -332809
35825 -332809 922412 1524088 837766 590089 1576629 1987027 116702 -2734647 -3831860
35816 -3831860 -2909563 -2510619 -4095597 -5810728 -5350353 -3337311 -1885570 -1075419 423745
35807 423745 1780103 429003 -3248094 -5019690 -2394457 1668338 3081505 2307411
35799 2307411 2592655 4265297 4615848 2887832 1491059 1704357 1617617 -369096 -2837471
35790 -2837471 -3832472 -3824176 -4300998 -5062980 -4866059 -3669506 -2454922 -1500950 -360374
35781 -360374 937478 1972182 2856676 3961478 4992192 5256186 4598072 3398251 2079276
35772 2079276 1254142 1712766 3363872 4722403 4450997 3071513 2202100 2380890 2645569
35763 2645569 2158342 1253676 712569 751241 995422 991999 564489 -46806 -349047 -109927
35753 -109927 391695 842307 1371590 2161702 2784087 2515622 1428850 654853 1120372
35744 1120372 2200401 2220574 564137 -1281379 -1498938 -379292 219667 -168147 76427
35735 76427 1658804 2636742 1419980 -180610 477259 2307554 1800722 -1261215 -3034632
35726 -3034632 -1476773 582390 127250 -1490904 -1474340 -467132 -959694 -2390797 -1792254
35717 -1792254 1059413 2881159 1832226 -4603 -230888 531490 560453 93035 341418
35708 341418 823570 -14817 -1916236 -2588723 -786637 1768014 2381650 645530 -1211460
35699 -1211460 -1147736 381499 1435908 1256919 866352 1122123 1488680 1249786 739769
35690 739769 434702 -173185 -1533340 -2598523 -1934627 18940 1259968 835002 -116813
35681 -116813 -85075 1156760 2817816 4011393 4180641 3453776 2705809 2504171 2131852
35672 2131852 654329 -1300657 -2254947 -2312508 -3071369 -4691233 -5080601 -3155898 -1057802
35663 -1057802 -1263353 -2800368 -2693580 -645170 335556 -1538234 -4003102 -3845927 -1246810
35654 -1246810 860033 1014071 734240 1619056 2849630 2704543 1404935 898515 2044915
35645 2044915 3383753 3092246 1277696 -272582 -178341 1218058 2462129 2568839 1942296
35636 1942296 1688159 1984091 1545886 -770330 -4144349 -6402323 -6427780 -5074609 -3561362
35627 -3561362 -2049762 -372955 800145 525650 -1073348 -2818859 -3678213 -3409902 -2194153
35618 -2194153 -201347 2318407 4674949 5668001 4382209 1531687 -461144 291025
35610 291025 2911332 4729540 4352133 2604235 614766 -1290011 -2508831 -2015281 -247183
35601 -247183 661499 -198090 -1069387 -568792 -386952 -2634380 -5705243 -5650029 -1535357
35592 -1535357 3124264 4784604 3629291 2109268 1543837 1538666 1708607 2332801 3281005
35583 3281005 3487631 2276666 804208 1078978 3150349 4431813 3023377 740396
35575 740396 860794 3320085 4692274 3197121 918911 80733 -42719 -839054 -1592458
35566 -1592458 -1126016 2704 1098203 2876141 5100796 5173349 1995785 -1183225 -1250356
35557 -1250356 -259585 -1895163 -4961926 -5320565 -2987990 -1859160 -2771083 -2501492 -167634
35548 -167634 998482 -385243 -1400134 -272168 676238 -153403 -637698 426417 293315
35539 293315 -2619354 -4795299 -2978149 18708 -503821 -3719764 -4796416 -2128198
35531 -2128198 1446720 3554263 4149821 3102521 -1403 -3566085 -4913833 -3862940
35523 -3862940 -2767812 -2989120 -3722906 -4104881 -4049788 -3223463 -1511888 -236007 -677200
35514 -677200 -1881050 -2236538 -2459027 -4123810 -5814016 -4259273 332128 3494503 2263127
35505 2263127 -991521 -1955078 477402 3898372 5633934 4875425 2661825 933041
35497 933041 1010666 2388085 3483111 3557368 3015531 2043376 351725 -1612949 -2623884
35488 -2623884 -2228299 -1236986 -437806 69268 124716 -617351 -1699499 -1865448 -535471
35479 -535471 1504227 3121716 3814544 3613139 2830455 1996910 1368426 563475 -712366
35470 -712366 -1899630 -2224493 -1618219 -271075 1911566 4310299 4980161 2670009 -1072532
35461 -1072532 -3456159 -3731420 -3314310 -3093137 -2586617 -1698683 -1250506 -1336095 -839965
35452 -839965 804525 2619540 3289621 2430681 589644 -1060717 -1216551 265466 1850539
35443 1850539 2173994 1785807 1746963 1500190 147916 -1041279 -73136 2156953 2595930
35434 2595930 602868 -1123751 -843762 -97939 -547493 -1177827 -382179 1274567 2253872
35425 2253872 2464082 2764506 3229220 3378997 3185525 2703315 1695053 559568 490470
35416 490470 1784390 3170172 3682064 3872786 4226116 3838549 1955286 -385494 -1549069
35407 -1549069 -1250077 -310190 561800 886356 384530 -334923 -125873 1051517 2120804
35398 2120804 2898429 4240268 5601001 4886049 1950943 -346394 -374519 -367971 -2446450
$$ [...]
##END NTUPLES=NMR SPECTRUM
##END=
