##TITLE=31Pdec_IBEPA2709
 d2O, 24 sc
 29.09.2021
##JCAMPDX= 6.0         $$ Bruker NMR JCAMP-DX V2.0
##DATA TYPE= NMR SPECTRUM
##DATA CLASS= NTUPLES
##ORIGIN= UXNMR, Bruker Analytische Messtechnik GmbH
##OWNER= root
$$ XWIN-NMR		Version 3.5
$$ Thu Sep 30 08:35:40 2021 Russian Standard Time (UT+4h)  she@DPX200
##.OBSERVE FREQUENCY= 81.013821
##.OBSERVE NUCLEUS= ^31P
##.ACQUISITION MODE= SIMULTANEOUS
##.ACQUISITION SCHEME= undefined
##.AVERAGES= 24
##.DIGITISER RES= 16
##SPECTROMETER/DATA SYSTEM= spect
##.PULSE SEQUENCE= zgpg30
##.SOLVENT NAME= CDCl3
##.SHIFT REFERENCE= (INTERNAL, CDCl3, 0, 248.564)
##AUDIT TRAIL= $$ (NUMBER, WHEN, WHO, WHERE, WHAT)
$$ ##TITLE= Audit trail, XWIN-NMR		Version 3.5
$$ ##JCAMPDX= 5.01
$$ ##ORIGIN= Bruker BioSpin GmbH
$$ ##OWNER= she
$$ F:/spectra/data/she/nmr/P31/1/pdata/1/auditp.txt
$$ ##AUDIT TRAIL=  $$ (NUMBER, WHEN, WHO, WHERE, WHAT)
(   1,<2021-09-30 08:34:20.09 +0400>,<she>,<DPX200>,
      <created by zg, POWCHK disabled, PULCHK disabled
       configuration hash MD5:
       00 E9 B6 7A A2 85 ED C7 34 08 36 98 17 FE 4E 26
       data hash MD5: 32K
       56 39 55 80 6B AD D3 7B 21 60 9B 3E FD 8C BA 07>)
(   2,<2021-09-30 08:34:29.65 +0400>,<she>,<DPX200>,
      <Start of raw data processing
       efp BC_mod = 2 LB = 1 FT_mod = 6 PKNL = 1 PHC0 = -8856.668 PHC1 = 137.0694 SI = 64K 
       data hash MD5: 64K
       C4 2C 6E FF 60 0D F8 34 7C 1F F1 86 87 FE 3D D0>)
(   3,<2021-09-30 08:34:57.48 +0400>,<she>,<DPX200>,
      <pk PHC0 = -10.57045 PHC1 = 0 
       data hash MD5: 64K
       CB 63 28 07 47 C1 76 B1 58 96 CD 17 E2 0B 32 84>)
(   4,<2021-09-30 08:35:01.01 +0400>,<she>,<DPX200>,
      <abs ABSG = 5 
       data hash MD5: 64K
       82 18 D4 88 94 24 65 D9 40 B3 D1 0C A9 47 AE 67>)
$$ ##END=
$$ 
$$ hash MD5
$$ E2 E7 78 86 0A 8E 86 3A C5 0C 58 FC 98 A8 7B AC
##$RELAX= 
##$RELAX= 
##$RELAX= 
##$RELAX= 
##$RELAX= 
##$RELAX= 
##$RELAX= 
##$RELAX= 
$$ Bruker specific parameters
$$ --------------------------
##$DU= <F:/spectra>
##$EXPNO= 1
##$NAME= <P31>
##$PROCNO= 1
##$TYPE= <nmr>
##$USER= <she>
##$AMP= (0..31)
100 100 100 100 100 100 100 100 100 100 100 100 100 100 100 100 100 100 
100 100 100 100 100 100 100 100 100 100 100 100 100 100 
##$AQSEQ= 0
##$AQ_mod= 1
##$AUNM= <au_zg>
##$AUTOPOS= <>
##$BF1= 81.014009
##$BF2= 200.13
##$BF3= 200.13
##$BF4= 200.13
##$BF5= 200.13
##$BF6= 200.13
##$BF7= 200.13
##$BF8= 200.13
##$BYTORDA= 1
##$CFDGTYP= 0
##$CFRGTYP= 5
##$CHEMSTR= <none>
##$CNST= (0..31)
1 1 145 1 1 1 1 1 1 1 1 1 1 1 1 1 1 1 1 1 1 1 1 1 1 1 1 1 1 1 1 1 
##$CPDPRG= <waltz16>
##$CPDPRG1= <>
##$CPDPRG2= <waltz16>
##$CPDPRG3= <>
##$CPDPRG4= <mlev>
##$CPDPRG5= <mlev>
##$CPDPRG6= <mlev>
##$CPDPRG7= <mlev>
##$CPDPRG8= <mlev>
##$CPDPRGB= <>
##$CPDPRGT= <>
##$D= (0..31)
0 1 0 0 0 0 0 0 0 0 0 0.03 2e-05 3e-06 0 0 0 0 0 0 0 0 0 0 0 0 0 0 0 0 
0 0 
##$DATE= 1632976459
##$DBL= (0..7)
120 120 120 11 120 120 24 19 
##$DBP= (0..7)
150 150 150 150 150 150 150 150 
##$DBP07= 0
##$DBPNAM0= <>
##$DBPNAM1= <>
##$DBPNAM2= <>
$$ [...]
##$SUBNAM3= <"">
##$SUBNAM4= <"">
##$SUBNAM5= <"">
##$SUBNAM6= <"">
##$SUBNAM7= <"">
##$SUBNAM8= <"">
##$SUBNAM9= <"">
##$SW= 501.771253377433
##$SWIBOX= (0..15)
0 1 3 0 0 0 0 0 0 0 0 0 0 0 0 0 
##$SW_h= 40650.406504065
##$TD= 32768
##$TD0= 1
##$TE= 0
##$TE2= 300
##$TE3= 300
##$TEG= 300
##$TL= (0..7)
0 120 53 12 22 120 120 120 
##$TP= (0..7)
150 150 150 150 150 150 150 150 
##$TP07= 0
##$TPNAME0= <>
##$TPNAME1= <>
##$TPNAME2= <>
##$TPNAME3= <>
##$TPNAME4= <>
##$TPNAME5= <>
##$TPNAME6= <>
##$TPNAME7= <>
##$TPOAL= (0..7)
0.5 0.5 0.5 0.5 0.5 0.5 0.5 0.5 
##$TPOFFS= (0..7)
0 0 0 0 0 0 0 0 
##$TUNHIN= 0
##$TUNHOUT= 0
##$TUNXOUT= 0
##$USERA1= <user>
##$USERA2= <user>
##$USERA3= <user>
##$USERA4= <user>
##$USERA5= <user>
##$V9= 5
##$VALIST= <valist>
##$VCLIST= <CCCCCCCCCCCCCCC>
##$VD= 0
##$VDLIST= <DDDDDDDDDDDDDDD>
##$VPLIST= <PPPPPPPPPPPPPPP>
##$VTLIST= <TTTTTTTTTTTTTTT>
##$WBST= 1024
##$WBSW= 4
##$XGAIN= (0..3)
0 0 0 0 
##$XL= 0
##$YL= 0
##$YMAX_a= 3355
##$YMIN_a= -3258
##$ZGOPTNS= <>
##$ZL1= 120
##$ZL2= 120
##$ZL3= 120
##$ZL4= 120
##$ABSF1= 248.5645
##$ABSF2= -253.2056
##$ABSG= 5
##$ABSL= 3
##$ALPHA= 0
##$AQORDER= 0
##$ASSFAC= 0
##$ASSFACI= 0
##$ASSFACX= 0
##$ASSWID= 0
##$AUNMP= <proc_1d>
##$AZFE= 0.1
##$AZFW= 0.5
##$BCFW= 0
##$BC_mod= 2
##$BYTORDP= 0
##$COROFFS= 0
##$CY= -3
##$DATMOD= 1
##$DC= 0
##$DFILT= <>
##$DTYPP= 0
##$F1P= 0
##$F2P= 0
##$FCOR= 1
##$FTSIZE= 65536
##$FT_mod= 6
##$GAMMA= 0
##$GB= 0
##$INTBC= 1
##$INTSCL= 5.30512e-09
##$ISEN= 30
##$LB= 1
##$LEV0= 0
##$LPBIN= 0
##$MAXI= 10000
##$MC2= 0
##$MEAN= 0
##$ME_mod= 0
##$MI= 50
##$NCOEF= 0
##$NC_proc= -7
##$NLEV= 6
##$NOISF1= 182.463
##$NOISF2= 159.3651
##$NSP= 0
##$NTH_PI= 0
##$NZP= 0
##$OFFSET= 248.5645
##$PC= 4
##$PHC0= -8867.238
##$PHC1= 137.0694
##$PH_mod= 1
##$PKNL= yes
##$PPARMOD= 0
##$PSCAL= 0
##$PSIGN= 0
##$REVERSE= no
##$SF= 81.014009
##$SI= 65536
##$SIGF1= 159.3651
##$SIGF2= -187.1042
##$SINO= 113.3802
##$SIOLD= 16384
##$SREGLST= <1H.CDCl3>
##$SSB= 0
##$STSI= 65536
##$STSR= 0
##$SW_p= 40650.406504065
##$SYMM= 0
##$S_DEV= 0
##$TDeff= 32768
##$TDoff= 0
##$TI= <>
##$TILT= no
##$TM1= 0
##$TM2= 0
##$TOPLEV= 0
##$USERP1= <user>
##$USERP2= <user>
##$USERP3= <user>
##$USERP4= <user>
##$USERP5= <user>
##$WDW= 1
##$XDIM= 65536
##$YMAX_p= 82966686
##$YMIN_p= -316321600
$$ End of Bruker specific parameters
$$ ---------------------------------
##NTUPLES= NMR SPECTRUM
##VAR_NAME=  FREQUENCY,     SPECTRUM/REAL,   SPECTRUM/IMAG
##SYMBOL=    X,             R,               I
##VAR_TYPE=  INDEPENDENT,   DEPENDENT,       DEPENDENT
##VAR_FORM=  AFFN,          ASDF,            ASDF
##VAR_DIM=   65536,         65536,           65536
##UNITS=     HZ,            ARBITRARY UNITS, ARBITRARY UNITS
##FACTOR=    0.620285442955139, 1,           1
##FIRST=     20137.2065510759, 0,            0
##LAST=      -20513.1999529892, 0,           0
##MIN=       -20513.1999529892, -316321600,  0
##MAX=       20137.2065510759, 82966686,     0
$$ Real data points
##PAGE= N=1
##DATA TABLE= (X++(R..R)), XYDATA
$$ [...]
13134C030151j234952r66117P01989N81635j922489l064645l41155L367179L984197
$$ 3030151 1795199 829082 1531071 2112706 190217 -2874428 -3215583 151596 4135793
13125D135793J880597J48969n12172j499550k417976j470505Q26304J941420J243157
$$ 4135793 6016390 6165359 5653187 4153637 1735661 265156 1091460 3032880 4276037
13116D276037L98216O82q72203j731664r05556Q70190Q05223j131057j591230
$$ 4276037 4674253 4674935 3802732 2071068 1165512 2035702 2840925 1709868 118638
13107A18638N62681K028027N47191j284013o48203O76731o1455j257297Q9306
$$ 118638 681319 2709346 3256537 1972524 1324321 2001052 1939597 682300 771606
13098G71606K284580J134819k738331m215273j516398J442336J589898O76395
$$ 771606 3056186 4191005 1452674 -2762599 -4278997 -2836661 -1246763 -570368
13090e70368P89052N01096j513344k794167p92306K328739K539766P5040j111922
$$ -570368 218684 719780 -793564 -3587731 -4380037 -2051298 488468 563508 -548414
13081e48414O02924K552430K101752J3388j335520j030981N5452P41297N20252
$$ -548414 54510 2606940 4708692 4722080 3386560 2355579 2411031 3152328 3672580
13072C672580l01366j052996j416259j416567p16358R78732K443535J567726j412056
$$ 3672580 3371214 2318218 901959 -514608 -1230966 -252234 2191301 3759027 2346971
13063B346971l126010j365683J430240J416932j126136k422220q11894J354905
$$ 2346971 -779039 -2144722 -714482 702450 -423686 -2845906 -3657800 -2302895
13055b302895J639141M52651o27746j008966o15838O15457J832965J709317N85989
$$ -2302895 -663754 -211103 -838849 -1847815 -2463653 -1848196 -15231 1694086 2280075
13046B280075L12819J211413J302653m13639k079569j826629n46049n5711j39183
$$ 2280075 2592894 3804307 5106960 4693321 2613752 787123 241074 185363 46180
13037D6180N65625J833319K016770M56436j749733l040023k564396p44319O90004
$$ 46180 611805 2445124 4461894 4918330 3168597 128574 -2435822 -3180141 -2490137
13028b490137L00831q29299j00206K496291L438314N54235l267289l730396r09674
$$ -2490137 -2189306 -3018605 -3118811 -622520 2815794 3370029 102740 -3627656 -4537330
13019d537330J471673J458563M71801m354k00461l46390N5283P46698Q05574N37663
$$ -4537330 -3065657 -1607094 -1135293 -1139647 -1340108 -1686498 -1631215 -884517 -78943 458720
13009D58720J004530J503614J84155k354265l006786p49950J553942J425266J28319
$$ 458720 1463250 2966864 3151019 796754 -2210032 -2959982 -1406040 19226 147545
13000A47545j55244Q3215n34080j068859L5870J521091R54540r43390j129465
$$ 147545 -7699 75516 -458564 -1527423 -1491553 29538 984078 40688 -1088777
12991a088777O12426R31131j703185m113941k872146P53893K755451J834313L04613
$$ -1088777 -476351 454780 -1248405 -5362346 -8234492 -7480599 -4725148 -2890835 -2586222
12982b586222J43784O88448O00180P2337R8192P75254J340068J231121M25592
$$ -2586222 -2442438 -1753990 -1153810 -1081473 -983281 -208027 1132041 2363162 2788754
12973B788754p19420j443866j091967k07923k49265j359023j464090R03660L659025
$$ 2788754 2069334 625468 -466499 -674422 -923687 -2282710 -3746800 -2843140 815885
12964H15885L213112m91582l348129k354837O45915J994701J051706j73417p74515
$$ 815885 4028997 3537415 189286 -2165551 -1519636 475065 1526771 1353354 578839
12955E78839j486113k017137r26986J357223K178757M94676j228494n76305J276701
$$ 578839 -907274 -2924411 -3851397 -2494174 -315417 179259 -1049235 -1625540 -348839
12946c48839J635364M60485J2479R68727J467403K60880j397777j842914j248035
$$ -348839 1286525 1747010 1759489 2728216 4195619 4456499 3058722 1215808 -32227
12937c2227o67513j43814Q28992J770877J670768O76206j03518m73142j331535
$$ -32227 -699740 -843554 -14562 1756315 3427083 4103289 3999771 3526629 2195094
12928B195094k590286k530829l75047J785873J392181q75755j808491j09576J971197
$$ 2195094 -395192 -2926021 -3301068 -1515195 -123014 -998769 -2807260 -2916836 -945639
12919i45639K090068Q44153O0732j47029p09393j269027p84108K13501K69303
$$ -945639 1144429 1988582 2049314 1902285 1192892 -76135 -860243 -646742 -377439
12910c77439l56979n4209J076135R98275q36472k260197j645077j98223L90872
$$ -377439 -734418 -788627 287508 1285783 449311 -1810886 -3455963 -3654186 -3263314
12901c263314N43103J199289J423049m9088j984215j895313K88355K025979J624136
$$ -3263314 -2720211 -1520922 -97873 -146961 -2131176 -4026489 -3738134 -1712155 -88019
12892h8019j6952j210208j276358l25982J102996J858107J106622k30165m14853
$$ -88019 -104971 -1315179 -2591537 -2917519 -1814523 43584 1150206 920041 505188
12883E05188N11050P31456l71302j176473n85931J34056l66225j138708o54226
$$ 505188 1016238 1747694 1376392 199919 -386012 -251956 -618181 -1756889 -2411115
12874b411115M73909O40949J78194O72983J760753J290145r14338k058595l77310
$$ -2411115 -1937206 -1296257 -1118063 -445080 1315673 2605818 1691480 -367115 -744425
12865g44425J957147J717779r21375k781783j923763L24562J522791Q40450o20160
$$ -744425 1212722 2930501 2009126 -772657 -2696420 -2371858 -849067 -8617 -628777
12856f28777j209599k21871J303594J329830q66926l320105l292950n39268K396385
$$ -628777 -1838376 -2060247 -756653 573177 -293749 -3613854 -6906804 -7446072 -5049687
12847e049687L214488K089630O24692k39724o38387r53363j300197j451153r47255
$$ -5049687 -1835199 254431 879123 639399 1012 -952351 -2252548 -3703701 -4650956
12838d650956L09245J552684J865466J299826N12564l82025j365388j344640N98663
$$ -4650956 -4341711 -2789027 -923561 376265 888829 506804 -858584 -2203224 -1604561
12829a604561K757107K107183j101037k715934l25344K918233K575264q81545
$$ -1604561 1152546 3259729 2158692 -557242 -882586 2035647 4610911 3729366
12821C729366l158892k292585m75770l4221o07455p77269j22834R61112J785027
$$ 3729366 570474 -1722111 -2197881 -2232102 -2839557 -3616826 -3739660 -2778548 -993521
12812i93521J518444L78512K82981K293211L956302J980418k490399m490970j899679
$$ -993521 524923 903435 1186416 3479627 7435929 9416347 6925948 2434978 535299
12803E35299J610134J751371r21919k690309j762976M23766J718858J243260l83055
$$ 535299 2145433 3896804 2974885 284576 -1478400 -1054634 664224 1907484 1524429
12794A524429j580646j200404Q3509P09335N90510Q79590J331912L18029j930979
$$ 1524429 -56217 -1256621 -1173112 -463777 126733 1006323 2338235 2656264 725285
12785G25285k775904j068496R57660J184029N12060N57977Q92725N73717J65071
$$ 725285 -2050619 -3119115 -2161455 -977426 -465366 92611 985336 1559053 1724124
12776A724124J87680k14979j079447o40798J230351J561372q98811k548841m05710
$$ 1724124 1911804 1696825 617378 -23420 1206931 2768303 1869492 -679349 -1085059
12767a085059K285165P60777l192613l578759M42441L489253K474869M34621M87518
$$ -1085059 1200106 1960883 -1231730 -4810489 -4368048 -878795 1596074 2030695 2518213
12758B518213J140143n5240k191293k938832j906046l2143J898432K638430R78583
$$ 2518213 3658356 3603116 1411823 -1527009 -3433055 -3465198 -1566766 1071664 2050247
12749B050247j731562k212930K11513K394734J995107M02311m86449j227056k439641
$$ 2050247 318685 -1894245 -1682732 712002 2707109 3109420 2622971 1395915 -1043726
12740a043726k459349r1891K580382K856566J134211l51843p89624o01792K44278
$$ -1043726 -3503075 -3594966 -1014584 1841982 2976193 2624350 1834726 1232934 1477212
12731A477212J478194J669016K51280j150532j289412j230703j716675j048521
$$ 1477212 2955406 4624422 4875702 3725170 2435758 1205055 -511620 -1560141
12723a560141J646289L423517J362421k363786l177593p58953J024805L63750
$$ -1560141 86148 3509665 4872086 2508300 -669293 -1428246 -403441 -39691
12715c9691m49135M21044J526448J002561o34506j782803j747812o56771P84468
$$ -39691 -488826 -67782 1458666 2461227 1826721 43918 -1703894 -2360665 -1576197
12706a576197J108720m04854j966364j229158J006913J691779L15208l19695J061336
$$ -1576197 -467477 -872331 -2838695 -4067853 -3060940 -1369161 -1053953 -1373648 -312312
12697c12312J892907N8582k398520k345993k97409O58082n19445j861588j592381
$$ -312312 1580595 1639177 -759343 -3105336 -3402745 -2744663 -3264108 -5125696 -6718077
12688f718077r8154J301195J874865J576267Q01046K55809L16883N21336K38450
$$ -6718077 -6816231 -5515036 -3640171 -2063904 -1262858 -1007049 -690166 -168830 69620
12679F9620l93604p48836o01863j87509K66696N61964N21511M45129R66394J848192
$$ 69620 -323984 -1072820 -1674683 -1862192 -1595496 -1033532 -512021 -66892 899502 2747694
12669B747694J691616j62684k095171j956159j16288Q27918k91755j504642o85728
$$ 2747694 4439310 4276626 2181455 225296 109008 936926 645171 -859471 -1545199
12660a545199J110150J115075r14572k144064q02219J248812J453724L21038R5788
$$ -1545199 -435049 680026 -234546 -2378610 -3180829 -1932017 -478293 -157255 -61467
12651f1467Q29170N44200r74084j615886p36263l90571j407149j322486J393352
$$ -61467 767703 1311903 337819 -1278067 -2014330 -2404901 -3812050 -5134536 -3741184
12642c741184L741098K123840j919255l609938j620370R05477J677050J656286
$$ -3741184 -86 2123754 204499 -3405439 -5025809 -4120332 -2443282 -786996
12634g86996J705012P88080j103425j685927l182J467162M51735j678531k253337
$$ -786996 918016 1706096 602671 -1083256 -1086438 380724 832459 -846072 -3099409
12625c099409j074744L14053J266897J682441P83133j250761j999083P5418K517712
$$ -3099409 -4174153 -3860100 -2593203 -910762 -127629 -1378390 -3377473 -3302055 -784343
12616g84343J938492p66155j630079L29597J901299R75758m84875j33823J117181
$$ -784343 1154149 387994 -1242085 -912488 988811 1964569 1479694 1345871 2463052
12607B463052J162636J83899k40724o4847m96762j528117j863197j183643p24283
$$ 2463052 3625688 3809587 3568863 3504016 3007254 1479137 -384060 -1567703 -2291986
12598b291986j270259j847517j020634J116800K808281K492704O35520o47492
$$ -2291986 -3562245 -5409762 -6430396 -5313596 -2505315 -12611 622909 -24583
12590b4583j67940O10973m95541k909312l457873p14241K606013L109752J179607
$$ -24583 -192523 418450 -77091 -2986403 -6444276 -7158517 -4552504 -1442752 -263145
12581b63145j66442N5149O646j125948j527049j19865J115943K03195j441245
$$ -263145 -429587 -374438 -367792 -1493740 -3020789 -3140654 -2024711 -1821516 -3262761
12572c262761j178794O28191J416702P35905N96044J441628J101975j225470l039658
$$ -3262761 -4441555 -3813364 -2396662 -1660757 -1064713 376915 1478890 253420 -2786238
12563b786238k358541p94230n18891n62235R10431K565459J804918m01686o22626
$$ -2786238 -5144779 -5939009 -6457900 -7020135 -6109704 -3544245 -1739327 -2141013 -2763639
12554b763639J319857J942491Q7263r54462R18213K774045J278773j920404k866219
$$ -2763639 -1443782 498709 585972 -368490 549723 3323768 4602541 2682137 -184082
12545a84082j187484K85733L76539L31368M71732k25199j206238m69117J787733
$$ -184082 -1371566 -1085833 -709294 -377926 93806 -131393 -1337631 -1806748 -19015
12536a9015K693520Q74109j482694j857168m89141Q78922J349091Q33917m69822
$$ -19015 2674505 3548614 2065920 208752 -280389 598533 1947624 2781541 2311719
12527B311719j465376p86080R24657J249229m01114j556385n01023R43263M48797
$$ 2311719 846343 60263 984920 2234149 1833035 276650 -224373 718890 1167687
12518A167687j075547j272178j92986M35519N35499J213321J804774O67780j315657
$$ 1167687 92140 -1180038 -1373024 -937505 -402006 811315 2616089 3283869 1968212
12509A968212j348754Q14479K154594R39388r28709j254231m97223Q3532O58587
$$ 1968212 619458 1433937 3588531 4527919 3599210 2344979 1847756 1931288 2589875
12500B589875J333325P28525j660195l494032k458205K17064J547667J038165
$$ 2589875 3923200 4651725 2991530 -502502 -2960707 -2743643 -1195976 -157811
12492a57811N49575O86930J81918j167187j664318m54406J053315J344721P50891
$$ -157811 391764 1078694 1260612 93425 -1570893 -2025299 -971984 372737 1123628
12483A123628M37127P23466J107092J014615J89373q08390o22353J136030K442367
$$ 1123628 1560755 2284221 3391313 4405928 4595301 3786911 3164558 4300588 6742955
12474F742955R72327k358788m065293k647417k64117P68378P10037N35377r3972
$$ 6742955 7715282 5356494 1291201 -1356216 -1620333 -851955 -141918 393459 299487
12465B99487j192163j077772R97510K638743J372427j375217k131079l45831J294129
$$ 299487 -892676 -1970448 -972938 1665805 3038232 1663015 -468064 -813895 480234
12456D80234J064682p9878r44063j581426j981938j556817m54168M19040Q99039
$$ 480234 1544916 1465038 520975 -1060451 -3042389 -4599206 -5053374 -4634334 -3735295
12447c735295J400154J481374N99569j27158N95919J424184J33276k022421j517021
$$ -3735295 -2335141 -853767 -254198 -381356 214563 1638747 1772023 -250398 -1767419
12438a767419J465220K593842K65076j667362l95361J170251k36874k330253j373371
$$ -1767419 -302199 2291643 2556719 889357 493996 1664247 1427373 -902880 -2276251
12429b276251J075277R74529q45894j51539K808947L096695o91996l767840k487978
$$ -2276251 -1200974 -226445 -1072339 -1223878 1585069 4681764 3989768 221928 -2266050
12420b266050N11480J022240p22314j564090k60821J772462K794029K006234m528
$$ -2266050 -1754570 -732330 -1454644 -3018734 -3279555 -1507093 1286936 3293170 3288642
12411C288642j112528K27479K198147J475710j582335k817564m61921K050022
$$ 3288642 2176114 2403593 4601740 6077450 4495115 1677551 1215630 3265652
12403C265652J306999j370672k777448k346914j259065J62417J413510Q24961
$$ 3265652 4572651 3201979 424531 -1922383 -3181448 -3019031 -1605521 -780560
12395g80560j503365k361406m6679K319811J450764q30023r02408N51475L61162
$$ -780560 -2283925 -4645331 -4692010 -2372199 -921435 -1751458 -2653866 -2102391 -1741229
12386a741229j118127q08352J365455K466736J694257Q71579K60865j357538k730105
$$ -1741229 -2859356 -3667708 -2302253 164483 1858740 2730319 2991184 1633646 -1096459
12377a096459j287878J618922J771409j115457k801641j517322j53171k40792
$$ -1096459 -2384337 -765415 1005994 -109463 -2911104 -4428426 -4581597 -4822389
12369d822389N23536K697148K775588n65189l190473j992794K07698J16547m39753
$$ -4822389 -4298853 -1601705 1173883 608694 -2581779 -4574573 -4366875 -4250328 -4690081
12360d690081J045745K138540k23668l280653k304770J475857K805385P38612
$$ -4690081 -3644336 -1505796 -1729464 -5010117 -7314887 -5839030 -3033645 -2295033
12352b295033q16928j15882N87624K14628N10297J817441J947787L80763m96329
$$ -2295033 -3111961 -3227843 -2640219 -2425591 -1915294 -97853 1849934 2230697 1734368
12343A734368M66752J403565R45753J95473K3972m82099j607327j894109q08992
$$ 1734368 2201120 3604685 4550438 4745911 4769883 4287784 2680457 786348 -22644
12334b2644j6752o14645j235903k33971J923448L440094L038985O47879k326912
$$ -22644 -39396 -654041 -1889944 -2123915 -200467 3239627 6278612 6926491 4599579
12325D599579l484937j908683J93084L26608n29353K61609K106034J731904j274464
$$ 4599579 1114642 -794041 -600957 -274349 -803702 -542093 1563941 3295845 2021381
12316B021381l383292k511041q05300n59298p62357K64316J676290J836586J062002
$$ 2021381 -1361911 -3872952 -4678252 -5237550 -5999907 -5735591 -4059301 -2222715 -1160713
12307a160713N47182K57414l58672j003198j181444q59245K07973K035112L004198
$$ -1160713 -613531 -356117 -714789 -1717987 -2899431 -3758676 -3550703 -1515591 1488607
12298A488607J399631j255982j538539M64986Q42242j638495k996507n94093K023009
$$ 1488607 2888238 1632256 93717 558703 1400945 -237550 -3234057 -3828150 -1805141
12289a805141P43110k150703j566853K063454L421764N66905k545825k400643
$$ -1805141 -1062031 -3212734 -4779587 -2716133 705631 1272536 -1273289 -3673932
12281c673932m06481M89197K92791Q41072K173851K349421M32577j860902k018009
$$ -3673932 -4080413 -3591216 -3298425 -2457353 -283502 2065919 2498496 637594 -1380415
12272a380415J40899J963884J233901q11617j283474k682M01662r83108j774624
$$ -1380415 -1239516 724368 1958269 1146652 -136822 -139504 262158 -720950 -2495574
12263b495574m93472P87388J65443o02128O94687K394689J467722j212436j990450
$$ -2495574 -2989046 -2201658 -2036215 -2638343 -1943656 451033 1918755 706319 -1284131
12254a284131j77045J126248J58242r56092J68701K508735L039684N89883k751211
$$ -1284131 -1461176 -334928 -176686 -1132778 -964077 1544658 4584342 5174225 2423014
12245B423014l811202j786135O55036N80664j152830j088709J390130K897961
$$ 2423014 -1388188 -3174323 -2519287 -1938623 -3091453 -4180162 -2790032 107929
12237A07929J609663L81999J685009K914296P20130k714345k586246Q68724K683804
$$ 107929 1717592 2099591 3784600 6698896 7419026 4704681 2118435 2987159 5670963
12228E670963O88342k017051k432470j277977m37930l20079o64360j181007r18880
$$ 5670963 6359305 4342254 1909784 631807 193877 -126202 -790562 -1971569 -2890449
12219b890449N24239J362970r8505k182121j993086p0987P43963K21238L12677
$$ -2890449 -2366210 -1003240 -1101745 -3283866 -5276952 -5347939 -4603976 -4382738 -4070061
12210d070061O50290n86024j812122K31307L744963L227718j335073l385438q6302
$$ -4070061 -3419771 -4005795 -5817917 -5586610 -1841647 1386071 50998 -3334440 -3420742
12201c420742L185839K021845j80019O64605J738818q17945l662948j389263L514035
$$ -3420742 -234903 1786942 1606923 2271528 4010346 3192401 -470547 -1859810 1654225
12192A654225L793494j086468m288000k306748Q09805J107645K14517Q09294J693693
$$ 1654225 5447719 4361251 73251 -2233497 -1423692 -316047 -101530 707764 2401457
12183B401457N45126j763811k574847j247009N49874J085351q2527j880791k341703
$$ 2401457 2946583 1182772 -1392075 -2639084 -2089210 -1003859 -1086386 -2967177 -5308880
12174e308880o92083J238475J318218L84807Q91832K582272K543051L0721j957455
$$ -5308880 -6000963 -4762488 -3444270 -3059463 -2167631 414641 2957692 2988413 1030958
12165A030958j232433L58060J91551j024525q93091N47804J124081K91953r3405
$$ 1030958 -201475 156585 348136 -676389 -1569480 -1021676 102405 394358 300953
12156C00953R39516J717189N81947j219807j063376J110023K278528M14652k491078
$$ 300953 1240469 2957658 3539605 2319798 1256422 2366445 4644973 5059625 2568547
12147B568547l014484r58594P26606N13404K02338J382927K515329J493209p37685
$$ 2568547 -445937 -1404531 -677925 -164521 37817 1420744 3936073 5429282 4691597
12138D691597j628279r78571p07027j115694l21783K047023L226197Q91815l251144
$$ 4691597 3063318 2084747 1377720 262026 -59757 1987266 5213463 6105278 2854134
12129B854134n197948l338068P949J706607J325107R25582J875656K936290K076855
$$ 2854134 -2343814 -5681882 -5673933 -3967326 -2642219 -1716637 159019 3095309 5172164
12120E172164n20458k455546k050650j02993J519073J813192Q01670r02090k023819
$$ 5172164 4651706 2196160 145510 42517 1561590 3374782 4176452 3274362 1250543
12111A250543j401332L80992J321828O58724k32897l49244o00256j574508j782499
$$ 1250543 -150789 230203 1552031 2210755 1977858 1628614 1028358 -546150 -2328649
12102b328649r7626J779417J709435O02249P75443J810952J194325j168834k321262
$$ -2328649 -2426275 -646858 1062577 1664826 2440269 4251221 5445546 4276712 1955450
12093A955450p69876J193046R44565q70100j795609j168339n01344q29350j207189
$$ 1955450 1185574 2378620 3323185 2453085 657476 -510863 -1012207 -1841557 -3048746
12084c048746k30333J693256K454694R06330j363347j972624r28263j44377l2059
$$ -3048746 -3279079 -1585823 868871 1775201 411854 -1560770 -2489033 -2633410 -2665469
12075b665469Q91044K516088K409275P6298j299989J49560J465280k21691k258279
$$ -2665469 -1774425 741663 3150938 3227236 1927247 2076807 3542087 3320396 1062117
12066A062117n75728L028385L284296K9523j647855M8009J141771o93530k276215
$$ 1062117 486389 3514774 6799070 6828593 5180738 5228747 6370518 5676988 3400773
12057C400773j070845K37666j105473k784672j606511Q37194J157902o2318n8641
$$ 3400773 2329928 2567594 1462121 -1322551 -2929062 -2091868 -933966 -996284 -1054925
12048a054925Q33798L96030o24684K78981K265960K093545q4842o79432J076157
$$ -1054925 -221127 174903 -449781 -170800 2095160 4188705 4103863 3424431 4500588
12039D500588J514324j348634m224518l402238n2732J921058J164308m99009j246462
$$ 4500588 6014912 4666278 441760 -2960478 -3013210 -1092152 72156 -426853 -1673315
12030a673315q07371K59015R99933M47688j012646j426280K07449K052989J684828
$$ -1673315 -2480686 -2221671 -1221738 -774050 -1786696 -3212976 -3005527 -952538 732290
12021G32290m60969j725340j030465m7159k48575p19572N4036J614943K252355
$$ 732290 271321 -1454019 -2484484 -2531643 -2780218 -3499790 -3445754 -1830811 421544
12012D21544J603241R38041Q91408M53575j143749k740233k605127q99546M85724
$$ 421544 2024785 2962826 3854234 4307809 3164060 423827 -2181300 -3080846 -2595122
12003b595122M57513j33671j35191K81737K97918j62344o13558r56351j239101
$$ -2595122 -2137609 -2271280 -2406471 -2124734 -1826816 -1989160 -2602718 -3559069 -4798170
11994d798170q88271O57061K590896L173535J849586L0642o86557l14956O0611
$$ -4798170 -5686441 -5029380 -2438484 735051 2584637 2615279 1928722 1613766 1674377
11985A674377q8389m18122n59394m29856M5370O87095P35254k49822j242752p59181
$$ 1674377 1585988 1167866 608472 178616 223986 911081 1646335 1396513 153761 -605420
11975f05420P55680J052972n78482j671884M4487K779185K603874r42947l783474
$$ -605420 150260 1203232 624750 -1047134 -1002647 1776538 4380412 3437465 -346009
11966c46009k639338Q25918K693185J838646L16375j78570R033M0128j64554m31884
$$ -346009 -2985347 -2159429 533756 2372402 2688777 2510207 2519240 2559368 2394814 1962930
11956A962930o66634m74876L76879J101646P10228l17433n42350J66200M19464
$$ 1962930 1296296 821420 1198299 2299945 3010173 2692740 2150390 2316590 2736054
11947B736054l00968p36612j06517L76740m84309j692397j539600l48661J98930
$$ 2736054 2435086 1698474 1591957 1968697 1484388 -208009 -1747609 -2096270 -1897340
11938a897340K5329P21906K357340K520863j43959l250400l537863j357443J55510
$$ -1897340 -1872011 -1150105 1207235 3728098 3584139 333739 -3204124 -4561567 -4406057
11929d406057r191L79183K313491L128660P16507k381960k316759J95804J120685
$$ -4406057 -4415248 -4036065 -1722574 1406086 2122593 -259367 -2576126 -2380322 -1259637
11920a259637m12497j110545N39701J733914M33878j128202o96397o2189j330956
$$ -1259637 -1672134 -2782679 -2242978 -509064 -75186 -1203388 -1899785 -1961974 -3292930
11911c292930k236445K96815L995532L767576l63206k965723j251200J348632
$$ -3292930 -5529375 -5232560 -1237028 2530548 2167342 -798381 -2049581 -700949
11903g00949J007576j276545k393980j691801l56448J233498K961418L520853
$$ -700949 306627 -969918 -3363898 -5055699 -5412147 -4178649 -1217231 2303622
11895B303622J916371n90292j864791j479908o06895j63761j92752l41395j34601
$$ 2303622 4219993 3629701 1764910 285002 -321893 -485654 -678406 -1019801 -1154402
11886a154402N43469Q98885J63109q90901q71000j75509m26363j343850q03135
$$ -1154402 -610933 287952 451061 -439840 -1310840 -1486349 -1912712 -3256562 -4059697
11877d059697J314357K235456N86253j295997j160209j81886k28670m31765O72175
$$ -4059697 -2745340 -509884 76369 -1219628 -2379837 -2561723 -2790393 -3222158 -2549983
11868b549983J839875J188493k41224l67296N8645q36750j778401j12427K732539
$$ -2549983 -710108 478385 237161 -130135 -71490 -908240 -2686641 -2799068 -66529
11859f6529K342145j536503l641511p49979L498825L928029P16163k095202k505471
$$ -66529 2275616 739113 -2902398 -3652377 -153552 3774477 4490640 2395438 -110033
11850a10033j561851j31274J676714K529264Q56073j950368k453584r2904J656646
$$ -110033 -1671884 -1803158 -126444 2402820 3258893 1308525 -1145059 -1237963 418683
11841D18683L99637j539253p97537J719068K217089j93789k342282j866279j81079
$$ 418683 818320 -720933 -1518470 200598 2417687 2223898 -118384 -1984663 -2165742
11832b165742N55189P03174J406185J781680M84037j306486j343199l5601K80218
$$ -2165742 -1610553 -907379 498806 2280486 2764523 1458037 114838 79237 359455
11823C59455m69337M6869K008249K236245q24553l960086l531035p16521N89999
$$ 359455 -109882 -63013 1945236 4181481 3356928 -603158 -4134193 -4850714 -4260715
11814d260715l09205n22075J243592K536517J238266q98739p82292J390788K334230
$$ -4260715 -4569920 -5091995 -3848403 -1311886 -73620 -972359 -1754651 -363863 1970367
11805A970367L63069k125767j846214R10064K621082J154885j637669k559044
$$ 1970367 2333436 207669 -1638545 -728481 1892601 3047486 1409817 -1149227
11797a149227q69655J597444K909645K262992j53949k797561l168688n72841K190453
$$ -1149227 -2018882 -421438 2488207 4751199 4597250 1799689 -1368999 -1941840 248613
11788B48613K019197k84891j448590o81167j05026n13318l41356O43553L98641
$$ 248613 2267810 1982919 534329 -146838 -251864 -765182 -1106538 -462985 -64344
11779f4344j472221k455385j345598k05410k80930L54002K681044L944757K051083
$$ -64344 -1536565 -3991950 -5337548 -5542958 -5823888 -5469886 -2788842 1155915 3206998
11770C206998n53869q25629J43950N1585l9381J583495K767883P41252k317420
$$ 3206998 2653129 1827500 1971450 2023035 1983654 3567149 6335032 7076284 4758864
11761D758864k388677n80609j027414k957211j590613K926544M526805Q12690
$$ 4758864 2370187 1789578 762164 -2195047 -3785660 -859116 3667689 4480379
11753D480379k938811k200159K91546K52295j048915k14315J622319R52771j566878
$$ 4480379 1541568 -658591 -367045 -114750 -1163665 -1377980 244339 1197110 -369768
11744c69768j995542L84572K100305J068604p94938j244680p64130p18855q11831
$$ -369768 -2365310 -1980738 119567 1188171 393233 -851447 -1615577 -2334432 -3146263
11735c146263J9983J462083K054250J190852j06264n61027k33180k01174p74196
$$ -3146263 -3126280 -1664197 390053 1580905 1474641 913614 680434 479260 -294936
11726b94936r08454R7375J270071J321478M80760l25448j179697k290424k340103
$$ -294936 -1203390 -1106015 164056 1485534 1966294 1640846 461149 -1829275 -4169378
11717d169378j54619K510476K724133Q78531K82903J793905K301046j27310k922529
$$ -4169378 -4323997 -1813521 910612 1789143 2072046 3865951 6166997 6039687 3117158
11708C117158k952329r97519K41094L85983Q21429J479380J100631j08306o54233
$$ 3117158 164829 -832690 -591596 -205613 615816 2095196 3195827 3087521 2433288
11699B433288k72144j83049r52163j714438j506638k45855J411030K382177J814676
$$ 2433288 2161144 1978095 1025932 -688506 -2195144 -2440999 -1029969 1352208 3166884
11690C166884J17383j228380j313386m72835P34507J831618J685489m64822k836858
$$ 3166884 3284267 2055887 742501 269666 1004173 2835791 4521280 4056458 1219600
11681A219600k437843N63806K477002J325538n06842n96778k11026j154765k016908
$$ 1219600 -1218243 -654437 1822565 3148103 2641261 2044483 1833457 678692 -1338216
11672a338216r63179L50164m05327j584424r3558K884284L296883O40981j578781
$$ -1338216 -2301395 -1951231 -2356558 -3940982 -4034540 -1150256 2146627 2787608 1208827
11663A208827j610602j176814j194621l12471J402272J623879J3847o21964R10878
$$ 1208827 -401775 -1578589 -2773210 -3085681 -1683409 -59530 -45683 -667647 243231
11654B43231J977448O31803j108590q81842J79131j09207j226170j371374o01464
$$ 243231 2220679 2852482 1743892 862050 1041181 931974 -294196 -1665570 -2267034
11645b267034N0006P83818J855065J882823l5348j958768j518664M55531J325645
$$ -2267034 -2217028 -1433210 421855 2304678 2269330 310562 -1208102 -752571 573074
11636E73074O64541K33008O85658R90989P58576O19733M47485m65819j524025
$$ 573074 1237615 1470623 2156281 3147270 3905846 4525579 4973064 4507245 2983220
11627B983220j357111k42987J69722m02672o57087l60881q03310k065414k292122
$$ 2983220 1626109 1383122 1552844 1150172 493085 132204 -671106 -2736520 -5028642
11618e028642p32675O83254K40894q90609n81278J017429K008913J694447J104439
$$ -5028642 -5761317 -5078063 -4837169 -5727778 -6309056 -5291627 -3282714 -1588267 -483828
11609d83828Q97612N24508k16787k87446R99993K291934J366523j824129m323785
$$ -483828 413784 938292 721505 434059 1434052 3725986 5092509 3268380 -1055405
11600a055405l342225K16841K757694K527585J334454J036344O15497j207875
$$ -1055405 -4397630 -4180789 -1423095 1104490 2438944 3475288 4090785 2882910
11592B882910k465698m64359L032934L231533n38098l184336j170049K261376
$$ 2882910 417212 -47147 2985787 6217320 5679222 2494886 1324837 3586213
11584C586213K074097j319208l493972k713466j126714k35772P16354J802833
$$ 3586213 5660310 4341102 847130 -1866336 -2993050 -3228822 -2512468 -709635
11576g09635J612075J16189p53782k25064L46097K63346L95601O06463n22331
$$ -709635 902440 1018629 264847 39783 385880 649226 1044827 1651290 1128959
11567A128959k325336j906549R20184K166930k76708k614268p49687K971048L121058
$$ 1128959 -1196377 -3102926 -2182742 -15812 -292520 -2906788 -3656475 -685427 2435631
11558B435631n05626k851343j269432J509718K448646J838456P78931r85963k959693
$$ 2435631 1930005 -921338 -2190770 -681052 1767594 3606050 4384981 3399018 439325
11549D39325k961059m26530J956788J954179Q38890P36709J119242L19582j210602
$$ 439325 -2521734 -2948264 -991476 962703 1801593 2538302 3657544 3977126 2766524
11540B766524j743646j250765j103355j464002j151031J85134J509056J880136
$$ 2766524 1022878 -227887 -1331242 -2795244 -3946275 -3761141 -2252085 -371949
11532c71949J233499M2253q17373n58981K44271j4948j339783j431935P33222
$$ -371949 861550 903803 86430 -472551 -228280 -243228 -1583011 -3014946 -2281724
11523b281724K490752J180152j331705j226558J051496J283047j524389l012696
$$ -2281724 209028 1389180 57475 -1169083 -117587 1165460 -358929 -3371625
11515c371625j94768L512944L100462p73283l024934j393347J271538J866920
$$ -3371625 -3566393 -53449 3047013 2273730 -751204 -2144551 -873013 993907
11507I93907Q16395J20326K89917O41067P86806M07636r96665k704394k530520
$$ 993907 1810302 1930628 2220545 2861612 3648418 4056054 3059389 354995 -2175525
11498b175525K30908K777673J955859j163301k396781j84775K460326K529840
$$ -2175525 -1944617 833056 2788915 1625614 -771167 -955942 1504384 4034224
11490D034224R35483K50761P32508Q15459M8131q53369j810426k839057k631234
$$ 4034224 4969707 5220468 5952976 6768435 6816566 5963197 4152771 1313714 -1317520
11481a317520l46245J873176J204033j321620j907827J87203J562725K89968j190470
$$ -1317520 -1663765 209411 1413444 91824 -1816003 -1628800 -66075 223893 -966577
11472i66577n73518N06288j86913j385562p49146R34008J362129P52747Q28401
$$ -966577 -1540095 -1033807 -1220720 -2606282 -3355428 -2421420 -1059291 -306544 521857
11463E21857J195037K82097j134902r46860M55947R31643N78213J161318J920330
$$ 521857 1716894 1998991 864089 -82771 373176 1304819 1883032 3044350 4964680
11454D964680K61837l008577l660333m92387K432789J888258j33512n55328m7130
$$ 4964680 5226517 2217940 -1442393 -1934780 498009 2386267 2252755 1697427 1650297
11445A650297o04299j402129p31966K33260n27726j731032o82523J638154J548424
$$ 1650297 1045998 -356131 -1088097 -854837 -1382563 -3113595 -3796118 -2157964 -609540
11436f09540j348326l139671j404295J448107K133664R45179K51950O21915P42268
$$ -609540 -1957866 -5097537 -6501832 -5053725 -2920061 -1974882 -1722932 -1101017 -358749
11427c58749J07186l59420p5673M10053M73324J68394j66427k46848K41266J276997
$$ -358749 -251563 -610983 -686656 -276603 196721 365115 198688 -48160 193106 1470103
11417A470103J980830J346437j58220o48512P19988K104472J097273j784192l405916
$$ 1470103 3450933 4797370 4639150 3990638 4710626 6815098 7912371 6128179 2722263
11408B722263k209468l09445k74200j475727j545495k51489N82166M93906Q84162
$$ 2722263 512795 203350 -70850 -1546577 -3092072 -3343561 -2761395 -2267489 -1383327
11399a383327J850380J441399q25369k315173r06582J755927K640611J370551
$$ -1383327 467053 1908452 1083083 -1232090 -2138672 -382745 2257866 3628417
11391C628417k21554j246346k060986k257769r25258J181994J988672R48719k42061
$$ 3628417 3406863 2160517 99531 -2158238 -3083496 -1901502 87170 1035889 793828
11382G93828k18792L01374n1132j277815k105818j486737L32226J858791J597463
$$ 793828 575036 876410 825278 -452537 -2558355 -4045092 -3712866 -1854075 -256612
11373b56612k66777j777143j426611M3301Q67189O20127K32649K20143K84888
$$ -256612 -523389 -2300532 -3727143 -3683842 -2816653 -2196526 -1963877 -1743734 -1458846
11364a458846L58935O06214N36953m28447j519963j209688N67754K149917K377160
$$ -1458846 -1099911 -493697 43256 -385191 -1905154 -3114842 -2547088 -397171 1979989
11355A979989J768964J093706J25301j407741k641456k343744n59945J120262
$$ 1979989 3748953 4842659 4967960 3560219 918763 -1424981 -1984926 -864664
11347h64664J031268q07176k424788j891317K68952J566572R26420K26771J294614
$$ -864664 166604 -640572 -3065360 -4956677 -4687725 -3121153 -2194733 -1967962 -673348
11338f73348K781783K042128p46824k687616k127130k61062J232642J913377J672097
$$ -673348 2108435 4150563 3403739 716123 -1411007 -1672069 -439427 1473950 3146047
11329C146047L57958j097840j210824k59015j55024j357130j936189o04552J307083
$$ 3146047 3504005 2406165 1195341 936326 781302 -575828 -2512017 -3116569 -1809486
11320a809486K017693J649386J186810O88031j47912r10604j132344r68516n08305
$$ -1809486 208207 1857593 3044403 3732434 3584522 2673918 1541574 573058 64753
11311F4753L75567J068347O99508r0406J05336O41537n61555k886799k814946
$$ 64753 440320 1508667 2208175 2117769 2223105 2864642 2303087 -583712 -3398658
11302c398658N84780L367989K302022m59238j260372m70746m61844p59244L59207
$$ -3398658 -2813878 554111 2856133 2396895 1136523 665777 203933 -555311 -196104
11293a96104J433960n3071k301603j191213K601692L811916O29799k556386k053710
$$ -196104 1237856 1184785 -1116818 -2308031 293661 4105577 4735376 2178990 125280
11284A25280J41921N72355m61305p82359l00719p1717K18507R76702Q86875q77123
$$ 125280 267201 839556 378251 -404108 -704827 -776544 -558037 418665 1305540 428417
11274D28417k294045j103396J514308K502220J180279n47602j382146j527692
$$ 428417 -1865628 -2969024 -1454716 1047504 2227783 1680181 298035 -1229657
11266a229657j037983J83799R99676J09339j461213j299658O62366J704982L71705
$$ -1229657 -2267640 -2083841 -1084165 -974826 -2436039 -3735697 -3073331 -1368349 -996644
11257i96644j234772n88867J533386K329019J014666m42334m90559O6404q5979
$$ -996644 -2231416 -2820283 -1286897 1042122 2056788 1614454 1123895 1190299 1104320
11248A104320o54368p71798r76522k256743l568946k568266P35051L229925K757516
$$ 1104320 449952 -321846 -1298368 -3555111 -7124057 -9692323 -8957272 -5727347 -2969831
11239b969831R73309N42750J265889J206114K58084j21609J05142k62444r02205
$$ -2969831 -1996522 -1453772 -187883 1018231 1276315 1154706 1259848 997404 95199
11230I5199l54269R06912Q89526j81276J32615K033953K544420L76171j667335
$$ 95199 -259070 647842 1537368 1356092 1488707 3522660 6067080 6443251 4775916
11221D775916j164308J83336k03975j536726j582985o21107l53458o06107k26945
$$ 4775916 3611608 3794944 3590969 2054243 471258 -149849 -503307 -1109414 -1336359
11212a336359J65075n19697j042944L39404K229042J790969m52511j208398K65920
$$ -1336359 -1171284 -1690981 -2733925 -2394521 -165479 1625490 1172979 -35419 230501
11203B30501J156622n7771j362753r65462l4623n2585k33416M35635Q62542k20056
$$ 230501 1387123 1329352 -33401 -998863 -1033486 -1086071 -1319487 -883852 -21310 -241366
11193b41366j653809j400085L67794J644589J339439N4631j179319j472809j21031
$$ -241366 -1895175 -3295260 -2927466 -1282877 56562 111193 -1068126 -2540935 -2661966
11184b661966K303842L486905J787588j134214j987505k61912J035589k10692
$$ -2661966 -358124 3128781 4916369 3782155 1794650 1532738 2568327 2357635
11176B357635k066397j484800R57697J752770k74291k056168p90826J840666K158495
$$ 2357635 291238 -1193562 -235865 1516905 1242614 -813554 -1604380 236286 2394781
11167B394781j10983j714729r48417R7109p16431k153656j735195M67235K237253
$$ 2394781 2283798 569069 -379348 -282239 -998670 -3152326 -4887521 -4420286 -2183033
11158b183033K362113J412040R5548j198139j604365m86228J061200J152482k28157
$$ -2183033 179080 1591120 1686668 488529 -1115836 -1602064 -540864 611618 383461
11149C83461j089610l23093Q03127P47178j4850P1070J124962J547962L19796
$$ 383461 -706149 -1029242 -226115 521063 506213 577283 1702245 3250207 3570003
11140C570003j412399j766015p42396k74358j282574j996432n66014J658778J713876
$$ 3570003 2157604 391589 -350807 -625165 -1907739 -3904171 -4470185 -2811407 -1097531
11131a097531l40927j129830R26047L015097K194981k13360j019661j39789j20920
$$ -1097531 -1438458 -2568288 -1642241 1372856 3567837 3354477 2334816 2195027 2074107
11122B074107j616156k504195j555734k10328j7778m04988N6664J502291K711179
$$ 2074107 457951 -2046244 -3601978 -3812306 -3830084 -4235072 -4178408 -2676117 35062
11113C5062K497542Q49270q96310j227744k13963N90169M59083M67586J254678
$$ 35062 2532604 3381874 2485564 1257820 1043857 1634026 2093109 2560695 3815373
11104C815373J452059m6160j766089j709698m91614p1574l96792N5276J119498
$$ 3815373 5267432 5221272 3455183 1745485 1253871 1182297 785505 840781 1960279
11095A960279J158597J10519m48930k09966m06170j124024j003580J17780Q01174
$$ 1960279 3118876 3229395 2780465 2570499 2164329 1040305 36725 154505 955679
11086I55679N38419K21307j19239j365553k752652k124425M92352K282528J579254
$$ 955679 1494098 1715405 1596166 230613 -2522039 -4646464 -4154112 -1871584 -292330
11077b92330p3748p25391m03305K69961J282477J908414P60832j470594j908009
$$ -292330 -366078 -1091469 -1494774 -1224813 57664 1966078 2726910 1256316 -651693
11068f51693K57090J925156N42263j905950j850935O22389K203456J091149j173217
$$ -651693 -394603 1530553 2072816 166866 -1684069 -1061680 1141776 2232925 1059708
11059A059708k304848j713925k60630R84239J393398R53340J27708m67206k73718
$$ 1059708 -1245140 -2959065 -3219695 -2235456 -842058 111282 238990 -228216 -501934
11050e01934P74464J571285N41836j916521k901084o96765K185823K151817k65789
$$ -501934 272530 1843815 2385651 469130 -2431954 -3128719 -942896 1208921 943132
11041I43132j462152m57417J66218q86083j822650j608951j617144k086271q89133
$$ 943132 -519020 -976437 -810219 -1696302 -3518952 -5127903 -6745047 -8831318 -9720451
11032i720451K260374M145823K948476J258725J493210J762578l67173l008608
$$ -9720451 -7460077 -3314254 -365778 892947 2386157 4148735 3781562 772954
11024G72954k728323n9850J594981J162884N16776Q91513J709631K190420J704268
$$ 772954 -1955369 -2015219 -420238 742646 1259422 2150935 3860566 6050986 7755254
11015G755254l63313k945476l178540l75713J904185O56968j860250j763957J69220
$$ 7755254 7391941 4446465 1267925 892212 2796397 3453365 1593115 -170842 -1622
11006a622K29466j611734j797722M17818J696638M99599l70504J243884L191489
$$ -1622 227844 -1383890 -3181612 -2763794 -1067156 -567557 -938061 305823 3497312
10997C497312K540920j16283k111441k320139j392255j08306P11026J02190j571376
$$ 3497312 6038232 5921949 3810508 1490369 98114 -10192 700834 803024 -768352
10988g68352k239472p60418J109755R92230o61375j194360L70209J863747J053674
$$ -768352 -3007824 -3768242 -2658487 -1666257 -2327632 -3521992 -3151783 -1288036 -234362
10979b34362j078466j512571O43967K740815K114312k25565j065369M43710J793676
$$ -234362 -1312828 -2825399 -2181432 559383 2673695 2448130 1382761 1826471 3620147
10970C620147R27059j111512k271582k340449k212177j760729k61465J775967
$$ 3620147 4547206 3435694 1164112 -1176337 -3388514 -5149243 -5410708 -3634741
10962c634741K805026K110091M93932p37760r31840n14942m53128q84174o96168
$$ -3634741 -829715 1280376 1774308 1036548 104708 -410234 -863362 -1747536 -2443704
10953b443704N65254J200236l03325k140401j277404J460265J973075o65013k272681
$$ -2443704 -1878450 -678214 -981539 -3121940 -4399344 -2939079 -966004 -1631017 -3903698
10944c903698K7527L182600K901031j7926j517140m07467Q31951K46060j557546
$$ -3903698 -3876171 -693571 2207460 2189534 672394 264927 1096878 1342938 -214608
10935b14608k899716k439468K7165K616664K666328M13549p49606O70943J758072
$$ -214608 -3114324 -5553792 -5526627 -2909963 -243635 169914 -579692 91251 1849323
10926A849323P7071j982843j096580J440109K020537N80223p2193O10321O51113
$$ 1849323 1926394 -56449 -1153029 287080 2307617 2887840 2815647 3425968 4077081
10917D077081l75130q98413n34861l02539j70014M96030Q02575k50526j206802
$$ 4077081 3701951 2803538 2268677 1966138 1796124 2292154 3094729 2844203 1637401
10908A637401k54616J204488N69804j434867j914647n17080P49054J406555K264724
$$ 1637401 1382785 2587273 3157077 1722210 -192437 -709517 39537 1446092 3710816
10899C710816K294610R0574k314135j690744Q13523J126083r93196j765869j77286
$$ 3710816 6005426 6096000 3781865 2091121 2904644 4030727 3037531 1271662 1094376
10890A094376M55650j305952k525493j340155o6433o08856j081875L25466J755458
$$ 1094376 1550026 244074 -2281419 -3621574 -3688007 -4296863 -5378738 -5053272 -3297814
10881c297814Q49663j253301j806792l75715J308919J936042J525274R33059J172762
$$ -3297814 -2448151 -3701452 -5508244 -5883959 -4575040 -2638998 -1113724 -180665 992097
10872I92097K049678J701441p32318k806468j792991Q83210J644716M54248L55100
$$ 992097 3041775 4743216 4010898 1204430 -588561 294649 1939365 2393613 2748713
10863B748713J626192J193626j551568l224079k066156n38856n81517o14664O66363
$$ 2748713 4374905 5568531 4016963 792884 -1273272 -1812128 -2393645 -3008309 -2341946
10854b341946J550402P10081k36501J18293N11067j47760o01779P1888O82507
$$ -2341946 -791544 -81463 -317964 -199671 311396 163636 -438143 -366255 316252
10845C16252O02071R77025J631693M35751k363865l172021p25407J347538M12575
$$ 316252 918323 1895348 3527041 3962792 1598927 -1573094 -2298501 -950963 -538388
10836e38388q92004L20977J882842M90076k348250k827654q57357Q27429J502950
$$ -538388 -1430392 -1109415 773427 1263503 -1084747 -3912401 -4769758 -3942329 -2439379
10827b439379K089436J747412o53275k910808j842023J372112K431376K94448
$$ -2439379 -349943 1397469 744194 -2166614 -4008637 -2636525 -205149 89299
10819H9299j698232j246448J84206P03435N84103M35718j71068q63237J02151
$$ 89299 -1608933 -2855381 -2671175 -1967740 -1383637 -947919 -1118987 -1982224 -1880073
10810a880073K771884M015970J411107k700069l621003n27542K281774J256533
$$ -1880073 891811 4907781 6318888 3618819 -2184 -529726 1752048 3008581
10802C008581j524107j507363J587844L312484R95458k521700l214071j197417
$$ 3008581 1484474 -22889 1564955 4877439 5872897 3351197 137126 -1060291
10794a060291O26553J055621Q74421K94626q11011j228149N9617J551353J260823
$$ -1060291 -433738 621883 1496304 1790930 979919 -248230 -188613 1362740 2623563
10785B623563J6868j32516N15203N18039M52745J174501P26217k445418m853527
$$ 2623563 2640431 2507915 3023118 3541157 3993902 5168403 5894620 3449202 -1404325
10776a404325k135321L097727L838680q54595m478631l100506k14790K75276l78804
$$ -1404325 -3539646 -441919 3396761 2542166 -1936465 -5036971 -5251761 -4976485 -5355289
10767e355289J5210M58799O0008N62179K387260K640240J61713j728695o07304
$$ -5355289 -5340079 -4881280 -4821272 -4259093 -1871833 768407 930120 -798575 -1405879
10758a405879J140765Q82868L1807M73832P18745q22597k266484j439343M69807
$$ -1405879 -265114 617754 649561 1123393 1842138 1019541 -1246943 -2686286 -2216479
10749b216479J423162J588620J356348j61361k166334j641360J524974L004976
$$ -2216479 -793317 795303 2151651 1990290 -176044 -1817404 -292430 2712546
10741B712546N44017k228443j641120O55325J505181J118617O60661o38307k374800
$$ 2712546 3256563 1028120 -613000 42325 1547506 2666123 3326784 2688477 313677
10732C13677j541784K023723L584175R47105j255979N77115K434105k39498m126063
$$ 313677 -1228107 795616 4379791 5326896 4070917 4648032 7082137 6842639 2716576
10723B716576l549656k6578J068067j72695J13476J293785l23789l466808l202606
$$ 2716576 -833080 -859658 208409 35714 149190 1442975 1119186 -2347622 -5550228
10714e550228L42519J902377j97061j920509p03323J288824J955343J977053J759415
$$ -5550228 -5207709 -3305332 -3502393 -5422902 -6126225 -4837401 -2882058 -905005 854410
10705H54410L56844j589377j895460n27233L28299J61785O08674J871709K122451
$$ 854410 1211254 -378123 -2273583 -2800816 -2472517 -2310732 -1702058 169651 2292102
10696B292102Q07753m11597l14507N96819J326250J097668l77682j858960j353995
$$ 2292102 3099855 2688258 2373751 2970570 4296820 5394488 5016806 3157846 1803851
10687A803851O66409J246991k98040r33782O82205J406176p50087k549234j049657
$$ 1803851 2470260 3717251 3419211 2485429 3167634 4573810 3823723 1274489 224832
10678B24832J080483M30725j049402q7269J535870M39633j776728j439259M89842
$$ 224832 1305315 1736040 686638 599369 2135239 2574872 798144 -641115 -151273
10669a51273O23180m28675J65357J557768J010851o01287p68672m06244j282833
$$ -151273 471907 43232 208589 1766357 2777208 2175921 1407249 1001005 -281828
10660b81828j298269J554630L697978J258769k304440j387497J902295J384324
$$ -281828 -1580097 -25467 3672511 4931280 2626840 1239343 3141638 4525962
10652D525962k152679k596711L54755J135181j145750j495629J212085K329555
$$ 4525962 2373283 -223428 131327 1266508 120758 -1374871 -162786 2166769
10644B166769L76363o36754O99976Q49441j246874k079882o57904k80538j541478
$$ 2166769 2543132 1906378 2606354 3455795 2208921 129039 -528865 -809403 -2350881
10635b350881r53413J632854J694777j715273l638301j506552J173620J739639
$$ -2350881 -3304294 -1671440 23337 -1691936 -5330237 -6836789 -5663169 -3923530
10627c923530J995885K605112J125149j658184r23883L342229M264324r60241
$$ -3923530 -1927645 677467 1802616 144432 -779451 2562778 6827102 5866861
10619E866861n366352k802271K399217K687239j061742k236674O10264K635952
$$ 5866861 500509 -2301762 97455 2784694 1722952 -513722 96542 2732494
10611B732494J110240j171055j179680J51646L33086p36772r14581P82887K289487
$$ 2732494 3842734 2671679 1491999 1643645 1976731 1239959 325378 1108265 3397752
10602C397752J106874j623477k069582M54361J809623o03386l305665k141570
$$ 3397752 4504626 2881149 811567 1265928 3075551 2472165 -833500 -2975070
10594b975070J017223J575771m36413j487636r24230q27464j100708n9265J411010
$$ -2975070 -1957847 -382076 -818489 -2306125 -3230355 -4057819 -5158527 -5217792 -3806782
10585c806782J400945J165316K651106L702264J264992k453816k882622n16194
$$ -3806782 -2405837 -1240521 1410585 5112849 6377841 3924025 1041403 525209
10577E25209M05027r18274j744098j238269m77272R66245L026502K519424j747776
$$ 525209 930236 11962 -1732136 -2970405 -3447677 -2481432 545070 3064494 1316718
10568A316718m698797k110882J998122K031062J79422J116875K366282n86706
$$ 1316718 -3382079 -5492961 -3494839 -1463777 -1284355 -167480 2198802 1612096
10560A612096m198038k321865K237313K437876n30756o75620Q44762q56821k952269
$$ 1612096 -2585942 -4907807 -2670494 -232618 -763374 -1438994 -594232 -1451053 -4403322
10551d403322K63687M809643K951073j916980r55127L113663Q07892n235262l888783
$$ -4403322 -4139635 670008 3621081 1704101 748974 3862637 4670529 -564733 -4453516
10542d453516L500137M469791k166435m395763R92045L655700j82557j798679
$$ -4453516 -953379 3516412 1349977 -3045786 -2053741 1601959 1419402 -379277
10534c79277J939936K963103j013186j836458K075551J882698l806026n113617
$$ -379277 1560659 4523762 3510576 1674118 3749669 5632367 1826341 -3287276
10526c287276K63949K462478j587994l011969O91508J242401k204899m89028N703667
$$ -3287276 -3023327 -560849 -2148843 -5160812 -4469304 -3226903 -5431802 -5920830 -217163
10517b17163M702915l174773m268743K503035L064713l797626l017435O310153
$$ -217163 4485752 1310979 -2957764 -454729 2609984 -1187642 -4205077 2105076
10509B105076O647621m275532p090247K683068N535781l777961n433719N177506
$$ 2105076 8752697 4477165 -2613082 69986 5605767 1827806 -3605913 1571593
10501A571593O179023o379852o682328R493069J0479126j0419064j4812247Q716177
$$ 1571593 7750616 1370764 -5311564 4181505 14660631 4241567 -10570680 -1854503
10493a854503J4690375j4109007k1850680J6764562K1891569o8050491j58090263
$$ -1854503 12835872 -1273135 -23123815 -6359253 15532316 -52518175 -210608438
10486b10608438j05713162N8166314J51306092R1043387p679728k1288200J9451144
$$ -210608438 -316321600 -258155286 -106849194 -15805807 -23485535 -44773735 -25322591
10479b5322591K3156523q480775j3596397J0301395J5485041l212937q648985
$$ -25322591 -2166068 -10646843 -24243240 -13941845 1543196 -1669741 -10318726
10472a0318726M502017O867804m883053n444277O785366P948415l870095o615571
$$ -10318726 -5816709 1051095 -3831958 -9276235 -2490869 5457546 1587451 -5028120
10464e028120K239402L021808o119304o251463M653545P838878n28320l649942
$$ -5028120 -2788718 233090 -5886214 -12137677 -7484132 354746 -173574 -3823516
10456c823516L149513N349739j562105m769664k0843J735731k452538k453455
$$ -3823516 -674003 4675736 3113631 -1656033 -1676876 58855 -2393683 -4847138
10448d847138L131726L462745k666780l788055J985872L308652k250065l582906
$$ -4847138 -1715412 1747333 -919447 -4707502 -2721630 587022 -1663043 -5245949
10440e245949K308103M524530r73371m194386j51740K992385M72443j236532J238712
$$ -5245949 -2937846 1586684 613313 -3581073 -3732813 -740428 -267985 -1504517 -265805
10431b65805J763360j849317k786990J110644K684629o90603k166451J012618
$$ -265805 1497555 -351762 -3138752 -2028108 656521 -34082 -2200533 -1187915
10423a187915K269335j266256l248381l86258J895639N30732j48465J476537P83320
$$ -1187915 1081420 -184836 -3433217 -3819475 -1923836 -1393104 -1541569 -65032 718288
10414G18288k566947k249296K535516M134134m6708k705059Q5218K305893j15746
$$ 718288 -1848659 -4097955 -1562439 2571695 2524987 -180072 -94854 2211039 2095293
10405B095293k044706L63845K349665L7390k232125m13745J954521J053321n17207
$$ 2095293 50587 414432 2764097 2801487 569362 155617 2110138 3163459 2646252
10396B646252N812J47047j605692j641208J443950K684489o25391l231751o43593
$$ 2646252 2652064 2799111 1193419 -447789 996161 3680650 3055259 -176492 -820085
10387h20085L035309K193330j053470j108770J957047L459272J365299k130837
$$ -820085 2215224 4408554 3355084 2246314 4203361 7662633 9027932 6897095
10379F897095m106996l053350J08407J701482p56742l837514k103957K952913
$$ 6897095 2790099 -263251 -154844 1546638 789896 -3047618 -5151575 -2198662
10371b198662M034507o78961m261066j665584L017641L639724O07182j790539
$$ -2198662 1835845 1156884 -3104182 -4769766 -1752125 1887599 2494781 704242
10363G04242k097178j599834r43728k82274k23946l81394N31406K023722K214850
$$ 704242 -1392936 -2992770 -3936498 -4218772 -4442718 -4824112 -4292706 -2268984 -54134
10354e4134J306014J072373R55448r07053k902416j496874K164354K982880N81
$$ -54134 1251880 2324253 3279701 2372648 -529768 -2026642 137712 3120592 3121173
10345C121173k182178j217402r1538p53406q41834R28282J884161N10161p82384
$$ 3121173 938995 -278407 -369945 -1123351 -1965185 -1036903 847258 1357419 575035
10336E75035m71138m68727j499790j028048J641875L104196J388764q16142j037694
$$ 575035 103897 -364830 -1864620 -2892668 -1250793 1853403 3242167 2426025 1388331
10327A388331o52133j140879j128433K17444R43353j3906p39092q7029L35395
$$ 1388331 736198 -404681 -1533114 -1315670 -372317 -386223 -1125315 -1212344 -876949
10318h76949j75716J35046J514786J430829p37808j999402q09372M12980p4686
$$ -876949 -1052665 -917619 597167 2027996 1290188 -709214 -1518586 -1105606 -1180292
10309a180292m81142M90695J030568N6536m51666N55752Q86667o13910j369950
$$ -1180292 -1661434 -1170739 -140171 -83635 -535301 20451 907118 293208 -1076742
10300a076742N05109K615556K029264l60305j862571j769024q60415M22182J419913
$$ -1076742 -571633 2043923 4073187 3712882 1850311 81287 -779128 -356946 1062967
10291A062967J124913j8545m25138k01617r86110k517916k533598o21759J072477
$$ 1062967 2187880 2169335 1744197 1542580 556470 -1961446 -4495044 -5116803 -4044326
10282d044326J423914J320617J011056N3322l06931J225334K396792J52235l429473
$$ -4044326 -2620412 -1299795 -288739 -235417 -542348 682986 3079778 3232013 -197460
10273a97460l404851j02561J147697j004401j854671R04956L296938K162511R8661
$$ -197460 -3602311 -3704872 -2557175 -3561576 -5416247 -4511291 -1214353 948158 1046819
10264A046819J84791J044896L93643r71998j567886j640838j129767P15578K297227
$$ 1046819 1231610 2276506 2670149 1698151 130265 -1510573 -2640340 -1924762 372465
10255C72465R32638j745863j136874K341350K902133j089140m008059k111488
$$ 372465 1305103 -440760 -1577634 763716 3665849 2576709 -1431350 -3542838
10247c542838R98499J455332R97613J745815J562593p99556j960226j39162P25403
$$ -3542838 -2544339 -1089007 -91394 1654421 3217014 2417458 457232 318070 1043473
10238A043473j837767l416093k48900L418648K106962j594824j629115J439269
$$ 1043473 -794294 -4210387 -4459287 -1040639 1066323 -528501 -2157616 -718347
10230g18347K278117M7442j352475o64674l27702r81593o95366O86625J271058
$$ -718347 1559770 1607212 254737 -409937 -737639 -1719232 -2414598 -1727973 -456915
10221d56915Q32908P28233P48610k25526j307012q52182L29373K92881n76498
$$ -456915 375993 1104226 1852836 1627310 320298 -531884 -202511 90370 -486128
10212d86128n12047L46246N25213m8235m86783q46080j293117r23914M54993J178968
$$ -486128 -998175 -651929 -126716 -174951 -661734 -1507814 -2800931 -3724845 -3269852 -2090884
10202b090884L57153m54275q3611K70003k15222j96522P71545O84523j021174
$$ -2090884 -1733731 -2188006 -2271617 -2001614 -2216836 -2413358 -1641813 -957290 -1978464
10193a978464j627521N0253Q89044j126673k654913l31937L164952L164779L53037
$$ -1978464 -3605985 -3555732 -2666688 -3793361 -6448274 -6780211 -3615259 -450480 -97443
10184i7443q86724M73290J530716P75083l00033l61394L07172J014383J005881
$$ -97443 -984167 -510877 1019839 1794922 1494889 1133495 1440667 2455050 3460931
10175C460931l70840k161358k270048q22477l51115j164434k55859L010071M457927
$$ 3460931 3090091 928733 -1341315 -2163792 -2514907 -3679341 -3935200 -925129 3532798
10166C532798J542674k001759j888500K32293L96229j078607j371223n72039n18415
$$ 3532798 5075472 3073713 1185213 1417506 1813735 735128 -636095 -1208134 -1726549
10157a726549o61260L88056J408995Q25485O7624P44064J122242n31628k024029
$$ -1726549 -2387809 -1999753 -590758 234727 302351 1046415 2168657 1637029 -387000
10148c87000r76398M96036n29698k353008j742371L85895J323306J691162L040840
$$ -387000 -1363398 -867362 -1397060 -3750068 -5492439 -5106544 -3783238 -2092076 948764
10139I48764L357495N84010k260512j485290N14001o85353l357130k601643O39855
$$ 948764 4306259 4890269 2629757 1144467 1658468 973115 -2384015 -4985658 -4345803
10130d345803J246360o99542k23497L098760M020829Q15892j875051j054316M50752
$$ -4345803 -3099443 -3798985 -4022482 -923722 3097107 3912999 2037948 983632 1434384
10121A434384j07143j228862j157937q70314r63408j75851J191720P87160j294478
$$ 1434384 1327241 98379 -1059558 -1929872 -2893280 -3069131 -1877411 -1090251 -2384729
10112b384729j890200j13375J113885M02930J95891J789279K541715N74066j659994
$$ -2384729 -4274929 -4388304 -3274419 -2871489 -2675598 -886319 1655396 2229462 569468
10103E69468j349729L05022N81422l73451m33253Q34054J755476J027538q65163
$$ 569468 -780261 -475239 106183 -267268 -700521 133533 1889009 2916547 2051384
10094B051384k245068j731116L00963J876948J735090P44909J32364l38714j076652
$$ 2051384 -193684 -1924800 -1623837 253111 1988201 2733110 2865474 2526760 1450108
10085A450108j306532p50506o66742j246728m92941J849868K335799p78658l378458
$$ 1450108 143576 -606930 -1273672 -2520400 -3013341 -1163473 1172326 393668 -2984790
10076b984790j255008K756305K740551j242055l784089k487978O5828J875029
$$ -2984790 -4239798 -1483493 1257058 15003 -3769086 -6257064 -6191236 -4316207
10068d316207L277863L552330J390689j288287j302377K69287j09168j704451
$$ -4316207 -1038344 2513986 3904675 2616388 1314011 1583298 1474130 -230321
10060b30321p39422J949202J437528k411631l811005n66202K257467R04659j357063
$$ -230321 -969743 979459 2416987 5356 -3805649 -4371851 -2114384 -1209725 -2566788
10051b566788o57513J110039N60786j214363j321352j28041L71463M44452J320220
$$ -2566788 -3224301 -2114262 -1553476 -2767839 -4089191 -4217232 -3845769 -3401317 -2081097
10042b081097K269477J965825Q80077O6105n53484j053554q08011j75795m37225
$$ -2081097 188380 2154205 3034282 3100387 2546903 1493349 685338 509543 72318
10033G2318j108034k53597J634574J586992p97313k084390n18285J069199J20289
$$ 72318 -1035716 -1289313 345261 1932253 1134940 -949450 -1467735 -398536 -278247
10024b78247j541499j201995L24142P30504R9904j27074J8450j74330k69946Q2604
$$ -278247 -1819746 -3021741 -2697599 -1967095 -1867191 -1994265 -1975815 -2150145 -2420091 -2337487
10014b337487j83153j542980k186405m51018K345259L433106K051894q5649j074858
$$ -2337487 -2520640 -4063620 -6250025 -6701043 -4355784 -922678 1129216 1043567 -31291
10005c1291n55416K90528P0956j004864j107317M93830J795254Q55040j016397
$$ -31291 -586707 -296179 -225223 -1230087 -2337404 -1843574 -48320 806720 -209677
9996b09677j195560K43016J131941P97734J85715n19186j357622r30399J388553
$$ -209677 -1405237 -1162221 -30280 767454 953169 433983 -923639 -1854038 -465485
9987d65485K944503J175105j973514k906872j863846j176916l17868J973043K968416
$$ -465485 2479018 3654123 1680609 -1226263 -3090109 -4267025 -4584893 -2611850 356566
9978C56566r4481l314160r94568M091414L928489j572131m091913o11665K338182
$$ 356566 262085 -3052075 -4046643 44771 3973260 2401129 -1690784 -2302449 35733
9969C5733O96698q37736J256912K570717l54431k799787k60314L058191J392736
$$ 35733 732431 -105305 1151607 3722324 3367893 568106 307792 3365983 4758719
9960D758719k735600l215356l08926J188049K18311o22622o22654o87532q5155
$$ 4758719 2023119 -1192237 -1501163 -313114 -94803 -717425 -1340079 -2027611 -2112766
9951b112766J616661K056230q1570j814613o47826R07703p4057j617285p97940
$$ -2112766 -496105 1560125 1478555 -336058 -983884 -76181 -150238 -1767523 -2565463
9942b565463P22368N5736j475868j151168J89003O12664J067254K385321K174635
$$ -2565463 -1843095 -1787359 -3263227 -4414395 -4225392 -3612728 -2545474 -160153 2014482
9933B014482o07612k136806J72520K422456O21807k187482j376078J087022P63418
$$ 2014482 1406870 -729936 -557416 1865040 2486847 299365 -1076713 10309 773727
9924G73727r34035l003J959055P10369k084052j295224K360190L259977K67271
$$ 773727 -160308 -163311 1795744 2506113 422061 -873163 1487027 4747004 5014275
9915E014275k003611r79152J100892J914152J223051q77962l219168k818956O06025
$$ 5014275 3010664 2031512 3132404 5046556 6269607 5391645 2172477 -646479 -40454
9906d0454K255486p10939l587769j451440K312039J874600j010315r49919J180765
$$ -40454 2215032 1504093 -2083676 -3535116 -1223077 651523 -358792 -1308711 -127946
9897a27946J097541Q1267J654857K959437l57397m186781j996686K552808J253704
$$ -127946 969595 1050862 2705719 5665156 5307759 1120978 -875708 1677100 2930804
9888B930804l461000k614388K384379K063628l017767k971079K412460L062027
$$ 2930804 -530196 -3144584 -760205 1303423 -1714344 -4685423 -2272963 789064
9880G89064j371298l10173N548231K771009p052319k495563K1154414L4331758
$$ 789064 -582234 -892407 4655824 7426833 374514 -2121049 19033365 53365123
9872E3365123J3280930k1154021l0565916j2049301L775742R25788n462636j638610
$$ 53365123 66646053 45492032 14926116 2876815 6652557 7578345 2115709 477099
9864D77099M005726J187646l800057k108916J577591l92147m066250k023311K828083
$$ 477099 4482825 5670471 1870414 -238502 1339089 946942 -3119308 -5142619 -2314536
9855b314536K941599p72172j848675K77010R82055m56292p00928N95806O50134
$$ -2314536 627063 -145109 -1993784 -1716774 -734719 -1191011 -1891939 -1296133 -645999
9846f45999o12367n59262Q60691R14091r55935k149721j064766J007526K299752
$$ -645999 -1258366 -1817628 -956937 -42846 -998781 -3148502 -4213268 -3205742 -905990
9837i05990K400657J644466N75742p0004j48840m27859j242062j767362j439753
$$ -905990 1494667 3139133 3714875 3644871 3496031 3068172 1826110 58748 -1381005
9828a381005q37459l43547N19963J516495J268709l76839j395956n16927O03466
$$ -1381005 -2218464 -2562011 -2042048 -525553 743156 366317 -1029639 -1546566 -943100
9819i43100o1974j612974j570006L43138J844136J342717j14548m86594O42054
$$ -943100 -1005074 -2618048 -4188054 -3844916 -2000780 -658063 -772611 -1259205 -617151
9810f17151J646709R58539q19327j607872q31094l69498j481480k320457o43485
$$ -617151 1029558 1988097 1168770 -439102 -1270196 -1639694 -3121174 -5441631 -6085116
9801f085116K184418K806327R91158j86706N35527R06317m20560j358361k08655
$$ -6085116 -3900698 -1094371 -103213 -289919 245608 1151925 731365 -626996 -835651
9792h35651J118614K87902j493731j572896j48668N22763J17685M53171K035101
$$ -835651 282963 570865 -922866 -2495762 -2644430 -2121667 -2003982 -1550811 484290
9783D84290L009437J910347l46579j727572j350371k34608j35306j383912k043324
$$ 484290 3493727 5404074 5057495 3329923 1979552 1744944 1609638 225726 -1817598
9774a817598l51923K155533K122155n77841k098574l72045J512319K92993j978017
$$ -1817598 -2169521 -13988 2108167 1530326 -568248 -940293 572026 865019 -1112998
9765a112998j260660J659193K294935l51015k475981j718650j83374K5299J25074
$$ -1112998 -2373658 -714465 1580470 1229455 -1246526 -2965176 -3148550 -3123251 -2998177
9756b998177J459297K519489J734433M24238K99759M36814m42841r39200M49928
$$ -2998177 -1538880 980609 2715042 3139280 3439039 3875853 3433012 2493812 2943740
9747B943740J556613o75952m519053m828623m30507L793902L486377J31134k104023
$$ 2943740 4500353 3824401 -694652 -5523275 -5953782 -2159880 1326497 1457631 -646392
9738f46392k011948j223300m50442R70554K505288K386160M84451j093286r96992
$$ -646392 -2658340 -3881640 -4332082 -3361528 -856240 1529920 2014371 921085 -75907
9729g5907l41308m65037o96097J47718J278900R37090o25622j232634o6312J101032
$$ -75907 -417215 -882252 -1578349 -1430631 -151731 785359 159737 -1072897 -1139209 -38177
9719c8177P42828j59537o4546M04364l66719j949286k229330o07366J252923K031259
$$ -38177 704651 545114 480568 884932 518213 -1431073 -3660403 -4267769 -3014846 -983587
9709i83587K076902J766902O94036p39921j049751j14105J28809j209317k242083
$$ -983587 1093315 2860217 3554253 2814332 1764581 1650476 1779285 569968 -1672115
9700a672115j414638j85971l25610o05631Q06872K364739J278539j326079j562446
$$ -1672115 -3086753 -3272724 -3598334 -4203965 -3397093 -1032354 246185 -1079894 -2642340
9691b642340R71327K404174Q38510r11570n16330O5290j288479k473398n96893
$$ -2642340 -1671013 733161 1571671 660101 143771 209061 -1079418 -3552816 -4149709
9682d149709K606813K914866L1211k040860q82030J495833K210068J137523J0196
$$ -4149709 -1542896 1371970 1403181 -637679 -1519709 -23876 2186192 3323715 3333911
9673C333911j31581M55539R23885M68266r01132k013220j783600o84732j1794
$$ 3333911 3202330 3657869 4581754 5050020 4148888 2135668 352068 -332664 -344458
9664c44458N036J39518N07861M00058k85047q24622r21432q49349l96514Q44529
$$ -344458 -339422 -199904 307957 708015 422968 -401654 -1323086 -2172435 -2568949 -1724420
9654a724420K060715J759498J08651r02227k84970N32661N1131r94627j008330
$$ -1724420 336295 2095793 2204444 1302217 1017247 1549908 1601039 606412 -401918
9645d01918j26217J98486l16852m23935M22831J017990K86929r29934j087496
$$ -401918 -528135 -329649 -646501 -1070436 -647605 370385 657314 -272620 -1360116
9636a360116k65252J14846k60782j10338R40119J154998n75066k270600j329035
$$ -1360116 -1625368 -1510522 -1771304 -1881642 -941523 213475 -361591 -2632191 -3961226
9627c961226J406703K663473J546498L95630N16599L22292j094193j808651n16316
$$ -3961226 -2554523 108950 1655448 2051078 2567677 2889969 1795776 -12875 -529191
9618e29191Q04666K59763n87026K24936J083884l15261k140857j015223J764261
$$ -529191 275475 535238 -51788 173148 1257032 941771 -1199086 -2214309 -450048
9609d50048J681931j438328k661482J15376K589271R36826k084782j578602J912498
$$ -450048 1231883 -206445 -2867927 -2752551 -163280 773546 -1311236 -2889838 -977340
9600i77340L410930P95740k645432k997490l54051K031840J720368n61555k100134
$$ -977340 2433590 3229330 583898 -2413592 -2767643 -735803 984565 423010 -1677124
9591a677124j365981L53108Q91211P8628n67054m61709l96809n27769o8496Q16536
$$ -1677124 -3043105 -2689997 -1798786 -1720158 -2287212 -2748921 -3145730 -3673499 -3741995 -2925459
9581b925459J014034O37008Q19194J054757l43591k468062j954408J579494L769179
$$ -2925459 -1911425 -1274417 -455223 599534 255943 -2212119 -4166527 -2587033 1182146
9572A182146J629289j738784j746670R85730K261997P78966j048211j715605k065813
$$ 1182146 2811435 1072651 -674019 311711 2573708 3352674 2304463 588858 -1476955
9563a476955k253588r86305J580126L142730K343810L93080j026070j584398j562675
$$ -1476955 -3730543 -4716848 -3136722 6008 2349818 2742898 1716828 132430 -1430245
9554a430245j010008j59348O05879J342349J996142J683804k1567j657902j505945
$$ -1430245 -2440253 -2599601 -1993722 -651373 1344769 3028573 3007006 1349104 -156841
9545a56841j49958M94209J40871m2727j7907p24713j636669j251056m7194j5833
$$ -156841 -306799 187410 328281 285554 267647 -457066 -2093735 -3344791 -3391985 -3407818
9535c407818r24504k53045K280615L422729J243022j631762j848207o6183O42479
$$ -3407818 -4332322 -4585367 -2304752 1117977 2360999 729237 -1118970 -1185153 -542674
9526e42674n10908j533560r92751L76602J110163N36639q32207j455190N769K725968
$$ -542674 -1053582 -2587142 -3579893 -3203291 -2093128 -1556489 -2388696 -3843886 -3838117 -1112149
9516a112149L974026K317479n19617k032749j856317j049204K8780J313135J737539
$$ -1112149 2861877 5179356 4659739 2626990 770673 -278531 -249751 1063384 2800923
9507B800923N01658j091345j170235j75827r2479j107581j315267P9521J435790
$$ 2800923 3302581 2211236 1041001 865174 772695 -334886 -1650153 -1570632 -134842
9498a34842J187829j02366j017373j168256r30901m59894J18646L60652J32330
$$ -134842 1052987 950621 -66752 -1235008 -2165909 -2625803 -2507157 -2146505 -2014175
9489b014175n3305R5302J20833k76522n21859p6247N29987M48706o5489J1018
$$ -2014175 -2067480 -1972178 -1851345 -2127867 -2649726 -2725973 -2195986 -1747280 -1812769 -1801751
9479a801751P29715Q54798j43045p03748Q96926L457172L477262k00587l986046
$$ -1801751 -1072036 -217238 -360283 -1064031 -167105 3290067 6767329 6566742 2580696
9470B580696l714383k56134J699627L10991j204176n5860J797434J309274l94849
$$ 2580696 -1133687 -1389821 309806 620797 -583379 -639239 1158195 2467469 2072620
9461B072620k4630K131368K510441N5183k173241j827849l25295J67152j39908
$$ 2072620 2047990 4179358 6689799 6744982 4571741 2743892 2418597 2585749 2445841
9452B445841j62261j40018n13870n49013J44036L93162m99652j075609P3121J753361
$$ 2445841 2283580 2143562 1629692 1080679 1224715 1617877 1118225 42616 115737 1869098
9442A869098J784136J86367j063278p60806N64973J722643J619536j65372k391831
$$ 1869098 3653234 3839601 2776323 2015517 2580490 4303133 5922669 5757297 3365466
9433C365466k857101j268652K3942m65608r92328L01385J859893J092825j215372
$$ 3365466 508365 -760287 -736345 -1201953 -2194281 -1892896 -33003 1059822 -155550
9424a55550k089017j002308K4056L80856J320870K511751J860641o07638k157789
$$ -155550 -2244567 -3246875 -3222819 -2841963 -1521093 990658 2851299 2243661 85872
9415H5872j580021p62697r08487n30802J129010J922008L35414j467558q03930
$$ 85872 -1494149 -2256846 -3165333 -3696135 -2567125 -645117 -309703 -1777261 -2581191
9406b581191J364258K111981R01815l54019n47645k65265m6031J38061n800q08722
$$ -2581191 -1216933 895048 1796863 1442844 895199 629934 583903 721964 716164 -92558
9396i2558j692273j740861r08239J80667J024282J233025O90253K53080R69449
$$ -92558 -1784831 -3525692 -4433931 -4253264 -3228982 -1995957 -1305704 -1052624 -83175
9387h3175K090906J665093k03895r99924J38387O75424j084553k729050j474516
$$ -83175 2007731 3672824 3468929 2469005 2607392 3282816 2198263 -530787 -2005303
9378b005303J094442J402390n38442j512459k61711J175004J056923j27479j275035
$$ -2005303 -910861 491529 -46913 -1559372 -1821083 -646079 410844 283365 -991670
9369i91670j615482k89354K437510L925782J960059j481702k327305k54660R02539
$$ -991670 -2607152 -2896506 -458996 3466786 5426845 3945143 1617838 1363178 2265717
9360B265717r01277l009899k437419k03212O91296l64500j286663l95239J684345
$$ 2265717 1364440 -1645459 -4082878 -4286090 -3594794 -3959294 -5245957 -5641196 -3956851
9351c956851K915460K046001R5484o28001N03197J396782K99868j370241j163223
$$ -3956851 -1041391 1004610 1100094 472093 975290 2372072 2671940 1301699 138476
9342A38476N38280J241505K54220p21576n64234J60037P62560Q14229m15873k487389
$$ 138476 676756 1918261 2172481 1450905 886671 1046708 1809268 2623497 2207624 -279765
9332b79765k833382k56277J973446L80011k614583j784702K320337L776940Q36571
$$ -279765 -3113147 -3369424 -1395978 -1015967 -3630550 -5415252 -3094915 682025 1518596
9323A518596j293257P24033K953882J142420k291242k734066o85955K97740r5859
$$ 1518596 225339 949372 3903254 5045674 2754432 20366 -665589 -367849 -463708
9314d63708M05339J762369J938866Q38853O8020k17192r03896j428341p40468
$$ -463708 -58369 1704000 3642866 4481719 4549739 4332547 3428651 2000310 1259842
9305A259842K79478J56391n40187m64728q7025m27974o14178O06788K178168K147987
$$ 1259842 1539320 1695711 1155524 690796 603771 175797 -438381 168407 2346575 4494562
9295D494562O02206j048070k268029k822703j868689K06368J182899M36607L41435
$$ 4494562 5096768 4048698 1780669 -1042034 -2910723 -2704355 -1521456 -1084849 -743414
9286g43414J898674K327042P5625j614615k22847J016525j164778l207345k51831
$$ -743414 1155260 3482302 3557927 1943312 1720465 2736990 1572212 -1635133 -1886964
9277a886964M533895L991944j349767m016763j672582J67940j392824k072561
$$ -1886964 2646931 6638875 5289108 1272345 -400237 -232297 -1625121 -3697682
9269c697682R12057L454625J916631p20538o77520K19707j101657k862558j883694
$$ -3697682 -2785625 669000 2585631 1865093 1187573 1407280 305623 -2556935 -4440629
9260d440629N11779J138838O35355J582279L128641K291486p12732k702216k343263
$$ -4440629 -3928850 -2790012 -2154657 -572378 2556263 4847749 4135017 1432801 -910462
9251i10462j215974o93399p34349j183920j725418j194232Q72493K801059K794191
$$ -910462 -2126436 -2819835 -3554184 -4738104 -6463522 -7657754 -6785261 -3984202 -1190011
9242a190011J364867Q1529p21221j200751o30804J119132K236062J288801m37194
$$ -1190011 174856 256385 -464836 -1665587 -2296391 -1177259 1058803 2347604 1910410
9233A910410r90407o89608q36601r58188J96713J956495K406046J148494m49920
$$ 1910410 920003 230395 -606206 -1564394 -1367681 588814 2994860 4143354 3693434
9224C693434j125130n03710R34082J637876L17679j540014q15322K232323L092530
$$ 3693434 2568304 2064594 2998676 4636552 4954231 3414217 2598895 4831218 7923748
9215G923748n81318m781289m602081j199261O31875k39743q33226K43472J142542
$$ 7923748 7342430 2561141 -2040940 -3240201 -2608326 -2848069 -3681295 -3437823 -2295281
9206b295281O74376l9682j29655n3641R5169O77652J027061M15749L876J111818
$$ -2295281 -1620905 -1660587 -1790242 -1843883 -1748714 -1071062 -44001 371748 375624 1487442
9196A487442K290384J233258j080582j659543m36215p3035r28319m20595J935250
$$ 1487442 3777826 5011084 3930502 2270959 1834744 1761709 833390 412795 2348045
9187B348045K998557R18939j985549k945183k254332j355687k44456J268853K033948
$$ 2348045 5346602 6265541 4279992 1334809 -919523 -2275210 -2519666 -1250813 783135
9178G83135J233441j60103j021690j477601j634499q80167M64434Q60303P0699
$$ 783135 2016576 1856473 834783 -642818 -2277317 -3157484 -2693050 -1832747 -1762048
9169a762048j35338R89278J660316N58426q29385o61740L27574L17586o23763
$$ -1762048 -1897386 -908108 752208 1310634 481249 -180491 147083 464669 -159094
9160a59094r68729j41216J064651J701311J246135j03906j012691j88856J405627
$$ -159094 -1127823 -1269039 -204388 1496923 2743058 2639152 1626461 1437605 2843232
9151B843232J274909r13856k472116j701485m44401q52527j804524r77854J102261
$$ 2843232 4118141 3204285 732169 -969316 -1413717 -2266244 -4070768 -5048622 -3946361
9142c946361J810123M41115r64743o21825J040296K352926K038943J26524j785617
$$ -3946361 -2136238 -1695123 -2659866 -3281691 -2241395 111531 2150474 2276998 491381
9133D91381j739274K49449J932969J744351P12091L82110L79071l20258j090338
$$ 491381 -1247893 -998444 934525 2678876 3390967 3773077 4152148 3831890 2741552
9124B741552p12350K32722J71799q36153j296526p33171p9973J33094K46260K98170
$$ 2741552 2029202 2261924 2433723 1597570 301044 -432127 -512100 -379006 -132746 165424
9114A65424J8945j36483M96956J313423R37401p50227k321187k531931j362431
$$ 165424 184369 47886 544842 1858265 2795666 2045439 -275748 -2807679 -4170110
9105d170110L86657J524842J004953p82787j769273n36706J639182K397516J329452
$$ -4170110 -3783453 -2258611 -1253658 -2036445 -3805718 -4342424 -2703242 -305726 1023726
9096A023726m9693o97278p17574k00387P53895J223954N46273j47126N64390J710392
$$ 1023726 974033 276755 -440819 -641206 112689 1336643 1882916 1735790 2300180 4010572
9086D010572J043683j264118k539731j532833O8133O61827P50680R14470K73407
$$ 4010572 5054255 3790137 1250406 -282427 -214294 447533 1198213 2112683 2386090
9077B386090j409388k221166p65764J180974Q97433j328443k639987j590332L56929
$$ 2386090 976702 -1244464 -2010228 -829254 68179 -1260264 -3900251 -5490583 -5133654
9068e133654J356162J357044J169869Q08878j40967j201611j227209j7621J141908
$$ -5133654 -3777492 -2420448 -1250579 -441701 -582668 -1784279 -3011488 -3029109 -1887201
9059a887201J018442k1409o66747m84053j20500J22600N74583Q85640J14955j179712
$$ -1887201 -868759 -890168 -1556915 -2040968 -2161468 -2038868 -1464285 -578645 -463690 -1643402
9049a643402q36178J573694L181224J627409j217166j937632o28783q1798q16630
$$ -1643402 -2479580 -905886 2275338 3902747 2685581 747949 119166 37368 -779262
9040g79262p04113N78889Q17784k86533j06865J890349K231926r09154l865540
$$ -779262 -1483375 -904486 -86702 -373235 -480100 1410249 3642175 2733021 -1132519
9031a132519k700473P25444J911938O77083M37007J823321J860542m53584k200002
$$ -1132519 -3832992 -3107548 -1195610 -518527 -81520 1741801 3602343 3148759 948757
9022I48757j230991P81708J437806Q61929L20917k5746m05924l94262m9781m29221
$$ 948757 -282234 499474 1937280 2799209 3120126 3094380 2688456 2294194 2244413 1815192
9012A815192j662955k117857p68079J112574J861496J479468N50375j065835k824397
$$ 1815192 152237 -1965620 -2733699 -1621125 240371 1719839 2270214 1204379 -1620018
9003a620018k655878J79109K835042K137357q23516k172119q10374O09249L87127
$$ -1620018 -4275896 -4096787 -1261745 875612 52096 -2120023 -2930397 -2321148 -1934021
8994a934021R5697J068926J668503J83356j817166j663477K45450J180637L72603
$$ -1934021 -1838324 -769398 899105 1082461 -734705 -2398182 -2152732 -972095 -599492
8985e99492j40102R04307J989085J250283q57819k399081k299372r29786P55804
$$ -599492 -739594 164713 2153798 3404081 2546262 147181 -2152191 -3081977 -2326173
8976b326173J809094J678546P45981J0820j66322l65568q30788q10793K10445
$$ -2326173 -517079 1161467 1907448 1918268 1751946 1386378 555590 -255203 -44758
8967d4758J456886J786091J049048q7794j024853j407080j200454j082813j772556
$$ -44758 1412128 3198219 4247267 4159473 3134620 1727540 527086 -555727 -2328283
8958b328283k471773j385509J344273K913998J540381p64785j101509J17576M43980
$$ -2328283 -4800056 -6185565 -4841292 -1927294 -386913 -1151698 -2253207 -2135631 -1691651
8949a691651k88236j27506R48360O95872j195165j999537l34061J406778Q30878
$$ -1691651 -1979887 -2107393 -1159033 -463161 -1658326 -3657863 -3991924 -2585146 -1754268
8940a754268q00401r29752L28100J075477J025525J333876J787161P91655j703777
$$ -1754268 -2554669 -3484421 -3156321 -2080844 -1055319 278557 2065718 2857373 1153596
8931A153596l329846k064575J180872L373638K478804m15358k247860j507108
$$ 1153596 -2176250 -4240825 -3059953 313685 2792489 2377131 129271 -1377837
8923a377837j394j40004j279263q45433J237420K105116N21649j173504j058164
$$ -1377837 -1379231 -1519235 -2798498 -3643931 -2406511 -301395 220254 -953250 -2011414
8914b011414n11614j026601j099672P97517K654447J844567k61743m50445Q75751
$$ -2011414 -2523028 -3549629 -4649301 -3851784 -1197337 647230 385487 -64958 810793
8905H10793N64397j514730j909510P28951L294136K745455q2664k415201k733887
$$ 810793 1375190 -139540 -2049050 -1320099 1974037 4719492 4636828 2221627 -512260
8896e12260j006086J869099L772499K717903m49594k612605k371456j441111j439856
$$ -512260 -1518346 350753 4123252 6841155 6391561 3778956 1407500 -33611 -1473467
8887a473467j635200q77339M41018J520451K299228K438084J119386j122784k303996
$$ -1473467 -3108667 -3986006 -3544988 -2024537 274691 2712775 3832161 2709377 405381
8878D05381j682246o17164J7227R68894K236005K179845L91646j072029q84572
$$ 405381 -1276865 -1894029 -1876802 -907908 1328097 3507942 3899588 2827559 1942987
8869A942987l90556p12643o37431N88449J168276k1379q60199L70841J423678
$$ 1942987 1552431 839788 202357 790806 1959082 1937703 1077504 1448345 2872023
8860B872023k15500k414072j541453J146248J209304j568463k660019j55562K364668
$$ 2872023 2656523 242451 -1299002 -152754 1056550 -511913 -3171932 -3327494 -962826
8851i62826J876682L14092L96535Q36397q24681l114319k323369J574760M263945
$$ -962826 913856 1227948 1624483 2460880 1636199 -1478120 -3801489 -2226729 2037216
8842B037216K794319o83601k094579o92138N66163n57562k543896k403252K4266
$$ 2037216 4831535 4147934 2053355 1361217 1927380 1369818 -1174078 -3577330 -3553064
8833c553064J796042R82814p87652r18171N48424J516280J022195k190o12592
$$ -3553064 -1757022 -774208 -1561860 -2480031 -1931607 -415327 606868 604678 -7914
8824g914o93047j60454R82091J861318J493949K47556p70730j390506j929566
$$ -7914 -700961 -861415 120676 1981994 3475943 3723499 2952769 1562263 -367303
8815c67303j699484k5476J639160J091030j061100j802155j54419J424996R85032
$$ -367303 -2066787 -2092263 -453103 637927 -423173 -2225328 -2379747 -954751 30281
8806C0281k15358l37195J56721J02232p622N39375O37762p35404j929608p53832
$$ 30281 -185077 -522272 -365551 -263319 -270941 268434 906196 170792 -1758816 -2512648
8796b512648J547895J522623j178262k717658m30191L159996L625254N45708k143803
$$ -2512648 -964753 557870 -620392 -3338050 -3768241 -608245 3017009 3562717 1418914
8787A418914j487874R14932J529846l63956k162617j750851K814J117051J247765
$$ 1418914 -68960 845972 2375818 2011862 -150755 -1901606 -1898792 -781741 466024
8778D66024J226667R68947k84331k011105k598179j649596m46300J90934Q37225
$$ 466024 1692691 2661638 2377307 366202 -2231977 -3881573 -4327873 -4136939 -3299714
8769c299714J798017K213473J578857O14928j50298j065121j813127j103391Q77940
$$ -3299714 -1501697 711776 2290633 2905561 2755263 1690142 -122985 -1226376 -348436
8760c48436J723899K37885j330119o59880Q80004O39156p29199n90978P19325
$$ -348436 1375463 1613348 283229 -376651 503353 1142509 413310 -177668 541657
8751E41657L65847j604196j757497P59102K124034m6550k466300j367717J343606
$$ 541657 907504 -696692 -2454189 -1695087 428947 382397 -2083903 -3451620 -2108014
8742b108014J357674q77931j192374J070201K052114R7304j507407k86220J260829
$$ -2108014 -750340 -1628271 -2820645 -1750444 301670 398974 -1108433 -1394653 -133824
8733a33824P0033k286963k291712p5409J342138J048959Q35869J348436J090715
$$ -133824 -63791 -2350754 -4642466 -4717875 -3375737 -2326778 -1490909 -142473 948242
8724I48242n33155k092028k513614k142717j061562J112675L211703K957605M34231
$$ 948242 415087 -1676941 -4190555 -6333272 -7394834 -6282159 -3070456 -112851 321380
8715C21380j344227o31260O13236R6467j206021r89312N12951J083177P5271q50757
$$ 321380 -1022847 -1654107 -1040871 -944404 -2150425 -3139737 -2626786 -1543609 -1468338 -2319095
8705b319095k82520J348603K578942K163168n4587k533169l021427j173557P56665
$$ -2319095 -2601615 -1253012 1325930 3489098 3434511 901342 -2120085 -3293642 -2536977
8696b536977R23979L21931P08276J500842R23831o81433j201703j62230N48810
$$ -2536977 -1612998 -1291067 -582791 918051 1841882 1160449 -41254 -203484 345326
8687C45326l61181j767825j740047K23325K686135L223601N43157l292722m011712
$$ 345326 -15855 -1783680 -3523727 -3300402 -614267 2609334 3152491 -140231 -4151943
8678d151943k56983L774374L274542p36641l009202j390033J100084J556340O53964
$$ -4151943 -4408926 -634552 2639990 1903349 -1105853 -2495886 -1395802 160538 814502
8669H14502j08163q89927j560722n89753J928254K961023P51600j994463j827344
$$ 814502 706339 -183588 -1744310 -2334063 -405809 2555214 3306814 1312351 -514993
8660e14993M38621J324578n2846j311011p67045O49433J420558J210040L87138
$$ -514993 -76372 1248206 1195360 -115651 -882696 -233263 1187295 2397335 2784473
8651B784473o22544j295753j394931j320789j303180p72323N42255J602801J310565
$$ 2784473 2161929 866176 -528755 -1849544 -3152724 -3925047 -3382792 -1779991 -469426
8642d69426J75155l87749J08953J080959J881447J949101P87000j045650j792346
$$ -469426 -294271 -682020 -573067 507892 2389339 4338440 5125440 4079790 2287444
8633B287444o64244O92652L27398j238567j967669j300093l85961J20357N21622
$$ 2287444 1623200 2315852 2643250 1404683 -562986 -1863079 -2249040 -2128683 -1607061
8624a607061O13825j58118j013120l94487J326092J731365j22690j869944r96745
$$ -1607061 -993236 -1151354 -2164474 -2558961 -1232869 498496 375806 -1494138 -2490883
8615b490883J436155K188429N37059o01468R52945K958414J566732k719334m735550
$$ -2490883 -1054728 1133701 1670760 1069292 2022237 4980651 6547383 3828049 -907501
8606i07501j550851K829140K465803k204990m842507k067147K164652K688507
$$ -907501 -2458352 370788 2836591 631601 -4210906 -6278053 -4113401 -1424894
8598a424894R8877j295166j1432J607173J740869J057946N13617m2904p31505
$$ -1424894 -1326017 -2621183 -2632615 -1025442 715427 1773373 2286990 2244086 1512581
8589A512581j114821j078341p77141J19774J658061K509884J403851o69104j467317
$$ 1512581 397760 -680581 -1457722 -1337948 320113 2829997 4233848 3564744 2097427
8580B097427n00800P11053J099323Q90657K34792r21404j568975m24653J628257
$$ 2097427 1596627 2307680 3407003 4297660 4532452 3611048 2042073 1617420 3245677
8571C245677J937960l54632k860688k886127m90656K120453L091100K103391O2331
$$ 3245677 5183637 4829005 1968317 -917810 -1408466 711987 3803087 5906478 5968809
8562E968809j650996k123445j530998o59393n8872O86n62399j128622o71012N91309
$$ 5968809 4317813 2194368 663370 3977 -54895 -54209 -616608 -1745230 -2416242 -1824933
8552a824933R70798j83982j191975o74113K22136J40666R7448J126825J402993
$$ -1824933 -854135 -1038117 -2230092 -2904205 -2682069 -2541403 -2443955 -1317130 85863
8543H5863p27793k616514p41555K832547K768715q83164k283529P37594K991855
$$ 85863 -641930 -3258444 -3999999 -1167452 1601263 718099 -1565430 -827836 2164019
8534B164019N11688k915035k122792J120403J530284j053637k136194j13962K026113
$$ 2164019 2675707 -239328 -2362120 -1241717 288567 -765070 -2901264 -3015226 -989113
8525i89113K167498J491618J099229K60319j120015j603237q15520l05008q78366
$$ -989113 1178385 2670003 3769232 4029551 2909536 1306299 490779 185771 -692595
8516f92595j343582p61877O4687K28149J07663K69805M04251J47305j64228k00870
$$ -692595 -2036177 -2798054 -2733367 -2505218 -2397555 -2127750 -1723499 -1576194 -1740422 -1941292
8506a941292k06026m07940n77456m08191J85469J047766J587001J088949j71705
$$ -1941292 -2147318 -2555258 -3132714 -3540905 -3355436 -2307670 -720669 368280 196575
8497A96575r09939o84673o55806j375049j260241Q86672L113087K552960k57367
$$ 196575 -713364 -1398037 -2053843 -3428892 -4689133 -3802461 -689374 1863586 1606219
8488A606219j979373j188512K44489O85389P71910J051699L21304j997210l830719
$$ 1606219 -373154 -1561666 -1317177 -631788 140122 1191821 1513125 -484085 -4314804
8479d314804k867273O6457J892855J156759m32177l83643J597428L386974K921512
$$ -4314804 -7182077 -7115620 -5222765 -4066006 -4498183 -4881826 -3284398 102576 3024088
8470C024088N68658j315184j167753J49058Q29882K86390q93575k092350k660740
$$ 3024088 3592746 2277562 1109809 1258867 2088749 2375139 1481564 -610786 -3271526
8461c271526j795984J83551J407669Q50999O6742O65393J388892L03597j244112
$$ -3271526 -5067510 -4883959 -3476290 -2625291 -2558549 -1893156 -504264 -200667 -1444779
8452a444779l10505K433932L049936L51325k266555k140131p25281m724P47580
$$ -1444779 -1755284 678648 3728584 4079909 1813354 -326777 -1052058 -1056782 -309202
8443c09202K171299K238011l17996k747759k067991M4038j5693j762108j578058
$$ -309202 1862097 4100108 3782112 1034353 -1033638 -989600 -1005293 -2767401 -4345459
8434d345459J061354K670236J353610o01852p87318q175k8662n97602n23830Q8953
$$ -4345459 -3284105 -613869 739741 137889 -649429 -657604 -686266 -1283868 -1807698 -1718745
8424a718745L38171N9819l54055o85825n66009N23853K101484K587640J237234
$$ -1718745 -1380574 -1320755 -1674810 -2360635 -2926644 -2402791 -301307 2286333 3523567
8415C523567p04399j557448j125502l43836K05377O00454R13687R73695O25955
$$ 3523567 2819168 1261720 136218 -207618 -2241 598213 1511900 2485595 3111550
8406C111550n8237o51736n87276J7168Q3202j036746k239962j931851l94972N52683
$$ 3111550 3053313 2401577 1814301 1831469 1914671 877925 -1362037 -3293888 -3688860 -3136177
8396c136177K68626k1593M53726Q35066N22909M57607J322166J995591J276732
$$ -3136177 -2867551 -2889144 -2435418 -1600352 -1077443 -619836 702330 2697921 3974653
8387C974653n7822n55367n08361j214473k303725j823699P01310K911996K229151
$$ 3974653 3916831 3361464 2853103 1638630 -665095 -2488794 -1787484 1124512 3353663
8378C353663r09675l327232k652047p5508J019092p08829k621689j447795K147274
$$ 3353663 2443988 -883244 -3535291 -3610799 -2591707 -3300536 -5922225 -7370020 -5222746
8369e222746M222629K819254K86786m96788Q2561R0264m00406M9680J144527J023805
$$ -5222746 -1000117 1819137 2105923 1609135 1691696 1781960 1381554 1431234 2575761 3599566
8359C599566p44700k538052k984802k059619j22021K165666L183987J822181l82885
$$ 3599566 2854866 316814 -2667988 -4727607 -4849628 -2683962 500025 2322206 1939321
8350A939321q27177L32540M52069j129757j830550j74105J500795O68601j397894
$$ 1939321 1112144 1444684 1896753 766996 -1063554 -1237659 263136 931737 -466157
8341d66157j734384r4871J345756J567797J366935J082852K33090p27414n99433
$$ -466157 -2200541 -2295412 -949656 618141 1985076 3067928 3301018 2573604 1974171
8332A974171M12344P31604r3225o96065j02600R45488J322373P83989m45837j951956
$$ 1974171 2386515 3118119 3024894 2328829 2226229 3171717 4494090 5278079 4832242 2880286
8322B880286k653508j555024N40868J544397Q33026p7857k45894p84165k413144
$$ 2880286 226778 -1328246 -787378 757019 1590045 1512188 1266294 482129 -1931015
8313a931015l376853j772888J210619K569240J467188q4509l38297L71161J033327
$$ -1931015 -5307868 -7080756 -5870137 -3300897 -1833709 -1918218 -2256515 -1885354 -852027
8304h52027J294322R67787m2498p61830J59868J980395J985014o30521k873041
$$ -852027 442295 1410082 1367584 605754 765622 2746017 4731031 4100510 1227469
8295A227469j938703M71407N42215j823883k870001q58964J382402J147208q4268
$$ 1227469 -711234 -239827 302388 -1521495 -4391496 -5250460 -3868058 -2720850 -2805118
8286b805118L41473J679842J447869N3727M1864J290352R04550j605000k912988
$$ -2805118 -2463645 -783803 664066 717793 759657 2050009 2954559 1349559 -1563429
8277a563429j183919P26118j21737j815660o46485K738946M083008J858446q12153
$$ -1563429 -2747348 -2021230 -2142967 -3958627 -4605112 -1866166 2216842 4075288 3263135
8268C263135j047213J55633L63891p00242j635677j743957j315459n67135L61792
$$ 3263135 2215922 2371555 2735446 2035204 399527 -1344430 -2659889 -3227024 -2865232
8259b865232R91588J020870P32781L65380j28619l05643N95415K047916K156218
$$ -2865232 -1873644 -852774 -119993 245387 116768 -188875 406540 2454456 4610674
8250D610674K27759j822261j956194p68865j48297j77335N34911J875010J919411
$$ 4610674 4838433 3016172 1059978 291113 142816 -34519 500392 2375402 4294813
8241D294813k4681k081412k349811j236080k64953J43632N18145Q97844Q58660
$$ 4294813 4270132 2188720 -161091 -1397171 -1662124 -1518492 -1000347 -102503 756157
8232G56157M82284J74364j55726p27573j027734m42263L99225J55827j178911
$$ 756157 1238441 1412805 1257079 529506 -498228 -940491 -541266 -385439 -1564350
8223a564350j975334j184020K48669R22283R55486J317917J860951J419972k13633
$$ -1564350 -3539684 -4723704 -4475035 -3552752 -2597266 -1279349 581602 2001574 1787941
8214A787941j734111k025997j338853l32696R50141K358481K786426J295322j179556
$$ 1787941 53830 -1972167 -3311020 -3643716 -2693575 -335094 2451332 3746654 2567098
8205B567098k377273j185364J116880K289648J336784q07379k315265k038170
$$ 2567098 189825 -995539 121341 2410989 3747773 2940394 625129 -1413041
8197a413041m02116J119220J571032J373337J295789R99793m98718k877085m056098
$$ -1413041 -1815157 -695937 875095 2248432 3544221 4544014 4045296 1168211 -2887887
8188b887887k407559J047052L379777K729009J53516j590096r55633Q88270J578577
$$ -2887887 -5295446 -4248394 -868617 1860392 2013908 423812 -531821 356449 1935026
8179A935026L97811j001366r60807p1539q2291j077886j307938o1692R32593K0825
$$ 1935026 2332837 1331471 370664 299125 216834 -861052 -2168990 -2230682 -1298089 -1277264
8169a277264j694382j744072K12953J996736K037914J232515J041095J183912
$$ -1277264 -2971646 -4715718 -4502765 -2506029 -468115 764400 1805495 2989407
8161B989407M66161r72313j754420j397648q81855q38176n74165L57492Q56035
$$ 2989407 3455568 2483255 728835 -668813 -1550668 -2388844 -2963009 -2605517 -1749482
8152a749482j77574j754103j839134k58558J065571R75237N15257Q69727J438235
$$ -1749482 -1927056 -3681159 -5520293 -5778851 -4713280 -3738043 -3222786 -2353059 -914824
8143i14824J091212Q0370o44528j001917j217638o87487Q49006J862292R24271
$$ -914824 176388 256758 -387770 -1389687 -2607325 -3294812 -2445806 -583514 340757
8134C40757n28936O8082K010862J745511j520684l849324k114349J277779K012649
$$ 340757 -188179 -120097 1890765 3636276 2115592 -1733732 -3848081 -2570302 -557653
8125e57653J49199o84424P39620J939110J431114R56140J805320K215193N07004
$$ -557653 -408454 -1092878 -353258 1585852 3016966 3973106 5778426 7993619 8500623
8116H500623j669287j794268m88277k89371j431548j762002n95859K50451k77775
$$ 8500623 6831336 5037068 4548791 4259420 2827872 1065870 470011 720462 442687
8107D42687q58853m57143j66075q31233r74547P22232K455613J518354j305118
$$ 442687 -416166 -873309 -1039384 -1870617 -2845164 -2122932 332681 1851035 545917
8098E45917k427890n91475J428398J017148p67355j254691L1135J255142R25744
$$ 545917 -1881973 -2473448 -1045050 -27902 -795257 -2049948 -2018813 -763671 162073
8089A62073o87446k100896j694837Q75292L583048L522508M46321k467633k498797
$$ 162073 -525373 -2626269 -4321106 -3445814 137234 3659742 4106063 1638430 -860367
8080h60367o03454O27092O10042M07601J44353p18801j406574p05952O54073R41161
$$ -860367 -1463821 -836729 -226687 180914 325267 -393534 -1800108 -2506060 -1851987 -910826
8070i10826L03149K02362M52280k98012j408326q63418Q18222Q32267j129019
$$ -910826 -607677 -405315 46965 -251047 -1659373 -2522791 -1704569 -872302 -2001321
8061b001321k034068n76390P32696K20853j16542J139619J635270l88732k002563
$$ -2001321 -4035389 -4611779 -3879083 -3658230 -3774772 -2635153 -999883 -1388615 -3391178
8052c391178k8667L127343K793412o19502k485289j201083L62232M02629L33171
$$ -3391178 -3419845 -292502 2500910 1881408 -603881 -1804964 -1442732 -1040103 -706932
8043g06932R03950P53707j25281K83568J855044J585803j171106k728233p51820
$$ -706932 197018 950725 825444 1109012 2964056 4549859 3378753 650520 -101300
8034a01300J736780J104803j271262j700542o1862R44734P94284J222830K014136
$$ -101300 1635480 2740283 1469021 -231521 -293383 651351 1445635 2668465 4682601
8025D682601Q41696k295867m086166k511887L22828J384935N57270k83287l53928
$$ 4682601 5524297 3228430 -857736 -3369623 -3046795 -1661860 -1104590 -1387877 -1741805
8016a741805l16623m75535l43263K27581P28067Q40337P44732N33766O8526m03787
$$ -1741805 -2058428 -2533963 -2877226 -2649645 -1921578 -1081241 -336509 197257 265783 -138004
8006a38004j91754P99913J441083N37051j447201k636643k017221o75472j65786
$$ -138004 -329758 470155 1911238 2448289 1001088 -1635555 -3652776 -4328248 -4494034
7997d494034m00184j85209O73393J167553Q69596M91402M68469L85310J83864
$$ -4494034 -4894218 -5079427 -4406034 -3238481 -2368885 -1877483 -1409014 -1023704 -839840
7988h39840M70815J003227M27173j456818k620667j400774R69460J969568J061203
$$ -839840 -369025 634202 1061375 -395443 -3016110 -4416884 -3447424 -1477856 -416653
7979d16653k52190q73581q32273j10346J242031J995019Q24005j268022j645096
$$ -416653 -668843 -1542424 -2374697 -2485043 -1243012 752007 1576012 307990 -1337106
7970a337106K46978J793266Q52105j201533j505116L90822K221056K015044O3877
$$ -1337106 -1090128 703138 1555243 353710 -1151406 -760584 1460472 3475516 3539393
7961C539393j860190k244105r97166M08834L34600r06857j090411Q57762K819295
$$ 3539393 1679203 -564902 -1562068 -1153234 -818634 -1725491 -2815902 -1958140 861155
7952H61155K097365n72292j774711k84375J157260l2945k427098k753990o51322
$$ 861155 2958520 2386228 611517 327142 1484402 1451457 -975641 -3729631 -4380953
7943d380953J085292P10020l03178J06018J595941K239681J212265o10258k105132
$$ -4380953 -3295661 -2585641 -2888819 -2782801 -1186860 1052821 2265086 1654828 -450304
7934d50304k690976j951130J61259K428146K806233O39341k029565k303367K76916
$$ -450304 -3141280 -5092410 -4931151 -2503005 303228 942569 -1086996 -3390363 -3113447
7925c113447K985217K935067M01899j663804j343392J07939L63353p50249j359581
$$ -3113447 -128230 2806837 3208736 1544932 201540 309479 672832 -77417 -1436998
7916a436998m13543J044171J609777J164635L19627n64274j116338q04404J17475
$$ -1436998 -1850541 -806370 803407 1968042 2287669 1723395 607057 -197347 -79872
7907g9872M60548j98892o09340L04829J567117J413361k04594j661479j709485
$$ -79872 380676 181784 -427556 -122727 1444390 2857751 2653157 991678 -717807
7898g17807l62118J583212K687991J493471j383434k818210r80979J430927O15860
$$ -717807 -1079925 503287 3191278 4684749 3301315 483105 -497874 933053 1548913
7889A548913k342294k639745P80083L168925J109789k305916k449712l3240R55933
$$ 1548913 -793381 -3433126 -2653043 515882 1625671 -680245 -3129957 -3163197 -2207264
7880b207264l8392j08279J356093J592349m01042j860810p51991J196846J731097
$$ -2207264 -2245656 -2353935 -997842 594507 193465 -1667345 -2419336 -1222490 508607
7871E08607J371968J314657O13064j756981l847451k914605J90277J890573J062034
$$ 508607 1880575 3195232 3808296 2051315 -1796136 -4710741 -4520464 -2629891 -1567857
7862a567857L44236J531816K465387M42794l095276l921694p09486L026366L393423
$$ -1567857 -1223621 308195 2773582 3216376 121100 -3800594 -4510080 -1483714 1909709
7853A909709P67607j359670j046510L85390R73363N22466j26253o37037r78340
$$ 1909709 2677316 1317646 271136 656526 1629889 2152355 2026102 1389065 410725
7844D10725q31570l14210l46914j150698j387401k28790P79220r2151j512476
$$ 410725 -420845 -735055 -1081969 -2232667 -3620068 -3848858 -3069638 -3161789 -4674265
7835d674265o47425K189234L378172J215075j561261j927524o91835l44698r38506
$$ -4674265 -5321690 -3132456 245716 1460791 -100470 -2027994 -2719829 -3064527 -4003033
7826d003033p98427J11889M84496N21869J469824K539265J421994j626795l188840
$$ -4003033 -4801460 -4689571 -4205075 -3683206 -2213382 325883 1747877 121082 -3067758
7817c067758j383554J320398J678622R2023n95130N65206J689244J043920q54253
$$ -3067758 -4451312 -3130914 -1452292 -1360269 -1955399 -1390193 299051 1342971 488718
7808D88718k256833k131570q70124L38928P78106R43821J552890J906011N62837
$$ 488718 -1768115 -3899685 -4769809 -4430881 -3652775 -2708954 -1156064 749947 1312784
7799A312784j904676k626216k87314K310852J675055j406464k870833j049407
$$ 1312784 -591892 -3218108 -3505422 -1194570 480485 -925979 -3796812 -4846219
7791d846219J395837J666439L58827m10885k77274k57200m91708k12251O95721
$$ -4846219 -3450382 -1783943 -1425116 -1836001 -2113275 -2370475 -2862183 -3074434 -2378713
$$ [...]
##END NTUPLES=NMR SPECTRUM
##END=
