##TITLE=31Pdec_IBEPA0107
 , 24 sc
 2.07.2021
##JCAMPDX= 6.0         $$ Bruker NMR JCAMP-DX V2.0
##DATA TYPE= NMR SPECTRUM
##DATA CLASS= NTUPLES
##ORIGIN= UXNMR, Bruker Analytische Messtechnik GmbH
##OWNER= root
$$ XWIN-NMR		Version 3.5
$$ Fri Jul  2 08:43:44 2021 Russian Standard Time (UT+4h)  she@DPX200
##.OBSERVE FREQUENCY= 81.013821
##.OBSERVE NUCLEUS= ^31P
##.ACQUISITION MODE= SIMULTANEOUS
##.ACQUISITION SCHEME= undefined
##.AVERAGES= 24
##.DIGITISER RES= 16
##SPECTROMETER/DATA SYSTEM= spect
##.PULSE SEQUENCE= zgpg30
##.SOLVENT NAME= CDCl3
##.SHIFT REFERENCE= (INTERNAL, CDCl3, 0, 248.564)
##AUDIT TRAIL= $$ (NUMBER, WHEN, WHO, WHERE, WHAT)
$$ ##TITLE= Audit trail, XWIN-NMR		Version 3.5
$$ ##JCAMPDX= 5.01
$$ ##ORIGIN= Bruker BioSpin GmbH
$$ ##OWNER= she
$$ F:/spectra/data/she/nmr/P31/1/pdata/1/auditp.txt
$$ ##AUDIT TRAIL=  $$ (NUMBER, WHEN, WHO, WHERE, WHAT)
(   1,<2021-07-02 08:42:06.15 +0400>,<she>,<DPX200>,
      <created by zg, POWCHK disabled, PULCHK disabled
       configuration hash MD5:
       00 E9 B6 7A A2 85 ED C7 34 08 36 98 17 FE 4E 26
       data hash MD5: 32K
       35 2A D5 CB 40 F7 D2 52 CF 39 80 08 2A DE 51 CB>)
(   2,<2021-07-02 08:42:41.62 +0400>,<she>,<DPX200>,
      <Start of raw data processing
       efp BC_mod = 2 LB = 1 FT_mod = 6 PKNL = 1 PHC0 = -7580.774 PHC1 = 585.6861 SI = 64K 
       data hash MD5: 64K
       B9 D6 56 F0 58 BC 74 17 E4 0D AB 56 66 63 6F 42>)
(   3,<2021-07-02 08:43:07.81 +0400>,<she>,<DPX200>,
      <pk PHC0 = 75.56291 PHC1 = -194 
       data hash MD5: 64K
       40 F7 0C BF C8 2A 13 23 5A 7C 40 4E 1C CB 33 9A>)
(   4,<2021-07-02 08:43:12.40 +0400>,<she>,<DPX200>,
      <abs ABSG = 5 
       data hash MD5: 64K
       AB 3E 21 BC 94 69 FB 85 E0 EF 7D 6D 86 3C E4 17>)
$$ ##END=
$$ 
$$ hash MD5
$$ 8F 54 05 D1 02 89 C1 06 94 09 41 65 13 CC E2 69
##$RELAX= 
##$RELAX= 
##$RELAX= 
##$RELAX= 
##$RELAX= 
##$RELAX= 
##$RELAX= 
##$RELAX= 
$$ Bruker specific parameters
$$ --------------------------
##$DU= <F:/spectra>
##$EXPNO= 1
##$NAME= <P31>
##$PROCNO= 1
##$TYPE= <nmr>
##$USER= <she>
##$AMP= (0..31)
100 100 100 100 100 100 100 100 100 100 100 100 100 100 100 100 100 100 
100 100 100 100 100 100 100 100 100 100 100 100 100 100 
##$AQSEQ= 0
##$AQ_mod= 1
##$AUNM= <au_zg>
##$AUTOPOS= <>
##$BF1= 81.014009
##$BF2= 200.13
##$BF3= 200.13
##$BF4= 200.13
##$BF5= 200.13
##$BF6= 200.13
##$BF7= 200.13
##$BF8= 200.13
##$BYTORDA= 1
##$CFDGTYP= 0
##$CFRGTYP= 5
##$CHEMSTR= <none>
##$CNST= (0..31)
1 1 145 1 1 1 1 1 1 1 1 1 1 1 1 1 1 1 1 1 1 1 1 1 1 1 1 1 1 1 1 1 
##$CPDPRG= <waltz16>
##$CPDPRG1= <>
##$CPDPRG2= <waltz16>
##$CPDPRG3= <>
##$CPDPRG4= <mlev>
##$CPDPRG5= <mlev>
##$CPDPRG6= <mlev>
##$CPDPRG7= <mlev>
##$CPDPRG8= <mlev>
##$CPDPRGB= <>
##$CPDPRGT= <>
##$D= (0..31)
0 1 0 0 0 0 0 0 0 0 0 0.03 2e-05 3e-06 0 0 0 0 0 0 0 0 0 0 0 0 0 0 0 0 
0 0 
##$DATE= 1625200925
##$DBL= (0..7)
120 120 120 11 120 120 24 19 
##$DBP= (0..7)
150 150 150 150 150 150 150 150 
##$DBP07= 0
##$DBPNAM0= <>
##$DBPNAM1= <>
##$DBPNAM2= <>
$$ [...]
##$SUBNAM3= <"">
##$SUBNAM4= <"">
##$SUBNAM5= <"">
##$SUBNAM6= <"">
##$SUBNAM7= <"">
##$SUBNAM8= <"">
##$SUBNAM9= <"">
##$SW= 501.771253377433
##$SWIBOX= (0..15)
0 1 3 0 0 0 0 0 0 0 0 0 0 0 0 0 
##$SW_h= 40650.406504065
##$TD= 32768
##$TD0= 1
##$TE= 0
##$TE2= 300
##$TE3= 300
##$TEG= 300
##$TL= (0..7)
0 120 53 12 22 120 120 120 
##$TP= (0..7)
150 150 150 150 150 150 150 150 
##$TP07= 0
##$TPNAME0= <>
##$TPNAME1= <>
##$TPNAME2= <>
##$TPNAME3= <>
##$TPNAME4= <>
##$TPNAME5= <>
##$TPNAME6= <>
##$TPNAME7= <>
##$TPOAL= (0..7)
0.5 0.5 0.5 0.5 0.5 0.5 0.5 0.5 
##$TPOFFS= (0..7)
0 0 0 0 0 0 0 0 
##$TUNHIN= 0
##$TUNHOUT= 0
##$TUNXOUT= 0
##$USERA1= <user>
##$USERA2= <user>
##$USERA3= <user>
##$USERA4= <user>
##$USERA5= <user>
##$V9= 5
##$VALIST= <valist>
##$VCLIST= <CCCCCCCCCCCCCCC>
##$VD= 0
##$VDLIST= <DDDDDDDDDDDDDDD>
##$VPLIST= <PPPPPPPPPPPPPPP>
##$VTLIST= <TTTTTTTTTTTTTTT>
##$WBST= 1024
##$WBSW= 4
##$XGAIN= (0..3)
0 0 0 0 
##$XL= 0
##$YL= 0
##$YMAX_a= 5347
##$YMIN_a= -6769
##$ZGOPTNS= <>
##$ZL1= 120
##$ZL2= 120
##$ZL3= 120
##$ZL4= 120
##$ABSF1= 248.5645
##$ABSF2= -253.2056
##$ABSG= 5
##$ABSL= 3
##$ALPHA= 0
##$AQORDER= 0
##$ASSFAC= 0
##$ASSFACI= 0
##$ASSFACX= 0
##$ASSWID= 0
##$AUNMP= <proc_1d>
##$AZFE= 0.1
##$AZFW= 0.5
##$BCFW= 0
##$BC_mod= 2
##$BYTORDP= 0
##$COROFFS= 0
##$CY= -3
##$DATMOD= 1
##$DC= 0
##$DFILT= <>
##$DTYPP= 0
##$F1P= 0
##$F2P= 0
##$FCOR= 1
##$FTSIZE= 65536
##$FT_mod= 6
##$GAMMA= 0
##$GB= 0
##$INTBC= 1
##$INTSCL= 5.30512e-09
##$ISEN= 30
##$LB= 1
##$LEV0= 0
##$LPBIN= 0
##$MAXI= 10000
##$MC2= 0
##$MEAN= 0
##$ME_mod= 0
##$MI= 50
##$NCOEF= 0
##$NC_proc= -7
##$NLEV= 6
##$NOISF1= 182.463
##$NOISF2= 159.3651
##$NSP= 0
##$NTH_PI= 0
##$NZP= 0
##$OFFSET= 248.5645
##$PC= 4
##$PHC0= -7505.211
##$PHC1= 391.6861
##$PH_mod= 1
##$PKNL= yes
##$PPARMOD= 0
##$PSCAL= 0
##$PSIGN= 0
##$REVERSE= no
##$SF= 81.014009
##$SI= 65536
##$SIGF1= 159.3651
##$SIGF2= -187.1042
##$SINO= 113.3802
##$SIOLD= 16384
##$SREGLST= <1H.CDCl3>
##$SSB= 0
##$STSI= 65536
##$STSR= 0
##$SW_p= 40650.406504065
##$SYMM= 0
##$S_DEV= 0
##$TDeff= 32768
##$TDoff= 0
##$TI= <>
##$TILT= no
##$TM1= 0
##$TM2= 0
##$TOPLEV= 0
##$USERP1= <user>
##$USERP2= <user>
##$USERP3= <user>
##$USERP4= <user>
##$USERP5= <user>
##$WDW= 1
##$XDIM= 65536
##$YMAX_p= 360974567
##$YMIN_p= -10872291
$$ End of Bruker specific parameters
$$ ---------------------------------
##NTUPLES= NMR SPECTRUM
##VAR_NAME=  FREQUENCY,     SPECTRUM/REAL,   SPECTRUM/IMAG
##SYMBOL=    X,             R,               I
##VAR_TYPE=  INDEPENDENT,   DEPENDENT,       DEPENDENT
##VAR_FORM=  AFFN,          ASDF,            ASDF
##VAR_DIM=   65536,         65536,           65536
##UNITS=     HZ,            ARBITRARY UNITS, ARBITRARY UNITS
##FACTOR=    0.620285442955139, 1,           1
##FIRST=     20137.2065510759, 0,            0
##LAST=      -20513.1999529892, 0,           0
##MIN=       -20513.1999529892, -10872291,   0
##MAX=       20137.2065510759, 360974567,    0
$$ Real data points
##PAGE= N=1
##DATA TABLE= (X++(R..R)), XYDATA
$$ [...]
$$ plain form
44515 -60810 1551353 2214005 1763317 1040779 554512 141219 -423800 -1073826 -1508778 -1293518
44505 -1293518 -200542 1280953 2145502 1904564 1125394 670094 722417 875029 857778
44496 857778 771264 776146 908439 1090806 1055796 456542 -559322 -1056755 -186140 1550500
44486 1550500 2532068 1931547 860661 852331 1535421 1029321 -1051866 -2349398 -699821
44477 -699821 2524666 3733492 1699849 -940646 -1322436 180168 1261944 1094089 696484
44468 696484 641071 355580 -277111 -420938 137643 455357 222980 672870 2517300 4083308
44458 4083308 3124483 62609 -2203281 -1848295 -62015 1030382 1097559 1300687 2127664
44449 2127664 2793969 2611722 1864055 1101042 342681 -639990 -1717494 -2421268 -2340516
$$ packed form
44515f0810J612163O62652m50688p22538m86267m13293n65019o50026m34952K15260
44505a293518J092976J481495Q64549k40938p79170m55300N2323J52612j7251
44496H57778q6514M882J32293J82367l5010n99254j015864m97433Q70615J736640
44486A550500R81568o00521j070886q330O83090n06100k081187j297532J649577
44477f99821L224487J208826k033643k640495l81790J502604J081776j67855l97605
44468F96484n5413k85491o32691j43827N58581L17714k32377M49890J844430J566008
44458D083308r58825l061874k265890L54986J786280J092397O7177K03128Q26977
44449B127664O66305j82247p47667p63013p58361r82671j077504p03774Q0752
$$ plain form
44440 -2340516 -1399757 -71707 633251 -119892 -2034618 -3765540 -4116999 -2868769 -515841
44431 -515841 2089291 3715564 3359130 1486835 -64890 -144432 391057 113055 -956101
44422 -956101 -1697111 -1565672 -750259 708619 2530483 3382315 2130083 -228202 -1581125
44413 -1581125 -1636916 -1928733 -2724246 -2288796 -126025 1416320 483458 -1232593 -952227
44404 -952227 992105 1849595 637750 -899051 -1469636 -1938503 -3186010 -4240394 -3710546
44395 -3710546 -1862887 -106882 933039 1843901 3153659 4358034 4397106 2942534 1011857
44386 1011857 7400 187781 697301 1180708 2269928 3886684 4384459 2650359 -15200
44377 -15200 -1712432 -2647525 -3983535 -4823732 -3119257 453722 2529815 1773021 777156
$$ packed form
44440b340516R40759J328050P04958p53143j914726j730922l51459J248230K352928
44431e15841K605132J626273l56434j872295j551725p9542N35489k78002j069156
44422i56101p41010J31439Q15413J458878J821864Q51832j252232k358285j352923
44413a581125n5791k91817p95513M35450K162771J542345r32862j716051K80366
44404i52227J944332Q57490j211845j536801n70585m68867j247507j054384N29848
44395c710546J847659J756005J039921R10862J309758J204375L9072j454572j930677
44386A011857j004457J80381N09520M83407J089220J616756M97775j734100k665559
44377a5200j697232r35093j336010q40197J704475L572979K076093p56794r95865
$$ plain form
44368 777156 1931011 4007757 4718733 4243085 3766707 2535755 -555610 -3676850 -3671471
44359 -3671471 -607270 2266946 3092153 3012427 2946307 1843883 -774282 -3229102 -4119317
44350 -4119317 -4172822 -4189699 -3258136 -806502 1486905 1930379 1371674 1323417 1091884 -578476
44340 -578476 -2281439 -1609576 526779 736057 -1469927 -2652522 -857398 1293724 816060
44331 816060 -1172320 -1739536 -737141 -139662 -177480 656606 2207717 2331471 314623
44322 314623 -1881958 -2474494 -1897403 -1242760 -532424 466760 1273245 1646378 2254784
44313 2254784 3302680 3591396 2111342 -307359 -2071098 -2821134 -3242594 -3519566 -3192434
44304 -3192434 -2179085 -834513 761219 2590878 4017546 4324392 3832673 3559847 3811003
$$ packed form
44368G77156J153855K076746P10976m75648m76378j230952l091365l121240N379
44359c671471L064201K874216Q25207p9726o6120j102424k618165k454820q90215
44350d119317n3505j6877R31563K451634K293407M43474n58705m8257k31533j670360
44340e78476j702963O71863K136355K09278k205984j182595J795124K151122m77664
44331H16060j988380n67216J002395N97479l7818Q34086J551111J23754k016848
44322C14623k196581n92536N77091O54643P10336R99184Q06485L73133O08406
44313B254784J047896K88716j480054k418701j763739p50036m21460k76972L27132
44304c192434J013349J344572J595732J829659J426668L06846m91719k72826K51156
$$ plain form
44295 3811003 3944722 3462845 2494119 1302950 249485 134656 1412220 2894542 2533678
44286 2533678 99044 -2006519 -1490306 1038264 2988125 2951701 1867173 1272602 1538996
44277 1538996 2007091 1988225 1285234 313923 -95277 353599 573220 -810428 -3055974
44268 -3055974 -3246815 96553 4164867 4457522 246397 -4342282 -5271566 -2934195 -482539
44259 -482539 582083 1245592 2235226 2738978 2178368 1453438 1513258 1759514 835543 -1480685
44249 -1480685 -3872829 -4815980 -3991067 -2478125 -1595013 -1502836 -1315541 -754009 -799858
44240 -799858 -1914573 -2623423 -1416192 600948 991375 -211574 -332591 1767689 3691333
44231 3691333 2960435 547033 -732638 52760 1564182 2479135 2433763 1442770 5958
$$ packed form
44295C811003J33719m81877r68726j191169j053465j14829J277564J482322l60864
44286B533678k434634k105563N16213K528570J949861l6424j084528n94571K66394
44277A538996M68095j8866p02991r71311m09200M48876K19621j383648k245546
44268c055974j90841L343368M068314K92655m211125m588679r29284K337371K451656
44259d82539J064622O63509R89634N03752n60610p24930N9820K46256r23971k316228
44249a480685k392144r43151Q24913J512942Q83112R2177J87295N61532m5849
44240g99858j114715p08850J207231K017140L90427j202949j21017K100280J923644
44231C691333p30898k413402j279671P85398J511422R14953m5372r90993j436812
$$ plain form
44222 5958 -768829 -549738 -608453 -1849994 -2891039 -1919152 224150 994400 -33364
44213 -33364 -554450 903810 2864267 3156687 1681401 -106622 -1324882 -2157824 -2801437
44204 -2801437 -2859439 -1844249 -35731 1295881 964102 -621306 -1774616 -1871609 -2243015
44195 -2243015 -3685678 -4402664 -2336406 1297427 3159611 2224331 697821 433155 941714
44186 941714 1484014 2529703 3977600 4206717 2442758 254894 -812564 -1364602 -2288350
44177 -2288350 -2565458 -1107650 641601 487523 -922912 -908615 1047796 2477543 1717587
44168 1717587 202496 -61051 508727 109505 -1418228 -2218598 -984672 1243821 2290810
44159 2290810 1394791 21924 21350 1346927 2177780 1309271 -326267 -966605 -187046
$$ packed form
44222E958p74787K19091n8715j241541j041045R71887K143302P70250j027764
44213c3364n21086J458260J960457K92420j475286j788023j218260q32942o43613
44204b801437n8002J015190J808518J331612l31779j585408j153310r6993l71406
44195b243015j442663p16986K066258L633833J862184r35280j526510k64666N08559
44186I41714N42300J045689J447897K29117j763959k187864j067458n52038r23748
44177b288350k77108J457808J749251j54078j410435J4297J956411J429747p59956
44168A717587j515091k63547N69778l99222j527733q00370J233926K228493J046989
44159B290810q96019j372867n74J325577Q30853q68509j635538o40338P79559
$$ plain form
44150 -187046 1000795 1770361 2174008 2242427 1448929 -405546 -2381717 -3128684 -2258311
44141 -2258311 -546697 1138642 2598815 3858124 4521050 4164417 3151704 2302765 1685218
44132 1685218 603628 -852188 -1276228 128378 1883079 1773649 -298971 -2293527
44124 -2293527 -2694696 -1859100 -676171 628946 1909911 2598565 2489710 2166650 2131243
44115 2131243 2246855 2333988 2482994 2564355 2326346 2047327 2035919 1638037 286868 -567837
44105 -567837 1194336 4592254 5668531 2726506 -927836 -1446314 400515 1036792 -458562
44096 -458562 -1651431 -850072 967188 2398422 3372302 4161213 4439757 3849431 2330010
44087 2330010 -95786 -2714531 -3780715 -2373317 -153702 548530 -11184 237842 1495856
$$ packed form
44150a87046J187841P69566M03647O8419p93498j854475j976171p46967Q70373
44141b258311J711614J685339J460173J259309O62926l56633j012713q48939o17547
44132A685218j081590j455816m24040J404606J754701j09430k072620j994556
44124b293527m01169Q35596J182929J305117J280965O88654j08855l23060l5407
44115B131243J15612Q7133J49006Q1361k38009k79019j1408l97882j351169q54705
44105e67837J762173L397918J076277k942025l654342n18478J846829O36277j495354
44096d58562j192869Q01359J817260J431234R73880P88911K78544n90326j519421
44087B330010k425796k618745j066184J407398K219615P02232n59714K49026J258014
$$ plain form
44078 1495856 1773958 434837 -744183 -832952 -1326710 -3079945 -4168828 -2807136 -477382
44069 -477382 121518 -1028948 -1677776 -805204 479724 1198925 1630372 2044716 1967666
44060 1967666 1132544 50451 -747890 -1271804 -1663978 -1843981 -1663714 -974021 354126
44051 354126 1987206 2910114 2279988 507074 -938189 -820369 869928 2927008 3821518
44042 3821518 3087536 1974385 2036875 2955752 2884508 1422911 746611 2534680 5047100
44033 5047100 5132942 2498994 -50534 -490160 364231 1000828 1403159 2126183 2737089
44024 2737089 2494551 1680701 1099438 850944 577455 399627 641112 981725 771409
44015 771409 -32813 -924477 -1482363 -1229484 606370 4038189 7213479 7692431 5222145
$$ packed form
44078A495856K78102j339121j179020q8769m93758j753235j088883J361692K329754
44069d77382N98900j150466o48828Q72572J284928P19201M31447M14344p7050
44060A967666q35122j082093p98341n23914l92174j80003J80267O89693J328147
44051C54126J633080R22908o30126j772914j445263J17820J690297K057080Q94510
44042C821518p33982j113151O2490R18877p1244j461597o76300J788069K512420
44033E047100Q5842k633948k549528m39626Q54391O36597M02331P23024O10906
44024B737089k42538q13850n81263k48494k73489j77828K41485L40613k10316
44015G71409q04222q91664n57886K52879J835854L431819L175290M78952k470286
$$ plain form
44006 5222145 2270674 1295130 2239701 3258952 3122850 2055420 720170 -516043 -1316278
43997 -1316278 -1376790 -1067690 -1295920 -2144592 -2279604 -611644 1795823 2688635 1633757
43988 1633757 696197 1358407 2182133 1151272 -692029 -445459 1880090 2700563 182584
43979 182584 -2460749 -1337653 2408150 4274692 2710713 404783 -434957 -539794 -739038
43970 -739038 -149805 1334548 1778713 351467 -884294 -424606 21442 -1134967 -1925059
43961 -1925059 3127 2862943 3214295 1476443 788753 1400926 890030 -367740 803357
43952 803357 4088377 4742643 1030058 -2362496 -1472918 789945 -231650 -3269196 -3633832
43943 -3633832 -1150324 -131508 -2146788 -4008577 -3537115 -2781351 -3886761 -5274565
$$ packed form
44006E222145k951471r75544R44571J019251j36102j067430j335250j236213q00235
43997a316278o0512L09100k28230q48672j35012J667960K407467Q92812j054878
43988A633757r37560O62210Q23726j030861j843301K46570K325549Q20473k517979
43979A82584k643333J123096L745803J866542j563979k305930q39740j04837j99244
43970g39038N89233J484353M44165j427246j235761M59688M46048j156409p90092
43961a925059J928186K859816L51352j737852o87690O12173n10896j257770J171097
43952H03357L285020O54266l712585l392554Q89578K262863j021595l037546l64636
43943c633832K483508J018816k015280j861789M71462P55764j105410j387804
$$ plain form
43935 -5274565 -4155208 -667949 2482496 3261276 1774791 -537889 -2090659 -2141604 -1306105
43926 -1306105 -761273 -890178 -1231335 -1430428 -1376957 -829882 13676 76274 -1203310 -2566348
43916 -2566348 -2460059 -1253966 -270986 632877 2294361 3574277 2262786 -1087861 -2958196
43907 -2958196 -1336599 1891745 3947531 4356441 4033862 3241367 1908314 481482 -749045
43898 -749045 -1908475 -2466552 -1634373 -455426 -1203175 -3583435 -4127620 -1230336 1664321
43889 1664321 475151 -3862202 -7091256 -7485820 -6642008 -5296803 -2225871 2232853
43881 2232853 5024945 4276342 1965798 1038916 1608611 1836227 1374976 1816096 3876002
43872 3876002 5881763 5706160 3334725 751621 -408876 -345514 -134496 -73643 335373
$$ packed form
43935e274565J119357L487259L150445P78780j486485k312680j552770n0945Q35499
43926a306105N44832j28905l41157j99093N3471N47075Q43558O2598j279584j363038
43916b566348J06289J206093R82980R03863J661484J279916j311491l350647j870335
43907b958196J621597L228344K055786M08910l22579p92495j333053j426832j230527
43898g49045j159430n58077Q32179J178947p47749k380260n44185K897284K894657
43889A664321j189170m337353l229054l94564Q43812J345205L070932M458724
43881B232853K792092p48603k310544r26882N69695K27616m61251M41120K059906
43872C876002K005761j75603k371435k583104j160497O3362K11018O0853M09016
$$ plain form
43863 335373 1168994 1819561 1989561 2052865 2198743 2049629 1461477 933818 847920 969178
43853 969178 954349 619383 -371568 -2036021 -3165359 -2270947 140099 1730721 1421570
43844 1421570 705553 997194 1474509 956926 228534 603839 1487360 1421272 575621 80328
43834 80328 -342399 -1857798 -4129287 -5628484 -6005523 -6024778 -5477887 -3555533 -1257015
43825 -1257015 -851144 -2425040 -3317703 -1824317 565722 1573191 997794 220082 376275
43816 376275 1854481 4086232 5114921 3087511 -932350 -3431310 -2819119 -1492431
43808 -1492431 -2166601 -4074543 -4747264 -3915912 -3172831 -2804109 -1701746 -152109 -60520
43799 -60520 -1921147 -3709469 -3620845 -2242259 -1039274 -61467 1597510 3863826 5469743
$$ packed form
43863C35373Q33621O50567J70000O3304J45878j49114n88152n27659q5898J21258
43853I69178j4829l34966r90951j664453j129338Q94412K411046J590622l09151
43844A421570p16017K91641M77315n17583p28392L75305Q83521o6088q45651m95293
43834H0328m22727j515399k271489j499197l77039j9255N46891J922354K298518
43825a257015M05871j573896q92663J493386K390039J007469n75397p77712J56193
43816C76275J478206K231751J028689k027410m019861k498960O12191J326688
43808a492431o74170j907942o72721Q31352P43081L68722J102363J549637R1589
43799f0520j860627j788322Q8624J378586J202985R77807J658977K266316J605917
$$ plain form
43790 5469743 5507372 4389893 3264271 2939231 3372703 3873261 3748507 2880760 1684532
43781 1684532 586674 -232613 -622882 -348273 650339 2097189 3582435 4656747 4645697
43772 4645697 2888544 -284228 -3059791 -3491115 -1694400 -49478 -522670 -2211395
43764 -2211395 -2532022 -735529 1077120 981074 -29108 399240 2432805 3730866 2640921
43755 2640921 177080 -1624464 -1993702 -1336922 -35671 1502641 2299161 1651363 411675
43746 411675 265337 1480318 2304321 1180251 -1018639 -1807134 -157038 1987790 1821087
43737 1821087 -1003921 -3918190 -4389022 -2500893 -172185 1235721 1504472 532191 -1603410
43728 -1603410 -3601299 -3720034 -2179705 -1215853 -1844346 -2154171 -297764 2179644 2178937
$$ packed form
43790E469743L7629j117479j125622l25040M33472N00558j24754q67747j196228
43781A684532j097858q19287l90269K74609R98612J446850J485246J074312j1050
43772D645697j757153l172772k775563m31324J796715J644922m73192j688725
43764b211395l20627J796493J812649r6046j010182M28348K033565J298061j089945
43755B640921k463841j801544l69238O56780J301251J538312P96520o47798j239688
43746D11675j46338J214981Q24003j124070k198890p88495J650096K144828j66703
43737A821087k825008k914269m70832J888129K328708J407906K68751r72281k135601
43728a603410j997889j18735J540329R63852o28493l09825J856407K477408p07
$$ plain form
43719 2178937 -410881 -2501869 -2371476 -1947789 -3383047 -5465170 -5477731 -3408255 -1890189
43710 -1890189 -2174372 -2473577 -970637 1383912 2313213 1260867 -380328 -1390192 -1684904
43701 -1684904 -1483155 -891061 -420433 -785940 -1883174 -2786813 -2936930 -2550304 -1853175
43692 -1853175 -929495 -385970 -842222 -1425076 -298350 2551478 4606084 4053508 2266960
43683 2266960 1518950 1677169 1341160 1106617 2734937 5271157 5215077 1552415 -2111039
43674 -2111039 -2128073 558906 2382578 2155766 1686219 2216620 2832029 2556654 1862817
43665 1862817 1327145 412869 -1226182 -2199930 -605132 3160132 5846681 4403655 -489968
43656 -489968 -4599313 -4358182 -641314 2382571 2029423 -352463 -1930545 -2106757 -2392346
$$ packed form
43719B178937k589818k090988J30393M23687j435258k082123j2561K069476J518066
43710a890189k84183k99205J502940K354549R29301j052346j641195j009864k94712
43701a684904K01749N92094M70628l65507j097234r03639j50117L86626O97129
43692a853175R23680N43525m56252n82854J126726K849828K054606n52576j786548
43683B266960p48010J58219l36009k34543J628320K536220n6080l662662l663454
43674b111039j7034K686979J823672k26812m69547N30401O15409k75375o93837
43665A862817n35672r14276j639051r73748J594798L765264K686549j443026m893623
43656d89968m109345K41131L716868L023885l53148k381886j578082j76212k85589
$$ plain form
43647 -2392346 -3354626 -3560070 -1916528 372413 1165670 1064 -1589898 -2074348 -1309939
43638 -1309939 46783 1542178 2791364 3036769 1830445 69575 -619532 160126 1083730
43629 1083730 1084951 924018 1813120 3174870 3158305 1211641 -1254366 -2903839 -3787890
43620 -3787890 -4241394 -3947627 -2988838 -2609274 -3673763 -5081520 -4950426 -2997317 -667737
43611 -667737 786214 1240403 886412 -242415 -1606102 -2031844 -961746 594797 958005
43602 958005 -425389 -2427650 -3514278 -3266590 -2394432 -1509809 -586289 204994 82938
43593 82938 -1080596 -1857664 -945883 701994 1085638 339132 618767 2365439 3018564
43584 3018564 791011 -2341989 -3441894 -2869109 -3330638 -5563387 -7564843 -7920324 -7396959
$$ packed form
43647b392346r62280k05444J643542K288941P93257j164606j590962m84450P64409
43638a309939J356722J495395J249186K45405j206324j760870o89107P79658R23604
43629A083730J221j60933Q89102J361750j6565j946664k466007j649473q84051
43620c787890m53504K93767R58789L79564j064489j407757J31094J953109K329580
43611f67737J453951M54189l53991j128827j363687m25742J070098J556543L63208
43602I58005j383394k002261j086628K47688Q72158Q84623R23520P91283j22056
43593H2938j163534p77068R11781J647877L83644p46506K79635J746672O53125
43584C018564k227553l133000j099905N72785m61529k232749k001456l55481N23365
$$ plain form
43575 -7396959 -6837220 -5665592 -3355443 -743718 1046001 1807076 1690475 621160 -963282
43566 -963282 -1834396 -1309262 -159104 487397 495060 388154 301531 -77363 -878907 -1782850
43556 -1782850 -2130623 -1282363 604523 2201654 2217115 1078671 548349 1456018 2697160
43547 2697160 2776689 1493278 -271636 -1657048 -2327577 -2506590 -2738443 -3073494 -2622356
43538 -2622356 -759368 1519364 2684797 2889811 3477844 4365339 3998311 2279054 1161204
43529 1161204 1365129 930401 -1352091 -3316432 -2452463 173163 1487143 600101 -1064094
43520 -1064094 -2658896 -4134436 -4413693 -2455542 159800 813151 19133 750616 3217469
43511 3217469 3960493 1420419 -1183108 -784796 813836 226600 -1843479 -1924190 387918
$$ packed form
43575g396959N59739J171628K310149K611725J789719P61075j16601j069315j584442
43566i63282q71114N25134J150158O46501P663j06906q6623l78894q01544r03943
43556a782850l47773Q48260J886886J597131J5461j138444n30322R07669J241142
43547B697160P9529j283411j764914j385412o70529j79013k31853l35051M51138
43538b622356J862988K278732J165433K05014N88033Q87495l67028j719257j117850
43529A161204K03925m34728k282492j964341Q63969K625626J313980q87042j664195
43520a064094j594802j475540k79257J958151K615342O53351p94018P31483K466853
43511C217469P43024k540074k603527L98312J598632n87236k070079q0711K312108
$$ plain form
43502 387918 1762501 392899 -1503016 -1471958 -413546 -663709 -2169828 -2524134 -338619
43493 -338619 2797486 3938528 1871162 -1575765 -3383781 -2575218 -1099826 -1018919 -1612064
43484 -1612064 -615599 2036910 3593777 2150329 -694785 -1952017 -832191 1101058
43476 1101058 2506332 3358372 3788242 3579111 3189011 3782503 5345113 5829412 3457969
43467 3457969 -565981 -2983527 -2231720 -93865 887512 543385 581841 1674951 2541181
43458 2541181 1973640 372518 -1274333 -2711705 -3850150 -3975587 -2849437 -1891769 -2645085
43449 -2645085 -4243162 -4103683 -1481161 1227106 1483928 -345671 -1933737 -1908742 -600569
43440 -600569 1327261 3397489 4633424 3882030 1311377 -1334813 -2445251 -1883784 -387438
$$ packed form
43502C87918J374583j369602j895915L1058J058412k50163j506119l54306K185515
43493c38619L136105J141042k067366l446927j808016Q08563J475392Q0907n93145
43484a612064R96465K652509J556867j443448k845114j257232J119826J933249
43476A101058J405274Q52040M29870k09131l90100N93492J562610M84299k371443
43467C457969m023950k417546P51807K137855R81377l44127L8456J093110Q66230
43458B541181n67541j601122j646851j437372j138445j25437J126150R57668p53316
43449b645085j598077J39479K622522K708267K56822j829599j588066K4995J308173
43440f00569J927830K070228J235935p51394k570653k646190j110438N61467J496346
$$ plain form
43431 -387438 1506977 3281919 3857755 2311095 -676522 -2868363 -2555427 -410846 1187353
43422 1187353 712626 -1023813 -2092263 -1685279 -654487 -83610 -39234 137995 841609
43413 841609 1726498 1925794 801432 -1040304 -1732288 -119750 2267032 2560247 303431
43404 303431 -1686742 -1167153 467994 706934 107372 1310820 4307921 5708158 3535042
43395 3535042 157683 -1153886 -649111 -1015737 -3122374 -5172978 -5742093 -5443912 -5160158
43386 -5160158 -4380794 -2341308 205462 1582286 1353287 934975 1702134 3069094 3232544
43377 3232544 1822443 827984 2083894 4492996 5090231 2813124 -228554 -1618951
43369 -1618951 -1295085 -538902 219435 1160411 1656257 881439 -493624 -851522 74534
$$ packed form
43431c87438J894415J774942N75836j546660k987617k191841L12936K144581J598199
43422A187353m74727j736439j068450M06984J030792N70877M4376J77229P03614
43413H41609Q84889J99296j124362j841736o91984J612538K386782K93215k256816
43404C03431j990173N19589J635147K38940n99562J203448K997101J400237k173116
43395C535042l377359j311569N04775l66626k106637k050604n69115K98181K83754
43386e160158P79364K039486K546770J376824k28999m18312P67159J366960J63450
43377C232544j410101r94459J255910K409102N97235k277107l041678j390397
43369a618951L23866P56183P58337R40976M95846p74818j375063l57898R26056
$$ plain form
43360 74534 813259 256329 -1027843 -1812948 -1479720 -55630 1871905 2934814 1861246
43351 1861246 -766662 -2579742 -2011642 -96074 1050177 826045 324774 466076 1070028
43342 1070028 1660034 2103097 2162519 1244618 -797935 -2961071 -3785714 -2826558 -1118739
43333 -1118739 -26853 228519 684196 2225151 4231296 4926743 3287777 481717 -1046792
43324 -1046792 -221821 1311930 1150095 -739701 -1935952 -926089 797534 1054405 136810
43315 136810 -125079 412908 355900 -52135 1221719 4215454 5888953 4401545 1943144
43306 1943144 1217802 1458556 631523 -475913 220293 1939585 2230314 1504432 2222455
43297 2222455 3763523 2747844 -706727 -1861532 1400807 4571147 2956816 -1353665
$$ packed form
43360G4534P38725n56930j284172p85105L33228J424090J927535J062909j073568
43351A861246k627908j813080N68100J915568J146251k24132n01271J41302O03952
43342A070028N90006M43063N9422r17901k042553k163136q24643R59156J707819
43333a118739J091886K55372M55677J540955K006145O95447j638966k806060j528509
43324a046792Q24971J533751j61835j889796j196251J009863J723623K56871r17595
43315A36810k61889N37987n7008m08035J273854K993735J673499j487408k458401
43306A943144p25342K40754q27033j107436O96206J719292K90729p25882P18023
43297B222455J541068j015679l454571j154805L262339L170340j614331m310481
$$ plain form
43289 -1353665 -2862835 -555539 1753455 1535410 -83453 -1499310 -2400935 -2299251 -609473
43280 -609473 1360763 1355224 -378015 -1147993 163736 1699584 1866509 1362795 980285
43271 980285 -65649 -2116512 -3528456 -2943973 -1509619 -1065302 -1393699 -1046521 41405
43262 41405 553274 -87902 -1094265 -1542528 -1090776 176915 1546064 1669022 -107338
43253 -107338 -2542316 -3543917 -2318118 199254 2699021 4378825 4723957 3549060
43245 3549060 1550959 95208 26746 912787 1576790 1272767 440039 373687 1825396
43236 1825396 3810075 4374018 2928689 1187252 1100258 2390942 3130655 2551304 2068558
43227 2068558 3068904 4636892 4512998 2141271 -272202 -315906 1615743 2870014 2001804
$$ packed form
43289a353665j509170K307296K308994k18045j618863j415857r01625J01684J689778
43280f09473J970236n539j733239p69978J311729J535848J66925n03714l82510
43271I80285j045934k050863j411944N84483J434354M44317l28397L47178J087926
43262D1405N11869o41176j006363m48263M51752J267691J369149J22958j776360
43253a07338k434978j001601J225799K517372K499767J679804L45132j174897
43245C549060j998101j455751o8462Q86041O64003l04023q32728o6352J451709
43236A825396J984679N63943j445329j741437q6994J290684P39713n79351m82746
43227B068558J000346J567988j23894k371727k413473m3704J931649J254271q68210
$$ plain form
43218 2001804 369886 -346387 -798247 -2532551 -4788423 -5037234 -2848119 -885677 -1105822
43209 -1105822 -1989897 -1103606 1177067 2414088 1556333 -321328 -2070945 -3274258 -3334850
43200 -3334850 -1799989 308019 1225136 696670 -52607 -579652 -1588825 -2863140 -2978926
43191 -2978926 -1733274 -724060 -524014 523949 3189445 5166319 4198064 1766657
43183 1766657 1059306 2317246 3064118 2453468 2244725 3102531 2991839 555386 -2312249
43174 -2312249 -2995967 -1603857 -212143 20957 -665130 -1921031 -3238826 -3352638 -1519328
43165 -1519328 911925 1774633 733666 -697173 -1448908 -1687099 -1570166 -976595 -550814
43156 -550814 -1257494 -2530724 -2584685 -1184265 -418375 -1720415 -3567504 -3447713 -1119808
$$ packed form
43218B001804j631918p16273m51860j734304k255872k48811K189115J962442k20145
43209a105822q84075Q86291K280673J237021q57755j877661j749617j203313o0592
43200c334850J534861K108008R17117n28466p49277n27045j009173j274315j15786
43191b978926J245652J009214K00046J047963K665496J976874r68255k431407
43183A766657p07351J257940P46872o10650k08743Q57806j10692k436453k867635
43174b312249o83718J392110J391714K33100o86087j255901j317795j13812J833310
43165a519328K431253Q62708j040967j430839p51735k38191J16933N93571M25781
43156e50814p06680j273230n3961J400420P65890j302040j847089J19791K327905
$$ plain form
43147 -1119808 1378528 2304561 1648069 501802 21569 676086 1756660 1979307 1056741
43138 1056741 14344 -478791 -976162 -1713954 -1640250 -350922 353117 -1184737 -3501630
43129 -3501630 -3724946 -1838957 -718297 -1771250 -3162998 -3183211 -2915844 -4007302 -5653848
43120 -5653848 -5797057 -4271737 -2848004 -2526417 -2358401 -1000612 1570288 3958232 4419927
43111 4419927 2331262 -866044 -2635188 -1934711 -431845 -472511 -2305804 -4090710 -4225205
43102 -4225205 -2755414 -725257 905380 1649713 1561592 1102661 567964 -235458 -1290648
43093 -1290648 -1628143 -85849 3004972 5445919 4913562 1134687 -3643155 -6413789
43085 -6413789 -5943794 -3666847 -1889209 -1325378 -996312 -291186 149511 -24175 140667
$$ packed form
43147a119808K498336R26033o56492j146267m80233O54517J080574K22647r22566
43138A056741j042397m93135m97371p37792P3704J289328P04039j537854k316893
43129c501630k23316J885989J120660j052953j391748k0213K67367j091458j646546
43120e653848j43209J525320J423733L21587J68016J357789K570900K387944M61695
43111D419927k088665l197306j769144P00477J502866m0666j833293j784906j34495
43102d225205J469791K030157J630637P44333q8121m58931n34697q03422j055190
43093a290648l37495J542294L090821K440947n32357l778875m777842k770634
43085f413789M69995K276947J777638N63831L29066P05126M40697j73686J64842
$$ plain form
43076 140667 1295103 2229954 1387425 -643836 -1709778 -1010409 76837 258060 -33700
43067 -33700 232244 1136303 2154322 3108254 3852981 3665489 1998779 -372373 -1884324
43058 -1884324 -1943294 -1462720 -1500658 -2019568 -2339870 -2243684 -2027858 -1808364 -1489281 -1250394
43048 -1250394 -1242029 -879280 440031 1735117 1047378 -1581735 -3345721 -2353234 -576198
43039 -576198 -947083 -2730005 -2761176 -736483 372490 -420732 -435410 1530683 2359889
43030 2359889 -196003 -2898294 -1603182 1896123 2263495 -1273153 -4008301 -2969652
43022 -2969652 -479406 435741 66900 -216379 -695907 -1624630 -1636205 -155272 853524
43013 853524 -161381 -1540415 -877492 1327274 2824141 3064634 3029005 2608937 780889
$$ packed form
43076A40667J154436R34851q42529k031261j065942O99369J087246J81223k91760
43067c3700K65944R04059J018019R53932P44727j87492j666710k371152j511951
43058a884324n8970M80574l7938n18910l20302R6186K15826K19494L19083K38887
43048a250394Q365L62749J319311J295086o87739k629113j763986R92487J777036
43039e76198l70885j782922l1171K024693J108973p93222j4678J966093Q29206
43030B359889k555892k702291J295112L499305L67372l536648k735148J038649
43022b969652K490246R15147l68841k83279m79528r28723j1575J480933J008796
43013H53524j014905j379034O62923K204766J496867K40493l5629m20068j828048
$$ plain form
43004 780889 -1950219 -3598184 -3297283 -2106898 -1151180 -504077 -73166 -230484 -1166741
42995 -1166741 -2354417 -2776022 -1463598 1500825 4068557 3559116 22243 -2969197
42987 -2969197 -2453545 85268 988053 -316077 -771196 1686446 5349065 7087883 5604752
42978 5604752 1789146 -2408841 -4705429 -3675041 -334018 2373826 2445584 504740
42970 504740 -1652419 -3119358 -3990212 -4462665 -4581604 -4276848 -3249261 -1399877 517526
42961 517526 1463453 1353320 803079 -168874 -1778235 -2905498 -1862816 765374 2154282
42952 2154282 1183601 292107 1769532 4107697 4330824 2516295 1179503 923346 -101521
42943 -101521 -2232040 -3031567 -1232355 793138 498413 -941181 -681957 1167942 1886649
$$ packed form
43004G80889k731108j647965L00901J190385R55718O47103M30911j57318r36257
42995a166741j187676m21605J312424K964423K567732n09441l536873k991440
42987b969197N15652K538813R02785j304130m55119K457642L662619J738818j483131
42978E604752l815606m197987k296588J030388L341023K707844P1758j940844
42970E04740k157159j466939q70854m72453j18939L04756J027587J849384J917403
42961E17526R45927j10133n50241r71953j609361j127263J042682K628190J388908
42952B154282r70681q91494J477425K338165K23127j814529j336792k56157j024867
42943a01521k130519p99527J799212K025493k94725j439594K59224J849899P18707
$$ plain form
42934 1886649 714316 57284 1422596 2877885 2230219 690020 1038999 3285113 4684320
42925 4684320 3756966 1795418 162230 -1364038 -2680123 -2336843 -174650 1088564
42917 1088564 -709930 -3570335 -3866220 -1615820 -157632 -769900 -1008546 796300 2686481
42908 2686481 2504518 1416653 1550318 2233800 1543206 187185 532274 2311138 2735875
42899 2735875 1241008 817241 3317107 6179832 5860737 2670092 -10475 -220509 996599
42890 996599 1915375 2018322 1605999 1156796 1306235 2267071 3144431 2908707 2071370 2174489
42880 2174489 3450713 4327777 3779726 2950110 3545661 5423955 6752269 6190862 4143199
42871 4143199 1981137 568857 -408636 -1762740 -3390030 -3940649 -2591590 -757491
$$ packed form
42934A886649j172333o57032J365312J455289o47666j540199L48979K246114J399207
42925D684320r27354j961548j633188j526268j316085L43280K162193J263214
42917A088564j798494k860405k95885K250400J458188o12268k38646J804846J890181
42908B686481j81963j087865J33665O83482o90594j356021L45089J778864M24737
42899B735875j494867m23767K499866K862725l19095l190645k680567k10034J217108
42890I96599R18776J02947m12323m49203J49439R60836Q77360k35724q37337J03119
42880B174489J276224Q77064n48051q29616N95551J878294J328314n61407k047663
42871D143199k162062j412280r77493j354104j627290n50619J349059J834099
$$ plain form
42863 -757491 -680295 -2248745 -2912039 -1368975 511307 681631 -15222 276661 1021841
42854 1021841 407915 -1052141 -1132105 19155 -296344 -2671712 -4027736 -2371064 -250762
42845 -250762 -940220 -3273659 -3370877 -414167 2494587 3158344 3028290 4259335 6230390
42836 6230390 6518963 4343187 1708311 1173862 3013336 4803681 4029136 1024619 -1378196
42827 -1378196 -1379821 -285957 -251457 -1115515 -931610 1046181 3477603 4702318 4020676
42818 4020676 1622936 -1265607 -2541620 -1192651 1069886 1743835 790847 124284 264705
42809 264705 15656 -408994 1129256 4983013 8088993 7772075 5232501 3466703 3376983
42800 3376983 3833255 4162188 4476775 4531503 4251166 4627512 6231038 7647474 7439845
$$ packed form
42863g57491P7196j568450o63294J543064J880282J70324o96853K91883P45180
42854A021841o13926j460056p9964J151260l15499k375368j356024J656672K120302
42845b50762o89458k333439r7218K956710K908754O63757j30054J231045J971055
42836F230390K88573k175776k634876n34449J839474J790345p74545l004517k402815
42827a378196j625J093864L4500q64058J83905J977791K431422J224715o81642
42818D020676k397740k888543j276013J348969K262537O73949r52988o66563J40421
42809B64705k49049m24650J538250L853757L105980l16918k539574j765798q9720
42800C376983M56272L28933L14587N4728k80337L76346J603526J416436k07629
$$ plain form
42791 7439845 6957759 8801349 12712479 15467209 15191158 13497710 12582294 12245945 11026274
42782 11026274 8738479 6449812 4858933 3982543 3844781 4305045 4513634 3580339 1806630
42773 1806630 549793 723427 1799196 2360233 1479963 -362219 -1594240 -919549 1451061
42764 1451061 3976768 5216336 4973041 4080510 3332151 2765501 1925924 745362 -9279
42755 -9279 509737 1981209 2933707 2402433 1152875 687616 1333121 2029495 1919550 1358055
42745 1358055 1166212 1546715 2064854 2190544 1476834 -311326 -2611063 -3838459 -2617627
42736 -2617627 410348 2635103 2068949 -351447 -1899851 -1406329 -233879 434346 1556302
42727 1556302 3995287 5745692 3953930 -600710 -3779099 -3366047 -1472365 -642872
$$ packed form
42791G439845m82086J843590L911130K754730k76051j693448r15416l36349j219671
42782A1026274k287795k288667j590879q76390j37762M60264K08589r33295j773709
42773A806630j256837J73634J075769N61037q80270j842182j232021O74691K370610
42764A451061K525707J239568k43295q92531p48359n66650q39577j180562p54641
42755i279N19016J471472R52498n31274j249558m65259O45505O96374j09945n61495
42745A358055j91843L80503N18139J25690p13710j788160k299737j227396J220832
42736b617627L027975K224755n66154k420396j548404M93522J172450O68225J121956
42727A556302K438985J750405j791762m554640l178389M13052J893682Q29493
$$ plain form
42719 -642872 -348299 728524 1497339 485565 -701480 613425 3545136 4546006 2852054
42710 2852054 1519839 2401776 3479658 2604474 903714 431101 763638 287801 -795694
42701 -795694 -1119598 -629262 -162966 525552 2007370 3048410 1723204 -1320828 -2988285
42692 -2988285 -1649920 901811 2101923 1642318 939454 830320 956212 783828 270223
42683 270223 -200406 40604 1486918 3548466 4443988 2786002 -602812 -2990858 -2310152
42674 -2310152 568832 2501559 1378478 -1404497 -2440694 -375584 2453146 3035019
42666 3035019 1370935 -86536 -27579 423493 59060 -591201 -538276 56512 642826
42657 642826 1453228 2572819 2787182 1018919 -1551858 -2499466 -1219246 572349 1445491
$$ packed form
42719f42872K94573J076823P68815j011774j187045J314905K931711J000870j693952
42710B852054j332215Q81937J077882q75184j700760m72613L32537m75837j083495
42701g95694l23904M90336M66296O88518J481818J041040j325206l044032j667457
42692b988285J338365K551731J200112m59605p02864j09134J25892j72384n13605
42683B70223m70629K41010J446314K061548Q95522j657986l388814k388046O80706
42674b310152K878984J932727j123081k782975j036197K065110K828730N81873
42666C035019j664084j457471N8957M51072l64433o50261N2925N94788N86314
42657F42826Q10402J119591K14363j768263k570777r47608J280220J791595Q73142
$$ plain form
42648 1445491 1672662 1703616 1085344 -142237 -553320 798972 2722991 3461909 3063681
42639 3063681 2846809 3314270 4010899 4644807 4761082 3169079 -269988 -2954106 -2144489
42630 -2144489 929009 2318156 968870 12260 1508836 3213127 2599256 1141005
42622 1141005 1589164 3145216 2897524 861179 -127599 763067 1242181 75085 -914398
42613 -914398 -180458 964274 708219 -421331 -809490 -308151 130604 297659 723298
42604 723298 1559728 2585447 3644610 4257956 3698513 2326842 1846549 3191637 5099473
42595 5099473 5909132 5848874 6208177 7048621 7356905 7071312 7276589 8301285 9101031
42586 9101031 8998301 8894795 9997150 11953842 13054273 12206301 10139046 8324410 7022284
$$ packed form
42648A445491K27171L0954o18272j227581m11083J352292J924019P38918l98228
42639C063681k16872M67461O96629O33908J16275j592003l439067k684118Q09617
42630b144489L073498J389147j349286r56610J496576J704291o13871j458251
42622A141005M48159J556052k47692k036345r88778Q90666M79114j167096r89483
42613i14398P33940J144732k56055j129550l88159N01339M38755J67055M25639
42604G23298Q36430J025719J059163O13346n59443j371671m80293J345088J907836
42595E099473Q09659o0258L59303Q40444L08284k85593K05277J024696P99746
42586I101031j02730j03506J102355J956692J100431q47972k067255j814636j302126
$$ plain form
42577 7022284 5179382 2558329 954329 2058237 4601103 5333809 3044939 -103731
42569 -103731 -1821052 -2415701 -3107682 -3397981 -2137227 -179993 324825 -913292 -1905644
42560 -1905644 -1288128 189753 1526090 2985589 4701845 5210340 3049762 -656549
42552 -656549 -2807125 -1805900 681329 2089298 2207577 2916019 4977444 6678469 6333257
42543 6333257 4758571 3861925 3720911 2976481 1692509 1487020 2511281 2737614 1306775
42534 1306775 308761 1531733 3366828 3181697 1360582 398816 799373 663017 -735535
42525 -735535 -1674897 -910787 352791 422116 -578851 -1343874 -1092406 167135 1970540
42516 1970540 3269813 3041071 1725979 1001575 1387031 1262877 -708437 -3300974 -4285235
$$ packed form
42577G022284j842902k621053j604000J103908K542866P32706k288870l148670
42569a03731j717321n94649o91981k90299J260754J957234N04818j238117r92352
42560a905644O17516J477881J336337J459499J716256N08495k160578l706311
42552f56549k150576J001225K487229J407969J18279P08442K061425J701025l45212
42543F333257j574686q96646j41014p44430j283972k05489J024261K26333j430839
42534A306775r98014J222972J835095j85131j821115r61766M00557j36356j398552
42525g35535r39362P64110J263578O9325j000967p65023K51468J259541J803405
42516A970540J299273k28742j315092p24404L85456j24154j971314k592537r84261
$$ plain form
42507 -4285235 -3533051 -2869410 -2994909 -2390622 -5648 2379892 1959701 -1319032 -4256984
42498 -4256984 -4088709 -1500016 912428 2188625 3387070 4756087 4682942 2358124 -259315
42489 -259315 -799100 186348 118163 -1732907 -3176165 -2253229 102755 1419954 804583
42480 804583 -212150 319931 2529949 4625222 4898189 3591555 2408774 2287975 2435970
42471 2435970 1830915 787249 391800 1089458 2478410 3833812 4260079 3185517 1363570
42462 1363570 368766 397702 -68665 -1438555 -1610961 880830 3950688 4486572 2589274
42453 2589274 767366 -94509 -1081531 -2191318 -2069780 -733669 410134 1307373 2997401
42444 2997401 4575270 3890867 1761601 1718478 4460307 6402629 5408204 4028091 4607604
$$ packed form
42507d285235P52184O63641j25499O04287K384974K385540m20191l278733k937952
42498d256984J68275K588693K412444J276197J198445J369017p3145k324818k617439
42489b59315n39785R85448o8185j851070j443258R22936K355984J317199o15371
42480H04583j016733N32081K210018K095273K72967j306634j182781j20799J47995
42471B435970o05055j043666l95449O97658J388952J355402M26267j074562j821947
42462A363570r94804K8936m66367j369890j72406K491791L069858N35884j897298
42453B589274j821908q61875r87022j109787J21538J336111J143803Q97239J690028
42444B997401J577869o84403k129266m3123K741829J942322r94425j380113N79513
$$ plain form
42435 4607604 4996525 2539223 -863592 -1775068 -977296 -1800050 -4173743 -4904594 -3304264
42426 -3304264 -2076738 -2319463 -1827340 548049 2530022 2141072 851440 909647 1777575
42417 1777575 1621404 897803 1824467 4578423 6289836 4555285 617683 -2070341 -1917639
42408 -1917639 -556285 7964 106910 1080144 2430961 2472329 1464970 1552400 3105678
42399 3105678 3780848 2364426 964008 1603415 3025232 3134261 2469224 2550339 2655670
42390 2655670 1411887 172552 1280897 3741552 4203309 2054057 125711 177317 963114
42381 963114 1245124 1534629 2005575 1610442 424996 415702 2707052 6045272 8706126
42372 8706126 9978256 9432982 7126624 4982751 5377424 7728727 9086063 8572725 8227754
$$ packed form
42435D607604L88921k457302l402815r11476P97772q22754k373693p30851J600330
42426c304264J227526k42725M92123K375389J981973l88950j289632N8207Q67928
42417A777575j56171p23601R26664K753956J711413j734551l937602k688024J52702
42408a917639J361354N64249R8946R73234J350817M1368j007359Q7430J553278
42399C105678O75170j416422j400418O39407J421817J09029o65037Q1115J05331
42390B655670j243783j239335J108345K460655M61757k149252j928346N1606P85797
42381I63114K82010K89505M70946l95133j185446r294K291350L338220K660854
42372H706126J272130n45274k306358k143873L94673K351303J357336n13338l44971
$$ plain form
42363 8227754 8887856 8925071 8294464 9781664 14012635 17037404 15834146 12872017 11834064
42354 11834064 11881120 10148461 7386619 6534627 7297586 6792840 4754340 3637983 3938714
42345 3938714 3823316 3467262 5202143 8532974 9412949 6169726 2396940 1820752 3457464
42336 3457464 4264612 3888010 3966464 4641059 4631976 3718563 2710604 1674803 282300
42327 282300 -681322 -131360 1385868 2357123 2538811 2784291 3017706 2449657 1813375
42318 1813375 3031951 5847257 6952512 4137919 -199513 -1815402 -134455 1418207
42310 1418207 682658 -309615 975028 3224476 3222435 1071925 352776 2752195 5466158
42301 5466158 5331531 3150937 1774670 1619511 839435 -816663 -1251471 545653 2731611
$$ packed form
42363H227754O60102L7215o30607J487200M230971L024769j203258k962129j037953
42354A1834064M7056j732659k761842q51992P62959n04746k038500j116357L00731
42345C938714j15398l56054J734881L330831Q79975l243223l772786n76188J636712
42336C457464Q07148l76602P8454O74595r083r13413j007959j035801j392503
42327B82300r63622N49962J517228R71255J81688K45480K33415n68049o36282
42318A813375J218576K815306J105255k814593m337432j615889J680947J552662
42310A418207p35549r92273J284643K249448k041k150510p19149K399419K713963
42301E466158j34627k180594j376267j55159p80076j656098m34808J797124K185958
$$ plain form
42292 2731611 3210266 2225364 1289973 932516 745111 700880 1128911 1851590 2377536 2677373
42282 2677373 2961864 2950347 2153970 782011 -322258 -640717 -293464 596207 2155685
42273 2155685 4096823 5386462 5202115 4000164 2956041 2326753 1207470 -677035
42265 -677035 -1892552 -1090043 721479 1266019 332260 190672 2020912 3750589 2942241
42256 2942241 513437 -424551 1091358 2703928 2065797 -299922 -2042633 -1811481 -448792
42247 -448792 91274 -1206245 -3094699 -3076985 -317576 3023833 4313938 3616340 2928105
42238 2928105 2873653 2228976 729943 20752 1023276 2419457 2940008 3298820 4239495
42229 4239495 4308291 1846029 -1651972 -2610944 125594 3861984 5532426 4926461 3752554
$$ packed form
42292B731611M78655r84902r35391l57457j87405m4231M28031P22679N25946K99837
42282B677373K84491j1517p96377j371959j104269l18459L47253Q89671J559478
42273B155685J941138J289639j84347j201951j044123o29288j119283j884505
42265f77035j215517Q02509J811522N44540r33759j41588J830240J729677q08348
42256B942241k428804r37988J515909J612570o38131k365719j742711K31152J362689
42247d48792N40066j297519j888454J7714K759409L341409J290105o97598o88235
42238B928105n4452o44677j499033p09191J002524J396181N20551L58812R40675
42229D239495O8796k462262l498001r58972K736538L736390J670442o05965j173907
$$ plain form
42220 3752554 2984261 2299593 1297806 137632 -658122 -308126 1740279 4572944 5760042
42211 5760042 3922040 1021322 416140 2486221 4113520 3258370 1891355 2575254 3969828
42202 3969828 2655096 -1283778 -3781309 -2370537 750747 2411237 2543331 2808138
42194 2808138 3440291 3743163 4074293 4988358 5671057 5516271 6016882 8484687 10918678
42185 10918678 10167905 6764241 4493569 5091105 6450575 6660197 6767090 8255906 10268260
42176 10268260 10956379 9912340 7965432 6012871 5041885 5789482 7362202 7600357 5732119
42167 5732119 3321171 1893272 1236944 811455 946886 1499055 1133452 -564853 -1751265
42158 -1751265 -638857 1968747 3800482 3818565 2782036 2145585 3113491 5439413 6604544
$$ packed form
42220C752554p68293o84668j001787j160174p95754L49996K048405K832665J187098
42211E760042j838002k900718o05182K070081J627299q55150j367015O83899J394574
42202C969828j314732l938874k497531J410772L121284J660490J32094K64807
42194B808138O32153L02872L31130R14065O82699j54786N00611K467805K433991
42185A0918678p50773l403664k270672N97536J359470K09622J06893J488816K012354
42176A0268260O88119j044039j946908j952561r70986P47597J572720K38155j868238
42167E732119k410948j427899o56328m25489J35431N52169l65603j698305j186412
42158a751265J112408K607604J831735J8083j036529o36451R67906K325922J165131
$$ plain form
42149 6604544 4115711 -534967 -2572928 -9048 3499070 3826832 1859991 1025419
42141 1025419 1605107 1184369 -451109 -795547 1010084 2631419 2011788 -89589 -1673909
42132 -1673909 -1707205 -377117 1149899 1048807 -1465326 -4678026 -6072619 -5264338 -3710703
42123 -3710703 -2075211 36985 2056318 2567083 1654152 986877 1209359 1181254 144906
42114 144906 -1224091 -2250573 -2910597 -2777502 -1246286 799410 1475986 589997 22885
42105 22885 863872 1926652 1767641 548895 -724713 -1298238 -518461 1807806 4399531
42096 4399531 5370028 4514753 3262649 2293944 1107748 44201 347419 1648569 1808867
42087 1808867 200255 -1135375 -688850 359627 422699 -177821 -553076 -890437 -1282940
$$ packed form
42149F604544k488833m650678k037961K563880L508118L27762j966841q34572
42141A025419N79688m20738j635478l44438J805631J621335o19631k101377j584320
42132a673909l3296J330088J527016j01092k514133l212700j394593Q08281J553635
42123c710703J635492K112196K019333N10765r12931o67275K22482k8105j036348
42114A44906j368997j026482o60024J33095J531216K045696O76576q85989n67112
42105B2885Q40987J062780j59011j218746j273608n73525P79777K326267K591725
42096D399531R70497q55275j252104r68705j186196j063547L03218J301150J60298
42087A808867j608612j335630M46525J048477O3072o00520l75255l37361l92503
$$ plain form
42078 -1282940 -828861 566471 1306799 533473 -409326 -452286 -688548 -1972913 -2746650
42069 -2746650 -1523148 308385 694866 383275 1455057 3583561 4569106 3891240 3096923
42060 3096923 3100230 3487895 4133329 5229949 6013983 5549175 4419074 3648946 2591647
42051 2591647 215331 -2116433 -1920891 492330 2214271 2087962 2040722 3398723 4659166
42042 4659166 4275728 3386262 3985767 5823559 6815494 5840529 3916041 2905796 3656459
42033 3656459 5143232 5419769 3897500 2287841 2363209 3404825 3418394 2424868 2411483
42024 2411483 3858232 4605337 3066320 656598 -245802 636979 1767954 2139922 2048717
42015 2048717 2066251 2273785 2392936 2257468 2279368 3204540 4757961 5047046 2710012
$$ packed form
42078a282940M54079J395332P40328p73326r42799m2960k36262j284365p73737
42069b746650J223502J831533L86481l11591J071782K128504R85545o77866p94317
42060C096923L307L87665O45434J096620P84034m64808j130101p70128j057299
42051B591647k376316k331764J95542K413221J721941j26309m7240J358001J260443
42042D659166l83438q89466N99505J837792R91935r74965j924488j010245P50663
42033C656459J486773K76537j522269j609659P5368J041616J3569r93526j3385
42024B411483J446749P47105j539017k409722r02400Q82781J130975L71968r1205
42015B048717J7534K07534J19151j35468K1900R25172J553421K89085k337034
$$ plain form
42006 2710012 -519649 -1200206 1478135 4506046 4978340 3560896 2888294 3812107 4685598
41997 4685598 3766361 1216919 -1090193 -1343195 265838 1490578 802823 -233172 876028
41988 876028 3253040 3302111 520562 -496961 3756783 9946301 11680764 7840266 3537987
41979 3537987 2918076 4533381 4906372 3672538 3077099 4062070 5138002 4732155 3057832
41970 3057832 1534252 1215390 1900188 2408924 1886385 1018711 1405095 3298310 4741805
41961 4741805 3932980 1937743 1624997 3799854 5958027 5681552 3846393 2954573 3323495
41952 3323495 3151366 2128987 2334862 4627289 6576559 5854684 3902396 3845121 5864452
41943 5864452 7266839 6697685 5606173 5363304 5442467 5097977 4666183 4365902 3707361
$$ packed form
42006B710012l229661o80557K678341L027911M72294j417444o72602R23813Q73491
41997D685598r19237k549442k307112k53002J609033J224740o87755j035995J109200
41988H76028K377012M9071k781549j017523M253744O189518J734463l840498m302279
41979C537987o19911J615305L72991j233834n95439R84971J075932m05847j674323
41970C057832j523580l18862O84798N08736n22539q67674L86384J893215J443495
41961D741805q08825j995237l12746K174857K158173k76475j835159q91820L68922
41952C323495j72129j022379K05875K292427J949270p21875j952288n7275K019331
41943E864452J402387n69154j091512k42869P9163l44490m31794l00281o58541
$$ plain form
41934 3707361 2903580 3002339 3765386 3386656 1420758 63822 1165107 3698856 5597895
41925 5597895 6383443 6531161 6100895 5727605 7007287 9718742 10581596 7563903 3888366
41916 3888366 4435366 8955997 12288669 11224900 7899969 5943119 6284506 7698533
41908 7698533 8978463 9445356 9178539 9443235 11095817 12393945 10865009 7726320 7301346
41899 7301346 10782675 13793458 12374812 8617142 7356162 9327301 11123247 10892632
41891 10892632 10393891 11276237 12548725 12730060 12163128 11961840 12281806 12788409 13651843
41882 13651843 15011794 16312762 17110708 17865766 19010542 19729138 18760548 16479004 15247488
41873 15247488 17004780 20720828 23052630 21971609 19194806 18234357 20429121 24096841
$$ packed form
41934C707361q03781R8759P63047l78730j965898j356936J101285K533749J899039
41925E597895P85548J47718m30266l73290J279682K711455Q62854l017693l675537
41916C888366N47000M520631L332672j063769l324931j956850L41387J414027
41908G698533J279930M66893k66817K64696J652582J298128j528936l138689m24974
41899G301346L481329L010783j418646l757670j260980J971139J795946k30615
41891A0892632m98741Q82346J272488J81335n66932k01288L19966N06603Q63434
41882A3651843J359951J300968P97946P55058J144776P18596r68590k281544j231516
41873A5247488J757292L716048K331802j081021k776803r60449K194764L667720
$$ plain form
41865 24096841 27441670 30496658 33584175 35843886 36881447 38392127 42059454 46766410
41857 46766410 50166372 52496455 56372306 62914924 70708584 78942264 88772350 100532142
41849 100532142 112293144 122935783 134426199 149036775 166298565 185062856 206698258
41842 206698258 233056684 262249140 289788689 313659034 334824901 352253644 360974567
41835 360974567 356927320 341480308 319401255 294185247 267188536 239749616 213747719
41828 213747719 190360627 169755545 151801910 136187625 122303605 109752384 98433684
41821 98433684 87824513 77348857 67889555 61217719 57048275 52688906 47011755 42478201
41813 42478201 40995975 40017352 36015606 30277605 27311062 28077754 28912747 27451340
$$ packed form
41865B4096841L344829L054988L087517K259711J037561J510680L667327M706956
41857D6766410L399962K330083L875851O542618P793660Q233680R830086J1759792
41849A00532142J1761002J0642639J1490416J4610576J7261790J8764291K1635402
41842B06698258K6358426K9192456K7539549K3870345K1165867J7428743Q720923
41835C60974567m047247j5447012k2079053k5216008k6996711k7438920k6001897
41828B13747719k3387092k0605082j7953635j5614285j3884020j2551221j1318700
41821I8433684j0609171j0475656r459302o671836m169444m359369n677151m533554
41813D2478201j482226r78623m001746n738001k966543P66692Q34993j461407
$$ plain form
41805 27451340 25537693 25062061 24679371 22674578 20094308 18732155 18224471 17227268 15625426
41796 15625426 13852136 11937942 10755821 11856616 14235881 13926248 9340782 4571273
41788 4571273 4341858 7805323 10694785 11658713 12470860 13357212 12646411 10728804 10074692
41779 10074692 10992522 11181356 9933629 9076098 9206621 8849317 8161929 9405721 12345400
41770 12345400 13285116 10758949 8365837 9351706 11858753 12603921 12115442 12697530 13716163
41761 13716163 12876297 10499253 8729797 7755494 6510142 6065221 8350171 11929059
41753 11929059 12949803 10507066 7639724 6696217 7020374 7658854 8907643 10250470
41745 10250470 10061626 8721238 9071305 12195645 15439662 16336680 15904399 16066525 16366402
$$ packed form
41805B7451340j913647m75632l82690k004793k580270j362153n07684r97203j601842
41796A5625426j773290j914194j182121J100795K379265l09633m585466m769509
41788D571273k29415L463465K889462R63928Q12147Q86352p10801j917607o54112
41779A0074692R17830J88834j247727q57531J30523l57304o87388J243792K939679
41770A2345400R39716k526167k393112R85869K507047P45168m88479N82088J018633
41761A3716163q39866k377044j769456r74303j245352m44921K284950L578888
41753A1929059J020744k442737k867342r43507L24157O38480J248789J342827
41745A0250470j88844j340388L50067L124340L244017Q97018m32281J62126K99877
$$ plain form
41736 16366402 15808940 15817441 18229416 21622355 22766046 21203315 19582036 19628906 20477366
41727 20477366 21163877 22155118 23637724 24510978 24206665 23827128 24304243 24784667 24053640
41718 24053640 22452529 21096594 20042214 18595010 16881983 15719679 15131999 14286808
41710 14286808 12911859 11570318 10364821 8610851 6307746 4813887 5172605 6504764
41702 6504764 7056597 6436530 5855025 6337242 7608399 8748757 9152385 8716852 7713292
41693 7713292 6586123 5463964 4046682 2474163 1782198 2516491 3396031 2807653 1380747
41684 1380747 1251221 2659032 3455688 2677621 2268161 3846309 5944418 6468375 6050133
41675 6050133 6454854 7100254 6124389 4125697 3692641 5274343 6457725 5719110 4212876
$$ packed form
41736A6366402n57462Q501K411975L392939J143691j562731j621279M6870Q48460
41727B0477366O86511R91241J482606Q73254l04313l79537M77115M80424p31027
41718B4053640j601111j355935j054380j447204j713027j162304n87680q45191
41710A4286808j374949j341541j205497j753970k303105j493859L58718J332159
41702F504764N51833o20067n81505M82217J271157J140358M03628m35533j003560
41693G713292j127169j122159j417282j572519o91965P34293Q79540n88378j426906
41684A380747j29526J407811P96656p78067m09460J578148K098109N23957m18242
41675F050133M04721O45400r75865j998692m33056J581702J183382p38615j506234
$$ plain form
41666 4212876 3263588 2644241 2120018 2265206 2833221 2660311 2137323 3292025 6211898
41657 6211898 7964860 6685523 4268621 3129994 2776099 1916764 1590721 3212739 5357648
41648 5357648 5737304 5022633 5332077 5993798 4599406 1866665 1427353 4221135 6835807
41639 6835807 6709799 5714033 6690992 9083230 10316470 9767299 9062247 9397941 10450892
41630 10450892 11408487 11642095 10746682 9019098 7567122 7141725 7278249 7234559 7214108
41621 7214108 7940262 9479369 11153524 12295610 12620122 12203759 11513029 11188950 11565575
41612 11565575 12572734 13974684 15318480 16002273 16068812 16518740 17972582 19549513 20180873
41603 20180873 20322116 20766367 20514456 18181889 15267241 15134368 18137472 20616485 20012587
$$ packed form
41666D212876r49288o19347n24223J45188N68015j72910n22988J154702K919873
41657F211898J752962j279337k416902j138627l53895q59335l26043J622018K144909
41648E357648L79656p14671L09444O61721j394392k732741m39312K793782K614672
41639F835807j26008r95766R76959K392238J233240n49171p05052L35694J052951
41630A0450892R57595K33608q95413j727584j451976m25397J36524m3690k0451
41621G214108P26154J539107J674155J142086L24512m16363o90730l24079L76625
41612A1565575J007159J401950J343796O83793O6539M49928J453842J576931O31360
41603B0180873J41243M44251k51911k332567k914648j32873L003104K479013o03898
$$ plain form
41594 20012587 18320569 18613369 20460777 21159089 19809430 17692407 15771691 14233817
41586 14233817 13682271 14478087 15396992 15000892 13915840 13835838 14740075 15083903 14372194
41577 14372194 13492028 12710326 11429796 9928047 9283583 9351879 8741846 7180924 6122628
41568 6122628 6526396 7687860 8829520 10260468 12167652 13565257 13392695 11906987
41560 11906987 10375431 9872875 10522352 11376524 11232909 10215881 9972952 11299954 12427379
41551 12427379 11269931 8621363 7011670 6898118 6559797 5714238 6267714 8728259 10740219
41542 10740219 10594068 9733835 10046159 10824050 10513898 9754606 10327139 12153700 13562473
41533 13562473 13941679 14197187 14864391 15354829 15008820 13886905 12801812 13112912 15542599
$$ packed form
41594B0012587j692018K92800J847408O98312j349659k117023j920716j537874
41586A4233817n51546P95816R18905l96100j085052q0002R04237L43828p11709
41577A4372194q80166p81702j280530j501749o44464O8296o10033j560922j058296
41568F122628M03768J161464J141660J430948J907184J397605j72562j485708
41560A1906987j531556n02556O49477Q54172j43615j017028k42929J327002J127425
41551A2427379j157448k648568j609693j13552l38321q45559N53476K460545K011960
41542A0740219j46151q60233L12324P77891l10152p59292N72533J826561J408773
41533A3562473L79206K55508O67204M90438l46009j121915j085093L11100K429687
$$ plain form
41524 15542599 18528378 19234269 17331163 16011984 17519914 19539735 18633900 15773915
41516 15773915 15021746 17256586 19014805 18235496 17641721 20683558 26769892 32661607
41508 32661607 36719515 39536450 41686787 43277507 45212560 48696758 53344811 57468098
41500 57468098 60631691 64629749 71357019 80628603 90754162 100741258 111340782 124100828
41492 124100828 139773335 157694751 176714315 196762791 219178889 244864759 271968560
41485 271968560 295973739 312587458 320315963 319874030 311710026 295410846 271873969
41478 271873969 244806660 218760515 195871519 175448773 156504288 139352055 124409163
41471 124409163 110818991 97423201 84534921 73647524 65454891 58995141 52910532
$$ packed form
41524A5542599K985779P05891j903106j319179J507930K019821r05835k859985
41516A5773915p52169K234840J758219p79309n93775L041837O086334N891715
41508C2661607M057908K816935K150337J590720J935053L484198M648053M123287
41500E7468098L163593L998058O727270R271584J0125559R987096J0599524J2760046
41492A24100828J5672507J7921416J9019564K0048476K2416098K5685870K7103801
41485B71968560K4005179J6613719P728505m41933q164004j6299180k3536877
41478B71873969k7067309k6046145k2888996k0422746j8944485j7152233j4942892
41471A24409163j3590172j3395790j2888280j0887397q192633o459750o084609
$$ plain form
41464 52910532 46947741 41867754 38161028 35298022 32432837 29584281 27517702 26268546
41456 26268546 24584183 21630272 18616509 17438452 17933836 17986933 16483811 14535427
41448 14535427 13290555 12256494 10699076 9076715 7858806 6456313 4815514 4542008
41440 4542008 6496936 8602477 8416446 6920967 7022737 8833080 9537274 8067655 6625555
41431 6625555 6646047 6455789 4713967 3379664 4701640 7260176 7914415 6473676 5430505
41422 5430505 5615593 5239135 3518689 2292045 2878799 3735900 2933885 1243679 784850
41413 784850 1703644 2311813 1993663 1743992 1719185 524680 -2152645 -4147024 -3615610
41404 -3615610 -1851657 -1349155 -1965044 -1403042 676227 1729713 322409 -1423561 -981385
$$ packed form
41464E2910532n962791n079987l706726k863006k865185k848556k066579j249156
41456B6268546j684363k953911l013763j178057M95384N3097j503122j948384
41448A4535427j244872j034061j557418j622361j217909j402493j640799k73506
41440D542008J954928K105541j86031j495479J01770J810343P04194j469619j442100
41431F625555K0492j90258j741822j334303J321976K558536O54239j440739j043171
41422E430505J85088l76458j720446j226644N86754Q57101q02015j690206m58829
41413G84850R18794O08169l18150k49671k4807j194505k677325j994379N31414
41404c615610J763953N02502o15889N62002K079269J053486j407304j745970M42176
$$ plain form
41395 -981385 957369 2131085 2412635 3141008 3631534 1626656 -2440864 -4739641 -2980639
41386 -2980639 321361 1408325 331022 148253 2051883 3768800 2917578 40842
41378 40842 -2330419 -2438290 -536545 1773433 2840923 2112199 506520 -504173 -351565
41369 -351565 265073 409064 -89445 -720983 -1024550 -1064954 -1344939 -2248198 -3432146 -3936929
41359 -3936929 -3175135 -1637235 -256227 694565 1502881 1987566 1457547 10070 -919142
41350 -919142 -42103 2043554 3287379 2379397 91502 -1596924 -1407576 190218 1574239
41341 1574239 1603967 734822 221244 117866 -1112804 -4200522 -7028648 -6568649 -2823379
41332 -2823379 877345 2034753 1677262 1886885 2493551 2142493 1285118 1542344 2563031
$$ packed form
41395i81385J938754J173716K81550P28373M90526k004878m067520k298777J759002
41386b980639L302000J086964j077303j82769J903630J716917q51222k876736
41378D0842k371261j07871J901745K309978J067490p28724j605679j010693J52608
41369c51565O16638J43991m98509o31538l03567m0404k79985r03259j183948n04783
41359c936929P61794J537900J381008R50792Q08316M84685n30019j447477r29212
41350i19142Q77039K085657J243825r07982k287895j688426J89348J597794J384021
41341A574239K9728q69145n13578j03378j230670l087718k828126M59999L745270
41332b823379L700724J157408l57491K09623O06666l51058q57375K57226J020687
$$ plain form
41323 2563031 2109395 -523277 -3477117 -5131258 -5668067 -5266051 -3237805 -145731 1610246
41314 1610246 1009112 161598 953375 1929105 898536 -1101731 -1411366 -184476 22903
41305 22903 -1321748 -2026786 -1170005 -573021 -1280010 -1434790 633103 3369249 4069023
41296 4069023 2645864 1380464 1624768 2482687 2594481 1878208 1213600 1085160 908212
41287 908212 -253846 -2229223 -3334891 -2049842 1052947 3760251 4476336 3252866
41279 3252866 891186 -1694410 -3179450 -2409741 30145 1858605 1456044 -446360
41271 -446360 -1880220 -1775327 -613147 343481 43175 -1542103 -3208140 -3548597 -2389060
41262 -2389060 -826297 72448 82931 -437470 -917232 -885361 -608768 -1029674 -2295690
$$ packed form
41323B563031m53636k632672k953840j654141n36809M02016K028246L092074J755977
41314A610246o01134q47514P91777R75730j030569k000267l09635J226890K07379
41305B2903j344651p05038Q56781N96984p06989j54780K067893K736146O99774
41296D069023j423159j265400K44304Q57919J11794p16273o64608j28440j76948
41287I08212j162058j975377j105668J285049L102789K707304P16085j223470
41279C252866k361680k585596j485040P69709K439886J828460m02561j902404
41271d46360j433860J04893J162180R56628l00306j585278j666037l40457J159537
41262b389060J562763Q98745J0483n20401m79762L1871K76593m20906j266016
$$ plain form
41253 -2295690 -3020287 -2119417 -623270 -201447 -677049 -854050 -1028695 -2257857 -3598818
41244 -3598818 -2970862 -835186 101770 -583618 -169233 2281348 3585047 1332216 -1804300
41235 -1804300 -1708250 1194083 2832830 1296780 -1374671 -2852710 -3161895 -3297099 -3365240
41226 -3365240 -2967009 -2281657 -2047952 -2729438 -3769058 -3787137 -2140739 -151020 361170
41217 361170 -341876 -467754 178726 37535 -682267 669306 4681944 7560221 5858089
41208 5858089 1407902 -1261654 -784263 583925 950922 223759 -1442457 -3592304 -4439754
41199 -4439754 -2699360 -34769 915012 417767 805443 2236830 2419906 655892 -853308
41190 -853308 -370041 1194672 2187142 2272438 1994106 1950580 2704101 4031019 4451114 3155860
$$ packed form
41253b295690p24597R00870J496147M21823m75602j77001j74645j229162j340961
41244c598818O27956K135676R36956o85388M14385K450581J303699k252831l136516
41235a804300R6050K902333J638747j536050k671451j478039l09185j35204o8141
41226c365240L98231O85352K33705o81486j039620j8079J646398J989719N12190
41217C61170p03046j25878O46480j41191p19802J351573M012638K878277j702132
41208E858089m450187k669556M77391J368188L66997p27163j666216k149847q47450
41199d439754J740394K664591R49781m97245L87676J431387J83076j764014j509200
41190h53308M83267J564713R92470Q5296k78332m3526P53521J326918M20095j295254
$$ plain form
41180 3155860 1860979 2651707 4542778 4630910 2283563 -414774 -2052970 -2933145 -3018834
41171 -3018834 -1943480 -978392 -1704925 -2704762 -1194039 1865527 2489570 230275 -704460
41162 -704460 1424537 2588720 -172117 -3141330 -1471658 3018694 4606647 2246256
41154 2246256 266415 1148723 2451303 1544950 -628257 -1999250 -2583344 -3345566 -3712734
41145 -3712734 -2191215 1138985 4102300 4563715 2649385 567541 94259 592632 231462
41136 231462 -1134003 -1663316 -284125 1885992 3520742 4814832 6172444 6756904 5815228
41127 5815228 4218877 3163420 2375292 1168802 322364 1082769 2807154 3345069 1761755
41118 1761755 -571455 -1673147 -915059 664221 1488548 1037422 412428 784398 1480008
$$ packed form
41180C155860j294881P90728J891071Q8132k347347k698337j638196q80175q5689
41171c018834J075354R65088p26533r99837J510723L059566O24043k259295r34735
41162g04460K128997J164183k760837k969213J669672M490352J587953k360391
41154B246256j979841Q82308J302580r06353k173207j370993n84094p62222l67168
41145c712734J521519L330200K963315M61415j914330k081844m73282M98373l61170
41136B31462j365465n29313J379191K170117J634750J294090J357612N84460r41676
41127E815228j596351j055457p88128j206490q46438P60405J724385N37915j583314
41118A761755k333210j101692P58088J579280Q24327m51126o24994L71970O95610
$$ plain form
41109 1480008 832652 -1070208 -2185583 -1478727 -287522 -25968 -342054 -425830 -309423
41100 -309423 92497 1361744 3091978 4120742 5051908 7817492 11548224 12267757 8828357
41091 8828357 5685296 6739160 9652776 10026373 8219889 7447153 7586967 6317874 4814582
41082 4814582 6304864 9360145 8748331 3752377 -170020 295254 1760057 400966
41074 400966 -2094091 -2216717 -391390 721163 855851 1423064 2194044 2108108 1947390
41065 1947390 3148264 4959960 5418967 4331457 3030575 2005160 881669 -13612
41057 -13612 -83695 169206 -89893 -599092 -864781 -1515820 -3121050 -4575295 -4439145 -3097246
41047 -3097246 -1854035 -694042 1190446 3289071 4121517 3368222 2017313 745903
$$ packed form
41109A480008o47356j902860j115375P06856J191205K61554l16086q3776J16407
41100c09423M01920J269247J730234J028764R31166K765584L730732P19533l439400
41091H828357l143061J053864K913616L73597j806484p72736J39814j269093j503292
41082D814582J490282L055281o11814m995954l922397M65274J464803j359091
41074D00966k495057j22626J825327J112553J34688N67213P70980q5936j60718
41065A947390J200874J811696M59007j087510j300882j025415j123491q95281
41057a3612p0083K52901k59099n09199k65689o51039j605230j454245J36150J341899
41047c097246J243211J159993J884488K098625Q32446p53295j350909j271410
$$ plain form
41039 745903 -329035 -731113 -22574 1196314 2028183 2534756 2995287 2748957 1376349
41030 1376349 172419 507076 1405018 886105 -812090 -1700926 -1444630 -1713947 -2954237
41021 -2954237 -3390120 -1948706 107192 1340990 1840165 1775537 371006 -2318729 -4418409
41012 -4418409 -4612697 -4042100 -4206582 -4381116 -3093019 -1130169 -744255 -2153443 -3082513
41003 -3082513 -2143530 -742665 -732695 -1649850 -1635214 -320849 720267 393681 -380770
40994 -380770 -166242 910719 1622821 1670355 1875199 2332247 1935761 420251 -603757
40985 -603757 135313 1555445 1995553 1914866 2736559 3764328 2925625 564237 -392449
40976 -392449 1200524 2970434 3012486 2881588 4462782 6215164 5455425 2825116 1227548
$$ packed form
41039G45903j074938m02078P08539J218888Q31869N06573M60531k46330j372608
41030A376349j203930L34657Q97942n18913j698195q88836K56296k69317j240290
41021b954237m35883J441414K055898J233798M99175o4628j404531k689735k099680
41012d418409j94288N70597j64482j74534J288097J962850L85914j409188r29070
41003c082513R38983J400865R970r17155J4636J314365J041116l26586p74451
40994c80770K14528J076961P12102M7534K04844M57048l96486j515510j024008
40985f03757P39070J420132M40108q0687Q21693J027769q38703k361388r56686
40976c92449J592973J769910M2052j30898J581194J752382p59739k630309j597568
$$ plain form
40967 1227548 1126225 334293 -1567885 -2133450 -286792 1464818 728073 -1304828 -2054767
40958 -2054767 -1306605 -568060 -162180 553501 932487 -372734 -2714788 -3801362 -3166978
40949 -3166978 -3082807 -5035343 -7122600 -6416077 -2772363 1217172 3409050 3768146 3197263
40940 3197263 2305880 1634774 1801238 2682065 3214512 2718352 1867242 1629509 1745069
40931 1745069 1258635 395923 670454 2609804 4321281 3348021 -273394 -3703630 -4262868
40922 -4262868 -2175352 -71415 -92089 -1883632 -3414222 -3359352 -2264163 -1362069 -866205
40913 -866205 -62885 1180837 1970119 1698288 956301 588107 523886 218789 -316947 -666096
40903 -666096 -714126 -503036 100523 838253 819256 -223249 -1205793 -1405621 -1929552 -3688330
$$ packed form
40967A227548j01323p91932j902178n65565J846658J751610p36745k032901p49939
40958b054767P48162P38545M05880P15681L78986j305221k342054j086574O34384
40949c166978Q4171j952536k087257P06523L643714L989535K191878L59096n70883
40940C197263q91383o71106J66464Q80827N32447m96160q51110k37733J15560
40931A745069m86434q62712K74531J939350J711477r73260l621415l430236n59238
40922d262868K087516K103937k0674j791543j530590N4870J095189R02094M95864
40913h66205Q03320J243722P89282k71831p41987l68194o4221l05097n35736l49149
40903f66096m8030K11090O03559P37730j8997j042505r82544j99828n23931j758778
$$ plain form
40893 -3688330 -4768552 -2432273 2334418 5149971 3887472 1290078 615361 1274131
40885 1274131 879744 -485994 -736502 684330 2311079 3168396 3624123 4083238 4702330
40876 4702330 6101870 8657690 11345925 12752243 12784438 12065401 10523845 8249755 6670004
40867 6670004 6737919 6920912 5422665 3459727 3416869 4506737 3761403 1085748 -601690
40858 -601690 -644577 -1768281 -4616979 -5549087 -2398652 1349006 1474294 -833579 -1490724
40849 -1490724 41852 946460 364561 238447 1032487 584642 -1949566 -4185536 -3909422
40840 -3909422 -2127240 -1245906 -1717398 -1913864 -592095 1576416 2762457 1867454 -289726
40831 -289726 -1793401 -1743380 -1018055 -701491 -717801 -672030 -921186 -1681985 -1996390 -919510
$$ packed form
40893c688330j080222K336279M766691K815553j262499k597394o74717O58770
40885A274131l94387j365738k50508J420832J626749Q57317M55727M59115O19092
40876D702330J399540K555820K688235J406318L2195p19037j541556k274090j579751
40867F670004O7915J82993j498247j962938m2858J089868p45334k675655j687438
40858f01690m2887j123704k848698r32108L150435L747658J25288k307873o57145
40849a490724J532576R04608n81899j26114P94040m47845k534208k235970K76114
40840c909422J782182Q81334m71492j96466J321769K168511J186041q95003k157180
40831b89726j503675N0021P25325L16564j6310M5771k49156p60799l14405J076880
$$ plain form
40821 -919510 929334 2264629 2904239 3321009 3156163 1804166 100494 -176933 1498105
40812 1498105 3826042 5152707 4653160 2567857 260345 -550975 398526 1611375 2169909
40803 2169909 3050799 4768971 5370885 3004280 -707833 -2433440 -1532729 -87585 868620
40794 868620 2182070 3711441 3722674 1843300 52186 -176493 407283 733824 989510
40785 989510 1424766 1439535 795411 246632 266310 478532 702018 1109387 1242777 545960
40775 545960 -156635 326358 1168039 517231 -1099295 -1132433 856710 2388283 2120787
40766 2120787 1634044 2080097 2244924 1473337 1366535 2639456 3367316 2651362 2948324
40757 2948324 5849331 8336629 6760742 2416253 -544208 -1107202 -1423075 -2003856 -1128130
$$ packed form
40821i19510J848844J335295O39610M16770j64846j351997j703672k77427J675038
40812A498105K327937J326665m99547k085303k307512q11320R49501J212849N58534
40803B169909Q80890J718172O01914k366605l712113j725607R00711J445144R56205
40794H68620J313450J529371J1233j879374j791114k28679N83776L26541K55686
40785I89510M35256J4769o44124n48779J9678K12222K23486M07369J33390o96817
40775E45960p02595M82993Q41681o50808j616526l3138J989143J531573k67496
40766B120787m86743M46053J64827p71587j06802J272921P27860p15954K96962
40757B948324K901007K487298j575887m344489k960461n62994l15873n80781Q75726
$$ plain form
40748 -1128130 1106977 2068560 608843 -1341033 -2083696 -2438229 -3678139 -5288419 -5886661
40739 -5886661 -4974924 -3057063 -1062664 120461 537660 1382832 3174544 4290192 2921907
40730 2921907 -99 -1684454 -983260 783695 2130417 2542087 1666028 -389735 -2067242
40721 -2067242 -1929311 -1125192 -1846713 -3417250 -2913902 -148649 1293033 -607920 -2941849
40712 -2941849 -2018922 1398135 3480299 2437028 -141571 -2043866 -2310512 -936795
40704 -936795 1262183 2650292 2219473 955855 543492 1022798 1063223 310500 -59469
40695 -59469 659035 1442412 882533 -932245 -2437804 -2202463 -208622 2331990 4216933
40686 4216933 5134028 5237892 4298872 2050577 -633934 -1936227 -1037618 789933 1667096
$$ packed form
40748a128130K235107R61583j459717j949876p42663l54533j239910j610280n98242
40739e886661R11737J917861J994399J183125M17199Q45172J791712J115648j368285
40730B921907k922006j684355P01194J766955J346722M11670q76059k055763j677507
40721b067242J37931Q04119p21521j570537N03348K765253J441682j900953k333929
40712b941849R22927L417057K082164j043271k578599j902295k66646J373717
40704i36795K198978J388109m30819j263618m12363M79306M0425p52723l69969
40695e9469P18504P83377n59879j814778j505559K35341J993841K540612J884943
40686D216933R17095J03864r39020k248295k684511j302293Q98609J827551Q77163
$$ plain form
40677 1667096 1211915 577167 785773 1638758 2068937 1184129 -763166 -2191806 -1517811
40668 -1517811 913135 2840726 2653376 1294626 726707 1067980 594493 -1464384 -3600353
40659 -3600353 -4123083 -3454170 -3250811 -3854838 -3923546 -2626136 -995646 -525013 -1272638
40650 -1272638 -2176086 -2658326 -2874816 -2622154 -1246318 1064058 2900870 3112638 1990814
40641 1990814 550234 -651714 -1447774 -1546431 -818390 379147 1720623 3187673 4325873
40632 4325873 4061731 2066013 -488881 -2467870 -4205936 -6179883 -7133521 -5359912
40624 -5359912 -1630448 969740 459015 -2132503 -4509880 -5419503 -4836542 -3221760 -1424121
40615 -1424121 -528003 -1031314 -2400479 -3593831 -3779727 -2862506 -1835924 -2043763 -3255400
$$ packed form
40677A667096m55181o34748K08606Q52985M30179q84808j947295j428640O73995
40668a517811K430946J927591j87350j358750n67919L41273m73487k058877k135969
40659c600353n22730O68913K03359o04027o8708J297410J630490M70633p47625
40650a272638r03448m82240k16490K52662J375836K310376J836812K11768j121824
40641A990814j440580j201948p96060r8657P28041J197537J341476J467050J138200
40632D325873k64142j995718k554894j978989j738066j973947r53638J773609
40624e359912L729464K600188n10725k591518k377377r09623N82961J614782J797639
40615a424121Q96118n03311j369165j193352j85896R17221J026582k07839j211637
$$ plain form
40606 -3255400 -3291301 -893521 1910188 2296027 925196 1187441 4093077 6684734 6319470
40597 6319470 3879389 1447536 -630118 -2473720 -2748094 -562059 2178342 2900906
40589 2900906 1959648 1683615 2512780 2668604 1567721 1041694 2531137 4934585 6079874
40580 6079874 5127537 2938700 1018336 494726 1349210 2409183 2705347 2697850 3405458
40571 3405458 4705136 5600413 5834488 5850049 5333741 3475077 883730 -484805 12889
40562 12889 631392 -244422 -1756354 -1899044 -273063 1717184 2832222 2940925 2273259
40553 2273259 941409 -577949 -1292645 -488600 1481957 3288596 3508955 1756117 -817220
40544 -817220 -2434939 -2448640 -1908410 -2050218 -2597724 -2215982 -533991 1051710 926102
$$ packed form
40606c255400l5901K397780K803709L85839j370831K62245K905636K591657l65264
40597F319470k440081k431853k077654j843602k74374K186035K740401P22564
40589B900906r41258k76033Q29165J55824j100883n26027J489443K403448J145289
40580F079874r52337k188837j920364n23610Q54484J059973K96164p497P07608
40571C405458J299678Q95277K34075J5561n16308j858664k591347j368535M97694
40562A2889O18503q75814j511932j42690J625981J990247J115038J08703o67666
40553B273259j331850j519358p14696Q04045J970557J806639K20359j752838k573337
40544h17220j617719j3701N40230j41808n47506L81742J681991J585701j25608
$$ plain form
40535 926102 -823463 -2459959 -2429073 -815419 978933 1680736 1166805 301209 9163
40526 9163 474732 1100512 1230074 874772 549891 416829 61157 -586149 -688143 365239
40516 365239 1588572 1257011 -734528 -2457290 -2361149 -1087422 -126695 399370 1472742
40507 1472742 3231317 4540047 4415986 2880388 460923 -2139992 -3852788 -3823455 -2544380
40498 -2544380 -1541463 -1537335 -1657036 -841040 678206 1788426 1767781 681318 -855550
40489 -855550 -1744826 -862113 1753618 4489556 5660967 5237460 4511045 4403719 4882784
40480 4882784 5725378 6714140 6993988 5518032 2773986 979149 1467153 2615054 1806902
40471 1806902 -811564 -2266563 -877269 1293863 1385349 -178399 -510896 1314029 2888823
$$ packed form
40535I26102j749565j636496L0886J613654J794352P01803n13931q65596k92046
40526I163M65569O25780J29562l55302l24881j33062l55672o47306j01994J053382
40516C65239J223333l31561j991539j722762R6141J273727R60727N26065J073372
40507A472742J758575J308730j24061j535598k419465k600915j712796K9333J279075
40498b544380J002917M128j19701Q15996J519246J110220k0645j086463j536868
40489h55550q89276Q82713K615731K735938J171411m23507p26415j07326M79065
40480D882784Q42594R88762K79848j475956k744046j794837M88004J147901q08152
40471A806902k618466j454999J389294K171132R1486j563748l32497J824925J574794
$$ plain form
40462 2888823 1995415 -402720 -1755064 -1083100 727262 2616284 3784946 3309901 1164337
40453 1164337 -732224 -317158 1749911 2761964 1680034 309691 246970 638908 123082
40444 123082 -754553 -702143 5266 198918 -77543 -35715 -79159 -1167431 -2518067 -2221509
40434 -2221509 -355643 821892 431606 348867 1800592 2940616 1906782 423823 1493872
40425 1493872 4403668 5201644 2344904 -1063461 -1737839 -480441 -285263 -1903244 -3401841
40416 -3401841 -3325840 -2291229 -1510795 -1308567 -1439759 -1848805 -2625975 -3637804 -4399183
40407 -4399183 -4233042 -2874504 -1105023 -175053 -226395 -126256 510641 239422 -2064155
40398 -2064155 -4898974 -5660117 -3952928 -1567042 542992 3013271 5537656 6060410
$$ packed form
40462B888823q93408k398135j352344O71964J810362J889022J168662m75045k145564
40453A164337j896561M15066K067069J012053j081930j370343o2721L91938n15826
40444A23082q77635N2410P07409J93652k76461M1828m3444j088272j350636K96558
40434b221509J865866J177535l90286q2739J451725J140024j033834j482959J070049
40425A493872K909796P97976k856740l408365o74378J257398J95178j617981j498597
40416c401841P6001J034611P80434K02228j31192m09046p77170j011829p61379
40407d399183J66141J358538J769481R29970n1342J00139O36897k71219k303577
40398b064155k834819p61143J707189K385886K110034K470279K524385N22754
$$ plain form
40390 6060410 3786609 1106733 772070 2365959 3362004 2860857 2341565 2932734 3773087
40381 3773087 3528113 2306020 1405992 1703129 2662460 2806239 1295273 -754980 -1074240
40372 -1074240 1088605 3709287 4333903 3204533 2805339 4412977 6450640 6618251 4539331
40363 4539331 1753056 -4817 103784 1777564 3563116 3689823 1917269 247087
40355 247087 777403 2948024 4083960 2976631 1686463 2835862 5999306 8211898
40347 8211898 7741199 5729816 3918338 2566683 1515480 1538916 3007362 4530963 4930193
40338 4930193 5459228 7566096 9282965 7224971 2293278 -447936 1115666 3004612
40330 3004612 1610103 -303761 1929766 6855748 8342051 4369095 -474069 -1838142
$$ packed form
40390F060410k273801k679876l34663J593889R96045n01147n19292N91169Q40353
40381C773087k44974j222093r00028K97137R59331J43779j510966k050253l19260
40372a074240K162845K620682O24616j129370l99194J607638K037663J67611k078920
40363D539331k786275j757873J08601J673780J785552J26707j772554j670182
40355B47087N30316K170621J135936j107329j290168J149399L163444K212592
40347H211898m70699k011383j811478j351655j051203K3436J468446J523601L99230
40338D930193N29035K106868J716869k057994m931693k741214J563602J888946
40330C004612j394509j913864K233527M925982J486303l972956m843164j364073
$$ plain form
40322 -1838142 -535460 804079 1946103 3518655 4458981 3925619 3530781 4715003 5573248
40313 5573248 3409475 -578025 -2352409 -529995 2095854 2834310 2276773 2304202 3041491
40304 3041491 3224068 2429712 1652718 2036845 3638700 5174797 4974920 2830426 802328
40295 802328 1200260 3699709 5666345 5622560 4974695 5543193 6788172 6889978 5646668
40286 5646668 4501985 3970573 2965165 1180269 410543 2236904 5491010 7598163
40278 7598163 7928293 8058933 8686969 8281891 5776984 2933419 2291946 3668321 4620719
40269 4620719 4087623 3533375 4227818 5391695 5897877 6084632 6579504 6672093 5483484
40260 5483484 3926977 3810370 5305918 6782383 7019408 6212725 4759504 2472954 -489853
$$ packed form
40322a838142J302682J339539J142024J572552R40326n33362l94838J184222Q58245
40313E573248k163773l987500j774384J822414K625849P38456n57537K7429P37289
40304C041491J82577p94356p76994L84127J601855J536097j99877k144494k028098
40295H02328L97932K499449J966636m3785o47865N68498J244979J01806j243310
40286E646668j144683n31412j005408j784896p69726J826361L254106K107153
40278G598163L30130J30640O28036m05078k504907k843565o41473J376375R52398
40269D620719n33096n54248O94443J163877N06182J86755M94872R2589j188609
40260E483484j556507j16607J495548J476465K37025q06683j453221k286550k962807
$$ plain form
40251 -489853 -2898609 -3299560 -1270765 2253372 5498192 6869872 6151888 4671797 3789150
40242 3789150 3533588 3372048 3658145 5019166 6631473 6734726 5081535 3394165 2965302
40233 2965302 3253606 3485076 4159710 5893482 7880926 8714928 8035670 6427863 4449566
40224 4449566 2738658 2264562 3235784 4269450 3819445 2096467 602625 215637 725242
40215 725242 1669485 2384830 1768866 -467303 -2542348 -2188620 453745 2967486 3724805
40206 3724805 3277615 2590937 1775705 1186417 1923537 4124928 6234633 7203860 8105789
40197 8105789 10189765 12587459 13689925 13848027 14658670 16036990 16183577 14582172 12946302
40188 12946302 12507829 12136882 10296593 7615602 6135755 6585157 7620411 7663672 6597472
$$ packed form
40251d89853k408756m00951K028795L524137L244820J371680p17984j480091q82647
40242C789150k55562j61540K86097J361021J612307J03253j653191j687370m28863
40233B965302K88304K31470O74634J733772J987444Q34002o79258j607807j978297
40224D449566j710908m74096R71222J033666m50005j722978j493842l86988N09605
40215G25242R44243P15345o15964k236169k075045L53728K642365K513741P57319
40206C724805m47190o86678q15232n89288P37120K201391K109705R69227R01929
40197H105789K083976K397694J102466J58102Q10643J378320J46587j601405j635870
40188A2946302m38473l70947j840289k680991j479847M49402J035254M3261j066200
$$ plain form
40179 6597472 5499548 5229791 5516098 5320948 4045655 2254563 1017154 700089 811851
40170 811851 910301 1078623 1489348 2105262 2877630 3634332 3811896 3140167 2577290 3341158
40160 3341158 4703496 4284812 1509056 -707690 609982 4317097 6421898 5189192
40152 5189192 2821030 1828350 1955952 1709926 1029686 773674 759159 211264 -377721
40143 -377721 304087 2062154 2954285 1823301 -187969 -1233012 -839271 278270 1546188
40134 1546188 2731961 3384016 3082300 2123385 1271735 930113 1034308 1442674 1784804
40125 1784804 1304466 -189095 -1355878 -445699 2354181 4701793 4734046 3117811 1942954
40116 1942954 2356385 3971089 5872264 7254150 7481509 6450737 4747281 2892465
$$ packed form
40179F597472j097924k69757K86307j95150j275293j791092j237409l17065J11762
40170H11851R8450J68322M10725O15914P72368P56702J77564o71729n62877P63868
40160C341158J362338m18684k775756k216746J317672L707115K104801j232706
40152E189192k368162r92680J27602k46026o80240k56012j4515n47895n88985
40143c77721O81808J758067Q92131j130984k011270j045043L93741J117541J267918
40134A546188J185773O52055l01716r58915q51650l41622J04195M08366L42130
40125A784804m80338j493561j166783R10179K799880K347612L2253j616235j174857
40116A942954M13431J614704J901175J381886K27359j030772j703456j854816
$$ plain form
40108 2892465 899761 -817521 -1010403 645743 2078945 977763 -1698113 -2401741
40100 -2401741 333886 3883081 5137454 4264816 3331387 2697493 939999 -2246145 -5137087
40091 -5137087 -6084808 -5066480 -2993248 -730558 982793 1719822 1777822 1707335 1474260
40082 1474260 852742 372879 808278 1876348 2569660 2624013 2483970 2159861 1678943
40073 1678943 2265996 4799917 7058165 5481137 808292 -1148115 3251017 10007379
40065 10007379 12662860 11263528 11853737 17195864 22575473 22577067 18313721 14889586 14051116
40056 14051116 13062285 10066866 6841368 5445541 5070447 3989189 2744255 3084025
40048 3084025 4509978 4377536 1898073 -71549 1264811 4427838 5283083 2651170
$$ packed form
40108B892465j992704j717282j92882J656146J433202j101182k675876p03628
40100b401741K735627L549195J254373q72638r33429o33894j757494l186144k890942
40091e137087r47721J018328K073232K262690J713351P37029N8000p0487k33075
40082A474260o21518m79863M35399J068070O93312N4353j40043l24109m80918
40073A678943N87053K533921K258248j577028m672845j956407M399132O756362
40065A0007379K655481j399332N90209N342127N379609J594m263346l424135q38470
40056A4051116r88831k995419l225498j395827l75094j081258j244934L39770
40048C084025J425953j32442k479463j969622J336360L163027Q55245k631913
$$ plain form
40040 2651170 -9619 605815 3250465 4398071 3454859 2899703 3487497 2514342 -1770079
40031 -1770079 -6506468 -7382814 -4229214 -996534 -521185 -1644229 -1847181 -651969 602454
40022 602454 944985 557927 165410 521221 1878032 3267521 3024515 857650 -1227368
40013 -1227368 -1037585 1160150 3016451 2864393 1246319 -111935 49120 1816175 4142548
40004 4142548 5489381 5158725 4072289 3579312 3576885 2727512 642967 -1223099 -1375035
39995 -1375035 -119327 1080992 1479245 1462364 1426165 1129177 369627 -221117 425270
39986 425270 2471737 4488707 4678221 2980085 1291654 1074106 1565422 1389005 1053107
39977 1053107 2022432 3676499 3608554 1499754 262760 1974991 4780931 5685828 4599910
$$ packed form
40040B651170k660789O15434K644650J147606r43212n55156N87794r73155m284421
40031a770079m736389q76346L153600L232680M75349j123044k02952J195212J254423
40022F02454L42531l87058l92517L55811J356811J389489k43006k166865k085018
40013a227368J89783K197735J856301j52058j618074j358254J61055J767055K326373
40004D142548J346833l30656j086436m92977k427q49373k084545j866066j51936
39995a375035J255708J200319L98253j6881l6199k96988p59550n90744O46387
39986D25270K046467K016970J89514j698136j688431k17548M91316j76417l35898
39977A053107R69325J654067o7945k108800j236994J712231K805940R04897j085918
$$ plain form
39968 4599910 3296224 1902243 -619009 -3340299 -3998561 -2784614 -2409285 -3800990
39960 -3800990 -4663877 -3377842 -1563114 -1182176 -1550154 -1262169 -1031280 -2115929 -3314064
39951 -3314064 -2234316 916189 3131408 2298547 -492103 -2431074 -1761057 707294
39943 707294 2116601 310007 -3231257 -4495012 -2034324 884754 1041803 34572
39935 34572 1261769 3810335 3533695 -183241 -3253292 -3278375 -2707972 -3745153 -4185525
39926 -4185525 -1370567 2829258 4575878 3536936 2242125 1471281 -19980 -1999065
39918 -1999065 -2675455 -1994375 -1653882 -1686612 -359267 1973243 2298716 -534946 -3756672
39909 -3756672 -4772679 -4599576 -5146185 -5562206 -4067412 -1711123 -1179219 -2550388 -3148780
$$ packed form
39968D599910j303686j393981k521252k721290o58262J213947L75329j391705
39960c800990q62887J286035J814728L80938l67978K87985K30889j084649j198135
39951c314064J079748L150505K215219q32861k790650j938971O70017K468351
39943G07294J409307j806594l541264j263755K460688K919078J57049j007231
39935C4572J227197K548566k76640l716936l070051k5083N70403j037181m40372
39926d185525K814958M199825J746620j038942j294811p70844j491261j979085
39918a999065o76390O81080L40493l2730J327345K332510L25473k833662l221726
39909c756672j016007J73103n46609m16021J494794K356289N31904j371169n98392
$$ plain form
39900 -3148780 -1610408 485158 1505239 1987379 2964864 3837865 3331644 1628588 249746
39891 249746 179717 1030915 1875910 2144654 1706492 729912 -227971 -338580 790596 2407032
39881 2407032 3008001 1883757 74914 -804147 -599554 -600336 -1325119 -1483118 122636
39872 122636 2685526 4518202 5270146 5586565 5173254 3153344 417376 -464644 1404377
39863 1404377 3577187 3246640 836984 -779522 36006 2231325 3943322 4385841 3801058
39854 3801058 2833917 2375568 3062526 4400908 5053648 4429457 3383999 2956998 3119024
39845 3119024 3348012 3722750 4491042 4977579 4079441 1853503 -443479 -2036603 -3183790
39836 -3183790 -3678322 -2302718 1019170 3729075 3237446 644516 -237718 2088881 4815437
$$ packed form
39900c148780J538372K095566J020081M82140R77485Q73001n06221j703056j378842
39891B49746p0029Q51198Q44995K68744m38162r76580r57883j10609J129176J616436
39881B407032O00969j124244j808843q79061K04593p82p24783j57999J605754
39872A22636K562890J832676P51944L16419m13311k019910k735968q82020J869021
39863A404377K172810l30547k409656j616506Q15528K195319J711997M42519n84783
39854C801058r67141m58349O86958J338382O52740o24191j045458m27001J62026
39845C119024K28988L74738P68292M86537q98138k225938k296982j593124j147187
39836c183790m94532J375604L321888K709905m91629k592930q82234K326599K726556
$$ plain form
39827 4815437 4842884 2924017 2075556 3120112 3970314 2938995 688833 -1329137 -2617354
39818 -2617354 -3208805 -2877708 -1608145 -17330 1306904 2259505 2682905 2183525 881573
39809 881573 -456087 -1459893 -2521782 -3660364 -3950278 -2816508 -1136370 -174785 47633
39800 47633 405328 980798 683886 -1233464 -3781929 -4770339 -2969803 238400 1924136
39791 1924136 840026 -1022221 -1074711 347285 786986 -335796 -852021 526431 2159630
39782 2159630 2366555 2098310 2775315 3371756 2203470 318801 233291 1860608 2552929
39773 2552929 1214428 -251706 -8170 1562878 3387368 5187472 6550099 6414140
39765 6414140 4588531 2388356 957248 255912 164976 884364 1624225 872260 -1043959
$$ packed form
39827D815437K7447j918867q48461J044556Q50202j031319k250162k017970j288217
39818b617354n91451L31097J269563J590815J324234R52601M23400m99380j301952
39809H81573j337660j003806j061889j138582k89914J133770J680138R61585K22418
39800D7633L57695N75470k96912j917350k548465r88410J800536L208203J685736
39791A924136j084110j862247n2490J421996M39701j122782n16225J378452J633199
39782B159630K06925k68245O77005N96441j168286j884669q5510J627317O92321
39773B552929j338501j466134K43536J571048J824490J800104J362627j35959
39765F414140j825609k200175j431108p01336r0936P19388P39861p51965j916219
$$ plain form
39756 -1043959 -1659243 44718 1747287 1213823 -283187 -241495 924009 845349 -508699
39747 -508699 -619164 1326750 2804434 1628300 -828545 -1532862 356818 2961990 4390020
39738 4390020 4667565 4871959 5162215 4421173 2111410 -105283 171288 2727937 4349155
39729 4349155 2941650 738857 1465010 5033719 7459623 6151215 2931824 1011726
39721 1011726 1092799 1884583 2793342 4125912 5419052 5509517 4300280 3105337 2974832
39712 2974832 3570805 3967207 3936240 4123928 5174243 6768765 7564825 6429728 3855788
39703 3855788 1638170 908587 1129094 1365639 1626074 2153310 2312158 1479746 523546
39694 523546 901463 2426678 3450910 3393936 3436454 4163100 4225462 2495583 168396
$$ packed form
39756a043959o15284J703961J702569n33464j497010M1692J165504p8660j354048
39747e08699j10465J945914J477684j176134k456845p04317J889680K605172J428030
39738D390020K77545K04394K90256p41042k309763k216693K76571K556649J621218
39729D349155j407505k202793P26153L568709K425904j308408l219391j920098
39721A011726Q1073P91784R08759J332570J293140R0465j209237j194943j30505
39712B974832N95973L96402l0967J87688J050315J594522P96060j135097k573940
39703C855788k217618p29583K20507K36545K60435N27236J58848q32412r56200
39694E23546L77917J525215J024232n6974M2518P26646O2362j729879k327187
$$ plain form
39685 168396 -817824 -486457 -191994 78953 1655782 4346082 5746596 4270238 1380308
39676 1380308 -227635 396940 2205667 3767727 4024804 2465363 -2045 -1059264
39668 -1059264 534095 2855512 2875143 439243 -1556388 -1086610 821051 2360931 3379182
39659 3379182 4281474 4242366 2428884 60542 -817398 -365823 -828666 -3082178 -4997751
39650 -4997751 -4123752 -928246 1685820 1680845 -143307 -1461373 -1157401 -418978 -1064166
39641 -1064166 -3034098 -4165578 -2801738 -28012 1495490 649053 -1123013 -1837953
39633 -1837953 -1008392 522408 1711594 1802084 648406 -729986 -760119 634914 1368410
39624 1368410 -233250 -2736928 -3033000 -406755 2483755 3183089 2345188 1961159 2100319
$$ packed form
39685A68396r86220L31367K94463K70947J576829K690300J400514j476358k889930
39676A380308j607943O24575J808727J562060K57077j559441k467408j057219
39668a059264J593359K321417J9631k435900j995631M69778J907661J539880J018251
39659C379182R02292l9108j813482k368342q77940M51575m62843k253512j915573
39650d997751Q73999L195506K614066m975j824152j318066L03972P38423o45188
39641a064166j969932j131480J363840K773726J523502q46437j772066p14940
39633a837953Q29561J530800J189186R0490j153678j378392l0133J395033P33496
39624A368410j601660k503678k96072K626245K890510O99334q37901l84029J39160
$$ plain form
39615 2100319 1268152 -611940 -1693258 -996118 55231 -296760 -1856879 -3258463 -3959824
39606 -3959824 -4250366 -4022653 -2889115 -1183678 298297 1266770 1603624 608127 -1940788
39597 -1940788 -4326200 -4393199 -2647786 -1840407 -2880228 -3341391 -1292592 1480107 2133177
39588 2133177 1079512 1005438 2379521 2896047 1506567 77603 45106 70181 -1147143
39579 -1147143 -1834497 422951 4245389 5361499 2158893 -2106934 -3558834 -2224198
39571 -2224198 -962822 -1360607 -2550916 -3383380 -3719559 -3480298 -2201346 -211994 1068880
39562 1068880 881730 204103 238352 735641 829128 686229 1024723 1563685 1459968 1058977
39552 1058977 1643214 3291760 4441769 3963899 2392681 680015 -905890 -1984292
$$ packed form
39615B100319q32167j880092j081318O97140J051349l51991j560119j401584p01361
39606c959824k90542K27713J133538J705437J481975R68473L36854r95497k548915
39597a940788k385412o6999J745413Q07379j039821m61163K048799K772699O53070
39588B133177j053665p4074J374083N16526j389480j428964l2497K5075j217324
39579a147143o87354K257448L822438J116110l202606m265827j451900J334636
39571b224198J261376l97785j190309q32464l36179K39261J278952J989352J280874
39562A068880j87150o77627L4249M97289R3487j42899L38494N38962j03717m00991
39552A058977N84237J648546J150009m77870j571218j712666j585905j078402
$$ plain form
39544 -1984292 -1583919 370769 2044041 1441721 -1256702 -4078558 -5575607 -5884863 -5804652
39535 -5804652 -5721527 -5486942 -4874978 -4103058 -3828458 -4205129 -4200527 -2892273 -1393381 -1929976
39525 -1929976 -4537204 -6437665 -5738923 -3997791 -3518490 -3670943 -2111048 1267357 4002519
39516 4002519 4455575 3460215 2561580 2415230 3039691 4005434 4201112 2860463 893299
39507 893299 -117818 -17552 291910 789988 1890883 2483442 1031387 -1243084 -1162167
39498 -1162167 1638244 3628908 2508700 708497 1653806 4661398 6127635 4488250
39490 4488250 1513669 -585768 -1107884 -315113 1072566 1918943 1690870 1266493 1586099
39481 1586099 2089728 1821102 1303884 1604023 2167083 1625622 443242 497613 1850695
$$ packed form
39544a984292M00373J954688J673272o02320k698423k821856j497049l09256Q0211
39535e804652Q3125K34585O11964P71920K74600l76671M602J308254J498892n36595
39525a929976k607228j900461O98742J741132M79301j52453J559895L378405K735162
39516D002519M53056r95360q98635j46350O24461R65743J95678j340649j967164
39507H93299j011117J00266L09462M98078J100895N92559j452055k274471Q0917
39498a162167K800411J990664j120208j800203R45309L007592J466237j639385
39490D488250k974581k099437n22116P92771J387679Q46377k28073m24377L19606
39481A586099N03629k68626n17218L00139N63060n41461j182380N4371J353082
$$ plain form
39472 1850695 2212033 394552 -1676016 -1652337 -48886 564420 -1170588 -4141098 -6263397
39463 -6263397 -6260035 -4315907 -1862335 -559503 -832071 -1506953 -1334193 -588736 -584353 -1754141
39453 -1754141 -2873369 -2374351 -89052 2495893 3580619 2616597 717861 -387591
39445 -387591 90997 1391931 2090685 1546101 391897 -321749 -175253 591339 1708521
39436 1708521 2926943 3542798 2800389 1205923 552823 1726104 3116165 2437737 -211178
39427 -211178 -2548674 -3346395 -3785987 -5035238 -6125707 -5456632 -3263866 -1139512 240152
39418 240152 1412261 2406267 2230999 472379 -1600579 -2214272 -1060694 402447 702710
39409 702710 93823 10625 726121 614191 -1290018 -3076699 -2298837 -17054 252436
$$ packed form
39472A850695L61338j817481k070568K3679J603451O13306j735008k970510k122299
39463f263397L362J944128K453572J302832k72568o74882J72760P45457M383j169788
39453a754141j119228M99018K285299K584945J084726r64022j898736j105452
39445c87591M78588J300934O98754n44584j154204p13646J46496P66592J117182
39436A708521J218422O15855p42409j594466o53100J173281J390061o78428k648915
39427b11178k337496p97721m39592j249251j090469O69075K192766K124354J379664
39418B40152J172109R94006j75268j758620k072958o13693J153578J463141L00263
39409G02710o08887q3198P15496j11930j904209j786681P77862K281783K69490
$$ plain form
39400 252436 -1933520 -2661047 419947 3940454 3481054 82760 -1622006 -401976 665758
39391 665758 -48003 -491400 667177 1551012 871285 629507 2402056 3868671 2321354
39382 2321354 -487712 -743299 1331921 1727391 -1025389 -3586049 -2985304 -834526 -326682
39373 -326682 -1392955 -1499855 -16913 1043851 508248 -299937 -103434 206094 -633962
39364 -633962 -1819500 -1667973 -452955 -12911 -661037 -607727 966493 2257746 1494721
39355 1494721 -339348 -1093083 -620449 -468646 -1073420 -1288308 -526279 518943 1354704
39346 1354704 2117724 2376092 1372755 -154814 -318795 1098262 2094772 1663617 1551542
39337 1551542 3311659 5370042 5108877 2767757 1046892 1288059 2133111 2002687 1062841
$$ packed form
39400B52436k185956p27527L080994L520507m59400l398294j704766J220030J067734
39391F65758p13761m43397J158577Q83835o79727k41778J772549J466615j547317
39382B321354k809066k55587K075220L95470k752780k560660O00745K150778N07844
39373c26682j066273j06900J482942J060764n35603q08185J96503L09528q40056
39364f33962j185538J51527J215018M40044o48126N3310J574220J291253p63025
39355A494721j834069p53735M72634J51803o04774k14888P62029J045222Q35761
39346A354704P63020K58368j003337j527569j63981J417057R96510m31155j12075
39337A551542J760117K058383k61165k341120j720865K41167Q45052j30424r39846
$$ plain form
39328 1062841 275830 -83589 -265124 -251442 244400 1315568 2587998 3263001 2754393
39319 2754393 1641760 1363941 2222387 2401585 239752 -2910266 -3661979 -669455 3597919
39310 3597919 5610724 4199798 746269 -2779262 -4935796 -4870863 -2754666 -198513
39302 -198513 820936 -108551 -1483184 -1731607 -903895 -61544 552393 1795867 3932882
39293 3932882 5606981 5279632 3182355 945260 -385302 -914821 -752939 231824 1290574
39284 1290574 1030472 -474558 -1260924 -214645 1163164 1145576 603219 1452846 3194949
39275 3194949 3435542 1688309 200894 517509 1451825 1445920 1042954 1654856 3248342
39266 3248342 4669634 5288782 5024420 3584926 1056698 -1342587 -2435485 -2658029 -3281309
$$ packed form
39328A062841p87011l59419j81535J3682M95842J071168J272430O75003n08608
39319B754393j112633k77819Q58446J79198k161833l150018p51713K992524M267374
39310C597919K012805j410926l453529l525531k156534O4933K116197K556153
39302a98513J019449r29487j374633k48423Q27712Q42351O13937J243474K137015
39293C932882J674099l27349k097277k237095j330562n29519J61882R84763J058750
39284A290574k60102j505030p86366J046279J377809j7588n42357Q49627J742103
39275C194949K40593j747233j487415L16615R34316n905m02966O11902J593486
39266C248342J421292O19148k64362j439494k528228k399285j092898k22544o23280
$$ plain form
39257 -3281309 -4379298 -4791775 -3941479 -2439879 -839286 982234 2835919 3675868 2717869
39248 2717869 600913 -1051344 -995786 798120 3212232 4677611 4256852 2363450 269439
39239 269439 -1103389 -1645729 -1511074 -763601 264116 840671 434445 -806508 -2269436
39230 -2269436 -3208521 -2912125 -1302180 329878 34275 -2573769 -5333972 -5743416 -3945161
39221 -3945161 -2545292 -3368626 -5326137 -5856865 -3716496 138986 3731760 5432928
39213 5432928 4704411 2401695 260043 -584346 -538150 -578754 -704875 -210535 696673
39204 696673 766862 -417117 -1453560 -724551 1652835 4112040 5288699 4733061 2637822
39195 2637822 -134749 -2061425 -2049604 -619216 687330 1040445 801895 412543 -264978
$$ packed form
39257c281309j097989m12477Q50296J501600J600593J821520J853685Q39949r57999
39248B717869k116956j652257N5558J793906K414112J465379m20759j893402k094011
39239B69439j372828n42340J34655P47473J027717N76555m06226j240953j462928
39230b269436r39085K96396J609945J632058k95603k608044k760203m09444J798255
39221c945161J399869q23334j957511n30728K140369L855482L592774J701168
39213E432928p28517k302716k141652q44389M6196m0604j26121M94340R07208
39204F96673P0189j183979j036443P29009K377386K459205J176659n55638k095239
39195B637822k772571j926676J1821J430388J306546L53115k38550l89352o77521
$$ plain form
39186 -264978 -1294817 -2154700 -2273636 -1646755 -744991 -231790 -738110 -2260949 -3702509
$$ packed form
39186b64978j029839q59883j18936O26881R01764N13201n06320j522839j441560
$$ [...]
##END NTUPLES=NMR SPECTRUM
##END=
