##TITLE=31Pdec_IBEP3003S
 CDCl3, 104 sc
 1.4.2019
##JCAMPDX= 6.0         $$ Bruker NMR JCAMP-DX V2.0
##DATA TYPE= NMR SPECTRUM
##DATA CLASS= NTUPLES
##ORIGIN= UXNMR, Bruker Analytische Messtechnik GmbH
##OWNER= root
$$ XWIN-NMR		Version 3.5
$$ Mon Apr  1 14:13:22 2019 Russian Standard Time (UT+4h)  she@DPX200
##.OBSERVE FREQUENCY= 81.013821
##.OBSERVE NUCLEUS= ^31P
##.ACQUISITION MODE= SIMULTANEOUS
##.ACQUISITION SCHEME= undefined
##.AVERAGES= 104
##.DIGITISER RES= 17
##SPECTROMETER/DATA SYSTEM= spect
##.PULSE SEQUENCE= zgpg30
##.SOLVENT NAME= CDCl3
##.SHIFT REFERENCE= (INTERNAL, CDCl3, 0, 182.463)
##AUDIT TRAIL= $$ (NUMBER, WHEN, WHO, WHERE, WHAT)
$$ ##TITLE= Audit trail, XWIN-NMR		Version 3.5
$$ ##JCAMPDX= 5.01
$$ ##ORIGIN= Bruker BioSpin GmbH
$$ ##OWNER= she
$$ F:/spectra/data/she/nmr/P31/1/pdata/1/auditp.txt
$$ ##AUDIT TRAIL=  $$ (NUMBER, WHEN, WHO, WHERE, WHAT)
(   1,<2019-04-01 14:12:15.85 +0400>,<she>,<DPX200>,
      <continue with go, POWCHK disabled, PULCHK disabled
       configuration hash MD5:
       00 E9 B6 7A A2 85 ED C7 34 08 36 98 17 FE 4E 26
       data hash MD5: 32K
       5F 5C 90 C6 8E D6 55 8D 7A 66 60 82 B9 EB 9F 79>)
(   2,<2019-04-01 14:12:18.10 +0400>,<she>,<DPX200>,
      <Start of raw data processing
       efp BC_mod = 2 LB = 1 FT_mod = 6 PKNL = 1 PHC0 = -1815.512 PHC1 = 87.59897 SI = 64K 
       data hash MD5: 64K
       D4 47 97 6A 47 12 06 C4 99 1D 93 35 7A CA 65 AF>)
(   3,<2019-04-01 14:12:44.45 +0400>,<she>,<DPX200>,
      <pk PHC0 = 155.5867 PHC1 = -136.2 
       data hash MD5: 64K
       45 53 47 34 8C 27 8F AE CA BB 70 F6 80 E3 E3 5F>)
(   4,<2019-04-01 14:12:48.25 +0400>,<she>,<DPX200>,
      <abs ABSG = 5 
       data hash MD5: 64K
       ED A2 20 02 C0 70 17 F7 B6 05 2F C1 CB 11 57 53>)
$$ ##END=
$$ 
$$ hash MD5
$$ C3 71 A1 E1 5E 5B 79 92 31 0A BD 63 41 71 0C C7
##$RELAX= 
##$RELAX= 
##$RELAX= 
##$RELAX= 
##$RELAX= 
##$RELAX= 
##$RELAX= 
##$RELAX= 
$$ Bruker specific parameters
$$ --------------------------
##$DU= <F:/spectra>
##$EXPNO= 1
##$NAME= <P31>
##$PROCNO= 1
##$TYPE= <nmr>
##$USER= <she>
##$AMP= (0..31)
100 100 100 100 100 100 100 100 100 100 100 100 100 100 100 100 100 100 
100 100 100 100 100 100 100 100 100 100 100 100 100 100 
##$AQSEQ= 0
##$AQ_mod= 1
##$AUNM= <au_zg>
##$AUTOPOS= <>
##$BF1= 81.014009
##$BF2= 200.13
##$BF3= 200.13
##$BF4= 200.13
##$BF5= 200.13
##$BF6= 200.13
##$BF7= 200.13
##$BF8= 200.13
##$BYTORDA= 1
##$CFDGTYP= 0
##$CFRGTYP= 5
##$CHEMSTR= <none>
##$CNST= (0..31)
1 1 145 1 1 1 1 1 1 1 1 1 1 1 1 1 1 1 1 1 1 1 1 1 1 1 1 1 1 1 1 1 
##$CPDPRG= <waltz16>
##$CPDPRG1= <>
##$CPDPRG2= <waltz16>
##$CPDPRG3= <>
##$CPDPRG4= <mlev>
##$CPDPRG5= <mlev>
##$CPDPRG6= <mlev>
##$CPDPRG7= <mlev>
##$CPDPRG8= <mlev>
##$CPDPRGB= <>
##$CPDPRGT= <>
##$D= (0..31)
0 1 0 0 0 0 0 0 0 0 0 0.03 2e-05 3e-06 0 0 0 0 0 0 0 0 0 0 0 0 0 0 0 0 
0 0 
##$DATE= 1554113377
##$DBL= (0..7)
120 120 120 11 120 120 24 19 
##$DBP= (0..7)
150 150 150 150 150 150 150 150 
##$DBP07= 0
##$DBPNAM0= <>
##$DBPNAM1= <>
$$ [...]
##$SUBNAM3= <"">
##$SUBNAM4= <"">
##$SUBNAM5= <"">
##$SUBNAM6= <"">
##$SUBNAM7= <"">
##$SUBNAM8= <"">
##$SUBNAM9= <"">
##$SW= 369.568048894756
##$SWIBOX= (0..15)
0 1 3 0 0 0 0 0 0 0 0 0 0 0 0 0 
##$SW_h= 29940.119760479
##$TD= 32768
##$TD0= 1
##$TE= 0
##$TE2= 300
##$TE3= 300
##$TEG= 300
##$TL= (0..7)
0 120 53 12 22 120 120 120 
##$TP= (0..7)
150 150 150 150 150 150 150 150 
##$TP07= 0
##$TPNAME0= <>
##$TPNAME1= <>
##$TPNAME2= <>
##$TPNAME3= <>
##$TPNAME4= <>
##$TPNAME5= <>
##$TPNAME6= <>
##$TPNAME7= <>
##$TPOAL= (0..7)
0.5 0.5 0.5 0.5 0.5 0.5 0.5 0.5 
##$TPOFFS= (0..7)
0 0 0 0 0 0 0 0 
##$TUNHIN= 0
##$TUNHOUT= 0
##$TUNXOUT= 0
##$USERA1= <user>
##$USERA2= <user>
##$USERA3= <user>
##$USERA4= <user>
##$USERA5= <user>
##$V9= 5
##$VALIST= <valist>
##$VCLIST= <CCCCCCCCCCCCCCC>
##$VD= 0
##$VDLIST= <DDDDDDDDDDDDDDD>
##$VPLIST= <PPPPPPPPPPPPPPP>
##$VTLIST= <TTTTTTTTTTTTTTT>
##$WBST= 1024
##$WBSW= 4
##$XGAIN= (0..3)
0 0 0 0 
##$XL= 0
##$YL= 0
##$YMAX_a= 17236
##$YMIN_a= -8376
##$ZGOPTNS= <>
##$ZL1= 120
##$ZL2= 120
##$ZL3= 120
##$ZL4= 120
##$ABSF1= 182.463
##$ABSF2= -187.1042
##$ABSG= 5
##$ABSL= 3
##$ALPHA= 0
##$AQORDER= 0
##$ASSFAC= 0
##$ASSFACI= 0
##$ASSFACX= 0
##$ASSWID= 0
##$AUNMP= <proc_1d>
##$AZFE= 0.1
##$AZFW= 0.5
##$BCFW= 0
##$BC_mod= 2
##$BYTORDP= 0
##$COROFFS= 0
##$CY= -3
##$DATMOD= 1
##$DC= 0
##$DFILT= <>
##$DTYPP= 0
##$F1P= 0
##$F2P= 0
##$FCOR= 1
##$FTSIZE= 65536
##$FT_mod= 6
##$GAMMA= 0
##$GB= 0
##$INTBC= 1
##$INTSCL= 5.30512e-09
##$ISEN= 30
##$LB= 1
##$LEV0= 0
##$LPBIN= 0
##$MAXI= 10000
##$MC2= 0
##$MEAN= 0
##$ME_mod= 0
##$MI= 50
##$NCOEF= 0
##$NC_proc= -8
##$NLEV= 6
##$NOISF1= 182.463
##$NOISF2= 159.3651
##$NSP= 0
##$NTH_PI= 0
##$NZP= 0
##$OFFSET= 182.463
##$PC= 4
##$PHC0= -1659.925
##$PHC1= -48.60103
##$PH_mod= 1
##$PKNL= yes
##$PPARMOD= 0
##$PSCAL= 0
##$PSIGN= 0
##$REVERSE= no
##$SF= 81.0140089999434
##$SI= 65536
##$SIGF1= 159.3651
##$SIGF2= -187.1042
##$SINO= 113.3802
##$SIOLD= 16384
##$SREGLST= <1H.CDCl3>
##$SSB= 0
##$STSI= 65536
##$STSR= 0
##$SW_p= 29940.119760479
##$SYMM= 0
##$S_DEV= 0
##$TDeff= 32768
##$TDoff= 0
##$TI= <>
##$TILT= no
##$TM1= 0
##$TM2= 0
##$TOPLEV= 0
##$USERP1= <user>
##$USERP2= <user>
##$USERP3= <user>
##$USERP4= <user>
##$USERP5= <user>
##$WDW= 1
##$XDIM= 65536
##$YMAX_p= 134652040
##$YMIN_p= -394878081
$$ End of Bruker specific parameters
$$ ---------------------------------
##NTUPLES= NMR SPECTRUM
##VAR_NAME=  FREQUENCY,     SPECTRUM/REAL,   SPECTRUM/IMAG
##SYMBOL=    X,             R,               I
##VAR_TYPE=  INDEPENDENT,   DEPENDENT,       DEPENDENT
##VAR_FORM=  AFFN,          ASDF,            ASDF
##VAR_DIM=   65536,         65536,           65536
##UNITS=     HZ,            ARBITRARY UNITS, ARBITRARY UNITS
##FACTOR=    0.456856943014862, 1,           1
##FIRST=     14782.0589164792, 0,            0
##LAST=      -15158.0608439998, 0,           0
##MIN=       -15158.0608439998, -394878081,  0
##MAX=       14782.0589164792, 134652040,    0
$$ Real data points
##PAGE= N=1
##DATA TABLE= (X++(R..R)), XYDATA
$$ [...]
$$ plain form
4097 3560994 13689983 9048449 7461146 16926717 21851054 10371802 -3461418 1540408
4089 1540408 23296007 38275532 30194318 7275069 -9236255 -8361395 891618 2569741
4081 2569741 -5684091 -10488930 -2862059 8123021 9507692 4257512 4125236 7718716
4073 7718716 2163599 -13226552 -22252077 -16132200 -6971107 -7863511 -12632481 -7857215
4065 -7857215 4057627 8547430 2168736 -1603098 8345339 25594939 34300506 26507713
4057 26507713 7382393 -13120265 -28975780 -38661905 -41179577 -35600643 -24857403 -15730973
4049 -15730973 -11586038 -7765737 1308377 12511959 17343084 14050438 9640769 8817561
4041 8817561 7773752 1746347 -7190144 -13647166 -15580963 -13725704 -8798701 -3809367
$$ packed form
4097C560994J0128989m641534j587303R465571M924337j1479252j3833220N001826
4089A540408K1755599J4979525q081214k2919249j6511324Q74860R253013J678123
4081B569741q253832m804839P626871J0985080J384671n250180j32276L593480
4073G718716n555117j5390151r025525O119877R161093q92404m768970M775266
4065g857215J1914842M489803o378694l771834R948437J7249600Q705567p792793
4057B6507713j9125320k0502658j5855515r686125k517672N578934J0743240R126430
4049a5730973M144935L820301R074114J1203582M831125l292646m409669q23208
4041H817561j043809o027405q936491o457022j933797J855259M927003M989334
$$ plain form
4033 -3809367 -5543628 -17840724 -33962132 -40095491 -27828309 -2075872 22964184 34890644
4025 34890644 31442567 19977597 9847131 5619954 6413161 8415613 7006956 573692
4017 573692 -5166735 -1742810 8688767 10880910 -4224505 -22952958 -23488596 -4826800
4009 -4826800 12426199 14747407 9774474 7228355 2697000 -8134130 -12943841 2245486
4001 2245486 27847280 37811711 21761181 -3987471 -19275204 -21290754 -18861289 -17082137
3993 -17082137 -15550794 -15011660 -17075221 -19469352 -17887455 -12387232 -7855851 -7785935 -10289557
3984 -10289557 -10669436 -5966556 3361874 14048664 20734920 17827404 4178955 -13069645
3976 -13069645 -22488942 -19331639 -11135353 -9244655 -15694542 -22012523 -20379893 -11755373
$$ packed form
4033c809367j734261j2297096j6121408o133359J2267182K5752437K5040056J1926460
4025C4890644l448077j1464970j0130466m227177P93207K002452j408657o433264
4017E73692n740427L423925J0431577K192143j5105415j8728453n35638J8661796
4009d826800J7252999K321208m972933k546119m531355j0831130m809711J5189327
4001B245486K5601794R964431j6050530k5748652j5287733k015550K429465J779152
3993a7082137J531343N39134k063561k394131J581897N500223M531381O9916k503622
3984a0289557l79879M702880R328430J0686790O686256k907516j3648449j7248600
3976a3069645r419297L157303Q196286J890698o449887o317981J632630Q624520
$$ plain form
3968 -11755373 -2636121 2065723 1991956 864776 3875261 12326084 20956911 24118162
3960 24118162 23159100 22556277 21189124 15826019 11709620 17850357 29996300 31627421
3952 31627421 17653791 4256471 6448209 17904298 24348464 25559703 29383662 33160395
3944 33160395 28851791 20998346 20655158 24065097 17287184 2626558 -593850 13110072
3936 13110072 23889819 15656251 -648285 -5441951 2200024 10310700 15769291 23540904
3928 23540904 30902389 29150375 19199898 11871065 12671814 16864939 18950973 17159339
3920 17159339 9482727 -4369786 -16702810 -17196943 -6034219 6146288 11834649 12132620
3912 12132620 8639573 -440922 -13549369 -23459209 -25337259 -21168609 -14222818 -5489604
$$ packed form
3968a1755373R119252M701844p3767j127180L010485Q450823Q630827L161251
3960B4118162r59062o02823j367153n363105m116399O140737J2145943J631121
3952C1627421j3973630j3397320K191738J1456089O444166J211239L823959L776733
3944C3160395m308604p853445l43188L409939o777913j4660626l220408J3703922
3936A3110072J0779747q233568j6304536m793666P641975Q110676N458591P771613
3928B3540904P361485j752014r950477p328833Q00749M193125K086034j791634
3920A7159339p676612j3852513j2333024m94133J1162724J2180507N688361K97971
3912A2132620l493047r080495j3108447r909840j878050M168650O945791Q733214
$$ plain form
3904 -5489604 2782654 7028964 8130684 10824657 15660892 18206431 17161558 15241316
3896 15241316 11268346 1715478 -7909053 -5859829 6736363 13026198 4711121 -4414661
3888 -4414661 -488323 8412725 8142742 4668212 13397244 29034123 30004497 12734441
3880 12734441 -2172443 -2876398 -2792947 -14522947 -28001778 -29168512 -23673417 -24410272
3872 -24410272 -27855591 -22101531 -10291499 -6035927 -9500474 -7991725 -210370 -366676
3864 -366676 -13706467 -25402972 -22439933 -13078569 -13512898 -23874998 -29042681 -19580431
3856 -19580431 -2494621 8333248 6487456 -2244477 -5936391 2387088 17539495 26390217
3848 26390217 19977260 660818 -21575473 -36898839 -40574335 -34818523 -26990540 -22960081
$$ packed form
3904e489604Q272258M246310J101720K693973M836235K545539j044873j920242
3896A5241316l972970r552868r624531K049224J2596192O289835q315077r125782
3888d414661L926338Q901048k69983l474530Q729032J5636879R70374j7270056
3880A2734441j4906884p03955Q3451j1730000j3478831j166734N495095p36855
3872b4410272l445319N754060J1810032M255572l464547J508749P781355j56306
3864c66676j3339791j1696505K963039R361364m34329j0362100n167683R462250
3856a9580431J7085810J0827869j845792q731933l691914Q323479J5152407Q850722
3848B6390217o412957j9316442k2236291j5323366l675496N755812P827983M030459
$$ plain form
3840 -22960081 -21752650 -18962907 -13899303 -9686811 -8564179 -12040118 -22445451 -36628136
3832 -36628136 -40990090 -24131333 4751483 21880338 17130856 5431864 4652693 13110838
3824 13110838 17483037 13736411 8841055 6775592 3930399 -2949095 -12501010 -22009129
3816 -22009129 -29365256 -33008646 -33891467 -34822844 -34662349 -28096009 -15359860 -5755413
3808 -5755413 -5466897 -8683602 -8478377 -9234638 -17767317 -28027945 -27563422 -16322655 -5981685
3799 -5981685 -1393455 4122349 13604680 19378020 15491828 7295515 3818974 8073002
3791 8073002 18150969 30259976 37255209 31764416 15130195 -2388687 -12985641 -16927343
3783 -16927343 -15512450 -6900355 7326251 19307151 23675429 23072979 20817011 14932355
$$ packed form
3840b2960081J207431K789743N063604M212492J122632l475939j0405333j4182685
3832c6628136m361954J6858757K8882816J7128855m749482j1698992p79171Q458145
3824A3110838M372199l746626m895356k065463k845193o879494r551915r508119
3816b2009129p356127l643390q82821r31377J60495O566340J2736149R604447
3808e755413K88516l216705K05225p56261q532679j0260628M64523J1240767J0340970
3799e981685M588230N515804R482331N773340l886192q196313l476541M254028
3791H073002J0077967J2109007O995233n490793j6634221j7518882j0596954l941702
3783a6927343J414893Q612095J4226606J1980900M368278o02450k255968n884656
$$ plain form
3775 14932355 4689700 -3578659 -4213623 -1396907 -3655683 -11610808 -17206897 -14347553
3767 -14347553 -5913761 73171 -722307 -4123313 -1944896 7433086 15455735 14213005
3759 14213005 8144820 8789938 19678220 33415598 41868117 41168236 29530634 11353273
3751 11353273 1327353 9758338 23364526 17733156 -7647032 -25809781 -20821605 -8794620
3743 -8794620 -7619050 -7421830 7563980 24848047 19166279 -6355428 -22859363 -17792623
3735 -17792623 -7405590 -4642376 -1115576 9918479 15724086 3489468 -18604205 -33899985
3727 -33899985 -38995370 -40115058 -37953460 -29651949 -19077155 -12719966 -9486621 -4328874
3719 -4328874 2175527 6746982 11363485 18906009 24538635 21218943 11693611 5698234
$$ packed form
3775A4932355j0242655q268359o34964K816716k258776p955125n596089K859344
3767a4347553Q433792N986932p95478l401006K178417R377982Q022649j242730
3759A4213005o068185O45118J0888282J3737378Q452519o99881j1637602j8177361
3751A1353273j0025920Q430985J3606188n631370k5380188j8162749M988176J2026985
3743h794620J175570J97220J4985810J7284067n681768k5521707j6503935N066740
3735a7792623J0387033K763214L526800J1034055N805607j2234618k2093673j5295780
3727c3899985n095385j119688K161598Q301511J0574794O357189L233345N157747
3719d328874O504401M571455M616503P542524N632626l319692r525332n995377
$$ plain form
3711 5698234 6288520 7990698 8371988 11713071 18481579 20025116 10066604 -3718951
3703 -3718951 -7590387 -417095 3513186 -5757786 -17838651 -14787114 2190939 11400066
3695 11400066 380447 -15924672 -17389053 -7990620 -6410645 -14666243 -17537406 -11972209
3687 -11972209 -12822741 -23434621 -25072339 -8801148 4480880 -4516834 -20364417 -16343330
3679 -16343330 1567840 3507893 -15972876 -28994414 -17996374 -289979 2585658
3672 2585658 -3041576 1446316 15183169 20860726 11786991 -816690 -4863467 938895
3664 938895 11410640 20641047 22980278 15957979 3782902 -5899471 -8612074 -4595089
3656 -4595089 3329653 10774883 14122982 14690688 16908554 20249583 18437468 9836172
$$ packed form
3711E698234N90286J702178L81290L341083O768508J543537r958512j3785555
3703c718951l871436P173292L930281r270972j2080865L051537J6978053R209127
3695A1400066j1019619j6305119j464381R398433J579975q255598k871163N565197
3687a1972209q50532j0611880j637718J6271191J3282028q997714j5847583M021087
3679a6343330J7911170J940053j9480769j3021538J0998040J7706395K875637
3672B585658n627234M487892J3736853N677557r073735j2603681m046777N802362
3664I38895J0471745R230407K339231p022299j2175077r682373k712603M016985
3656d595089P924742P445230L348099N67706K217866L341029j812115q601296
$$ plain form
3648 9836172 2112509 1574207 3995199 2070972 -3612531 -7595614 -8012372 -4973817 3451496
3639 3451496 14778415 17468764 4236207 -13649266 -18093891 -8889198 -3217426 -9294421
3631 -9294421 -14689077 -6221024 10771696 21269455 19795715 12025393 3624753 -3404709
3623 -3404709 -6953519 -5603522 -1855426 777081 1624680 -595885 -10857602 -30656984
3615 -30656984 -50682810 -58464237 -52745113 -43638158 -39002783 -37672963 -36499529 -36261195
3607 -36261195 -37776697 -38745271 -38555105 -40805304 -45790054 -44704358 -28497806 -1737036
3599 -1737036 18874071 21800179 12253244 4110642 4057381 7902770 10306610 11614486
3591 11614486 13110131 11555834 4803187 147694 8081166 25067258 31110011 12665418
$$ packed form
3648I836172p723663n38302K420992j924227n683503l983083m16758L038555Q425313
3639C451496J1326919K690349j3232557j7885473m444625R204693N671772o076995
3631i294421n394656Q468053J6992720J0497759j473740p770322q400640p029462
3623c404709l548810J349997L748096K632507Q47599k220565j0261717j9799382
3615c0656984k0025826p781427N719124R106955M635375J329820J173434K38334
3607c6261195j515502r68574J90166k250199m984750J085696J6206552K6760770
3599a737036K0611107K926108r546935q142602n3261L845389K403840J307876
3591A1614486J495645j554297o752647m655493P933472J6986092O042753j8444593
$$ plain form
3583 12665418 -16406448 -27526922 -11842344 8438452 8127198 -10715338 -25803614
3576 -25803614 -25417635 -18744145 -16008151 -13097120 -2922993 9336245 14111913 14412223
3568 14412223 21432547 34300476 37697780 23660359 4806382 -1053233 8254218 21250464
3560 21250464 29211072 31448043 28036496 17610903 3170184 -7260334 -7892298 451612
3552 451612 12506843 21181395 20350438 11051219 3404136 5763951 12927747 12192525 466590
3543 466590 -12443377 -17356373 -13861681 -4770839 7243514 15490850 13075549 5353819
3535 5353819 7546204 23569604 37946425 36859172 26604759 20570828 18036160 10206596
3527 10206596 206749 200808 10568828 17599169 13222061 4055672 -757512 1442467
$$ packed form
3583A2665418k9071866j1120474J5684578K0280796l11254j8842536j5088276
3576b5803614L85979O673490K735994K911031J0174127J2259238M775668L00310
3568A4412223P020324J2867929L397304j4037421j8853977n859615R307451J2996246
3560B1250464P960608K236971l411547j0425593j4440719j0430518o31964Q343910
3552D51612J2055231Q674552q30957r299219p647083K359815P163796p35222j1725935
3543D66590j2909967m912996L494692R090842J2014353Q247336k415301p721730
3535E353819K192385J6023400J4376821j087253j0254413o033931k534668p829564
3527A0206596r999847n941J0368020P030341m377108r166389m813184K199979
$$ plain form
3519 1442467 11323007 27762662 40576906 37046224 21597306 15805242 30336268 48452669
3511 48452669 47982818 30160046 14226285 10297517 11588515 10514538 8360482 7580121
3503 7580121 6286874 4535114 7441116 16929779 26261994 27883520 22845346 17686481
3495 17686481 14721658 10741968 4641822 734438 1914210 3243397 -2652278 -14077555
3487 -14077555 -19344576 -10218493 7164679 18800558 18054871 10092532 2980386 95450
3479 95450 1226263 5150628 8904355 8380113 1711335 -9802844 -23362156 -34051899
3471 -34051899 -34956646 -24171162 -10680697 -5759100 -8329322 -7010304 2616570 12695245
3463 12695245 17457568 21348918 26837231 25470965 11256297 -5315954 -8836080 -290844
$$ packed form
3519A442467R880540J6439655J2814244l530682j5448918n792064J4531026J8116401
3511D8452669m69851j7822772j5933761l928768J290998j073977k154056p80361
3503G580121j293247j751760K906002R488663R332215J621526n038174n158865
3495A7686481k964823l979690o100146l907384J179772J329187n895675j1425277
3487a4077555n267021R126083J7383172J1635879p45687p962339p112146k884936
3479I5450J130813L924365L753727n24242o668778j1514179j3559312j0689743
3471c4051899r04747J0785484J3490465M921597k570222J319018R626874J0078675
3463A2695245M762323L891350N488313j366266j4214668j6572251l520126Q545236
$$ plain form
3455 -290844 5009698 -515334 -7439738 -3487243 11073997 24814256 27344853 18660903
3447 18660903 8656296 6915184 12092465 14619678 10648316 6799843 8558618 12731526
3439 12731526 16552157 23905042 33914859 34417031 20071713 7604880 15504781 34156953
3431 34156953 36239167 15864269 -3396788 -3006014 8324664 14591750 15614438 17531230
3423 17531230 15462975 2199064 -14382559 -18409304 -7179697 6877931 13211030 12038042
3415 12038042 8167992 5465200 7052197 13149380 18370984 16878104 9672468 1939197
3407 1939197 -5032697 -13527427 -22402972 -26749573 -24828522 -20174638 -15841712 -10702201
3399 -10702201 -3132491 4274787 6135507 941688 -4585456 -881613 12255846 22380841
$$ packed form
3455b90844N300542n525032o924404L952495J4561240J3740259K530597q683950
3447A8660903j0004607j741112N177281K527213l971362l848473J758775M172908
3439A2731526L820631P352885J0009817N02172j4345318j2466833P899901J8652172
3431C4156953K082214k0374898j9261057L90774J1330678O267086J022688J916792
3423A7531230k068255j3263911j6581623m026745J1229607J4057628O333099j172988
3415A2038042l870050k702792J586997O097183N221604j492880p205636p733271
3407A939197o971894q494730q875545m346601J921051M653884M332926N139511
3399a0702201P569710P407278J860720n193819n527144L703843J3137459J0124995
$$ plain form
3391 22380841 19027652 8796679 6942207 14825203 17700567 8010585 -2250718 -277055
3383 -277055 8073725 8862828 975157 -7269008 -15763197 -30382084 -45030495 -43254324
3375 -43254324 -22090121 -647951 2284965 -10196390 -20922492 -20412975 -12944185 -5962920
3367 -5962920 -2148619 -1125369 -2453360 -5102838 -7006535 -6914307 -5919645 -6033931 -6766408
3358 -6766408 -4144925 4377206 13840196 14743455 4871620 -5595660 -5260674 4843880
3350 4843880 13711119 14218557 8796251 2829285 -870582 -902715 2914385 7053581 6786554
3341 6786554 2662737 -60415 562028 641053 -2763286 -7476073 -10819515 -13575435 -16815458
3332 -16815458 -19006348 -19007538 -18310400 -17708382 -15235793 -10213971 -6207824 -6820725 -10608822
$$ packed form
3391B2380841l353189j0230973j854472P882996K875364r689982j0261303J973663
3383b77055Q350780P89103p887671q244165q494189j4618887j4648411J776171
3375d3254324K1164203K1442170K932916j2481355j0726102N09517P468790O981265
3367e962920L814301J023250j327991k649478j903697R2228R94662j14286p32477
3358f766408K621483Q522131R462990R03259r871835j0467280L34986J0104554
3350D843880Q867239N07438n422306n966966l699867l2133L817100M139196k67027
3341F786554m123817k723152O22443P9025l404339m712787l343442k755920l240023
3332a6815458k190890j190O97138O02018K472589N021822M006147o12901l788097
$$ plain form
3323 -10608822 -12558859 -8978497 224309 11469203 18507118 16940772 9745099 4915626
3315 4915626 5168597 3441350 -7749496 -24735668 -34363950 -26948610 -5913144 14336551
3307 14336551 19386797 6709501 -10887436 -15970175 -3436303 14701978 23275831 19900530
3299 19900530 13848388 11762239 9783654 330705 -17045208 -33382287 -38104194 -29387648
3291 -29387648 -17374122 -14969579 -23299649 -28669169 -17771019 5590655 23776534 24967727
3283 24967727 13927014 1930687 -7240944 -16194548 -23710321 -23791075 -14952024 -3882153
3275 -3882153 2268845 2501109 -1219769 -8527325 -17912582 -23494302 -20303203 -11332194
3267 -11332194 -4449866 -3123287 -4499541 -5398049 -4987360 -2281110 3136202 7886786
$$ packed form
3323a0608822j950037L580362R202806J1244894P037915j566346p195673m829473
3315D915626K52971j727247j1190846j6986172r628282P415340K1035466K0249695
3307A4336551N050246j2677296j7596937n082739J2533872J8138281Q573853l375301
3299A9900530o052142k086149j978585r452949j7375913j6337079m721907Q716546
3291b9387648J2013526K404543q330070n369520J0898150K3361674J8185879J191193
3283B4967727j1040713j1996327r171631q953604p515773q0754Q839051J1069871
3275c882153O150998K32264l720878p307556r385257n581720L191099Q971009
3267a1332194O882328J326579j376254q98508M10689K706250N417312M750584
$$ plain form
3259 7886786 8344964 7364773 10390501 14931941 13657176 9878968 17473637 38736165
3251 38736165 54936788 50722199 37635599 37487189 49225689 52029284 39877274 31010385
3243 31010385 36859471 42288613 30173778 9637717 1569465 6003111 4929475 -5580066
3235 -5580066 -7995162 7208658 23801091 22706144 9112773 2328702 6827797 9596355
3227 9596355 3590919 -2692981 -2084386 -656211 -5394817 -11082746 -9292485 -2677482
3219 -2677482 435541 413478 4118909 11718861 16972481 18562796 19454926 16344818 2985818
3210 2985818 -15231438 -23711863 -18177032 -8401896 -237487 10026423 19241578 14942327
3202 14942327 -1126135 -6809727 8536048 24333959 19356847 4380221 940590 3328747
$$ packed form
3259G886786M58178r80191L025728M541440j274765l778208P594669K1262528
3251C8736165J6200623m214589j3086600j48410J1738500K803595j2152010q866889
3243C1010385N849086N429142j2114835k0536061q068252M433646j073636j0509541
3235e580066k415096J5203820J6592433j094947j3593371o784071M499095K768558
3227I596355o005436o283900O08595J428175m738606n687929J790261O615003
3219b677482L113023k2063L705431P599952N253620J590315Q92130l110108j3359000
3210B985818j8217256q480425N534831R775136Q164409J0263910R215155m299251
3202A4942327j6068462n683592J5345775J5797911m977112j4976626l439631K388157
$$ plain form
3194 3328747 -8279653 -27136190 -27265903 -9355581 -3293470 -19062534 -29718401 -16088334
3186 -16088334 3178978 4778122 -3144998 -793803 8989661 11245806 7722558 9886431
3178 9886431 14236026 8822215 -2903016 -6939181 -2353110 -239419 -3809633 -7996482
3170 -7996482 -13352105 -21130498 -20555629 -2878738 16144055 12215416 -9829860 -20047893
3162 -20047893 -8561902 -130580 -13817588 -32765259 -30865457 -11304563 1578050
3155 1578050 -1611360 -7121840 -2464724 7712171 12349383 9442328 6059711 7955890
3147 7955890 13408113 17213492 18646267 21954809 27694355 28894944 20906719 9791067
3139 9791067 3022190 -3220817 -16472606 -31096105 -32784577 -19878789 -5922258 1249411
$$ packed form
3194C328747j1608400j8856537j29713J7910322O062111j5769064j0655867J3630067
3186a6088334J9267312J599144p923120K351195R783464K256145l523248K163873
3178I886431M349595n413811j1725231m036165M586071K113691l570214m186849
3170g996482n355623p778393N74869J7676891J9022793l928639k2045276j0218033
3162b0047893J1485991Q431322j3687008j8947671J899802J9560894J2882613
3155A578050l189410n510480M657116J0176895M637212k907055l382617J896179
3147G955890N452223L805379J432775L308542N739546J200589p988225j1115652
3139I791067o768877o243007j3251789j4623499j688472J2905788J3956531P171669
$$ plain form
3131 1249411 8057894 17872921 20296449 7107126 -12741511 -24630881 -26240259 -24126457
3123 -24126457 -19916232 -10888987 65965 5011973 268588 -10423312 -19730513 -20789638
3115 -20789638 -12567482 -3975267 -5413371 -12982628 -10925259 4783330 16978482 10899589
3107 10899589 -3681238 -6974855 2597353 10148294 9241578 8222449 12256400 15084592
3099 15084592 12253561 9547619 12484010 16733797 14891674 6615557 -2447321 -7430179
3091 -7430179 -7282891 -4753570 -4039999 -4437211 2136434 20453000 39942048 42893580
3083 42893580 26745447 8955052 5488218 12828534 17194694 14044316 9936227 9484716
3075 9484716 9890372 8032208 5463149 4557066 4720371 4736198 5600868 8601315 12338352
$$ packed form
3131A249411O808483R815027K423528j3189323j9848637j1889370j609378K113802
3123b4126457M210225R027245J0954952M946008m743385j0691900r307201j059125
3115b0789638Q222156Q592215j438104p569257K057369J5708589J2195152o078893
3107A0899589j4580827l293617R572208P550941r06716j019129M033951K828192
3099A5084592k831031k705942K936391M249787j842123q276117r062878m982858
3091g430179J47288K529321P13571l97212O573645J8316566J9489048K951532
3083D2893580j6148133j7790395l466834P340316M366160l150378m108089m51511
3075I484716M05656j858164k569059r06083J63305J5827Q64670L000447L737037
$$ plain form
3066 12338352 13797883 11721579 7246299 1276527 -6898817 -16773478 -23203426 -18965884
3058 -18965884 -3204612 13906317 18592434 7317845 -8544125 -13993930 -5737274 5865697
3050 5865697 9929937 6664502 3542623 3065133 217995 -7485205 -14099635 -13604679 -9106380
3041 -9106380 -7258340 -6616501 362018 13988007 24058994 22127894 10775572 -1713950
3033 -1713950 -9960437 -12097352 -8017112 -1094605 3235495 4440129 7915925 15810339
3025 15810339 22151752 21108318 14671727 7701480 1162861 -4393767 -4821172 1158853
3017 1158853 6651462 5291865 759212 -83577 1245522 -790657 -4106748 -2498158
3009 -2498158 1689522 -50028 -7538595 -10408100 -2729502 10357015 21427443 26322528
$$ packed form
3066A2338352J459531k076304m475280n969772q175344r874661o429948M237542
3058a8965884J5761272J7110929M686117j1274589j5861970n449805Q256656J1602971
3050E865697M064240l265435l121879m77490k847138p703200o614430M94956M498299
3041i106380J848040O41839O978519J3625989J0070987j931100j1352322j2489522
3033a713950q246487k136915M080240O922507M330100J204634L475796P894414
3025A5810339O341413j043434o436591o970247o538619n556628m27405N980025
3017A158853N492609j359597m532653q42789J329099k036179l316091J608590
3009b498158M187680j739550p488567k869505P678598J3086517J1070428M895085
$$ plain form
3001 26322528 20318152 685674 -23467394 -35145721 -28572962 -15130452 -6103949 -533924
2993 -533924 3974380 1284572 -11458185 -22219643 -18202685 -5534345 -668928 -5778879
2985 -5778879 -7999646 -2847818 -2003439 -12517969 -22475636 -17464368 -2085551 6852252
2977 6852252 4144618 1207309 7379540 17146729 20174193 16023205 11908799 10001190
2969 10001190 4832974 -6937422 -20853919 -30709773 -35189385 -35709909 -32270953 -25883762
2961 -25883762 -21866782 -24950564 -31856811 -33876601 -27452271 -18134893 -13109652 -13476181
2953 -13476181 -15437514 -16042522 -15486955 -15128731 -14815237 -12244458 -5703744 1928475 4294390
2944 4294390 -762126 -7038947 -7442697 -3303484 -659778 946441 7827812 19179513
$$ packed form
3001B6322528o004376j9632478k4153068j1678327O572759J3442510R026503N570025
2993e33924M508304k689808j2742757j0761458M016958J2668340M865417n109951
2985e778879k220767N151828Q44379j0514530r957667N011268J5378817Q937803
2977F852252k707634k937309O172231R767189L027464m150988m114406j907609
2969A0001190n168216j1770396j3916497r855854m479612n20524L438956O387191
2961b5883762M016980l083782o906247k019790O424330R317378N025241l66529
2953a3476181j961333o05008N55567L58224L13494K570779O540714P632219K365915
2944D294390n056516o276821m03750M139213K643706J606219O881371J1351701
$$ plain form
2936 19179513 23707166 14531635 1028879 -1583646 8449527 17537134 13719457 -242697
2928 -242697 -11922566 -13024884 -5715821 2366333 6123263 5522735 2318651 -3000410
2920 -3000410 -10518202 -19640372 -30015310 -41012193 -47972292 -42809112 -23638491 -1518902
2912 -1518902 9252489 7472131 5017847 9790438 16009432 14218333 4203935 -6394661
2904 -6394661 -11476911 -10597430 -8030896 -10891696 -23042971 -37163472 -38756443 -23551673
2896 -23551673 -5928560 -3594144 -17640425 -34069416 -41083415 -37068763 -24589795 -6774862
2888 -6774862 9018724 12699928 1317219 -16502314 -28962225 -31372160 -26642054 -19137590
2880 -19137590 -11399390 -5769042 -5611647 -12183831 -20273689 -20321780 -8486729 6792600
$$ packed form
2936A9179513M527653r175531j3502756k612525J0033173R087607l817677j3962154
2928b42697j1679869j102318P309063Q082154L756930o00528l204084n319061
2920c000410p517792r122170j0374938j0996883o960099N163180J9170621K2119589
2912a518902J0771391j780358k454284M772591O218994j791099j0014398j0598596
2904f394661n082250Q79481K566534k860800j2151275j4120501j592971J5204770
2896b3551673J7623113K334416j4046281j6428991p013999M014652J2478968J7814933
2888f774862J5793586L681204j1382709j7819533j2459911k409935M730106P504464
2880a9137590P738200N630348J57395o572184q089858m8091J1835051J5279329
$$ plain form
2872 6792600 12742890 6170704 -5528476 -15985037 -24671145 -30114856 -29002090 -25294281
2864 -25294281 -28293612 -35064376 -27738162 268849 27065490 27381061 6871656 -7054999
2856 -7054999 -3933070 1049723 -3384822 -8875900 -7408346 -6677721 -14408728 -23128241
2848 -23128241 -23059343 -17846589 -15240758 -13116160 -7372646 -3580729 -6903353 -9266557
2840 -9266557 -1586795 8666920 8440723 1678690 2738463 10530495 9212743 -4280011
2832 -4280011 -13288661 -7382927 2608743 3782132 -440859 -1780387 -3305391 -10769145
2824 -10769145 -17682655 -13611408 -1671468 5605231 4408915 1426058 -197663 -4437706
2816 -4437706 -12069242 -17848118 -19331915 -18998831 -16216614 -6675784 7734940 17903131
$$ packed form
2872F792600N950290o572186j1699180j0456561q686108n443711J112766L707809
2864b5294281k999331o770764P326214K8007011K6796641L15571k0509405j3926655
2856g054999L121929M982793m434545n491078J467554P30625p731007q719513
2848b3128241O8898N212754K605831K124598N743514L791917l322624k363204
2840i266557P679762J0253715k26197o762033J059773P792032j317752j3492754
2832d280011r008650N905734R991670J173389m222991j339528j525004p463754
2824a0769145o913510M071247J1939940P276699j196316k982857j623721m240043
2816d437706p631536n778876j483797L33084K782217R540830J4410724J0168191
$$ plain form
2808 17903131 20366992 22694858 30536318 36596257 29743734 10831705 -7199945 -12906020
2800 -12906020 -5617215 6034287 10534433 1518705 -15403731 -25677383 -20324345 -6201070
2792 -6201070 1926985 -2495604 -13552335 -21823373 -21916131 -12958921 1334499 12456757
2784 12456757 13165651 5945169 1109798 4636379 11608659 13464869 8251628 1546650
2776 1546650 -382001 3241985 6729229 3078306 -7708298 -16604569 -15677011 -9029354
2768 -9029354 -8107824 -16446636 -26134056 -30623499 -32676252 -35653733 -35304130 -27389706 -17335111
2759 -17335111 -13608149 -15193238 -14475453 -10435650 -9733636 -14879942 -20432660 -22677699
2751 -22677699 -24682470 -28262275 -28191799 -19595736 -6312136 3018261 3907320 -2715997
$$ packed form
2808A7903131K463861K327866P841460O059939o852523j8912029j8031650n706075
2800a2906020P288805J1651502M500146r015728j6922436j0273652N353038J4123275
2792f201070Q128055m422589j1056731q271038r2758Q957210J4293420J1122258
2784A2456757P08894p220482m835371L526581O972280J856210n213241o704978
2776A546650j928651L623986L487244l650923j0786604q896271R27558O647657
2768i029354R21530q338812r687420m489443k052753k977481L49603P914424J0054595
2759a7335111L726962j585089P17785M039803P02014n146306n552718k245039
2751b2677699k004771l579805P0476Q596063J3283600R330397Q89059o623317
$$ plain form
2743 -2715997 -14290651 -26787189 -34136075 -33296106 -28695693 -26408490 -24693064 -16341225
2735 -16341225 -1384790 9008710 5660950 -5545281 -9606693 -710378 10952370 12498223
2727 12498223 3859300 -4279199 -5520508 -4556480 -7618700 -11740147 -8685907 2320692
2719 2320692 11597443 10445093 1778405 -3842554 -956521 5631644 8191638 4651571
2711 4651571 -1940564 -8777919 -13470802 -10615866 4637359 26655658 38970706 30395376
2703 30395376 9309026 -4197550 518986 16966574 33243452 42905032 43115944 31963311
2695 31963311 13588490 -673965 -3275750 1157592 3522873 1771896 -779558 -3252930
2687 -3252930 -5596203 -3583208 5226521 13145916 10105437 -1030434 -7158426 -3518620
$$ packed form
2743b715997j1574654j2496538p348886Q39969M600413K287203J715426Q351839
2735a6341225J4956435J0393500l347760j1206231m061412Q896315J1662748J545853
2727A2498223q638923q138499j241309R64028l062220m121447L054240J1006599
2719B320692R276751j152350q666688n620959K886033O588165K559994l540067
2711D651571o592135o837355m692883K854936J5253225K2018299J2315048q575330
2703C0395376k1086350j3506576M716536J6447588J6276878R661580K10912j1152633
2695C1963311j8374821j4262455k601785M433342K365281j750977k551454k473372
2687c252930k343273K012995Q809729P919395l040479j1135871o127992L639806
$$ plain form
2679 -3518620 1220093 748501 207864 3611054 3151015 -8638294 -22861523 -22613882 -5875795
2670 -5875795 10695313 12801489 4573673 -872950 -207830 -1508315 -9348516 -17096273
2662 -17096273 -17536859 -14621571 -17298013 -24585487 -26169283 -18729325 -11511415 -10945509
2654 -10945509 -9800484 -633805 8153816 2441166 -15570295 -29131502 -29934048 -25698178
2646 -25698178 -23233321 -17988763 -6032954 5259344 6338739 -2344557 -13365111 -20771208
2638 -20771208 -21083567 -13873021 -6333379 -8842252 -20239198 -26156395 -18463472 -7299358
2630 -7299358 -5862437 -12222476 -15946162 -14743007 -13150263 -10803324 -4224519 3196775
2622 3196775 4204861 -1026439 -5337453 -4154550 2391788 12778755 22507595 25264251
$$ packed form
2679c518620M738713m71592n40637L403190m60039j1789309j4223229K47641J6738087
2670e875795J6571108K106176q227816n446623O65120j300485p840201p747757
2662a7096273m40586K915288k676442p287474j583796P439958P217910N65906
2654a0945509J145025R166679Q787621n712650j8011461j3561207q02546M235870
2646b5698178K464857N244558J1955809J1292298J079395q683296j1020554p406097
2638b0771208l12359P210546P539642k508873j1396946n917197P692923J1164114
2630g299358J436921o360039l723686J203155J592744K346939O578805P421294
2622C196775J008086n231300m311014J182903O546338J0386967R728840K756656
$$ plain form
2614 25264251 23606046 30244554 47964330 57712095 41939066 12307703 -4142812 -1811332
2606 -1811332 521332 -8296745 -18616900 -21309914 -20871080 -20841924 -15409549 -3937329
2598 -3937329 3599150 5021620 12808184 31274091 43000781 32214234 8747038 -6078295
2590 -6078295 -6777230 -2306655 2676165 8679628 10406194 1779208 -10928280 -15040490
2582 -15040490 -8795072 -1204366 2610820 4643203 5462158 3927772 3168789 5925676
2574 5925676 6261820 -3106668 -17323939 -24162900 -20294373 -12077119 -2943267 7643388
2566 7643388 14803322 11985815 4517142 5660202 17147169 26670485 27412972 26526086
2558 26526086 29507239 29534244 20145037 7759054 2245167 2457819 251594 -5752827
$$ packed form
2614B5264251j658205O638508J7719776R747765j5773029k9631363j6450515K331480
2606a811332K332664q818077j0320155k693014M38834K9156N432375J1472220
2598c937329P536479J422470P786564J8465907J1726690j0786547k3467196j4825333
2590f078295o98935M470575M982820O003463J726566q626986j2707488m112210
2582a5040490O245418P590706L815186K032383Q18955j534386p58983K756887
2574E925676L36144r368488j4217271o838961L868527Q217254R133852J0586655
2566G643388P159934k817507p468673J143060J1486967R523316P42487q86886
2558B6526086K981153K7005r389207j2385983n513887K12652k206225o004421
$$ plain form
2550 -5752827 -8456583 -2349941 10072533 21102358 24853004 23137127 23985819 30712554
2542 30712554 34458124 24721054 6320876 -3807624 1575045 11567367 14373897 12773751
2534 12773751 15518928 21800085 23724804 19795285 16682717 18238620 19645967 14536012
2526 14536012 4765870 -197802 4391323 8880473 -829801 -21588019 -33325199 -31074189
2518 -31074189 -42561431 -91082774 -147282700 -149676082 -82177389 -2787666 23542049
2511 23542049 -1609721 -27319659 -25867722 -16293265 -21575381 -35228623 -38437293 -27322134
2503 -27322134 -11402379 757059 4828211 530163 -3872995 4140048 25475955 45209866
2495 45209866 50069714 43050237 34905745 28237980 17754896 2352546 -10558780 -12838409
$$ packed form
2550e752827k703756O106642J2422474J1029825L750646j715877Q48692O726735
2542C0712554L745570r737070j8400178j0128500N382669R992322K806530j600146
2534A2773751K745177O281157J924719l929519l112568J555903J407347n109955
2526A4536012r770142m963672M589125M489150r710274k0758218j1737180K251010
2518c1074189j1487242m8521343n6199926k393382O7498693P9389723K6329715
2511B3542049k5151770k5709938J451937R574457n282116j3653242l208670J1115159
2503b7322134J5919755J2159438M071152m298048m403158Q013043K1335907J9733911
2495D5209866M859848p019477q144492o667765j0483084j5402350j2911326k279629
$$ plain form
2487 -12838409 -4425207 5709790 7182656 -1601042 -11439608 -12638295 -5221990 4461011
2479 4461011 13593365 23036580 30664926 32981867 32198791 32912829 32300862 23626097 10315753
2470 10315753 5238063 12178162 18518213 12268468 -2493840 -14087731 -19278811 -22336380
2462 -22336380 -23664384 -19191362 -9720262 -3133722 -5945398 -16238156 -25300593 -24900911
2454 -24900911 -14668682 -3491950 -770515 -4936076 -4524106 6984783 21401595 24754948
2446 24754948 13852834 381027 -1408491 10261522 22254899 20205070 5005524
2439 5005524 -8019696 -8772853 -5230417 -10186497 -21039560 -23740614 -14326625 -3998840
2431 -3998840 -2058093 -5820079 -9690824 -12282705 -11070519 -2200575 9091153 9212928
$$ packed form
2487a2838409Q413202J0134997J472866q783698r838566j198687P416305R683001
2479D461011R132354R443215P628346K316941p83076P14038o11967q674765j3310344
2470A0315753n077690O940099O340051o249745j4762308j1593891n191080l057569
2462b2336380j328004M473022R471100O586540k811676j0292758r062437L99682
2454b4900911J0232229J1176732K721435m165561M11970J1508889J4416812L353353
2446B4754948j0902114j3471807j789518J1670013J1993377k049829j5199546
2439E005524j3025220p53157L542436m956080j0853063k701054R413989J0327785
2431c998840J940747l761986l870745k591881J212186Q869944J1291728J21775
$$ plain form
2423 9212928 -6448186 -26999535 -41954833 -52133188 -58877263 -56061122 -42379605 -29501198
2415 -29501198 -26852119 -28362203 -24633733 -17375855 -10612259 327161 17047133 26554051
2407 26554051 17574544 -869584 -13330853 -20671633 -30982093 -38025816 -31200827 -19864287
2399 -19864287 -22532341 -34784073 -33866886 -15725233 -892223 572151 3135131 16347457
2391 16347457 27079918 23991340 16775434 15259388 9715055 -9152793 -27328386 -25917339
2383 -25917339 -11106462 -4742088 -12048681 -18265308 -13505808 -2956260 6543374 14010581
2375 14010581 17025896 10400355 -3800307 -13481235 -7980269 10691782 28520927 30884066
2367 30884066 17074444 3655462 5986347 16178071 11632424 -11535138 -30083117
$$ packed form
2423I212928j5661114k0551349j4955298j0178355o744075K816141J3681517J2878407
2415b9501198K649079j510084L728470P257878O763596J0939420J6719972R506918
2407B6554051q979507j8444128j2461269p340780j0310460p043723O824989J1336540
2399a9864287k668054j2251732R17187J8141653J4833010J464374K562980J3212326
2391A6347457J0732461l088578p215906j516046n544333j8867848j8175593J411047
2383b5917339J4810877O364374p306593o216627M759500J0549548R499634P467207
2375A4010581L015315o625541j4200662r680928N500966J8672051J7829145K363139
2367C0884066j3809622j3418982K330885J0191724m545647k3167562j8547979
$$ plain form
2360 -30083117 -27156681 -16286527 -16889495 -22487700 -15206915 -397192 -712844 -19815656
2352 -19815656 -37555859 -42247161 -43478333 -47913208 -45478496 -29652313 -12708311 -8317356
2344 -8317356 -12552728 -13289086 -6887771 4578058 21187108 38843585 45057855 33670971
2336 33670971 16773691 10188902 12799768 11698150 2813897 -6075878 -10304456 -13847386
2328 -13847386 -19405457 -23376005 -23079901 -21308666 -21112683 -21540865 -20143136 -15214914 -5399561
2319 -5399561 7482266 14856599 7416191 -12438639 -29615052 -31829019 -22319902 -12923338
2311 -12923338 -7924681 -1141587 11461739 23325469 25317496 18086271 10910271 9388276
2303 9388276 9749477 6134840 -1931019 -11937758 -23081816 -33638255 -37012521 -26639854
$$ packed form
2360c0083117K926436J0870154o02968n598205P280785J4809723l15652j9102812
2352a9815656j7740203m691302j231172m434875K434712J5826183J6944002M390955
2344h317356m235372p36358O401315J1465829J6609050J7656477O214270j1386884
2336C3670971j6897280o584789K610866j101618q884253q889775m228578l542930
2328a3847386n558071l970548K96104J771235J95983m28182J397729M928222R815353
2319e399561J2881827P374333p440408j9854830j7176413k213967R509117R396564
2311a2923338M998657O783094J2603326J1863730J992027p231225p176000j521995
2303I388276L61201l614637q065859j0006739j1144058j0556439l374266J0372667
$$ plain form
2295 -26639854 -4342992 20792775 41375649 55234838 61067915 56629306 42794610
2288 42794610 25111459 9830627 1620757 4739511 20302979 40190584 49791828 42037516
2280 42037516 25789411 15635561 15041048 14135723 3797490 -12505668 -22682295 -19395114
2272 -19395114 -7078959 3959207 8150014 7779101 6698467 4439619 -1346627 -8869646
2264 -8869646 -12620157 -10576399 -8124755 -12274954 -22456121 -29585829 -26026324 -14998271
2256 -14998271 -6572649 -4262198 -1139286 7741241 16013513 16807043 17036832 28279621
2248 28279621 45193062 48554100 33561568 19887313 25436425 43428144 55768284
2241 55768284 56468689 49015090 32951468 10290962 -4039699 1832210 15152424 12717529
$$ packed form
2295b6639854K2296862K5135767K0582874J3859189N833077m438609j3834696
2288D2794610j7683151j5280832q209870L118754J5563468J9887605R601244p754312
2280D2037516j6248105j0153850n94513r05325j0338233j6303158j0176627L287181
2272a9395114J2316155J1038166M190807l70913j080634k258848n786246p523019
2264h869646l750511K043758K451644m150199j0181167p129708L559505J1028053
2256a4998271Q425622K310451L122912Q880527Q272272P93530K29789J1242789
2248B8279621J6913441L361038j4992532j3674255N549112J7991719J2340140
2241E5768284P00405p453599j6063622k2660506j4330661N871909J3320214k434895
$$ plain form
2233 12717529 -5835038 -18747818 -15177096 -6408083 -2496773 38333 1885661 -5706394
2225 -5706394 -22148621 -32006794 -29188726 -27839638 -36535289 -40489229 -25946361 -5571986
2217 -5571986 441517 -4344298 -2203638 6546633 4123884 -14705823 -34046998 -39459081
2209 -39459081 -32388273 -20728688 -10300051 -8010705 -19386861 -38754274 -52527514
2202 -52527514 -55307479 -53598583 -52243890 -47450530 -36176552 -23594944 -17335775 -19552527
2194 -19552527 -25688023 -26689292 -14926105 5521573 18150876 12386625 -1037435 -3554338
2186 -3554338 6080415 13108270 10682772 6713427 6142183 3069615 -5182751 -11919624
2178 -11919624 -15260309 -22941688 -34186928 -32452341 -9793954 14232517 15365356 -1134287
$$ packed form
2233A2717529j8552567j2912780L570722Q769013L911310K535106J847328p592055
2225e706394j6442227r858173K818068J349088q695651l953940J4542868K0374375
2217e571986O013503m785815K140660Q750271k422749j8829707j9341175n412083
2209c9459081P070808J1659585J0428637K289346j1376156j9367413j3773240
2202e2527514k779965J708896J354693M793360J1273978J2581608O259169k216752
2194a9552527o135496j001269J1763187K0447678J2629303n764251j3424060k516903
2186c554338R634753P027855k425498l969345n71244l072568q252366o736873
2178a1919624l340685p681379j1245240J734587K2658387K4026471J132839j6499643
$$ plain form
2170 -1134287 -7551718 7416758 25466503 27353025 17526537 11152139 9714048 3604330
2162 3604330 -7056391 -9830264 2398 9681210 6290238 -4828989 -8695315 -2747635
2154 -2747635 1158376 -4375398 -13501535 -19359887 -22729703 -22903083 -12294265 9766924
2146 9766924 27888350 28583977 20834490 23867841 37924381 43454293 30057961 10173902
2138 10173902 -726291 -3163070 -4749785 -4054055 4877048 17657215 20668377 7181702
2130 7181702 -14041715 -27131051 -23132775 -6320995 10603833 17028571 11372973 -344653
2122 -344653 -9537751 -8247947 6612218 27099612 36943887 27772873 10220225 1616045
2114 1616045 4844959 7743689 2053620 -6940328 -11228396 -11779080 -15241557 -23320603
$$ packed form
2170a134287o417431J4968476J8049745J886522r826488o374398j438091o109718
2162C604330j0660721k773873R832662R678812l390972j1119227l866326N947680
2154b747635L906011n533774r126137n858352l369816j73380J0608818K2061189
2146I766924J8121426O95627p749487L033351J4056540N529912j3396332j9884059
2138A0173902j0900193k436779j586715O95730Q931103J2780167L011162j3486675
2130G181702k1223417j3089336L998276J6811780J6924828O424738n655598j1717626
2122c44653r193098J289804J4860165K0487394R844275r171014j7552648q604180
2114A616045L228914K898730n690069q993948m288068n50684l462477q079046
$$ plain form
2106 -23320603 -28307312 -18983880 6093323 30259452 31944874 11515317 -5493088 -1267435
2098 -1267435 10502342 8478994 -2082728 -2093076 3956078 -6070026 -29718574 -36942040
2090 -36942040 -17147352 2565374 564280 -7683098 -1720565 6671308 -4323415 -26297028
2082 -26297028 -32605788 -19609568 -7965392 -9106637 -15779664 -21837982 -27604578 -27835386
2074 -27835386 -16834961 -4488773 -5840390 -15322639 -12850531 3949960 15735336 12457743
2066 12457743 6478249 8952706 13505525 11896724 8563575 9869280 12581397 11595391
2058 11595391 7973361 3748237 172509 3983834 20618847 37786552 33939991 10013835
2050 10013835 -6318830 1433809 15264386 11676996 -3688530 -9829141 -5129292 -5238239
$$ packed form
2106b3320603m986709R323432K5077203K4166129J685422k0429557j7008405M225653
2098a267435J1769777k023348j0561722j0348O049154j0026104k3648548p223466
2090c6942040J9794688J9712726k001094q247378N962533Q391873j0994723k1973613
2082b6297028o308760J2996220J1644176j141245o673027o058318n766596k30808
2074b7835386J1000425J2346188j351617r482249K472108J6800491J1785376l277593
2066A2457743n979494K474457M552819j608801l333149J305705K712117r86006
2058A1595391l622030m225124l575728L811325J6635013J7167705l846561k3926156
2050A0013835j6332665P752639J3830577l587390j5365526o140611M699849j08947
$$ plain form
2042 -5238239 -13424034 -16785849 -11472148 -10096360 -19119235 -26148061 -18037976 277921
2034 277921 13723140 16066483 13016185 11147797 11155117 10661907 8235507 3673514 -2903553
2025 -2903553 -10518399 -16583703 -18694597 -18098866 -19000403 -21961125 -21337835 -14651733 -11112606
2016 -11112606 -21102629 -37582093 -40642637 -25004283 -9825247 -11805404 -20462861 -14655879
2008 -14655879 4346046 14552545 6328860 -4504740 -907726 13465572 24293917
2001 24293917 26258434 22878816 16022924 7150667 3414919 10540632 21436763 22473295
1993 22473295 11480335 459830 -937873 3908976 6940079 6048767 2760385 -3465155
1985 -3465155 -12007842 -17278471 -15650302 -13286880 -19435847 -32775441 -41198941 -35499626
$$ packed form
2042e238239q185795l361815N313701J375788r022875p028826Q110085J8315897
2034B77921J3445219K343343l050298j868388P320m93210k426400m561993o577067
2025b903553p614846o065304k110894N95731r01537k960722O23290O686102L539127
2016a1112606r990023j6479464l060544J5638354J5179036j980157q657457N806982
2008a4655879J9001925J0206499q223685j0833600L597014J4373298J0828345
2001B4293917J964517l379618o855892q872257l735748P125713J0896131J036532
1993B2473295j0992960j1020505j397703M846849L031103q91312l288382o225540
1985c465155q542687n270629J628169K363422o148967j3339594q423500N699315
$$ plain form
1977 -35499626 -17855351 3062005 19575909 27371982 26399941 20837154 14292580 6262262
1969 6262262 -1665514 -157149 16948508 37793203 42141210 28045662 14593967 13156676
1961 13156676 11732854 -2445802 -19906008 -23040472 -11764605 947916 9939270 16826553
1953 16826553 15721709 167467 -19251842 -24638573 -17652978 -16876744 -26975494 -30875260
1945 -30875260 -17482384 1945324 12528206 14072935 12571207 8955405 5258835 7863343
1937 7863343 15670148 18374546 14678575 17428636 31107791 40199010 32594835 19452552
1929 19452552 16528104 19361993 14592248 4578098 1252421 3698511 2094958 -1247898
1921 -1247898 4701237 17189602 20297733 9574445 -969677 460512 10081774 18766354
$$ packed form
1977c5499626J7644275K0917356J6513904P796073r72041n562787o544574q030318
1969F262262p927776J508365J7105657K0844695M348007j4095548j3451695j437291
1961A3156676j423822j4178656j7460206l134464J1275867J2712521Q991354O887283
1953A6826553j104844j5554242j9419309n386731O985595P76234j0098750l899766
1945c0875260J3392876J9427708J0582882J544729j501728l615802l696570K604508
1937G863343P806805K704398l695971K750061J3679155R091219p604175j3142283
1929A9452552k924448K833889m769745j0014150l325677K446090j603553l342856
1921a247898N949135J2488365L108131j0723288j0544122J430189R621262Q684580
$$ plain form
1913 18766354 22718035 20977997 14071985 8056768 9240632 12803282 7598323 -5581776
1905 -5581776 -11984665 -2513624 15235422 29252864 35936759 35770594 26252514 6783458
1897 6783458 -15165051 -29190876 -30698925 -22033201 -8596880 4300445 14043884 21155336
1889 21155336 25308098 23581846 16432423 10798819 10880413 10744532 4467549 -1606397 2410492
1880 2410492 13488602 20895034 24510470 32931009 44706065 48218733 41948579 38098591
1872 38098591 41913594 43571277 36684282 29285014 28285091 27103775 18310425 6652313
1864 6652313 72508 -1711769 -1260279 3157151 9947981 11420080 7276123 8690187
1856 8690187 19245573 25099232 16198793 3920001 2770864 7307464 5462515 4015291
$$ packed form
1913A8766354L951681j740038o906012o015217J183864L562650n204959j3180099
1905e581776o402889R471041J7749046J4017442O683895j66165r518080j9469056
1897F783458k1948509j4025825j508049Q665724J3436321J2897325R743439P111452
1889B1155336M152762j726252p149423n633604Q1594j35881o276983o073946M016889
1880B410492J1078110P406432L615436Q420539J1775056L512668o270154l849988
1872C8098591L815003J657683o886995p399268r99923j181316q793350j1658112
1864F652313o579805j784277M51490M417430O790830J472099m143957J414064
1856H690187J0555386N853659q900439j2278792j149137M536600j844949j447224
$$ plain form
1848 4015291 18529462 43298260 54160853 41462836 20296617 5795391 -3114985
1841 -3114985 -11019882 -14707993 -12445612 -11039309 -14846591 -17206944 -10494679 1923906
1833 1923906 9390504 4845580 -10212622 -26030692 -29713981 -17824522 -3983218 -4749295
1825 -4749295 -17679272 -24329560 -16357190 -5894035 -5921553 -13088628 -16779611 -13916914
1817 -13916914 -6479376 5665358 19662075 25334274 16329019 243803 -11300574 -17386734
1809 -17386734 -23516075 -27932746 -23360963 -10231806 2040386 6902806 5773369 1826914
1801 1826914 -3291593 -6161940 -2687372 5526864 11533326 11499820 8443117 6733023 7335460
1792 7335460 9421300 12401998 14934838 15237135 13647998 12447078 12622703 12971702 12289267
$$ packed form
1848D015291J4514171K4768798J0862593j2698017k1166219j4501226q910376
1841c114985p904897l688111K262381J406303l807282k360353O712265J2418585
1833A923906P466598m544924j5058202j5818070l683289J1889459J3841304p66077
1825d749295j2929977o650288P972370J0463155k7518p167075l690983K862697
1817a3916914P437538J2144734J3996717N672199r005255j6085216j1544377o086160
1809a7386734o129341m416671M571783J3129157J2272192M862420j129437l946455
1801A826914n118507k870347L474568Q214236O006462l3506l056703j710094O02437
1792G335460K085840K980698K532840L02297j589137j200920J75625L48999o82435
$$ plain form
1783 12289267 10364546 7429704 4632655 3731645 4150855 2547221 -1817540 -4121219
1775 -4121219 -339359 6464951 11120032 14211634 18356726 19890833 13469241 3640246
1767 3640246 978328 5371142 4919018 -4015846 -7662370 5274936 23915876 27521573
1759 27521573 12673608 -4071077 -8908865 -4288957 1096073 4270957 5841021 5257814
1751 5257814 4287241 8598531 19391596 28023780 25601686 15207999 8343113 10418791
1743 10418791 15335659 14425322 6292837 -2645210 -3969186 6282260 23166030 34562176
1735 34562176 31336753 17030901 4193244 110670 159607 -2715170 -6707216 -4451352
1727 -4451352 4623622 11627288 9499978 2657845 2174847 12954354 28006274 34809519
$$ packed form
1783A2289267j924721k934842k797049r01010M19210j603634m364761k303679
1775d121219L781860O804310M655081L091602M145092J534107o421592r828995
1767C640246k661918M392814m52124q934864l646524J2937306J8640940L605697
1759B7521573j4847965j6744685m837788M619908N385030L174884J570064n83207
1751E257814r70573M311290J0793065Q632184k422094j0393687o864886K075678
1743A0418791M916868r10337q132485q938047j323976J0251446J6883770J1396146
1735C4562176l225423j4305852j2837657m082574M8937k874777l992046K255864
1727d451352R074974P003666k127310o842133m82998J0779507J5051920O803245
$$ plain form
1719 34809519 26284659 7190552 -8300071 -7032182 11405054 32598065 39401647 27483469
1711 27483469 8016738 -4577024 -5164146 1528433 8643125 12871846 14826936 16684731
1703 16684731 18745453 17419359 9047276 -2908046 -8384337 -2108564 8473311 11230525
1695 11230525 3521830 -5877288 -7043060 3241331 20920174 35830659 36196409 20127910
1687 20127910 1635971 -3210060 4631681 11373677 12591796 17882111 30403959 35290911
1679 35290911 13931932 -42677898 -137497063 -261704081 -371339112 -394878081 -298216648
1672 -298216648 -137182180 -14480591 20517370 5993561 511886 13589673 18501502
1665 18501502 5611109 -7385281 -7950555 -3560434 -3113404 -3454006 637891 6227128
$$ packed form
1719C4809519q524860j9094107j5490623J267889J8437236K1193011O803582j1918178
1711B7483469j9466731j2593762n87122O692579P114692M228721J955090J857795
1703A6684731K060722j326094q372083j1955322n476291O275773J0581875K757214
1695A1230525p708695r399118j165772J0284391J7678843J4910485L65750j6068499
1687B0127910j8491939m846031P841741O741996J218119N290315J2521848M886952
1679C5290911k1358979n6609830r4819165j24207018j09635031k3538969R6661433
1672b98216648J61034468J22701589L4997961j4523809n481675J3077787M911829
1665A8501502j2890393j2996390n65274M390121M47030l40602M091897N589237
$$ plain form
1657 6227128 7319064 2415773 -5577630 -11115930 -7868124 4345565 15081700 13495634
1649 13495634 3176593 -1236399 6667240 17442555 20346339 17903287 20448924 30752680
1641 30752680 40502368 41543300 35836401 31707105 31740766 28532600 15314815 -2279910
1633 -2279910 -11441291 -8892976 -4427186 -5307119 -6107075 58870 8720505 11688004 11320001
1624 11320001 16216513 25997837 31221229 27039529 17193407 6001573 -3396202 -4584549
1616 -4584549 6028696 18448610 17489345 4134345 -4825159 -2209251 -617321 -9417203
1608 -9417203 -16066468 -3611002 22881462 42244912 44353284 36897343 27528910 14672962
1600 14672962 -854097 -8245887 813784 17973833 24204572 9459918 -16990439 -35785117
$$ packed form
1657F227128J091936m903291p993403n538300L247806J2213689J0736135j586066
1649A3495634j0319041m412992P903639J0775315K903784k443052K545637J0303756
1641C0752680R749688J040932n706899m129296L3661l208166j3217785j7594725
1633b279910r161381K548315M465790q79933p99956O165945Q661635K967499l68003
1624A1320001M896512R781324N223392m181700r846122j1191834r397775j188347
1616d584549J0613245J2419914r59265j3355000q959504K615908J591930q799882
1608i417203o649265J2455466K6492464J9363450K108372p455941r368433j2855948
1600A4672962j5527059p391790R059671J7160049O230739j4744654k6450357j8794678
$$ plain form
1592 -35785117 -35585667 -21982831 -9091219 -3986706 -1930471 3847793 12845272 20011111
1584 20011111 22781855 21023867 13604629 337140 -14462598 -24678309 -27117048 -20761131
1576 -20761131 -5600133 12484756 20261623 9436633 -10588966 -20703357 -13879915
1569 -13879915 -2057644 -373822 -11713722 -28248913 -40267006 -40483360 -27708276 -11429353
1561 -11429353 -6213620 -15678930 -27289216 -28533329 -22261440 -18923431 -19735655 -17741469
1553 -17741469 -12085165 -9611859 -12502260 -15411339 -16426866 -19584128 -22854296 -15529882
1545 -15529882 4706363 21884155 19684546 3499450 -6340630 -174769 12716962 19952150
1537 19952150 19544559 16577684 15263901 16261435 15586473 6846348 -7978706 -12907903
$$ packed form
1592c5785117J99450J3602836J2891612N104513K056235N778264Q997479P165839
1584B0011111K770744j757988p419238j3267489j4799738j0215711k438739O355917
1576b0761131J5160998J8084889P776867j0824990k0025599j0114391O823442
1569a3879915J1822271J683822j1339900j6535191j2018093k16354J2775084J6278923
1561a1429353N215733r465310j1610286j244113O271889L338009q12224J994186
1553a7741469N656304K473306k890401k909079j015527l157262l270168P324414
1545a5529882K0236245J7177792k199609j6185096r840080O165861J2891731P235188
1537A9952150m07591k966875j313783R97534o74962q740125j4825054m929197
$$ plain form
1529 -12907903 4394421 29712190 33135687 7754738 -18889806 -21367816 -8218898
1522 -8218898 -2797711 -6899444 -4623785 5930622 9401119 1085806 -5132601 -1837437
1514 -1837437 -266404 -8583640 -16240128 -12141835 -3209882 -505558 641130 9984799
1506 9984799 20904005 18284240 3980466 -3759017 3241517 13392633 15195659 12002342
1498 12002342 10782261 8553986 -797732 -13900290 -21172578 -18823510 -10813703 -1873940
1490 -1873940 5485318 9119337 7849216 3272809 -2508590 -9743489 -18588730 -25514772
1482 -25514772 -25688797 -18229287 -6685643 4322127 10695671 9597511 2379099 -4909999
1474 -4909999 -7988056 -9864874 -15357433 -21717882 -21267953 -13531175 -7147305 -7104846 -7703807
$$ packed form
1529a2907903J7302324K5317769L423497k5380949k6644544k478010J3148918
1522h218898N421187m101733K275659J0554407L470497q315313o218407L295164
1514a837437J571033q317236p656488M098293Q931953K704324J146688R343669
1506I984799J0919206k619765j4303774p739483P000534J0151116J803026l193317
1498A2002342j220081k228275r351718j3102558p272288K349068Q009807Q939763
1490a873940P359258L634019j270121m576407n781399p234899q845241o926042
1482b5514772j74025P459510J1543644J1007770O373544j098160p218412p289098
1474d909999l078057j876818n492559o360449M49929P736778O383870M2459n98961
$$ plain form
1465 -7703807 -3244644 1491223 -686249 -6293586 -6306407 -1446189 -709494 -4693260 -3070687
1456 -3070687 7645232 16096899 12970166 5232098 3683382 4925849 -2017504 -16697933
1448 -16697933 -28202168 -32438099 -34775178 -35404405 -26144799 -6011497 11708209 14575917
1440 14575917 5505672 -3344520 -4714982 557491 8291125 13438062 12164823 5885954
1432 5885954 150979 -2311539 -2999174 -1701607 3550074 9042864 6772305 -3303994
1424 -3303994 -11599490 -13945116 -17980208 -27823447 -33333231 -25002632 -10417223 -3254387
1416 -3254387 -2885297 741515 6710772 4285429 -5948816 -8894195 2504970 15802757
1408 15802757 17941981 14199152 17637534 26977015 27596727 13234266 -4775496 -13745351
$$ packed form
1465g703807M459163M735867k177472n607337j2821M860218P36695l983766J622573
1456c070687J0715919Q451667l126733p738068j548716J242467o943353j4680429
1448a6697933j1504235m235931k337079o29227R259606K0133302J7719706K867708
1440A4575917r070245q850192j370462N272473P733634N146937j273239o278869
1432E885954n734975k462518o87635J297567N251681N492790k270559j0076299
1424c303994q295496k345626m035092r843239n509784Q330599J4585409P162836
1416c254387L69090L626812N969257k425343j0234245k945379J1399165J3297787
1408A5802757K139224l742829L438382R339481O19712j4362461j8009762q969855
$$ plain form
1400 -13745351 -16737105 -25322524 -38521545 -39658198 -18519988 11365642 26267874 18909414
1392 18909414 1689222 -13862108 -27251397 -37271085 -35868135 -21893108 -8353311
1385 -8353311 -5145454 -4410580 5422887 20042894 26899891 24814462 21339815 16890214
1377 16890214 8032788 2362984 11511463 29483427 35919135 23767389 7684389 1372244
1369 1372244 2333748 3787451 5566099 6137736 -732895 -12034420 -12393928 3620213
1361 3620213 18343369 13656820 -2727975 -8632610 819598 8420349 821587 -14429826
1353 -14429826 -20881088 -12647958 2846239 16082845 23934988 27755304 27428537 21753384
1345 21753384 14807910 15116351 23012467 25043346 10556834 -10551724 -19184525 -13605673
$$ packed form
1400a3745351k991754q585419j3199021j136653K1138210K9885630J4902232p358460
1392A8909414j7220192j5551330j3389289j0019688J402950J3975027J3539797
1385h353311L207857P34874R833467J4620007O856997k085429l474647m449601
1377A6890214q857426n669804R148479J7971964O435708j2151746j6083000o312145
1369A372244R61504J453703J778648N71637o870631j1301525l59508J6014141
1361C620213J4723156m686549j6384795n904635R452208P600751p598762j5251413
1353a4429826o451262Q233130J5494197J3236606P852143L820316l26767n675153
1345B1753384o945474L08441P896116K030879j4486512k1108558q632801N578852
$$ plain form
1337 -13605673 -9183488 -11199029 -6355247 12564573 31494085 35506219 29898477 28123051
1329 28123051 30612897 29380727 24236909 20616914 18384410 14745386 10890237 4860881
1321 4860881 -12300215 -39986097 -58086880 -50387547 -29497841 -19940059 -23144859 -20052979
1313 -20052979 -4681295 7620508 6581974 637164 -200026 3073944 7956152 15663337
1305 15663337 21132898 13682654 -5612255 -21320386 -24445549 -21769799 -19061011 -11310953
1297 -11310953 1960815 8107164 76962 -9839530 -8109066 -236963 1058386 -1851468
1289 -1851468 3395419 17855356 29810133 31411495 24719474 14246579 4695327 3137228
1281 3137228 12316126 23699775 26891830 23271347 20678691 18513188 9951018 -3930354
$$ packed form
1337a3605673M422185k015541M843782J8919820J8929512M012134n607742j775426
1329B8123051K489846j232170n143818l619995k232504l639024l855149o029356
1321D860881j7161096k7685882j8100783P699333K0889706R557782l204800L091880
1313b0052979J5371684J2301803j038534n944810q37190L273970M882208P707185
1305A5663337N469561p450244j9294909j5708131l125163K675750K708788P750058
1297a1310953J3271768O146349q030202r916492J730464P872103J295349k909854
1289a851468N246887J4459937J1954777J601362o692021j0472895r551252j558099
1281C137228R178898J1383649L192055l620483k592656k165503q562170j3881372
$$ plain form
1273 -3930354 -15728453 -26311086 -42924417 -60833765 -62629680 -42686731 -19203334
1266 -19203334 -12224915 -19621866 -25763996 -25838480 -27448287 -31567935 -27819862 -12602539
1258 -12602539 635605 -2073297 -15445446 -21409332 -12482267 818860 6049675 2869621
1250 2869621 -2317243 -7022786 -11172573 -11285761 -5179258 711214 -1944229 -10357469
1242 -10357469 -13391448 -7328601 509919 4574063 6543576 5275440 -5950273 -24891614
1234 -24891614 -34686420 -24076105 -5123314 2257710 -1881614 290296 16132751 31894603
1226 31894603 33824808 26824528 24575339 29508759 30797636 18274762 -7304616 -34582824
1218 -34582824 -47848301 -37215139 -8818330 16848387 22426487 9781296 -4814922
$$ packed form
1273c930354j1798099j0582633j6613331j7909348j795915J9942949K3483397
1266a9203334O978419p396951o142130p4484j609807m119648L748073J5217323
1258a2602539J3238144k708902j3372149n963886Q927065J3301127N230815l180054
1250B869621n186864m705543m149787j13188O106503N890472k655443q413240
1242a0357469l033979O062847P838520M064144J969513j268136j1225713j8941341
1234b4891614r794806J0610315J8952791P381024m139324K171910J5842455J5761852
1226C1894603J930205p000280k249189M933420J288877j2522874k5579378k7278208
1218c4582824j3265477J0633162K8396809K5666717N578100j2645191j4596218
$$ plain form
1211 -4814922 -10511397 -11761727 -17469862 -26171362 -27664661 -17839631 -5399883 -872498
1203 -872498 -3197483 -2424341 6021066 15874650 19414447 16184267 9809018 1862979 -6629262
1194 -6629262 -12224052 -13332435 -14269476 -18933346 -22935407 -19112731 -9715358 -5157510
1186 -5157510 -9562740 -15080752 -13521855 -7245286 -4383165 -8409021 -17143413 -27621875
1178 -27621875 -35900494 -34947818 -20207726 2060918 17855531 19369543 12412252 7935851
1170 7935851 9743485 13898120 17362373 21598096 27164429 29887551 25671980 16688584
1162 16688584 9827697 10435410 19406876 33277971 43436196 38977876 17755376 -6127334
1154 -6127334 -14227170 -5419578 2220990 -4683029 -16924208 -15963586 805808 17596132
$$ packed form
1211d814922n696475j250330n708135q701500j493299R825030J2439748M527385
1203h72498k324985P73142Q445407R853584L539797l230180o375249p946039q492241
1194f629262n594790j108383r37041m663870m002061L822676R397373M557848
1186e157510m405230n518012J558897O276569K862121m025856q734392j0478462
1178b7621875q278619R52676J4740092K2268644J5794613J514012o957291m476401
1170G935851J807634M154635L464253M235723N566333K723122m215571q983396
1162A6688584o860887O07713Q971466J3871095J0158225m458320k1222500k3882710
1154f127334q099836Q807592P640568o904019j2241179R60622J6769394J6790324
$$ plain form
1146 17596132 20888812 13488050 7374503 9832154 18355162 23970993 18477108 3190336
1138 3190336 -8879041 -4745999 13577161 30544419 34166860 26413993 16005482 7739362
1130 7739362 1919782 -1923998 -5688852 -13041037 -24390259 -34117283 -36579663 -32526772
1122 -32526772 -26398996 -20201249 -13865349 -8840307 -6376374 -3776119 2400537 9369883
1114 9369883 9259866 -910192 -13492184 -16999547 -7838062 5929013 12065205 4959690
1106 4959690 -10078110 -21943005 -22891621 -13845511 -2325393 4531133 6231276 8810565
1098 8810565 17176474 27577274 30713017 23515935 13652243 9129734 7981116 3933121
1090 3933121 -1615925 -1808581 2773005 3050953 -4924961 -14035445 -16897165 -14316180 -9012230
$$ packed form
1146A7596132L292680p400762o113547K457651Q523008N615831n493885j5286772
1138C190336j2069377M133042J8323160J6967258L622441p752867j0408511q266120
1130G739362n819580l843780l764854p352185j1349222r727024k462380M052891
1122c2526772O127776O197747O335900N025042K463933K600255O176656O969346
1114I369883j10017j0170058j2581992l507363R161485J3767075O136192p105515
1106D959690j5037800j1864895r48616R046110J1520118O856526J700143K579289
1098H810565Q365909J0400800L135743p197082r863692m522509j148618m047995
1090C933121n549046j92656M581586K77948p975914r110484k861720K580985N303950
$$ plain form
1081 -9012230 72610 10781115 13456110 2701618 -12445476 -19460473 -18587989 -18099416
1073 -18099416 -17847709 -10432675 2309068 7372073 -2111256 -18527607 -31764971 -38900198
1065 -38900198 -38514261 -27640961 -11309931 -3832185 -10896407 -19648448 -17375184 -11037762
1057 -11037762 -14329145 -23002323 -21690537 -12418873 -14579371 -32116056 -42382844 -29805684
1049 -29805684 -12487452 -16696177 -36780218 -43023000 -25265344 -5513286 -3714822 -12100091
1041 -12100091 -13329567 -7124187 -4275733 -5288975 -1624044 6468643 8759480 1725115
1033 1725115 -5833268 -5930329 -745832 3397082 3397688 -1335370 -9060249 -12281681 -1924687
1024 -1924687 20212581 38839398 40235620 26449122 10674884 2270324 708584 1242361
$$ packed form
1081i012230R084840J0708505K674995j0754492j5147094p014997Q72484M88573
1073a8099416K51707P415034J2741743N063005r483329j6416351j3237364p135227
1065c8900198L85937J0873300J6331030P477746p064222q752041K273264O337422
1057a1037762l291383q673178J311786R271664k160498j7536685j0266788J2577160
1049b9805684J7318232m208725k0084041o242782J7757656J9752058J798464q385269
1041a2100091j229476O205380K848454j013242L664931Q092687K290837p034365
1033A725115p558383r7061N184497M142914O06m733058p724879l221432J0356994
1024a924687K2137268J8626817J396222j3786498j5774238q404560j561740N33777
$$ plain form
1016 1242361 1049261 27126 -750442 -275434 1587497 4158742 6468549 7253464 5859514
1007 5859514 4510468 6900000 11353961 9137820 -4073468 -17563946 -15310530 3038395
999 3038395 19591704 19055014 4463883 -10351338 -15681069 -9936412 2283059 10898599
991 10898599 7203219 -4526880 -10277449 -6076858 -4014639 -11384109 -16693925 -8956869
983 -8956869 842511 -4703762 -19968431 -23101310 -10057348 -331644 -5695691 -13886772
975 -13886772 -11630872 -5858232 -9312250 -18187526 -18771710 -8764786 1678391 6468060
967 6468060 9428801 14443173 18630456 16437358 5945919 -8397937 -17002094 -12618459
959 -12618459 -313084 3921844 -10587190 -36475265 -55197445 -54474124 -37437085 -18504496
$$ packed form
1016A242361j93100j022135p77568M75008J862931K571245K309807P84915j393950
1007E859514j349046K389532M453961k216141j3211288j3490478K253416J8348925
999C038395J6553309n36690j4591131j4815221n329731N744657J2219471Q615540
991A0898599l695380j1730099n750569M200591K062219p369470n309816P737056
983h956869R799380n546273j5264669l132879J3043962R725704n364047q191081
975a3886772K255900N772640l454018q875276n84184J0006924J0443177M789669
967F468060K960741N014372M187283k193098j0491439j4343856q604157M383635
959a2618459J2305375M234928j4509034k5888075j8722180P23321J7037039J8932589
$$ plain form
951 -18504496 -11919025 -19511354 -28087373 -24176061 -11419251 -4864917 -7729677 -7016553
943 -7016553 3348802 10750607 5678360 234170 8412927 19356212 11308008 -13287623
935 -13287623 -29078061 -24267346 -13925394 -12189038 -12390991 -5419679 141764 -7731258
927 -7731258 -21126067 -20395470 -1950032 16779405 20737501 14381231 12102375 18965565
919 18965565 26084432 22810829 9749151 -1574842 -1194336 9331816 20371514 24411725
911 24411725 19755888 8067839 -5352870 -11070291 -3304220 11518246 21007912 21680375
903 21680375 20283234 20941437 20593328 18081361 16878256 15921804 8996461 -2312659 -6634105
894 -6634105 98361 7324167 7519440 8895326 19355180 29062149 23631757 6905815
$$ packed form
951a8504496O585471p592329q576019L911312J2756810O554334k864760P13124
943g016553J0365355P401805n072247n444190Q178757J0943285q048204k4595631
935a3287623j5790438M810715J0341952J736356k01953O971312N561443p873022
927g731258j3394809P30597J8445438J8729437L958096o356270k278856O863190
919A8965565P118867l273603j3061678j1323993L80506J0526152J1039698M040211
911B4411725m655837j1688049j3420709n717421P766071J4822466R489666O72463
903B1680375j397141O58203l48109k511967j203105r56452o925343j1309120m321446
894f634105O732466P225806J95273J375886J0459854R706969n430392j6725942
$$ plain form
886 6905815 -4925682 -6777498 -6747420 -8429665 -7637815 -5686713 -9296240 -15619420 -13241086
877 -13241086 -1824285 4260785 -2379343 -10725883 -9144095 -2210892 -331046 -2745645
869 -2745645 -1847765 2439833 3383383 -1152900 -6635656 -8756767 -6090488 952650 8050825
860 8050825 7498459 -3260522 -17116418 -26930530 -35332092 -47796760 -59760635 -59773612
852 -59773612 -45034436 -25936761 -13920794 -10861638 -12097966 -14529272 -18283940 -22933366
844 -22933366 -25569462 -23645613 -18904473 -16047520 -15480463 -10352523 3661437 17476755
836 17476755 16560488 1568331 -9250694 -3912020 6927318 6581925 -3147023 -6739330
828 -6739330 886478 9585045 12280463 13224198 15237099 12722129 3941173 -1361479 4178436
$$ packed form
886F905815j1831497j851816L0078j682245P91850J951102l609527o323180K378334
877a3241086J1416801O085070o640128q346540J581788O933203J879846k414599
869b745645Q97880M287598R43550m536283n482756k121111K666279P043138P098175
860H050825n52366j0758981j3855896r814112q401562j2464668j1963875j2977
852e9773612J4739176J9097675J2015967L059156j236328k431306l754668m649426
844b2933366k636096J923849M741140K856953N67057N127940J4013960J3815318
836A7476755r16267j4992157j0819025N338674J0839338l45393r728948l592307
828f739330P625808Q698567K695418R43735K012901k514970q780956n302652N539915
$$ plain form
819 4178436 12442156 11069538 2554605 994678 11605653 24241227 28870141 28026662
811 28026662 28912861 29819270 22289508 5609705 -7585276 -3270728 18606430 42937893
803 42937893 52898969 43767826 25300786 12694182 13941024 22956000 25341523 13983283
795 13983283 -1297201 -3642885 10775412 27493271 30310434 17761541 237435 -12773199
787 -12773199 -16877658 -10381949 3144815 12738369 10237029 2519149 4484507 18525972
779 18525972 29952791 25932081 10662801 -2976838 -9462172 -11957633 -13388115 -13786021
771 -13786021 -13494300 -12053736 -5651985 7679513 21003501 23390849 13374095 2170670
763 2170670 991930 9054991 17034872 19025084 16746021 13391656 8643648 1532124
$$ packed form
819D178436Q263720j372618q514933j559927J0610975J2635574M628914q43479
811B8026662Q86199R06409p529762j6679803j3194981M314548K1877158K4331463
803D2937893R961076r131143j8467040j2606604J246842R014976K385523j1358240
795A3983283j5280484k345684J4418297J6717859K817163j2548893j7524106j3010634
787a2773199m104459O495709J3526764R593554k501340p717880J965358J4041465
779A8525972J1426819m020710j5269280j3639639o485334k495461j430482l97906
771a3786021K91721J440564O401751J3331498J3323988K387348j0016754j1203425
763B170670j178740Q063061P979881J990212k279063l354365m748008p111524
$$ plain form
755 1532124 -5793709 -10836700 -14998988 -20468456 -23980832 -19756259 -9809714 -4593693
747 -4593693 -9303634 -15384910 -11859110 -648107 7178044 7653161 7172458 9586580 9619460
738 9619460 2693858 -5785134 -6166335 3727426 16011311 20244173 12884037 1515371
730 1515371 -1554239 6445409 13667984 9268053 1082594 7332890 30713318 52848380
722 52848380 58171442 51611234 46275816 44545255 40497338 32472513 22916894 11983559
714 11983559 1298021 -1299781 8646477 21784388 24646786 17153769 10485883 9759919
706 9759919 9201756 3624888 -5222505 -13767109 -19189906 -17316797 -7059995 3206787
698 3206787 3136138 -5322079 -10332356 -6864729 -588566 5341990 14666344 25465837 26132156
$$ packed form
755A532124p325833n042991m162288n469468l512376M224573R946545N216021
747d593693m709941o081276L525800J1211003P826151M75117m80703K414122L2880
738I619460o925602q478992l81201R893761J2283885M232862p360136j1368666
730A515371l069610P999648P222575m399931q185459O250296K3380428K2135062
722E2848380N323062o560208n335418j730561m047917q024825r555619j0933335
714A1983559j0685538k597802R946258J3137911K862398p493017o667886p25964
706I759919n58163n576868q847393q544604n422797J873109J0256802J0266782
698C206787p0649q458217n010277L467627O276163N930556R324354J0799493O66319
$$ plain form
689 26132156 11874482 -4255330 -6354771 3916705 10409748 2945706 -11781598 -18158495
681 -18158495 -6938255 14958788 28299678 19912563 -1070596 -11725391 -2451818 12621017
673 12621017 16542084 10978624 8240469 10085512 6922446 -4635862 -15217785 -15284678
665 -15284678 -6379800 2386119 4218857 202011 -1229001 9133974 31300788 53384048
657 53384048 62279191 55804367 41718184 28386080 20774584 20961229 25072417 22536938
649 22536938 7241215 -10984536 -14686484 -206292 16708567 19471181 8597609 -2512349
641 -2512349 -4982805 -2978594 -5932476 -14947558 -18994015 -7812461 11496126 18485571
633 18485571 5267471 -10203014 -7594073 6332628 8295094 -4715553 -10903631 -318112
$$ packed form
689B6132156j4257674j6129812k099441J0271476O493043p464042j4727304o376897
681a8158495J1220240K1897043J3340890q387115k0983159j0654795R273573J5072835
673A2621017L921067n563460k738155J845043l163066j1558308j0581923o6893
665a5284678Q904878Q765919J832738m016846j431012J0362975K2166814K2083260
657E3384048Q895143o474824j4086183j3332104p611496J86645M111188k535479
649B2536938j5295723j8225751l701948J4480192J6914859K762614j0873572j1109958
641b512349k470456K004211k953882r015082m046457J1181554J9308587O989445
633A8485571j3218100j5470485K608941J3926701J962466j3010647o188078J0585519
$$ plain form
625 -318112 7379035 -4417903 -19145989 -11497902 11527262 20624830 9965873 4601526
617 4601526 18682852 33420017 28681763 14414884 12872305 24965464 34252996 34958145
609 34958145 35513303 38304343 35546709 25983308 18659050 16982220 13771447 6100558
601 6100558 854455 52044 -5043334 -16709465 -20926686 -6842009 13816958 20701920
593 20701920 11998132 3484319 4107777 7376814 6967859 6218233 8010545 7316563 361612
584 361612 -7578680 -10440701 -10680347 -13154180 -14998848 -9982011 -682489 1839442 -8201997
575 -8201997 -23355173 -31228135 -27693033 -19018334 -12223027 -7211162 -853160 3764915
567 3764915 -1478225 -16821655 -28774479 -23878349 -5880474 8033688 7597860 -1271772
$$ packed form
625c18112P697147j1796938j4728086P648087K3025164R097568j0658957n364347
617D601526J4081326J4737165m738254j4266879j542579J2093159R287532P05149
609C4958145N55158K791040k757634r563401p324258j676830l210773p670889
601F100558n246103q02411n095378j1666131m217221J4084677K0658967O884962
593B0701920q703788q513813O23458L269037m08955p49626J792312o93982o954951
584C61612p940292k862021k39646k473833j844668N016837R299522K521931j0041439
575h201997j5153176p872962L535102Q674699O795307N011865O358002M618075
567C764915n243140j5343430j1952824M896130J7997875J3914162m35828q869632
$$ plain form
559 -1271772 -8144931 -10777055 -12834661 -15918570 -18837376 -20214201 -17662316 -8702186
551 -8702186 3517216 9954918 5842177 -2652324 -6326309 -3529546 1824035 8244619
543 8244619 16310718 23713764 27533699 29274142 31180489 29988700 21975027 12700752
535 12700752 12805346 23037774 31460883 27993307 15132509 1838573 -6537043 -8837322
527 -8837322 -4963154 3055506 11292488 19206733 30101698 42335215 45912006 34461127
519 34461127 16161574 4603080 1473251 -2543828 -10806036 -15625365 -12567223 -8861154
511 -8861154 -11173355 -14095669 -9953402 -3227646 -3785388 -9777323 -10290870 -4042879 -1202658
502 -1202658 -4082096 -1095415 12736648 23130911 16147146 -24275 -6724060 -627627
$$ packed form
559a271772o873159k632124k057606l083909k918806j376825K551885Q960130
551h702186J2219402O437702m112741q494501l673985K796763N353581O420584
543H244619Q066099P403046L819935J740443J906347j191789q013673r274275
535A2700752J04594J0232428Q423109l467576j2860798j3293936q375616k300279
527h837322L874168Q018660Q236982P914245J0894965J2233517L576791j1450879
519C4461127j8299553j1558494l129829m017079q262208m819329L058142L706069
511h861154k312201k922314M142267O725756n57742n991935n13547O247991K840221
502a202658k879438K986681J3832063J0394263o983765j6171421o699785O096433
$$ plain form
494 -627627 7150062 11768625 16885410 18893712 8567969 -9342969 -17216157 -11096528
486 -11096528 -8182266 -19056428 -29828928 -24876121 -12581624 -12105657 -24908487 -36366105
478 -36366105 -38472968 -34024590 -23459002 -5539887 10511859 11028972 -2010307 -11455402
470 -11455402 -8190120 -800401 645506 -2929849 -8079221 -17168148 -30751976 -40815387
462 -40815387 -39530703 -29309317 -18933462 -14648638 -18269878 -27582310 -34605567 -29918820
454 -29918820 -13749820 2042214 7179569 3779528 674773 1871121 4644249 5088203
446 5088203 1631312 -4226527 -8066963 -5942489 908981 7059364 8326691 3217206
438 3217206 -8492283 -22432219 -27243871 -14839751 6349738 17792218 12825862 3463712
$$ packed form
494f27627P777689M618563N116785K008302j0325743j7910938p873188O119629
486a1096528K914262j0874162j0772500M952807J2294497M75967j2802830j1457618
478c6366105k106863M448378J0565588J7919115J6051746N17113j3039279r445095
470a1455402L265282P389719J445907l575355n149372r088927j3583828j0063411
462d0815387J284684J0221386J0375855M284824l621240r312432p023257M686747
454b9918820J6169000J5792034N137355l400041l104755J196348K773128M43954
446E088203l456891n857839l840436K124474O851470O150383J267327n109485
438C217206j1709489j3939936m811652J2404120K1189489J1442480m966356r362150
$$ plain form
430 3463712 2463316 7711672 8794590 932444 -12631368 -25245554 -29525247 -22156694
422 -22156694 -9856065 -3719616 -4842242 -3927859 2097328 4152247 -3093053 -11204793
414 -11204793 -12069992 -11085694 -15942252 -21673489 -18914749 -9858530 -3581401 -999725 3119192
405 3119192 7542484 6775381 3192329 4353973 9051661 7715971 -2517659 -13037498
397 -13037498 -15278626 -9194953 -17498 6281065 4841731 -3800799 -12090820 -13899567
389 -13899567 -11799952 -9767464 -4096890 8845001 20876502 20486478 10576316 4986905
381 4986905 8527650 13518924 15723159 19255587 23929678 22604877 15505835 13201038
373 13201038 18996714 21064262 9946420 -7123645 -17810715 -20494938 -19219306 -12388391
$$ packed form
430C463712j000396N248356J082918p862146j3563812j2614186m279693P368553
422b2156694J2300629O136449j122626R14383O025187K054919p245300q111740
414a1204793q65199R84298m856558n731237K758740R056219O277129K581676M118917
405C119192M423292p67103l583052J161644M697688j335690j0233630j0519839
397a3037498k241128O083673R177455O298563j439334q642530q290021j808747
389a3899567K099615K032488N670574J2941891J2031501l90024r910162n589411
381D986905L540745M991274K204235L532428M674091j324801p099042k304797
373A3201038N795676K067548j1117842j7070065j0687070k684223J275632O830915
$$ plain form
365 -12388391 1569091 13540968 11568550 -2444749 -14101713 -14328857 -7508917 -1570473
357 -1570473 2083366 6080345 10078676 10730862 7519349 5501747 10070083 18947586 22492680
348 22492680 14861037 2402309 -3548304 -431595 4500753 5348417 2686855 -1949000
340 -1949000 -8322984 -12826469 -9937127 -1272208 4448900 3782216 3259551 7858471 12801041
331 12801041 12275600 8993793 8267042 8261621 3302515 -6827732 -16768194 -21809322 -20296870
322 -20296870 -13963270 -9310304 -13045124 -22081474 -24770333 -17191660 -10431459 -14277458
314 -14277458 -21427496 -18126467 -4739158 6064433 8287010 7331940 6671984 2540977
306 2540977 -5616268 -10667709 -8843443 -6681694 -10844442 -17331645 -17651994 -11669169 -6858983
$$ packed form
365a2388391J3957482J1971877j972418j4013299j1656964k27144O819940N938444
357a570473L653839L996979L998331O52186l211513k017602M568336Q877503L545094
348B2492680p631643j2458728n950613L116709M932348Q47664k661562m635855
340a949000o373984m503485K889342Q664919N721108o66684n22665M598920M942570
331A2801041n25441l281807p26751n421m959106j0130247r940462n041128J512452
322b0296870O333600M652966l734820r036350k688859P578673O760201l845999
314a4277458p150038L301029J3387309J0803591K222577r55070o59956m131007
306B540977q157245n051441J824266K161749m162748o487203l20349N982825M810186
$$ plain form
297 -6858983 -5904080 -2506761 7485189 15983337 10227885 -9647562 -27149538 -27682318
289 -27682318 -15832275 -8101766 -11199390 -16167445 -14146272 -8187678 -5525955 -6414039
281 -6414039 -6712369 -5686241 -5009810 -4259744 -2812988 -2526278 -4001001 -4227288 -2076572
272 -2076572 -1474979 -4994537 -9520542 -12201636 -14153533 -14027657 -6667535 5373779 8926253
263 8926253 -1623228 -12856828 -11337858 -5081172 -10034392 -21697146 -19872541 -627863
255 -627863 16274470 15751660 5785125 787983 1745724 1917913 161041 -1716437 -6234275
246 -6234275 -15104837 -22716852 -22841187 -17313110 -11792800 -7514444 -2805024 1776934 4962812
237 4962812 7169605 7240618 1715755 -8662110 -17148119 -19760903 -19942336 -20399593 -17595191
$$ packed form
297f858983R54903L397319R991950Q498148n755452j9875447j7501976n32780
289b7682318J1850043P730509l097624m968055K021173N958594K661723q88084
281f414039k98330J026128O76431P50066J446756K86710j474723k26287K150716
272b076572O01593l519558m526005k681094j951897J25876P360122J2041314L552474
263H926253j0549481j1233600J518970O256686m953220j1662754J824605J9244678
255f27863J6902333n22810r966535m997142R57741J72189j756872j877478m517838
246f234275q870562p612015j24335N528077N520310M278356M709420M581958L185878
237D962812K206793P1013n524863j0377865q486009k612784j81433m57257K804402
$$ plain form
228 -17595191 -10137520 -5017138 -7340357 -10298022 -5254742 2871956 1827408 -8154570
220 -8154570 -12816426 -4231294 7919162 10538950 4447178 121093 1142857 1137257 -3260141
211 -3260141 -5742912 -1323279 2960167 -2759292 -13795195 -13819129 2142496 18408149
203 18408149 19324260 9824934 4827776 5914407 3263271 -3088678 -1475077 9953929
195 9953929 16923342 10983728 3560883 8325473 20499695 25006111 17796268 7960762
187 7960762 3147911 2740402 3144638 2287751 431028 1045056 7412519 14990191 13423371
178 13423371 1022586 -10023817 -9222888 -1010395 5143201 9679013 17738409 25688848
170 25688848 24970916 15799898 6035573 -860179 -6565616 -9694551 -7621613 -4108654
$$ packed form
228a7595191P457671N120382k323219k957665N043280Q126698j044548r981978
220h154570m661856Q585132J2150456K619788o091772m326085J021764n600m397398
211c260141k482771M419633M283446n719459j1035903k3934J5961625J6265653
203A8408149R16111r499326m997158J086631k651136o351949J613601J1429006
195I953929O969413n939614p422845M764590J2174222M506416p209843r835506
187G960762m812851m07509M04236q56887j856723O14028O367463P577672j566820
178A3423371j2400785j1046403Q00929Q212493O153596M535812Q059396P950439
170B5688848p17932r171018r764325o895752n705437l128935K072938L512959
$$ plain form
162 -4108654 -4342898 -4565036 2214522 12336175 15781600 13306441 15795340 25475339 31294064
153 31294064 26246705 16889104 11115808 7780122 3849507 1683255 3034085 4395217
145 4395217 4173052 6727358 13748783 19075992 17722331 13179709 10430089 8640554 6335111
136 6335111 6787369 11841877 16500499 16189412 13963032 14126547 14069869 9393705 2579887
127 2579887 -712358 -629915 -1554912 -3968598 -4005832 354234 7029929 11699461 8956072
118 8956072 -4071751 -21088068 -28678580 -20811456 -7032295 -92463 -18786 1679751
110 1679751 5774425 3674972 -7686371 -18696395 -18617075 -8722428 284353 1333739
102 1333739 -2109531 -2186713 2526317 5191691 1248256 -2630686 3996482 19672245 30533982
$$ packed form
162d108654k34244k22138O779558J0121653L445425k475159K488899R679999N818725
153C1294064n047359r357601n773296l335686l930615k166252J350830J361132
145D395217k22165K554306P021425N327209j353661m542622k749620j789535k305443
136F335111M52258N054508M658622l11087k226380J63515n6678m676164o813818
127B579887l292245Q2443r24997k413686l7234M360066O675695M669532k743389
118H956072j3027823j7016317p590512P867124J3779161O939832P3677J698537
110A679751M094674k099453j1361343j1010024P9320R894647R006781J049386
102A333739l443270p7182M713030K665374l943435l878942O627168J5675763J0861737
$$ plain form
93 30533982 27676203 17559957 11397595 11616963 13898315 15072629 12339833 1942556
85 1942556 -13075650 -20310436 -12784459 -788382 1382340 -4735569 -7196112 -4286686
77 -4286686 -4872496 -9636402 -8316757 1525607 8210994 4302654 -1872384 -681066 4172804
68 4172804 4501876 1671250 1400933 1449105 -4508411 -14410356 -19019490 -14068922 -3732339
59 -3732339 6522625 14093336 17843280 18460369 18778732 18861833 13451239 -75578 -14428328
50 -14428328 -20301333 -19302031 -20828098 -26921873 -29165246 -22109162 -11527136 -5902836
42 -5902836 -6193207 -7913871 -7997138 -5364514 745985 8269446 11505397 7562221 1205914
33 1205914 -1086306 393781 881854 -93854 1610925 6579598 9923355 9407313 9343007
$$ packed form
93C0533982k857779j0116246o162362K19368K281352J174314k732796j0397277
85A942556j5018206p234786P525977J1996077K170722o117909k460543K909426
77d286686n85810m763906J319645R842364O685387l908340o175038J191318M853870
68D172804L29072k830626k70317M8172n957516r901945m609134M950568J0336583
59c732339J0254964P570711L749944O17089L18363Q3101n410594j3526817j4352750
50a4428328n873005R99302j526067o093775k243373P056084J0582026N624300
42e902836k90371j720664q3267K632624O110499P523461L235951l943176o356307
33A205914k292220J480087M88073r75708J704779M968673L343757n16042o4306
$$ plain form
24 9343007 12615759 14261353 8979311 1342961 572632 5966201 6382751 -3043108 -11823205
15 -11823205 -7735372 6374133 17335751 19749721 20070654 23238547 25323526 22799335
7 22799335 20315963 22580013 24323554 16740559 1889552 -7249267 -2253335
0 -2253335
$$ packed form
24I343007L272752J645594n282042p636350p70329N393569M16550r425859q780097
15a1823205M087833J4109505J0961618K413970L20933L167893K084979k524191
7B2799335k483372K264050J743541p582995j4851007r138819M995932
0b253335
$$ Imaginary data points
##PAGE= N=2
##DATA TABLE= (X++(I..I)), XYDATA
$$ plain form
65535 -2026052 6571688 18075435 24873150 26955797 27559909 26271763 19624118 8617986
65527 8617986 1777881 6068556 15646256 16302614 4041233 -7309740 -3560609 9594429
65519 9594429 13531483 2734879 -7374775 -2321674 11743234 17930195 11320376 1931445
65511 1931445 -1837256 -2148154 -3355650 -4131652 -1906393 1415192 2832952 2698068 1538805
65502 1538805 -2901850 -9953328 -11301442 437951 19488683 30742353 27099312 16682438
65494 16682438 10563282 9487469 6924424 310193 -6575553 -9891130 -8759906 -3199322
65486 -3199322 5485137 12116766 10684380 1703770 -7198061 -9958082 -8309215 -7391270
65478 -7391270 -8108971 -6981365 -2130472 3835656 7183604 7193851 5887202 4327765 389232
$$ packed form
65535b026052Q597740J1503747O797715K082647O04112j288146o647645j1006132
65527H617986o840105M290675R577700O56358j2261381j1350973L749131J3155038
65519I594429L937054j0796604j0109654N053101J4064908O186961o609819r388931
65511A931445l768701l10898j207496p76002K225259L321585J417760j34884j159263
65502A538805m440655p051478j348114J1739393J9050732J1253670l643041j0416874
65494A6682438o119156j075813k563045o614231o885746l315577J131224N560584
65486c199322Q684459O631629j432386q980610q901831k760021J648867R17945
65478g391270p17701J127606M850893N966128L347948J0247j306649j559437l938533
$$ plain form
65469 389232 -8815534 -22207011 -33872881 -38294428 -35609680 -30177067 -25099867 -20762048
65461 -20762048 -17919969 -18142146 -20072063 -19236706 -14466693 -11661425 -17048554 -27624676
65453 -27624676 -32574115 -25381413 -11533633 -2149985 -2042061 -6985311 -11637426 -15473064
65445 -15473064 -18874428 -17849312 -8548686 3974498 8410942 1009998 -9023779 -11914301
65437 -11914301 -9677767 -10156026 -13396902 -12655191 -7047317 -3518072 -5037657 -5858172
65429 -5858172 -1799519 2568445 1609122 -2949875 -6341650 -8108618 -9877671 -10497832
65421 -10497832 -8734287 -6657938 -5285121 -1339310 6034247 10136025 5330747 -3035768
65413 -3035768 -4937263 1034728 8212127 12639715 14728760 12765086 5053167 -2169330
$$ packed form
65469C89232r204766j3391477j1665870m421547K684748N432613N077200M337819
65461b0762048K842079k22177j929917Q35357M770013K805268n387129j0576122
65453b7624676m949439P192702J3847780R383648J07924m943250m652115l835638
65445a5473064l401364J025116R300626J2523184M436444p400944j0033777k890522
65437a1914301K236534m78259l240876P41711N607874L529245j519585q20515
65429e858172M058653M367964r59323m558997l391775j766968j769053o20161
65421a0497832J763545K076349J372817L945811P373557M101778m805278q366515
65413c035768j901495N971991P177399M427588K089045j963674p711919p222497
$$ plain form
65405 -2169330 256666 10342950 16419276 14783444 14642737 21276128 26078487 21212538
65397 21212538 14154344 16898187 27375115 33475252 31974363 31048620 34030571 32763121
65389 32763121 21379470 7456064 2314572 5110430 4013692 -7865437 -23827989
65382 -23827989 -32136624 -28780630 -18955975 -8960274 -1143720 3993089 6265046 8407657
65374 8407657 15312251 26639089 33958415 30395099 20272594 13368347 12363473 13457216
65366 13457216 17093054 27450877 40054701 41302227 25902024 5951429 -4159632
65359 -4159632 -4711154 -5259920 -9057180 -12161252 -13716267 -16964330 -21146285 -20991069 -14830034
65350 -14830034 -6949029 -1603303 351602 -439666 -2320498 -2401779 -399259 -652716 -5471461
$$ packed form
65405b169330K425996J0086284O076326j635832j40707O633391M802359m865949
65397B1212538p058194K743843J0476928O100137j500889r25743K981951j267450
65389C2763121j1383651j3923406n141492K795858j096738j1879129j5962552
65382b3827989q308635L355994R824655R995701P816554N136809K271957K142611
65374H407657O904594J1326838P319326l563316j0122505o904247j004874J093743
65366A3457216L635838J0357823J2603824J247526j5400203j9950595j0111061
65359d159632n51522n48766l797260l104072j555015l248063m181955J55216O161035
65350a4830034P881005N345726J954905p91268j880832q1281K002520k53457m818745
$$ plain form
65341 -5471461 -9592978 -7648930 -4106963 -7855546 -18748233 -27874156 -30179271 -28434578
65333 -28434578 -25588651 -22306736 -21565659 -25499968 -27373166 -18022414 -1972021 5246285
65325 5246285 -566216 -5769148 -864768 4444219 -2073813 -15236049 -21759005 -20502911
65317 -20502911 -19515016 -19619587 -16155448 -12869290 -17711109 -25548007 -21347241 -3175713
65309 -3175713 12956313 15903623 12761565 12331138 9103717 -4525749 -20099406 -21703496
65301 -21703496 -8598254 4049627 6385868 3974189 4700209 6146391 1656827 -7503909
65293 -7503909 -12714304 -8885561 -591327 2813972 -2923411 -11532968 -11488052 1100178
65285 1100178 16016205 19328140 9736558 -906191 -4140437 -4713596 -9876624 -16061195
$$ packed form
65341e471461m121517J944048L541967l748583j0892687r125923k305115J744693
65333b8434578K845927L281915P41077l934309j873198R350752J6050393P218306
65325E246285n812501n202932M904380N308987o518032j3162236o522956J256094
65317b0502911R87895j04571L464139L286158m841819p836898M200766J8171528
65309c175713J6132026K947310l142058m30427l227421j3629466j5573657j604090
65301b1703496J3105242J2647881K336241k411679P26020J446182m489564r160736
65293g503909n210395L828743Q294234L405299n737383q609557M4916J2588230
65285A100178J4916027L311935r591582j0642749l234246n73159n163028o184571
$$ plain form
65277 -16061195 -14320658 -5220114 1167073 -322719 -4503430 -6387849 -8405343 -13057593
65269 -13057593 -15937381 -12150595 -4482044 1067077 3937161 7087303 9948162 10045806
65261 10045806 9079789 10369241 12012157 9659651 4631388 1556256 -1132157 -9500972
65253 -9500972 -22339856 -30420661 -30055444 -28474120 -31588562 -34532749 -29768511 -17797335
65245 -17797335 -4213083 7595930 14886157 13162975 2871006 -6536374 -7255915 -4113209
65237 -4113209 -6783261 -14114752 -15304205 -5948028 5371582 7685730 -889014 -12670949
65229 -12670949 -16978241 -8458115 6189798 11978818 2147538 -11554266 -12553979 -1312691
65221 -1312691 5817398 -779703 -12915369 -18512223 -16593864 -13278068 -10728832 -6953335
$$ packed form
65277a6061195J740537R100544O387187j489792m180711j884419k017494m652250
65269a3057593k879788L786786P668551N549121K870084L150142K860859R7644
65261A0045806r66017J289452J642916k352506n028263l075132k688413q368815
65253i500972j2838884q080805L65217J581324l114442k944187M764238J1971176
65245a7797335J3584252J1809013P290227j723182j0291969r407380p19541L142706
65237d113209k670052p331491j189453R356177J1319610K314148q574744j1781935
65229a2670949m307292Q520126J4647913N789020r831280j3701804r99713J1241288
65221a312691P130089o597101j2135666n596854J918359L315796K549236L775497
$$ plain form
65213 -6953335 -2235917 112866 -2315095 -9125447 -16910848 -20059355 -15756631 -9001126
65205 -9001126 -7617893 -11429405 -12745332 -9186099 -8112925 -14365629 -21171298 -19232149
65197 -19232149 -9122908 1326032 6870509 6132217 -1450550 -12394566 -17105748 -9478950
65189 -9478950 3617530 10129050 8454661 7608667 12629818 17953308 16477991 8419700
65181 8419700 -923703 -6950722 -7321719 -2144203 5202263 10091926 10424373 6636427
65173 6636427 -361457 -7592630 -8708876 -579541 9327553 9300187 -1320811 -9963439
65165 -9963439 -7059177 1632845 3666223 -3796974 -12465670 -15574829 -15717274 -18924813
65157 -18924813 -25160073 -27619458 -20693071 -6769476 5736809 10756610 9670949 7531054
$$ packed form
65213f953335M717418K348783k427961o810352p785401l148507M302724O755505
65205i001126J383233l811512j315927L559233J073174o252704o805669J939149
65197a9232149J0109241J0448940N544477p38292p582767j0944016m711182P626798
65189i478950J3096480O511520j674389q45994N021151N323490j475317q058291
65181H419700r343403o027019l70997N177516P346466M889663L32447l787946
65173F636427o997884p231173j116246Q129335R907094k7366j0620998q642628
65165i963439K904262Q692022K033378p463197q668696l109159j42445l207539
65157a8924813o235260k459385O926387J3923595J2506285N019801j085661k139895
$$ plain form
65149 7531054 6114346 3204473 -1926205 -5595717 -3772783 2419415 6810260 3934279
65141 3934279 -5468607 -14952723 -19008691 -18700702 -18901182 -20574553 -19793004 -15524673 -13272114
65132 -13272114 -17166634 -22754553 -23042945 -18556818 -15183597 -14521347 -13784073 -13861823 -18441322
65123 -18441322 -23902407 -19343459 -1189580 19044303 27014544 21003051 10503553 3820849
65115 3820849 2538430 5059682 9345778 12538776 12156394 8208987 2610759 -2246612
65107 -2246612 -3330417 1482238 9376724 13461843 10945673 7393689 8759034 11753706
65099 11753706 7401321 -6340390 -20009731 -21778348 -9172954 8347890 17457899
65092 17457899 12868443 2292096 -2446881 130039 -262093 -10374886 -22111185 -21988406
$$ packed form
65149G531054j416708k909873n130678l669512J822934O192198M390845k875981
65141C934279r402886r484116m055968L07989k00480j673371P81549M268331K252559
65132a3272114l894520n587919k88392M486127L373221O62250P37274p7750m579499
65123a8441322n461085M558948J8153879K0233883P970241o011493j0499498o682704
65115C820849j282419K521252M286096L192998l82382l947407n598228m857371
65107b246612j083805M812655P894486M085119k516170l551984J365345K994672
65099A1753706m352385j3741711j3669341j768617J2605394J7520844R110009
65092A7457899m589456j0576347m738977K576920l92132j0112793j1736299J22779
$$ plain form
65084 -21988406 -8303332 7801082 16625877 18497499 18526534 19616513 22088694 24857447
65076 24857447 25025544 20191957 12347657 6090312 2898987 1261890 1829804 6348255
65068 6348255 10857464 7457791 -3640883 -10415434 -3116473 12059536 19491235 12329716
65060 12329716 -1245827 -9186659 -8121471 -4176101 -4890988 -11866806 -19882588 -22139379
65052 -22139379 -16181413 -4477497 9369776 22130275 29267827 26722278 16616034
65045 16616034 7056546 3034816 1122247 -3144054 -6778365 -4122459 2586844 4771247
65037 4771247 -287204 -5531570 -4327135 985157 3807293 2475035 1096643 3498097
65029 3498097 9387796 15370127 17727261 15058118 9331763 3512115 -1733649 -6876745
$$ packed form
65084b1988406J3685074J6104414Q824795J871622K9035J089979K472181K768753
65076B4857447J68097m833587p844300o257345l191325j637097N67914M518451
65068F348255M509209l399673j1098674o774551P298961J5176009P431699p161519
65060A2329716j3575543p940832J065188L945370p14887o975818q015782k256791
65052b2139379N957966J1703916J3847273J2760499P137552k545549j0106244
65045A6616034r559488m021730j912569m266301l634311K655906O709303K184403
65037D771247n058451n244366J204435N312292K822136j332258j378392K401454
65029C498097N889699N982331K357134k669143n726355n819648n245764n143096
$$ plain form
65021 -6876745 -9633709 -6499122 566372 3904026 70643 -4341936 -2088371 2745041
65013 2745041 -460312 -12462622 -20724382 -15682492 -3859122 1092882 -3906157 -10082847
65005 -10082847 -11380198 -11181412 -12115998 -8078696 5989668 21281746 22132711 6187482
64997 6187482 -11237302 -16111025 -11462415 -8960251 -11379498 -11838979 -7157800 -2407605
64989 -2407605 -1574951 -1721410 958012 5213403 7628391 6625577 1404410 -8029375
64981 -8029375 -17128009 -18229216 -9303066 2618472 9283098 8052104 -625668 -15248811
64973 -15248811 -28931471 -31408829 -22219402 -14341189 -16226030 -18002146 -7228288 8419024
64965 8419024 10183144 -2501101 -9628124 -386003 11795825 11352441 2997764 1227789
$$ packed form
65021f876745k756964L134587P065494L337654l833383m412579K253565M833412
65013B745041l205353j2002310q261760N041890J1823370M952004m999039o176690
65005a0082847j297351J98786r34586M037302J4068364J5292078Q50965j5945229
64997F187482j7424784m873723M648610K502164k419247m59481M681179M750195
64989b407605Q32654j46459K679422M255391K414988j002814n221167r433785
64981h029375r098634j101207Q926150J1921538O664626j230994q677772j4623143
64973a5248811j3682660k477358R189427P878213j884841j776116J0773858J5647312
64965H419024J764120j2684245p127023R242121J2181828m43384q354677j769975
$$ plain form
64957 1227789 8430004 15581062 17318168 14577491 7407655 -3708862 -12722518 -13933822
64949 -13933822 -10078861 -5971668 1331108 15369165 27367462 24174066 9155252 1771797
64941 1771797 12339395 27680640 27456908 7630883 -17181126 -29442904 -23049483 -6415876
64933 -6415876 5641342 5967815 1729355 3955537 12638814 18598902 18081610 16136791
64925 16136791 15422050 12464117 7776497 8692956 16694760 21722814 16226497 6492274
64917 6492274 2028960 1452167 -1380156 -3684282 1688636 10987919 11589504 645607
64909 645607 -9173661 -7030108 1153220 1875133 -6286263 -10344839 -1045696 13321416
64901 13321416 16759810 6590951 -3289552 -2176791 3118061 716972 -7117155 -9044443
$$ packed form
64957A227789P202215P151058J737106k740677p169836j1116517r013656j211304
64949a3933822L854961M107193P302776J4038057J1998297l193396j5018814p383455
64941A771797J0567598J5341245k23732j9826025k4812009j2261778O393421J6633607
64933f415876J2057218L26473m238460K226182Q683277N960088n17292j944819
64925A6136791p14741k957933m687620R16459Q001804N028054n496317r734223
64917F492274m463314n76793k832323k304126N372918R299283O01585j0943897
64909F45607r819268K143553Q183328P21913q161396m058576R299143J4367112
64901A3321416L438394j0168859r880503J112761N294852k401089p834127j927288
$$ plain form
64893 -9044443 -4576197 -3691340 -6514528 -651506 15811933 25834302 18548394 7847017
64885 7847017 11157436 21463057 18492722 844931 -11853971 -6598633 10142317 26849885
64877 26849885 38074588 39731826 29020963 13187230 5187080 6230859 4437554 -5442853
64869 -5442853 -13738283 -12597301 -8583897 -11189740 -19223109 -26272137 -30392402 -30587274
64861 -30587274 -22294171 -4633341 15049188 30778626 43875110 52519158 46519093
64854 46519093 23834560 2649396 1868603 15176822 20352077 11483594 4438403 8665798
64846 8665798 11580349 -429165 -19000750 -24537864 -13050092 564606 4366382 2710941
64838 2710941 4520995 7399555 1418369 -14401773 -27829387 -27587015 -15804622 -2636418
$$ packed form
64893i044443M468246Q84857k823188N863022J6463439J0022369p285908j0701377
64885G847017L310419J0305621k970335j7647791j2698902N255338J6740950J6707568
64877B6849885J1224703J657238j0710863j5833733q000150J043779j793305r880407
64869e442853q295430J140982M013404k605843q033369p049028m120265j94872
64861c0587274Q293103J7660830J9682529J5729438J3096484Q644048o000065
64854D6519093k2684533k1185164p80793J3308219N175255q868483p045191M227395
64846H665798K914551j2009514j8571585n537114J1487772J3614698L801776j655441
64838B710941J810054K878560n981186j5820142j3427614K42372J1782393J3168204
$$ plain form
64830 -2636418 6469680 12240305 14099998 9615526 1003034 -5775413 -9493093 -13710012
64822 -13710012 -17216966 -13636395 -3852370 1100215 -4117740 -9332812 -3482083 8109348
64814 8109348 11243118 2894295 -6585602 -8406995 -2769934 6302167 13553502 11397436
64806 11397436 -3146145 -19946365 -23958220 -13372356 -1019696 3202816 2046039
64799 2046039 1720600 3324993 6720011 12904247 17676100 12450374 -2161822 -12134173
64791 -12134173 -7197086 4950368 10205572 7312187 4912042 4002694 -3331479 -17102067
$$ packed form
64830b636418R106098N770625J859693m484472q612492o778447l717680m216919
64822a3710012l506954L580571R784025M952585n217955n215072N850729J1591431
64814H109348L133770q348823r479897j821393N637061R072101P251335k156066
64806A1397436j4543581j6800220m011855J0585864J2352660M222512j156777
64799B046039l25439J604393L395018O184236M771853n225726j4612196r972351
64791a2134173M937087J2147454N255204k893385k400145r09348p334173j3770588
$$ [...]
##END NTUPLES=NMR SPECTRUM
##END=
