##TITLE=31Pdec_IBEP3003
 CDCl3, 24 sc
 1.4.2019
##JCAMPDX= 6.0         $$ Bruker NMR JCAMP-DX V2.0
##DATA TYPE= NMR SPECTRUM
##DATA CLASS= NTUPLES
##ORIGIN= UXNMR, Bruker Analytische Messtechnik GmbH
##OWNER= root
$$ XWIN-NMR		Version 3.5
$$ Mon Apr  1 14:01:30 2019 Russian Standard Time (UT+4h)  she@DPX200
##.OBSERVE FREQUENCY= 81.013821
##.OBSERVE NUCLEUS= ^31P
##.ACQUISITION MODE= SIMULTANEOUS
##.ACQUISITION SCHEME= undefined
##.AVERAGES= 24
##.DIGITISER RES= 17
##SPECTROMETER/DATA SYSTEM= spect
##.PULSE SEQUENCE= zgpg30
##.SOLVENT NAME= CDCl3
##.SHIFT REFERENCE= (INTERNAL, CDCl3, 0, 182.463)
##AUDIT TRAIL= $$ (NUMBER, WHEN, WHO, WHERE, WHAT)
$$ ##TITLE= Audit trail, XWIN-NMR		Version 3.5
$$ ##JCAMPDX= 5.01
$$ ##ORIGIN= Bruker BioSpin GmbH
$$ ##OWNER= she
$$ F:/spectra/data/she/nmr/P31/1/pdata/1/auditp.txt
$$ ##AUDIT TRAIL=  $$ (NUMBER, WHEN, WHO, WHERE, WHAT)
(   1,<2019-04-01 14:00:28.18 +0400>,<she>,<DPX200>,
      <created by zg, POWCHK disabled, PULCHK disabled
       configuration hash MD5:
       00 E9 B6 7A A2 85 ED C7 34 08 36 98 17 FE 4E 26
       data hash MD5: 32K
       FB 01 AB 7D D8 0D FB 73 7A A7 CF A6 E7 B2 95 0D>)
(   2,<2019-04-01 14:00:35.00 +0400>,<she>,<DPX200>,
      <Start of raw data processing
       efp BC_mod = 2 LB = 1 FT_mod = 6 PKNL = 1 PHC0 = -1825.397 PHC1 = 87.59897 SI = 64K 
       data hash MD5: 64K
       71 C6 17 59 8D 53 E9 F9 D9 B4 DF 48 28 50 31 11>)
(   3,<2019-04-01 14:00:51.53 +0400>,<she>,<DPX200>,
      <pk PHC0 = 9.884976 PHC1 = 0 
       data hash MD5: 64K
       CD 12 A2 99 8F EF 53 A4 49 92 A9 62 B7 BA 37 77>)
(   4,<2019-04-01 14:00:54.20 +0400>,<she>,<DPX200>,
      <abs ABSG = 5 
       data hash MD5: 64K
       AB 4E 10 AE 8D E2 48 EC BC 2D 75 AB 3C C9 C9 6C>)
$$ ##END=
$$ 
$$ hash MD5
$$ 3F D9 B2 E5 24 81 CF 19 2B 34 E8 29 00 BB DF DD
##$RELAX= 
##$RELAX= 
##$RELAX= 
##$RELAX= 
##$RELAX= 
##$RELAX= 
##$RELAX= 
##$RELAX= 
$$ Bruker specific parameters
$$ --------------------------
##$DU= <F:/spectra>
##$EXPNO= 1
##$NAME= <P31>
##$PROCNO= 1
##$TYPE= <nmr>
##$USER= <she>
##$AMP= (0..31)
100 100 100 100 100 100 100 100 100 100 100 100 100 100 100 100 100 100 
100 100 100 100 100 100 100 100 100 100 100 100 100 100 
##$AQSEQ= 0
##$AQ_mod= 1
##$AUNM= <au_zg>
##$AUTOPOS= <>
##$BF1= 81.014009
##$BF2= 200.13
##$BF3= 200.13
##$BF4= 200.13
##$BF5= 200.13
##$BF6= 200.13
##$BF7= 200.13
##$BF8= 200.13
##$BYTORDA= 1
##$CFDGTYP= 0
##$CFRGTYP= 5
##$CHEMSTR= <none>
##$CNST= (0..31)
1 1 145 1 1 1 1 1 1 1 1 1 1 1 1 1 1 1 1 1 1 1 1 1 1 1 1 1 1 1 1 1 
##$CPDPRG= <waltz16>
##$CPDPRG1= <>
##$CPDPRG2= <waltz16>
##$CPDPRG3= <>
##$CPDPRG4= <mlev>
##$CPDPRG5= <mlev>
##$CPDPRG6= <mlev>
##$CPDPRG7= <mlev>
##$CPDPRG8= <mlev>
##$CPDPRGB= <>
##$CPDPRGT= <>
##$D= (0..31)
0 1 0 0 0 0 0 0 0 0 0 0.03 2e-05 3e-06 0 0 0 0 0 0 0 0 0 0 0 0 0 0 0 0 
0 0 
##$DATE= 1554112827
##$DBL= (0..7)
120 120 120 11 120 120 24 19 
##$DBP= (0..7)
150 150 150 150 150 150 150 150 
##$DBP07= 0
##$DBPNAM0= <>
##$DBPNAM1= <>
##$DBPNAM2= <>
$$ [...]
##$SUBNAM3= <"">
##$SUBNAM4= <"">
##$SUBNAM5= <"">
##$SUBNAM6= <"">
##$SUBNAM7= <"">
##$SUBNAM8= <"">
##$SUBNAM9= <"">
##$SW= 369.568048894756
##$SWIBOX= (0..15)
0 1 3 0 0 0 0 0 0 0 0 0 0 0 0 0 
##$SW_h= 29940.119760479
##$TD= 32768
##$TD0= 1
##$TE= 0
##$TE2= 300
##$TE3= 300
##$TEG= 300
##$TL= (0..7)
0 120 53 12 22 120 120 120 
##$TP= (0..7)
150 150 150 150 150 150 150 150 
##$TP07= 0
##$TPNAME0= <>
##$TPNAME1= <>
##$TPNAME2= <>
##$TPNAME3= <>
##$TPNAME4= <>
##$TPNAME5= <>
##$TPNAME6= <>
##$TPNAME7= <>
##$TPOAL= (0..7)
0.5 0.5 0.5 0.5 0.5 0.5 0.5 0.5 
##$TPOFFS= (0..7)
0 0 0 0 0 0 0 0 
##$TUNHIN= 0
##$TUNHOUT= 0
##$TUNXOUT= 0
##$USERA1= <user>
##$USERA2= <user>
##$USERA3= <user>
##$USERA4= <user>
##$USERA5= <user>
##$V9= 5
##$VALIST= <valist>
##$VCLIST= <CCCCCCCCCCCCCCC>
##$VD= 0
##$VDLIST= <DDDDDDDDDDDDDDD>
##$VPLIST= <PPPPPPPPPPPPPPP>
##$VTLIST= <TTTTTTTTTTTTTTT>
##$WBST= 1024
##$WBSW= 4
##$XGAIN= (0..3)
0 0 0 0 
##$XL= 0
##$YL= 0
##$YMAX_a= 51385
##$YMIN_a= -61413
##$ZGOPTNS= <>
##$ZL1= 120
##$ZL2= 120
##$ZL3= 120
##$ZL4= 120
##$ABSF1= 182.463
##$ABSF2= -187.1042
##$ABSG= 5
##$ABSL= 3
##$ALPHA= 0
##$AQORDER= 0
##$ASSFAC= 0
##$ASSFACI= 0
##$ASSFACX= 0
##$ASSWID= 0
##$AUNMP= <proc_1d>
##$AZFE= 0.1
##$AZFW= 0.5
##$BCFW= 0
##$BC_mod= 2
##$BYTORDP= 0
##$COROFFS= 0
##$CY= -3
##$DATMOD= 1
##$DC= 0
##$DFILT= <>
##$DTYPP= 0
##$F1P= 0
##$F2P= 0
##$FCOR= 1
##$FTSIZE= 65536
##$FT_mod= 6
##$GAMMA= 0
##$GB= 0
##$INTBC= 1
##$INTSCL= 5.30512e-09
##$ISEN= 30
##$LB= 1
##$LEV0= 0
##$LPBIN= 0
##$MAXI= 10000
##$MC2= 0
##$MEAN= 0
##$ME_mod= 0
##$MI= 50
##$NCOEF= 0
##$NC_proc= -5
##$NLEV= 6
##$NOISF1= 182.463
##$NOISF2= 159.3651
##$NSP= 0
##$NTH_PI= 0
##$NZP= 0
##$OFFSET= 182.463
##$PC= 4
##$PHC0= -1815.512
##$PHC1= 87.59897
##$PH_mod= 1
##$PKNL= yes
##$PPARMOD= 0
##$PSCAL= 0
##$PSIGN= 0
##$REVERSE= no
##$SF= 81.0140089999434
##$SI= 65536
##$SIGF1= 159.3651
##$SIGF2= -187.1042
##$SINO= 113.3802
##$SIOLD= 16384
##$SREGLST= <1H.CDCl3>
##$SSB= 0
##$STSI= 65536
##$STSR= 0
##$SW_p= 29940.119760479
##$SYMM= 0
##$S_DEV= 0
##$TDeff= 32768
##$TDoff= 0
##$TI= <>
##$TILT= no
##$TM1= 0
##$TM2= 0
##$TOPLEV= 0
##$USERP1= <user>
##$USERP2= <user>
##$USERP3= <user>
##$USERP4= <user>
##$USERP5= <user>
##$WDW= 1
##$XDIM= 65536
##$YMAX_p= 342277604
##$YMIN_p= -9510064
$$ End of Bruker specific parameters
$$ ---------------------------------
##NTUPLES= NMR SPECTRUM
##VAR_NAME=  FREQUENCY,     SPECTRUM/REAL,   SPECTRUM/IMAG
##SYMBOL=    X,             R,               I
##VAR_TYPE=  INDEPENDENT,   DEPENDENT,       DEPENDENT
##VAR_FORM=  AFFN,          ASDF,            ASDF
##VAR_DIM=   65536,         65536,           65536
##UNITS=     HZ,            ARBITRARY UNITS, ARBITRARY UNITS
##FACTOR=    0.456856943014862, 1,           1
##FIRST=     14782.0589164792, 0,            0
##LAST=      -15158.0608439998, 0,           0
##MIN=       -15158.0608439998, -9510064,    0
##MAX=       14782.0589164792, 342277604,    0
$$ Real data points
##PAGE= N=1
##DATA TABLE= (X++(R..R)), XYDATA
$$ [...]
$$ plain form
45747 998482 1362386 677297 -359041 -900359 -932668 -897642 -859630 -640167 -374736 -273312
45737 -273312 -65222 684934 1803163 2577761 2581484 2014293 1277196 613183 195787 205611
45727 205611 632778 1118802 1153457 571242 -108549 -106766 586843 940575 166296 -1023805
45717 -1023805 -1264132 -488964 28695 -304839 -600311 -172533 254428 -90222 -566433
45708 -566433 -196578 639807 872340 492533 300953 339996 -12432 -616495 -668331 -211823
45698 -211823 -195356 -890820 -1530266 -1700398 -1809982 -1886029 -1253907 61642 877673 514596
45688 514596 -158157 -130148 253971 107968 -473050 -700203 -402399 -153526 -380818 -1006403
45678 -1006403 -1669254 -1793323 -885200 668618 1574587 1037648 -214735 -922783 -872290
$$ packed form
45747I98482L63904o85089j036338n41318l2309L5026L8012K19463K65431J01424
45737b73312K08090P50156J118229P74598L723n67191p37097o64013m17396R824
45727B05611M27167M86024L4655n82215o79791J783O93609L53732p74279j190101
45717a023805k40327P75168N17659l33534k95472M27778M26961l44650m76211
45708e66433L69855Q36385K32533l79807j91580L9043l52428o04063n1836M56508
45698b11823J6467o95464o39446j70132j09584p6047O32122J315549Q16031l63077
45688E14596o72753K8009L84119j46003n81018k27153K97804K48873k27292o25585
45678a006403o62851j24069R08123J553818R05969n36939j252383p08048N0493
$$ plain form
45669 -872290 -808860 -1171847 -1660702 -1816533 -1389980 -382110 686853 881685 -92756
45660 -92756 -1230326 -1328341 -496663 158766 77251 -374675 -855981 -1414333 -1880700 -1835884
45650 -1835884 -1387780 -1200858 -1490439 -1649010 -1134258 -145276 821812 1527292 1847049
45641 1847049 1630179 1021172 492060 262811 49133 -395136 -849058 -934926 -519873 315977
45631 315977 1319952 1977050 1864699 1264901 926499 1028657 942878 298463 -345110 -353488
45621 -353488 10027 77175 -173627 -257452 -133878 -280034 -839007 -1362690 -1544802 -1663965
45611 -1663965 -2037134 -2425244 -2329291 -1719269 -1183292 -1311698 -2006071 -2440396 -1800283 -162157
45601 -162157 1426193 1885024 1110851 -46058 -724224 -778983 -606540 -527469 -523711 -458607
$$ packed form
45669h72290O3430l62987m88855j55831M26553J007870J068963J94832r74441
45660i2756j137570r8015Q31678O55429q1515m51926m81306n58352m66367M4816
45650a835884M48104J86922k89581j58571N14752R88982R67088P05480L19757
45641A847049k16870o09007n29112k29249k13678m44269m53922q5868M15053Q35850
45631C15977J003975O57098j12351n99798l38402J02158q5779o44415o43573q378
45621c53488L63515O7148k50802q3825J23574j46156n58973n23683j82112j19163
45611a663965l73169l88110R5953O10022N35977j28406o94373m34325O40113J638126
45601a62157J588350M58831p74173j156909o78166n4759J72443P9071L758O5104
$$ plain form
45591 -458607 -320156 -181375 -58390 48579 17817 -299065 -769421 -939549 -482295 395837
45581 395837 1166451 1526047 1542293 1351978 1018071 694380 591242 632860 420586 -246087
45571 -246087 -982223 -1175346 -668911 60180 383058 117567 -308834 -298486 228904 666447
45561 666447 437656 -204174 -446698 -4767 510903 496897 182072 183520 572355 854368
45551 854368 711790 301291 -113867 -378463 -296240 256348 919927 971875 157416 -839165
45541 -839165 -1096038 -557512 -108595 -436889 -1079141 -938056 249220 1362618 1150162
45532 1150162 -203115 -1254177 -1018091 56634 953028 1266726 1120912 521681 -480441
45523 -480441 -1308059 -1303851 -577662 213225 783198 1198941 1101393 -31183 -1647107 -2192526
$$ packed form
45591d58607J38451J38781J22985J06969l0762l16882m70356j70128M57254Q78132
45581C95837P70614L59596J6246j90315l33907l23691j03138M1618k12274o66673
45571b46087p36136j93123N06435P29091L22878k65491m26401J0348N27390M37543
45561F66447k28791o41830k42524M41931N15670j4006l14825J448L88835K82013
45551H54368j42578m10499m15158k64596Q2223N52588O63579N1948q14459r96581
45541h39165k56873N38526M48917l28294o42252J41085J187276J113398k12456
45532A150162j353277j051062K36086J074725Q96394L13698j45814n99231j002122
45523d80441q27618M208P26189P90887N69973M15743r7548j132576j615924n45419
$$ plain form
45513 -2192526 -983551 798421 1643292 1537551 1456869 1644784 1436274 535316 -537957
45504 -537957 -1255299 -1488039 -1117406 -114536 896375 1048403 434028 35988 162171
45495 162171 -91100 -1264904 -2365407 -2152819 -941468 -86272 -59757 -112690 280846
45486 280846 706211 686776 383164 124553 -44157 -55291 289257 800557 894876 462153
45476 462153 141622 314239 439274 -38619 -681224 -694648 -192014 6899 -336513 -624374
45466 -624374 -488487 -353469 -719244 -1466578 -2143588 -2496765 -2462273 -1997797 -1192553 -318872
45456 -318872 374275 737142 636396 165938 -102313 373547 1237196 1470425 747377 -46571
45446 -46571 -31510 512876 743273 491140 215505 74201 -177851 -514582 -610546 -474116
$$ packed form
45513b192526J208975J781972Q44871j05741q0682J87915k08510r00958j073273
45504e37957p17342k32740L70633J002870J010911J52028o14375l98040J26183
45495A62171k53271j173804j100503K12588J211351Q55196K6515n2933L93536
45486B80846M25365j9435l03612k58611j68710j1134L44548N11300R4319m32723
45476D62153l20531J72617J25035m77893o42605j3424N02634J98913l43412k87861
45466f24374J35887J35018l65775p47334o77010l53177L4492M64476Q05244Q73681
45456c18872O93147L62867j00746m70458k68251M75860Q63649K33229p23048p93948
45446d6571J5061N44386K30397k52133k75635j41304k52052l36731r5964J36430
$$ plain form
45436 -474116 -453869 -603761 -667740 -673915 -818962 -738008 209084 1661347 2211990 1208974
45426 1208974 -189883 -494808 239740 893477 1087210 1366433 1766218 1431716 -17201
45417 -17201 -1684356 -2455886 -2221039 -1584170 -912941 -199434 508239 1041547 1279362 1082001
45407 1082001 364428 -479413 -664471 14593 696060 519878 -126655 -134225 723036 1487624
45397 1487624 1364849 621513 -55994 -405013 -444310 -102036 507355 843593 505557 -187837
45387 -187837 -593205 -505102 -150648 309866 801285 1053515 848404 461973 324652 285430
45377 285430 -179056 -966271 -1266402 -780028 -350459 -823308 -1769019 -2081036 -1584104 -1181391
45367 -1181391 -1360816 -1459561 -835337 -15154 71019 -438380 -541963 45728 481605 224313
$$ packed form
45436d74116K0247j49892o3979o175j45047Q0954R47092J452263N50643j003016
45426A208974j398857l04925P34548O53737J93733K79223L99785l34502j448917
45417a7201j667155p71530K34847O36869O71229P13507P07673N33308K37815j97361
45407A082001p17573q43841j85058O79064O81467j76182o46533p570Q57261P64588
45397A487624j22775p43336o77507l49019l9297L42274O09391L36238l38036o93394
45387a87837m05368Q8103L54454M60514M91419K52230k05111l86431j37321l9222
45377B85430m64486p87215l00131M86374M29569m72849r45711l12017M96932M02713
45367a181391j79425r8745O24224Q20183Q6173n09399j03583N87691M35877k57292
$$ plain form
45357 224313 -17588 594506 1600076 1804397 981508 96306 -157461 -131469 -292496 -366643
45347 -366643 58945 703763 1018880 1041700 1152503 1241212 844547 48992 -435193 -208315
45337 -208315 379265 858160 1145890 1190334 689492 -357387 -1197098 -1015269 856
45328 856 786539 646968 -24202 -425090 -371179 -301368 -473571 -654578 -704912 -987924 -1779408
45317 -1779408 -2533586 -2336603 -1148155 -29099 145715 -255675 -265073 340138 887354
45308 887354 853896 489311 333806 558852 927280 1112123 950406 595682 437295 650884
45298 650884 884988 677072 104414 -336426 -433790 -402448 -328583 2581 588941 1019216
45288 1019216 1046183 948487 1043235 1170291 955837 361223 -249893 -421243 61362 827604
$$ packed form
45357B24313k41901O12094J005570K04321q22889q85202k53767K5992j61027p4147
45347c66643M25588O44818L15117K2820J10803Q8709l96665p95555m84185K26878
45337b08315N87580M78895K87730M4444n00842j046879q39711J81829J016125
45328H56P85683j39571o71170m00888N3911O9811j72203j81007n0334k83012p91484
45317a779408p54178J96983J188448J119056J74814m01390r398O05211N47216
45308H87354l3458l64585j55505K25046L68428J84843j61717l54724j58387K13589
45298F50884K34104k07916n72658m40840r7364L1342P3865L31164N86360M30275
45288A019216K6967r7696R4748J27056k14454n94614o11116j71350M82605P66242
$$ plain form
45278 827604 926513 -272271 -2016690 -2651434 -1540457 69858 614413 92896 -274009
45269 -274009 172106 926056 1302544 1171984 695950 85768 -239315 68401 631134 593521
45259 593521 -171535 -680807 -110401 1002865 1410618 784241 79698 206889 839757
45250 839757 872994 -154842 -1468905 -1945755 -1332788 -383236 76845 -82576 -449983
45241 -449983 -647295 -569654 -298582 -42690 -66925 -467398 -1037357 -1447807 -1488674 -1112841
45231 -1112841 -452695 105478 106903 -512225 -1297579 -1741940 -1718994 -1393820 -976883 -674895
45221 -674895 -562143 -357857 301616 1207310 1639977 1305843 686009 158363 -583322 -1742553
45211 -1742553 -2722888 -2941388 -2782540 -2890138 -2978525 -2344895 -1237501 -609509 -644581 -634872
$$ packed form
45278H27604R8909j198784j744419o34744J110977J610315N44555n21517l66905
45269b74009M46115P53950L76488j30560m76034o10182l25083L07716N62733l7613
45259E93521p65056n09272N70406J113266M07753o26377p04543J27191O32868
45250H39757L3237j027836j314063m76850O12967R49552M60081j59421l67407
45241d49983j97312P7641K71072K55892k4235m00473n69959m10450m0867L75833
45231a112841O60146N58173J425o19128p85354m44361K2946L25174M16937L01988
45221f74895J12752K04286O59473R05694M32667l34134o19834n27646p41685j159231
45211a742553r80335k18500J58848j07598q8387O33630J107394O27992l5072R709
$$ plain form
45201 -634872 -311899 -164312 -320220 -282985 -56980 -374311 -1340655 -1945261 -1533655 -798555
45191 -798555 -604678 -709256 -452652 47099 291868 409618 845967 1434717 1589657 1151154
45181 1151154 393160 -482864 -1255555 -1493359 -1128414 -838783 -1170617 -1658389 -1535070
45172 -1535070 -916413 -464624 -242016 156909 568155 379733 -325773 -703847 -363831
45163 -363831 150918 271611 81970 -114277 -290395 -544995 -921274 -1482355 -2145390 -2479856
45153 -2479856 -2181169 -1661589 -1560294 -1736548 -1462197 -630063 -10422 -168830 -829500
45144 -829500 -1464273 -1809766 -1635135 -777005 277863 562167 -198277 -1140925 -1352594
45135 -1352594 -850906 -143479 593292 1425831 2217794 2737180 2892084 2571083 1645001
$$ packed form
45201f34872L22973J47587j55908L7235K26005l17331r66344o04606M11606P35100
45191g98555J93877j04578K56604M99751K44769J17750M36349N88750J54940m38503
45181A151154p57994q76024p72691k37804L64945K89631l31834m87772J23319
45172a535070O18657M51789K22608L98925M11246j88422p05506l78074L40016
45163c63831N14749J20693j89641j96247j76118k54600l76279n61081o63035l34466
45153b479856K98687N19580J01295j76254K74351Q32134O19641j58408o60670
45144h29500o34773l45493J74631Q58130J054868K84304p60444r42648k11669
45135a352594N01688P07427P36771Q32539P91963N19386J54904l21001r26082
$$ plain form
45126 1645001 386218 -572096 -966212 -1113946 -1180678 -867938 -161010 339539 349321 465233
45116 465233 1130072 1666011 1180620 -29277 -897755 -1124242 -1350608 -1926692 -2437947
45107 -2437947 -2561875 -2567739 -2686341 -2591192 -1835787 -453265 1053113 2029894 1970868 912695
45097 912695 -360377 -875240 -388659 478448 1040053 1183470 1190289 1266494 1392471 1432279
45087 1432279 1278992 983802 737032 659218 727158 962891 1422382 1841632 1682206 872802
45077 872802 143402 149375 564439 600311 175826 -96034 43423 166911 -112896 -719691
45067 -719691 -1437953 -2024270 -1983115 -990908 296124 645307 -198907 -1063362 -877254 3441
45057 3441 565245 649007 924493 1655648 2291707 2312683 1870493 1407391 1038404 564541
$$ packed form
45126A645001j258783r58314l94116j47734o6732L12740P06928N00549R782J15912
45116D65233O64839N35939m85391j209897q68478k26487k26366n76084n11255
45107b437947j23928n864j18602R5149P55405J382522J506378R76781n9026j058173
45097I12695j273072n14863M86581Q67107N61605J43417O819P6205J25977L9808
45087A432279j53287k95190k46770p7814O7940K35733M59491M19250j59426q09404
45077H72802p29400N973M15064L5872m24485k71860J39457J23488k79807o06795
45067g19691p18262n86317M1155R92207J287032L49183q44214q64455J86108Q80695
45057C441N61804Q3762K75486P31155O36059K0976m42190m63102l68987m73863
$$ plain form
45047 564541 -72733 -575285 -573613 -61203 581420 1031427 1282823 1321956 908218 119176
45037 119176 -213045 632157 2032471 2531500 1741064 817631 686866 804279 368873
45028 368873 -203714 -96989 332205 135997 -424191 -141899 1010259 1509633 545834
45019 545834 -653320 -639566 110648 22822 -1175474 -2137411 -1885476 -989654 -489889 -529703
45009 -529703 -574130 -394260 -198581 -56576 194446 486623 485401 177186 82548 557632
44999 557632 1125965 947746 -38575 -845400 -513739 779985 1949247 2190830 1669525
44990 1669525 1046517 640385 241604 -354238 -872254 -803336 -139514 371451 16419 -872996
44980 -872996 -1111836 -65809 1481831 2212304 1774009 967174 566369 502113 322256
$$ packed form
45047E64541o37274n02552J672N12410O42623M50007K51396L9133m13738p89042
45037A19176l32221Q45202J400314M99029p90436r23433j30765J17413m35406
45028C68873n72587J06725M29194j96208n60188K82292J152158M99374r63799
45019E45834j199154J3754P50214q7826j198296r61937K51935Q95822M99765l9814
45009e29703m4427J79870J95679J42005K51022K92177j222l08215r4638M75084
44999E57632N68333j78219r86321q06825L31661J293724J169262K41583n21305
44990A669525o23008m06132l98781n95842n18016O8918O63822N10965l55032q89415
44980h72996k38840J046027J547640P30473m38295q06835m00805o4256j79857
$$ plain form
44971 322256 -410 -52745 396833 1027547 1253337 830272 139914 -227346 -169486 -125442
44961 -125442 -366071 -636428 -775786 -1181409 -2044270 -2545599 -1764498 -282040 215652
44952 215652 -795828 -1858646 -1535511 -286846 472497 410531 303254 522144 716840
44943 716840 873495 1476771 2389731 2604916 1588127 141117 -563667 -274584 412613
44934 412613 890370 841913 177469 -763165 -1213306 -711353 280353 866679 721378 290032
44924 290032 124230 321895 548220 382721 -245722 -803118 -550386 562580 1648644
44915 1648644 1842713 1289645 825838 906726 1307833 1732240 2151931 2512534 2605269 2394279
44905 2394279 2108843 1877863 1605587 1328502 1320539 1625099 1803359 1449977 764035 314543
$$ packed form
44971C22256l22666n2335M49578O30714K25790m23065o90358l67260N7860M4044
44961a25442k40629k70357j39358m05623q62861n01329P81101J482458M97692
44952B15652j011480j062818L23135J248665P59343o1966j07277K18890J94696
44943G16840J56655O03276R12960K15185j016789j447010p04784K89083O87197
44934D12613M77757m8457o64444r40634m50141N01953R91706N86326j45301m31346
44924B90032j65802J97665K26325j65499o28443n57396K52732J112966J086064
44915A648644J94069n53068m63807Q0888M01107M24407M19691L60603R2735k10990
44905B394279k85436k30980k72276k77085p963L04560J78260l53382o85942m49492
$$ plain form
44895 314543 349600 616599 837508 1090695 1591760 2208996 2392498 1729361 555706 -194432
44885 -194432 66335 895071 1312049 923593 267726 17380 181624 310241 258860 396597
44875 396597 999689 1680391 1694615 901561 191581 601068 1987051 3020656 2738043
44866 2738043 1670057 1002458 1018028 1061232 827618 790244 1196320 1461508 982275 -6210
44856 -6210 -775908 -857707 -153490 1152947 2411023 2794470 2272640 1779393 1901063 1992723
44846 1992723 1301697 388556 450046 1542785 2509782 2576190 2045396 1420183 832147 471394
44836 471394 594161 845889 524502 -151064 -23569 1244446 2356942 2055998 791305
44827 791305 -143779 -456450 -789725 -1251299 -1176193 -347012 518180 727707 419676 194484
$$ packed form
44895C14543L5057K66999K20909K53187N01065O17236J83502o63137j173655p50138
44885a94432K60767Q28736M16978l88456o55867k50346J64244J28617n1381J37737
44875C96597O03092O80702J4224p93054p09980M09487J385983J033605k82613
44866B738043j067986o67599J5570M3204k33614l7374M06076K65188m79233r88485
44856f210p69698q1799P04217J306437J258076L83447n21830m93247J21670R1660
44846A992723o91026r13141O1490J092739R66997O6408n30794o25213n88036l60753
44836D71394J22767K51728l21387o75566J27495J268015J112496l00944j264693
44827G91305r35084l12671l33275m61574P5106Q29181Q65192K09527l08031k25192
$$ plain form
44817 194484 392488 859246 1101312 692510 -159840 -601662 -85916 855068 1281482 1069923
44807 1069923 844665 873587 821126 583588 517302 655557 510944 -27484 -364287 -200024
44797 -200024 -151873 -782377 -1587633 -1655933 -941873 -169353 272288 593716 875658 826713
44787 826713 403176 77662 228251 631923 787121 479395 -128238 -718278 -966838 -692358
44777 -692358 -74998 388817 354415 34410 -1839 527623 1243037 1445442 848871 -87969
44767 -87969 -623418 -474196 5452 314944 272514 -7043 -317195 -395283 20035 921790
44757 921790 1902461 2462697 2414664 1905995 1188669 511852 108026 72247 281411 547613
44747 547613 782348 925534 871107 643120 521487 760448 1220039 1474786 1285150 794900
$$ packed form
44817A94484J98004M66758K42066m08802q52350m41822N15746R40984M26414k11559
44807A069923k25258K8922n2461k37538o6286J38255j44613n38428l36803J64263
44797b00024M8151o30504q05256o8300P14060P72520M41641L21428K81942m8945
44787H26713m23537l25514J50589M03672J55198l07726o07633n90040k48560K74480
44777f92358O17360M63815l4402l20005l6249N29462P15414K02405n96571r36840
44767h7969n35449J49222M79648L09492m2430k79557l10152p8088M15318R01755
44757I21790R80671N60236m8033n08669p17326o76817m03826l5779K09164K66202
44747E47613K34735J43186n4427k27987j21633K38961M59591K54747j89636m90250
$$ plain form
44737 794900 238155 -397726 -1293052 -2368361 -3053048 -2735243 -1581720 -622153 -618548 -1022863
44727 -1022863 -627107 771902 2055009 2296731 1818997 1331113 850114 216578 -24481
44718 -24481 674780 1642459 1600489 446051 -625544 -850978 -707554 -769331 -817181 -558515
44708 -558515 -299416 -278495 -121398 341677 427825 -383321 -1344585 -1337605 -575815 -387820
44698 -387820 -1294651 -2229780 -1966562 -656468 476131 604891 61625 -270281 -22482
44689 -22482 351777 310164 789 -12094 341945 581965 626423 1108593 2356781 3691480
44679 3691480 4294335 4212582 3841038 3015605 1577174 377343 476166 1413465 1561278
44670 1561278 458619 -424778 173832 1476033 1839657 1027854 280176 472212 1178636
$$ packed form
44737G94900n56745o35881q95326j075309o84687L17805J153523R59567L605m04315
44727a022863L95756J399009J283107K41722m77734m87884m80999o33536k41059
44718b4481O99261R67679m1970j154438j071595k25434J43424o1777m7850K58666
44708e58515K59099K0921J57097M63075Q6148q11146r61264O980P61790J87995
44698c87820r06831r35129K63218J310094J132599J28760n43266l31906K47799
44689b2482L74259m1613l09375j2883L54039K40020M4458M82170J248188J334699
44679C691480O02855q1753l71544q25433j438431j199831R8823R37299J47813
44670A561278j102659q83397N98610J302201L63624q11803p47678J92036P06424
$$ plain form
44661 1178636 1540869 1270983 621131 -58710 -449389 -318766 225036 672494 569703
44652 569703 72090 -129527 397507 1170455 1221196 297209 -723202 -935051 -578457 -568428
44642 -568428 -1099893 -1457584 -1188367 -663388 -297224 8023 309955 276427 -118454 -212353
44632 -212353 434760 1303044 1719684 1887863 2378998 3029534 3183278 2774037 2330104 2041079
44622 2041079 1644273 1200935 1168254 1595486 1960259 1953708 1805655 1704641 1522170 1269793
44612 1269793 1208626 1309172 1217455 990308 1217967 2057713 2726318 2407383 1220491 -123281
44602 -123281 -1176365 -1786203 -1720588 -948393 -125218 -137627 -1063771 -2008742 -2094790 -1335863
44592 -1335863 -442900 -11916 -68516 -292795 -478322 -646013 -764300 -606663 -76075 476725
$$ packed form
44661A178636L62233k69886o49852o79841l90679J30623N43802M47458j02791
44652E69703m97613k01617N27034P72948N0741r23987j020411k11849L56594J0029
44642e68428n31465l57691K69217N24979L66164L05247L01932l3528l94881r3899
44632b12353O47113Q68284M16640J68179M91135O50536J53744m09241m43933k89025
44622B041079l96806m43338l2681M27232L64773o551j48053j01014j82471k52377
44612A269793o1167J00546r1717k27147K27659Q39746O68605l18935j186892j343772
44602a23281j053084o09838O5615P72195Q23175j2409r26144r44971q6048P58927
44592a335863Q92963M30984n6600k24279j85527j67691j18287J57637N30588N52800
$$ plain form
44582 476725 519070 -134756 -1245450 -2414527 -3119249 -2735989 -1107940 938510 2209994
44573 2209994 2344257 1908987 1390016 825881 484809 913546 1901986 2324786 1658807
44564 1658807 845984 858185 1178249 752523 -156704 -376965 180365 335598 -394039 -932401
44554 -932401 -247920 1184624 2164284 2259504 1867790 1371917 951225 855780 1171972 1479503
44544 1479503 1301654 813737 638380 972997 1337134 1237892 759685 353048 206853 12111
44534 12111 -572033 -1260667 -1215216 -48611 1417979 1890023 1125082 203117 97466 541329
44524 541329 716538 574744 817855 1745753 2769733 3157346 2801195 2087009 1329443
44515 1329443 570436 -190845 -739745 -681160 169783 1385532 2116797 1915949 1265695
$$ packed form
44582D76725M2345o53826j110694j169077p04722L83260J628049K046450J271484
44573B209994J34263m35270n18971n64135l41072M28737R88440M22800o65979
44564A658807q12823J2201L20064m25726r09227k20261N57330J55233p29637n38362
44554i32401O84481J432544R79660R5220l91714m95873m20692r5445L16192L07531
44544A479503j77849m87917j75357L34617L64137r9242m78207m06637j46195j94742
44534A2111n84144o88634M5451J166605J466590M72044p64941r21965j05651M43863
44524E41329J75209j41794K43111R27898J023980L87613l56151p14186p57566
44515A329443p59007p61281n48900N8585Q50943J215749P31265k00848o50254
$$ plain form
44506 1265695 1024859 1395205 1735260 1447139 756152 422101 832519 1605393 2080161
44497 2080161 2017997 1706192 1472717 1323222 1139688 1024350 1185098 1535443 1684800 1391866
44487 1391866 843773 437204 422595 724467 908541 424613 -761795 -1812339 -1748161
44478 -1748161 -625135 498266 905444 976731 1342301 1916320 2275375 2450939 2664358
44469 2664358 2652681 2023459 1083311 556684 545579 482061 123142 -104527 150471 708999
44459 708999 1276615 1721098 1819259 1363737 720334 659052 1353243 2092235 2259566 2061125
44449 2061125 1999684 2168882 2387748 2519674 2360024 1772381 1244461 1626082 2861089
44440 2861089 3688899 3227106 2191238 1793819 2051348 2115330 1792281 1622743 1678737 1433735
$$ packed form
44506A265695k40836L70346L40055k88121o90987l34051M10418P72874M74768
44497B080161o2164l11805k33475j49495j83534j15338J60748L50345J49357k92934
44487A391866n48093m06569j4609L01872J84074m83928j186408j050544O4178
44478a748161J123026J123401M07178P1287L65570N74019L59055J75564K13419
44469B664358j1677o29222r40148n26627j1105o3518l58919k27669K54998N58528
44459G08999N67616M44483R8161m55522o43403o1282O94191P38992J67331j98441
44449B061125o1441J69198K18866J31926j59650n87643n27920L81621J235007
44440B861089Q27810m61793j035868l97419K57529O3982l23049j69538N5994k45002
$$ plain form
44430 1433735 879337 728702 1265393 1845733 1847232 1412332 980895 721180 679840 891766
44420 891766 1072925 753581 -28861 -662129 -770322 -606900 -537728 -688852 -1150166 -1830241
44410 -1830241 -2050214 -1160332 246122 731180 3042 -543388 139434 1253486 1538700
44401 1538700 1152960 1044517 1230142 998715 331925 -195927 -628467 -1415191 -2145170
44392 -2145170 -1860242 -712295 -4298 -316290 -785380 -610814 -122053 156471 431224
44383 431224 967320 1384219 1324214 1069015 822078 141276 -1128059 -2052108 -1700804 -595355
44373 -595355 -110973 -674857 -1424307 -1532002 -1066749 -543194 -317611 -504838 -928374 -1084712
44363 -1084712 -644090 -26697 -10106 -700441 -1332320 -1193592 -375869 504305 999609 1089479
$$ packed form
44430A433735n54398j50635N36691N80340J499m34900m31437k59715m1340K11926
44420H91766J81159l19344p82442o33268j08193J63422O9172j51124m61314o80075
44410a830241k19973Q89882J406454M85058p28138n46430O82822J114052K85214
44401A538700l85740j08443J85625k31427o66790n27852m32540p86724p29979
44392b145170K84928J147947P07997l11992m69090J74566M88761K78524K74753
44383D31224N36096M16899o0005k55199k46937o80802j269335r24049L51304J105449
44373e95355M84382n63884p49450j07695M65253N23555K25583j87227m23536j56338
44363a084712M40622O17393J6591o90335o31879J38728Q17723Q80174M95304Q9870
$$ plain form
44353 1089479 971441 787963 558232 356563 440311 942126 1446395 1285636 401023 -540418
44343 -540418 -1077273 -1415053 -1624654 -1147618 173086 1224161 833730 -489257 -1158734
44334 -1158734 -738296 -354359 -731689 -1071292 -455052 632948 982315 219542 -1025746
44325 -1025746 -2039103 -2430660 -2022150 -1035772 -189942 -6373 -155691 10124 439925
44316 439925 440886 -300224 -1239135 -1564344 -939663 317532 1482311 1871318 1366005 551102
44306 551102 167288 441523 1036804 1479266 1471110 1022366 536546 555147 1125376 1621657
44296 1621657 1495200 969307 643827 679564 826402 995459 1213977 1202078 719330 302758
44286 302758 864878 2377598 3704832 4050644 3843676 3743049 3526133 2704153 1674653
$$ packed form
44353A089479j18038j83478k29731k01669Q3748N01815N04269j60759q84613r41441
44343e40418n36855l37780k09601M77036J320704J051075l90431j322987o69477
44334a158734M20438L83937l77330l39603O16240J088000L49367p62773j245288
44325a025746j013357l91557M08510R86378Q45830J83569j49318J65815M29801
44316D39925R61p41110r38911l25209O24681J257195J164779L89007n05313q14903
44306E51102l83814K74235N95281M42462q156m48744m85820J8601N70229M96281
44296A621657j26457n25893l25480L5737J46838J69057K18518j1899m82748m16572
44286C02758N62120J512720J327234L45812k06968j00627k16916q21980j029500
$$ plain form
44277 1674653 1307373 1617452 1787311 1485682 1252068 1407532 1481673 1129938 856563 1239854
44267 1239854 2004261 2503464 2695067 2947493 3187771 2975024 2268064 1441786 659185
44258 659185 -84949 -420762 63654 918802 1133785 497277 -218561 -636952 -1277914 -2209189
44248 -2209189 -2349459 -1046720 549773 871658 106830 -239343 391168 1062917 973869
44239 973869 396528 -129728 -443085 -375567 264178 1046446 1198370 819914 893890 1761343
44229 1761343 2560911 2614280 2377309 2420024 2378324 1662210 485418 -514112 -1055087 -1029829
44219 -1029829 -272563 842270 1348392 983712 766793 1465812 2330181 2347878 1938781
44210 1938781 2149293 2829451 3016603 2655880 2440188 2243355 1322975 27076 -348386
$$ packed form
44277A674653l67280L10079J69859l01629k33614J55464P4141l51735k73375L83291
44267A239854P64407M99203J91603K52426K40278k12747p06960q26278p82601
44258F59185p44134l35813M84416Q55148K14983o36508p15838m18391o40962r31275
44248b209189j40270J302739J596493L21885p64828l46173O30511O71749q9048
44239I73869n77341n26256l13357O7518O39745P82268J51924l78456P3976Q67453
44229A761343P99568N3369k36971M2715m1700p16114j176792r99530n40975K5258
44219a029829P57266J114833N06122l64680k16919O99019Q64369J7697m09097
44210A938781K10512O80158J87152l60723k15692j96833r20380j295899l75462
$$ plain form
44201 -348386 370503 865265 433189 -18471 320351 867613 887492 808627 1303343 1979824
44191 1979824 2021671 1469164 953698 705795 639588 902126 1537136 2042156 1991536 1682568
44181 1682568 1511465 1227349 551158 795 189479 684261 520507 -356110 -1052318
44172 -1052318 -998833 -436857 226387 683796 448729 -709972 -1936341 -1842480 -242161
44163 -242161 1431339 1844648 1252341 809008 992436 1368944 1586847 1845156 2316771
44154 2316771 2695266 2660499 2516932 2912507 3866609 4489514 4009464 2830929 2060856
44145 2060856 2055795 2076176 1523353 806786 556846 610636 432678 79328 -37854 -67673
44135 -67673 -531056 -1264994 -1401908 -595789 414575 759542 430044 3964 -193079 -284397
$$ packed form
44201c48386P18889M94762m32076m51660L38822N47262J9879p8865M94716O76481
44191A979824M1847n52507n15466k47903o6207K62538O35010N05020n0620l08968
44181A682568j71103k84116o76191n50363J88684M94782j63754q76617o96208
44172a052318N3485N61976O63244M57409k35067j158701j226369R3861J600319
44163b42161J673500M13309n92307m43333J83428L76508K17903K58309M71615
44154B316771L78495l4767j43567L95575R54102O22905m80050j178535p70073
44145B060856n061K0381n52823p16567k49940N3790j77958l53350j17182k9819
44135f7673m63383p33938j36914Q06119J010364L44967l29498m26080j97043r1318
$$ plain form
44125 -284397 -434219 -551714 -357243 325687 1263266 1889497 1914189 1730011 1879047 2232979
44115 2232979 2176465 1597455 1156697 1411207 2126564 2677938 2737096 2319087 1531046 615932
44105 615932 -10630 -106044 153021 498299 961234 1668105 2397810 2688819 2398749 1898110
44095 1898110 1624616 1623495 1650705 1593351 1551661 1487333 1085646 235639 -509311 -343419
44085 -343419 883552 2493502 3721412 4219085 3827841 2532140 942963 149812 536548
44076 536548 1269245 1546561 1774849 2698598 3907284 4310117 3830208 3428894 3474604 3337675
44066 3337675 2823578 2744070 3536242 4423062 4658833 4662835 5078126 5513292 5219586 4459062
44056 4459062 4150114 4448434 4660375 4462588 4328910 4684250 5342472 5928299 6360352
$$ packed form
44125b84397j49822j17495J94471O82930R37579O26231K4692j84178J49036L53932
44115B232979n6514n79010m40758K54510P15357N51374N9158m18009p88041r15114
44105F15932o26562r5414K59065L45278M62935P06871P29705K91009k90070n00639
44095A898110k73494j121K7210n7354m1690o4328m01687q50007p44950J65892
44085c43419J226971J609950J227910M97673l91244j295701j589177p93151L86736
44076E36548P32697K77316K28288R23749J208686M02833m79909m01314M5710j36929
44066C337675n14097p9508P92172Q86820K35771M002M15291M35166k93706p60524
44056D459062l08948K98320K11941j97787j33678L55340O58222N85827M32053
$$ plain form
44047 6360352 6828264 7642770 9034923 10724164 11858660 11895505 11430489 11603876 12722122
44038 12722122 14008782 14701078 14800762 14671541 14523162 14537452 14972229 15777016 16462012
44029 16462012 16691368 16734725 16995311 17323451 17216286 16616732 16068414 15939237 15830544
44020 15830544 15055579 13527762 11790749 10205202 8612096 7015980 6055581 6224680
44012 6224680 6942692 7111275 6487307 5762890 5299825 4670498 3668588 2845910 2564031
44003 2564031 2342514 1786599 1408208 1718028 2124314 1690121 594605 -98745 110278
43994 110278 794214 1450158 1863979 1840313 1458093 1402875 2109564 2773577 2289738 1045686
43984 1045686 528965 1083332 1423710 726870 -170175 -294229 7625 19348 -6942 474346
$$ packed form
44047F360352M67912Q14506J392153J689241J134496L6845m65016J73387J118246
44038A2722122J286660O92296R9684j29221j48379J4290M34777Q04787O84996
44029A6462012K29356M3357K60586L28140j07165n99554n48318j29177j08693
44020A5830544p74965j527817j737013j585547j593106j596116r60399J69099
44012F224680P18012J68583o23968p24417m63065o29327j001910q22678k81879
44003B564031k21517n55915l78391L09820M06286m34193j095516o93350K09023
43994A10278O83936O55944M13821k3666l82220n5218P06689O64013m83839j244052
43984A045686n16721N54367L40378o96840q97045j24054L01854J1723k6290M81288
$$ plain form
43974 474346 1109854 1246748 1115060 1292794 1456570 826639 -418810 -1321188 -1618305
43965 -1618305 -1915599 -2330740 -2102602 -904643 382558 748141 275234 -219806 -312426
43956 -312426 -218665 -187629 -133233 141934 628251 1091335 1322287 1357204 1341521 1185068
43946 1185068 651505 -45826 -143715 741634 1885252 2236998 1789017 1531029 2067233
43937 2067233 2937925 3419919 3338334 2844443 2027471 1161597 831054 1280669 1934707 2039700
43927 2039700 1601077 1259858 1377051 1662794 1683702 1384706 1060348 1035890 1400863 1908104
43917 1908104 2170237 2076267 1906789 1895247 1864200 1563019 1202114 1247877 1688001 1908370
43907 1908370 1458721 640576 121582 179071 562418 958068 1311376 1698577 2089878 2303315
$$ packed form
43974D74346O35508J36894j31688J77734J63776o29931j245449r02378k97117
43965a618305k97294m15141K28138J197959J287201L65583m72907m95040r2620
43956c12426R3761L1036N4396K75167M86317M63084K30952L4917j5683j56453
43946A185068n33563o97331r7889Q85349J143618L51746m47981k57988N36204
43937B067233Q70692M81994q1585m93891q16972q65874l30543M49615O54038J04993
43927B039700m38623l41219J17193K85743K0908k98996l24358k4458L64973N07241
43917A908104K62133r3970j69478j1542l1047l01181l60905M5763M40124K20369
43907A908370m49649q18145n18994N7489L83347L95650L53308L87201L91301K13437
$$ plain form
43897 2303315 2124346 1505572 726235 247646 240512 345406 142228 -208628 -151905 372299
43887 372299 651616 114649 -779222 -984469 -94459 1251332 2129539 2129234 1408250 405506
43877 405506 -338605 -425604 67925 647453 942837 1073542 1397886 2039521 2707731 2870599
43867 2870599 2196380 1065005 487758 1066426 2093706 2282584 1466156 873335 1456417
43858 1456417 2708178 3638766 4175737 4802166 5388956 5418920 5103413 5197043 5685647 5678258
43848 5678258 4840829 4019486 4013705 4491181 4674000 4518932 4568785 4971401 5272276 5083005
43838 5083005 4500867 3872813 3445863 3269315 3261047 3326542 3412441 3390207 3015114 2246237
43828 2246237 1515151 1327248 1628738 1952779 2145795 2441526 2796743 2790269 2380581 2124751
$$ packed form
43897B303315j78969o18774p79337m78589p134J04894k03178l50856N6723N24204
43887C72299K79317n36967q93871k05247Q90010J345791Q78207l05p20984j002744
43877D05506p44111q6999M93529N79528K95384J30705L24344O41635O68210J62868
43867B870599o74219j131375n77247N78668J027280J88878q16428n92821N83082
43858A456417J251761R30588N36971O26429N86790K9964l15507R3630M88604p389
43848E678258q37429q21343n781M77476J82819j55068M9853M02616L00875j89271
43838E083005n82138o28054m26950j76548q268O5495Q5899k2234l75093p68877
43828B246237p31086j87903L01490L24041J93016K95731L55217o474m09688k55830
$$ plain form
43818 2124751 2292079 2346977 1795668 1058464 914382 1396835 1813857 1676311 1107287 465835
43808 465835 11445 -138990 -80982 -84986 -254438 -376479 -291940 -124036 72628 475585
43798 475585 980507 1005091 307296 -423127 -397065 185006 523921 416889 345109 545560
43788 545560 717062 578570 94445 -721514 -1567796 -1621590 -380102 1335359 2110871
43779 2110871 1731560 1346765 1723293 2317626 2412815 2210661 2223760 2354237 2237992 1938574
43769 1938574 1674002 1311195 726380 288455 398621 815428 950482 646621 258157
43760 258157 132616 328670 678943 927295 996642 1151271 1531762 1627311 921070 86392
43750 86392 515822 2260101 3506421 2852704 1152857 153135 174072 369770 571848
$$ packed form
43818B124751J67328N4898n51309p37204j44082M82453M17022j37546n69024o41452
43808D65835m54390j50435N8008m004j69452j22041Q4539J67904J96664M02957
43798D75585N04922K4584o97795p30423K6062N82071L38915j07032p1780K00451
43788E45560J71502j38492m84125q15959q46282n3794J241488J715461P75512
43779B110871l79311l84795L76528N94333R5189k02154J3099J30477j16245k99418
43769A938574k64572l62807n84815m37925J10166M16807J35054l03861l88464
43760B58157j25541J96054L50273K48352O9347J54629L80491R5549p06241q34678
43750H6392M29430J744279J246320o53717j699847r99722K0937J95698K02078
$$ plain form
43741 571848 1310227 2252386 2225915 1021891 -135848 -287694 200466 631653 928112
43732 928112 1088191 765040 114836 165885 1435614 2814358 2802127 1505418 468831
43723 468831 645524 1412184 1718736 1448356 1208432 1202787 894720 -136773 -1361440 -1679051
43713 -1679051 -676824 789420 1500124 1167821 540848 370795 663452 919829 749850
43704 749850 201408 -260503 -136805 502361 956855 780004 499912 965397 2166231
43695 2166231 3315958 3960385 4263936 4253749 3668219 2729488 2204843 2351579 2529418
43686 2529418 2226070 1784542 1743881 2141691 2842103 3804336 4574338 4325774 3035992
43677 3035992 1879485 1737326 2012497 1728026 1122938 1173908 2039814 3030984 3785880
$$ packed form
43741E71848P38379R42159k6471j204024j157739j51846M88160M31187K96459
43732I28112J60079l23151o50204N1049J269729J378744j2231j296709j036587
43723D68831J76693P66660L06552k70380k39924n645l08067j031493j224667l17611
43713a679051J002227J466244P10704l32303o26973j70053K92657K56377j69979
43704G49850n48442m61911J23698O39166M54494j76851k80092M65485J200834
43695B166231J149727O44427L03551j0187n85530r38731n24645J46736J77839
43686B529418l03348m41528m0661L97810P00412R62233P70002k48564j289782
43677C035992j156507j42159K75171k84471o05088N0970Q65906R91170P54896
$$ plain form
43668 3785880 4440231 4857029 4741817 4447962 4684589 5403354 5857852 5800190 5779590 6216669
43658 6216669 6994795 7984265 9121609 9946944 9996221 9767990 10329001 11724451 12745671
43649 12745671 12634888 12098009 12155221 12845668 13661005 14520681 15627576 16882781 18060750
43640 18060750 19154716 20061478 20377230 20009782 19578099 19713819 20325636 20947271 21368408
43631 21368408 21512565 21217482 20655465 20452327 20768840 20736689 19533481 17655372 16325292
43622 16325292 15838311 15281569 13859328 11811038 9963731 8932510 8821106 9224236 9431166
43613 9431166 8979914 8055821 7139686 6451748 6036816 6058059 6471271 6659371 6041449 4937133
43603 4937133 4198148 4065447 4068209 4005494 4212914 4694749 4798136 4142637 3266490 2935997
$$ packed form
43668C785880O54351M16798j15212k93855K36627P18765M54498n7662k0600M37079
43658F216669P78126R89470J137344Q25335M9277k28231N61011J395450J021220
43649A2745671j10783n36879N7212O90447Q15337Q59676J106895J255205J177969
43640A8060750J093966R06762L15752l67448m31683J35720O11817O21635M21137
43631B1368408J44157k95083n62017k03138L16513l2151j203208j878109j330080
43622A6325292m86981n56742j422241k048290j847307j031221j11404M03130K06930
43613I431166m51252r24093r16135o87938m14932K1243M13212J88100o17922j104316
43603D937133p38985j32701K762o2715K07420M81835J03387o55499q76147l30493
$$ plain form
43593 2935997 3310455 4160744 5357630 6620268 7268998 6934058 6272975 6290019 6993465
43584 6993465 7353660 6671094 5434867 4639675 4705794 5320703 5965282 6272137 6130591
43575 6130591 5776997 5615092 5669632 5426394 4546527 3492523 2954669 2860199 2650720 2486117
43565 2486117 3213257 4789005 5726615 4929266 3340493 2700231 3146172 3340203 2796089
43556 2796089 2591890 3456738 4555106 4884824 4715500 4702949 4545518 3685818 2680555
43547 2680555 2590610 3311638 3702386 3291544 2777422 2763745 2982244 3002970 2934773 3138258
43537 3138258 3769775 4704534 5438279 5209891 3907697 2692096 2817406 3869299 4202590
43528 4202590 3251446 2248485 2268994 2765029 2786750 2609336 3067714 3945620 4200999 3524460
$$ packed form
43593B935997L74458Q50289J196886J262638O48730l34940o61083J7044P03446
43584F993465L60195o82566j236227p95192O6119O14909O44579L06855j41546
43575F130591l53594j61905N4540k43238q79867j054004n37854r4470k09479j64603
43565B486117P27140J575748R37610p97349j588773o40262M45941J94031n44114
43556B796089k04199Q64848J098368L29718j69324j2551j57431q59700j005263
43547B680555q9945P21028L90748m10842n14122j3677K18499K0726o8197K03485
43537C138258O31517R34759P33745k28388j302194j215601J25310J051893L33291
43528D202590r51144j002961K0509M96035K1721j77414M58378Q77906K55379o76539
$$ plain form
43518 3524460 2646213 2159114 1937724 1815092 2050813 2845121 3887530 4634271 4732733
43509 4732733 4103813 2978791 1965043 1688205 2114480 2449206 1987249 1022354 685118
43500 685118 1737486 3589061 4735990 4314404 3020762 2225249 2364804 2678862 2473313
43491 2473313 2012682 1920745 2233070 2464503 2303088 1868149 1495823 1531124 2086493 2788936
43481 2788936 3074460 2939692 2990618 3472923 3762253 3256327 2279870 1525624 1052545 586712
43471 586712 471706 1372123 3056675 4373619 4659608 4463759 4587968 5033190 5293989
43462 5293989 5223945 5135405 5272395 5552697 5733165 5620989 5220619 4793029 4647725 4801908
43452 4801908 4983396 5000803 4932770 4924958 5001535 5125738 5278222 5461670 5780466 6444943
$$ packed form
43518C524460q78247m87099k21390j22632K35721P94308J042409P46741R8462
43509D732733o28920j125022j013748k76838M26275L34726m61957r64895l37236
43500F85118J052368J851575J146929m21586j293642p95513J39555L14058k05549
43491B473313m60631r1937L12325K31433j61415m34939l72326L5301N55369P02443
43481B788936K85524j34768N0926M82305K89330n05926r76457p54246m73079m65833
43471E86712j15006R00417J684552J316944K85989j95849J24209M45222K60799
43462E293989p0044q8540J36990K80302J80468j12176m00370m27590j45304J54183
43452D801908J81488J7407o8033p812P6577J24203J52484J83448L18796O64477
$$ plain form
43442 6444943 7460426 8379494 8657735 8233517 7493374 6776756 6296975 6412118 7345788
43433 7345788 8533060 8900851 8151563 7247634 7166183 7608939 7541314 6723818 5974046 5904764
43423 5904764 6118754 5969712 5597573 5681779 6379306 7056087 7133298 6751674 6369747 6062080
43413 6062080 5619626 5173647 5237023 6071090 7387573 8753619 9900409 10528708 10322641
43404 10322641 9481615 8814330 8881438 9375247 9773415 10215229 11109931 12160695 12572189
43395 12572189 12229471 11953260 12416145 13368313 14122374 14325309 14076216 13713870 13649192
43386 13649192 14020520 14411138 14299648 13822198 13622347 13941472 14425444 14837858 15246116
43377 15246116 15407011 14842912 13847148 13532390 14358442 15398605 15674251 15451458 15483334
$$ packed form
43442F444943J015483R19068K78241m24218p40143p16618m79781J15143R33670
43433G345788J187272L67791p49288r03929q1451M42756o7625q17496p49772o9282
43423E904764K13990j49042l72139Q4206O97527O76781P7211l81624l81927l07667
43413F062080m42454m45979O3376Q34067J316483J366046J146790O28299k06067
43404A0322641q41026o67285O7108M93809L98168M41814Q94702J050764M11494
43395A2572189l42718k76211M62885R52168P54061K02935k49093l62346o4678
43386A3649192L71328L90618j11490m77450j99851L19125M83972M12414M08258
43377A5246116J60895n64099r95764l14758Q26052J040163K75646k22793L1876
$$ plain form
43368 15483334 15717636 15700393 15676329 16231824 17236803 18191269 19297920 21039923 22870124
43359 22870124 23568740 23000801 22373831 22527431 23029776 23247829 23228025 23080487 22519639
43350 22519639 21591892 20935898 20680794 19970048 18331747 16693361 16122077 16228933 15814435
43341 15814435 14567109 13082642 11636032 10107179 8903162 8714058 9260558 9374934
43333 9374934 8574749 7635687 7343050 7562066 7864761 8187552 8405480 8069745 7152375
43324 7152375 6368359 6149265 5940340 5207755 4524711 4765407 5641141 6028473 5571775
43315 5571775 4975900 4703153 4379730 3767327 3424768 3862676 4655744 4996658 4747637
43306 4747637 4380772 4153946 3953498 3848263 4171177 4894877 5403369 5200702 4577933
$$ packed form
43368A5483334K34302j7243k4064N55495J004979R54466J106651J742003J830201
43359B2870124O98616n67939o26970J53600N02345K18053j9804j47538n60848
43350B2519639r27747o55994k55104p10746j638301j638386n71284J06856m14498
43341A5814435j247326j484467j446610j528853j204017j89104N46500J14376
43333I374934q00185r39062k92637K19016L02695L22791K17928l35735r17370
43324G152375p84016k19094k08925p32585o83044K40696Q75734L87332m56698
43315E571775n95875k72747l23423o12403l42559M37908P93068L40914k49021
43306D747637l66865k26826k00448j05235L22914P23700N08492k02667o22769
$$ plain form
43297 4577933 4223940 4306221 4354203 4103038 3987664 4467120 5209291 5509994 5381543 5511951
43287 5511951 6025554 6092087 5240820 4341430 4486246 5374285 5755669 5241149 4632714 4476366
43277 4476366 4403380 4185899 4367066 5260409 6192572 6455759 6341861 6498107 6837087 6877616
43267 6877616 6686849 6650598 6701291 6637582 6857734 7800993 8899468 9166593 8768413 8869639
43257 8869639 9768437 10357565 9875185 9108455 9138077 9742470 9961905 9703397 9800155 10659120
43247 10659120 11712049 12286444 12379401 12382483 12495638 12657229 12781269 12817618 12685059 12345771
43237 12345771 11967425 11874715 12217435 12755215 13178938 13618056 14456209 15514806 15930943
43228 15930943 15267750 14289822 14004928 14306468 14394045 14287502 14840333 16162688 17142537
$$ packed form
43297D577933l53993Q2281M7982k51165j15374M79456P42171L00703j28451J30408
43287E511951N13603O6533q51267q99390J44816Q88039L81384n14520o08435j56348
43277D476366p2986k17481J81167Q93343R32163K63187j13898J56246L38980M0529
43267F877616j90767l6251N0693o3709K20152R43259J098475K67125l98180J01226
43257H869639Q98798N89128m82380p66730K9622O04393K19435k58508R6758Q58965
43247A0659120J052929N74395R2957L082J13155J61591J24040L6349j32559l39288
43237A2345771l78346r2710L42720N37780M23723M39118Q38153J058597M16137
43228A5930943o63193r77928k84894L01540Q7577j06543N52831J322355R79849
$$ plain form
43219 17142537 16953810 16119169 15560068 15421945 15436504 15669589 16179592 16552392 16498557 16383976
43209 16383976 16532515 16644143 16636638 17308417 19121281 20927608 21165457 19988223 18915986
43200 18915986 18543469 18012802 16898692 16170610 16699553 17931432 18787013 19074238 19287690
43191 19287690 19644120 20057478 20636027 21510689 22416281 22996251 23350265 23837638 24491888
43182 24491888 25025122 25313259 25541163 25895921 26355675 26820043 27366677 28316504 29883402
43173 29883402 31665278 32800552 32985440 33034672 33873288 35206624 35953993 35935807 36224609
43164 36224609 37618114 39633141 41415277 42885852 44473724 46348586 48472438 50867351
43156 50867351 53297300 55222900 56643659 58440520 61214329 64285359 66614005 68286808
$$ packed form
43219A7142537j88727q34641n59101j38123J4559K33085N10003L72800n3835j14581
43209A6383976J48539J11628p505O71779J812864J806327K37849j177234j072237
43200A8915986l72517n30667j114110p28082N28943J231879Q55581K87225K13452
43191A9287690L56430M13358N78549Q74662R05592N79970L54014M87373O54250
43182B4491888N33234K88137K27904L54758M59754M64368N46634R49827J566898
43173B9883402J781876J135274J84888M9232Q38616J333336P47369j8186K88802
43164C6224609J393505K015027J782136J470575J587872J874862K123852K394913
43156E0867351K429949J925600J420759J796861K773809L071030K328646J672803
$$ plain form
43148 68286808 70207538 72611791 74871390 76685405 78464919 80389415 82007365 83139828
43140 83139828 84425986 86453520 88855485 90796110 92024365 92946558 93862529 94672069
43132 94672069 95377829 96434547 98312164 100859323 103382230 105380429 106937258 108227346
43124 108227346 108958274 108743723 107862466 106986139 106037226 104053095 100653871 97066292 94989045
43115 94989045 94727585 95127842 95186524 94996337 95060033 95359664 95399388 94772928 93433401 91636123
43105 91636123 89788219 88233178 87133757 86612767 86826119 87693257 88775560 89727626 90638545
43096 90638545 91521584 91691982 90221687 86993561 82839025 78651050 74793688 71296849
43088 71296849 68063586 64835380 61469708 58325627 55889043 53972414 51834731 49211825
$$ packed form
43148F8286808J920730K404253K259599J814015J779514J924496J617950J132463
43140H3139828J286158K027534K401965J940625J228255R22193R15971Q09540
43132I4672069P05760J056718J877617K547159K522907J998199J556829J290088
43124A08227346P30928k14551q81257q76327r48913j984131l399224l587579k077247
43115I4989045k61460M00257N8682j90187O3696K99631L9724o26460j339527j797278
43105I1636123j847904j555041j099421n20990K13352Q67138J082303R52066R10919
43096I0638545Q83039J70398j470295l228126m154536m187975l857362l496839
43088G1296849l233263l228206l365672l144081k436584j916629k137683k622906
$$ plain form
43080 49211825 46702445 44994259 44206707 44086389 44237971 43976490 42608933 40210503 37605091
43071 37605091 35292536 32956840 30330835 27862070 26015480 24512727 22879609 21271178
43063 21271178 20107491 19296812 18510326 17896038 17772043 17824568 17384355 16441542 15678419
43054 15678419 15462332 15448432 15285133 15138172 15320684 15813715 16307208 16436189 15983032
43045 15983032 15177807 14730808 15157554 16117592 16837288 17095442 17294758 17662561 18021451
43036 18021451 18357315 18897935 19476229 19546159 19138674 19120678 20057681 21382746 22193482
43027 22193482 22390668 22481824 22683841 22876289 23197513 24030733 25426657 26978095 28212968
43018 28212968 28829121 28800345 28642215 29240629 30855322 32563627 33347988 33508371 34207577
$$ packed form
43080D9211825k509380j708186p87552j20318J51582k61481j367557k398430k605412
43071C7605091k312555k335696k626005k468765j846590j502753j633118j608431
43063B1271178j163687q10679p86486o14288j23995N2525m40213r42813p63123
43054A5678419k16087j3900j63299j46961J82512M93031M93493J28981m53157
43045A5983032q05225m46999M26746R60038P19696K58154J99316L67803L58890
43036A8021451L35864N40620N78294O9930m07485j7996R37003J325065Q10736
43027B2193482J97186R1156K02017J92448L21224Q33220J395924J551438J234873
43018B8212968O16153k8776j58130N98414J614693J708305P84361J60383O99206
$$ plain form
43009 34207577 35751733 37285070 38281485 39281296 40741468 42153277 42997983 43758977 45097691
43000 45097691 46651630 47692459 48563994 50270022 52729786 54688624 55633445 56657962
42992 56657962 58840425 61698776 64095867 66044562 68630600 72390497 76677632 80680783
42984 80680783 84344577 88104040 92296935 97146084 102936453 109855620 117795391 126531386
42976 126531386 136084175 146875270 159583507 174775475 192544700 212602565 234821085
42969 234821085 259323857 285462356 310650178 330720947 341845334 342277604 332718311
42962 332718311 315681675 294504084 272043744 249588363 227142840 205005271 184625581
42955 184625581 167466593 153432262 141146034 129701963 119454562 110962648 103825552
$$ packed form
43009C4207577J544156J533337R96415R99811J460172J411809Q44706P60994J338714
43000D5097691J553939J040829Q71535J706028K459764J958838R44821J024517
42992E6657962K182463K858351K397091J948695K586038L759897M287135M003151
42984H0680783L663794L759463M192895M849149N790369O919167P939771Q735995
42976A26531386R552789J0791095J2708237J5191968J7769225K0057865K2218520
42969B34821085K4502772K6138499K5187822K0070769J1124387M32270r559293
42962C32718311j7036636k1177591k2460340k2455381k2445523k2137569k0379690
42955A84625581j7158988j4034331j2286228j1444071j0247401q491914p137096
$$ plain form
42948 103825552 97013822 90013744 83162267 76912110 71152820 65407692 59535644 54045987
42940 54045987 49664733 46634738 44495533 42534738 40393002 38243077 36475899 35225635
42932 35225635 34125909 32589296 30492443 28500924 27388018 27016823 26437691 25167030
42924 25167030 23866202 23352650 23379851 23009243 21943095 20803610 20156397 19929081 19851804
42915 19851804 19818204 19649960 19122154 18448428 18136033 18080173 17459594 15975583 14574108
42906 14574108 14312412 14977955 15523909 15506632 15312698 15196009 14960451 14604861 14491682
42897 14491682 14711251 14900791 14821709 14532635 13952287 13004500 12333572 12933495 14589488
42888 14589488 15557264 14560547 12488237 11258551 11471031 12136795 12407009 12428301 12454612
$$ packed form
42948A03825552o811730p000078o851477o250157n759290n745128n872048n489657
42940E4045987m381254l029995k139205j960795k141736k149925j767178j250264
42932C5225635j099726j536613k096853j991519j112906l71195n79132j270661
42924B5167030j300828n13552K7201l70608j066148j139485o47213k27316p7277
42915A9851804l3600j68244n27806o73726l12395n5860o20579j484011j401475
42906A4574108k61696O65543N45954j7277j93934j16689k35558l55590j13179
42897A4491682K19569J89540p9082k89074n80348r47787o70928N99923J655993
42888A4589488R67776r96717k072310j229686K12480O65764K70214K1292K6311
$$ plain form
42879 12454612 12225380 11622482 11109257 11018175 11010020 10692980 10232074 9886847 9491377 8949608
42869 8949608 8741954 9230754 9815740 9588278 8689691 8220769 8745382 9601301 9874286
42860 9874286 9417842 8645881 7917349 7536924 7870543 8885492 9809316 9808192 9012268 8468371
42850 8468371 8977406 10225761 11165241 11086143 10201749 9256603 8706752 8382422 7925403
42841 7925403 7358788 7053113 7243135 7805911 8445015 8832099 8647244 7866743 7047134
42832 7047134 6918738 7574335 8423037 9015512 9397021 9473735 8737111 7161187 5813241
42823 5813241 5787903 6791061 7535038 7409086 7001928 7000377 7378254 7825449 8216592 8366805
42813 8366805 8016754 7454192 7525709 8523075 9564406 9653178 8958566 8433081 8459229 8569929
$$ packed form
42879A2454612k29232o02898n13225r1082q155l17040m60906l45227l95470n41769
42869H949608k07654M88800N84986k27462q98587m68922N24613Q55919K72985
42860I874286m56444p71961p28532l80425L33619J014949R23824j124p95924n43897
42850H468371N09035J248355R39480p9098q84394r45146n49851l24330m57019
42841G925403n66615l05675J90022N62776O39104L87084j84855p80501q19609
42832G047134j28396O55597Q48702N92475L81509P6714p36624j575924j347946
42823E813241k5338J003158P43977j25952m07158j551L77877M47195L91143J50213
42813H366805l50051n62562P1517R97366J041331Q8772o94612n25485K6148J10700
$$ plain form
42803 8569929 8406211 8262894 8539495 9127718 9557263 9494751 8982830 8356411 7959104 7833205
42793 7833205 7765035 7723410 7991959 8618582 9047990 8767314 8145672 8105398 8996307 10290344
42783 10290344 11393787 12237757 12979697 13659153 14371925 15345046 16559523 17610941 18174380
42774 18174380 18352964 18416471 18479389 18557675 18616257 18443864 17859675 17178263 17030295 17531215
42764 17531215 18101383 18356446 18656927 19439433 20549045 21690894 23024402 24765773 26704162
42755 26704162 28740000 31355578 34690949 37597716 38711918 38308971 37943437 38176157
42747 38176157 37845532 35949951 33122244 30561073 28387923 25920884 23001779 20177952
42739 20177952 17856047 16007205 14554564 13454000 12484855 11431793 10381697 9493628
$$ packed form
42803H569929j63718j43317K76601N88223M29545o2512n11921o26419l97307j25899
42793G833205o8170m1625K68549O26623M29408k80676o21642m0274Q90909J294037
42783A0290344J103443Q43970P41940O79456P12772R73121J214477J051418N63439
42774A8174380J78584O3507O2918P8286N8582j72393n84189o81412j47968N00920
42764A7531215N70168K55063L00481P82506J109612J141849J333508J741371J938389
42755B6704162K035838K615578L335371K906767J114202m02947l65534K32720
42747C8176157l30625j895581k827707k561171k173150k467039k919105k823827
42739B0177952k321905j848842j452641j100564r69145j053062j050096q88069
$$ plain form
42731 9493628 8674945 7838777 7209627 6951977 6772551 6359943 5933053 5805789 5673943
42722 5673943 4996804 3939780 3242915 3178307 3296689 3232148 3082505 2880289 2372816 1587008
42712 1587008 1023209 949780 980419 710348 377317 496502 1112318 1793357 2225351 2500786
42702 2500786 2856105 3299959 3535738 3282508 2700696 2288505 2169213 1814303 909847
42693 909847 165555 542471 1816774 2759463 2788045 2526277 2530744 2497576 2217486 2297248
42683 2297248 3125159 3930096 3829283 3200570 2986570 3124432 2826802 2136405 1941243
42674 1941243 2433935 2750235 2356511 1708656 1210853 602740 -104719 -131328 833668 1715498
42664 1715498 1357657 224463 -209962 507505 1415261 1727860 1771582 2014150 2047582 1215801
$$ packed form
42731I493628q18683q36168o29150k57650j79426m12608m26890j27264j31846
42722E673943o77139j057024o96865o4608J18382o4541j49643k02216n07473p85808
42712A587008n63799p3429L0639k70071l33031J19185O15816O81039M31994K75435
42702B500786L55319M43854K35779k53230n81812m12191j19292l54910r04456
42693I09847p44292L76916J274303R42689K8582k61768M467l3168k80090P9762
42683B297248Q27911Q04937j00813o28713k14000J37862k97630o90397j95162
42674A941243M92692L16300l93724o47855m97803o08113p07459k6609R64996Q81830
42664A715498l57841j133194m34425P17467R07756L12599M3722K42568L3432q31781
$$ plain form
42654 1215801 -193995 -1117381 -1029286 -548190 -550561 -1027570 -1124681 -217522 1330179 2547457
42644 2547457 2804047 2248468 1459856 914038 770685 906545 1018401 863993 560049
42635 560049 517590 913870 1357111 1337999 966132 900955 1408385 1837677 1424572 439996
42625 439996 -14530 525441 1182246 915070 -9584 -371802 341306 1373988 1893400
42616 1893400 1975708 2033370 1950135 1443603 854671 799576 1182499 1281232 855647 521504
42606 521504 823736 1451660 1670988 1211155 457916 -31927 47 410095 877093 1236770
42596 1236770 1529093 1664752 1314358 423275 -413573 -577325 -316888 -462871 -1225697
42587 -1225697 -1844652 -1599373 -676791 200343 594584 561078 390803 383966 595696 668738
$$ packed form
42654A215801j409796r23386Q8095M81096k371m77009r7111R07159J547701J217278
42644B547457K56590n55579p88612n45818j43353J35860J11856j54408l03944
42635E60049m2459L96280M43241j9112l71867o5177N07430M29292m13105r84576
42625D39996m54526N39971O56805k67176r24654l62218P13108J032682N19412
42616A893400Q2308N7662q3235n06532n88932n5095L82923R8733m25585l34143
42606E21504L02232O27924K19328m59833p53239m89843L1974M10048M66998L59677
42596A236770K92323J35659l50394q91083q36848j63752K60437j45983p62826
42587a225697o18955K45279R22582Q77134L94241l3506j70275o837K11730P3042
$$ plain form
42577 668738 252280 -337651 -361412 273756 756157 507496 16840 53969 527903 751617
42567 751617 535998 348772 492891 732855 774774 638654 446636 178786 -240619 -784926
42557 -784926 -1270270 -1387057 -959909 -320910 -145777 -632061 -1102408 -820075 -18825 330716
42547 330716 -261643 -1208995 -1508075 -756257 475905 1129416 634048 -454456 -1020433
42538 -1020433 -744839 -500083 -1090406 -2115899 -2675889 -2749736 -3012553 -3470663 -3274575
42529 -3274575 -2061015 -633207 58364 -24250 -332599 -553382 -668502 -627622 -409886
42520 -409886 -136723 188441 734155 1345333 1403991 634197 -260332 -292856 594392 1461926
42510 1461926 1461469 622101 -385294 -879029 -573420 245655 853180 700706 13684 -474325
$$ packed form
42577F68738m16458n89931k3761O35168M82401k48661m90656L7129M73934K23714
42567G51617k15619j87226J44119K39964M1919j36120j92018k67850m19405n44307
42557g84926m85344j16787M27148O38999J75133m86284m70347K82333Q01250L49541
42547C30716n92359r47352k99080P51818J232162O53511m95368j088504n65977
42538a020433K75594K44756n90323j025493n59990p3847k62817m58110J96088
42529c274575J213560J427808O91571q2614l08349k20783j15120M0880K17736
42520d09886K73163L25164N45714O11178N8658p69794q94529l2524Q87248Q67534
42510A461926m57q39368j007395m93735L05609Q19075O07525j52474o87022m88009
$$ plain form
42500 -474325 -449679 -345616 -572778 -815556 -522179 133407 385716 35602 -153695 419789
42490 419789 1202105 1237004 591427 204736 353735 207189 -752087 -1730641 -1727835 -1014086
42480 -1014086 -653517 -898715 -968170 -336171 597530 1207417 1277312 801441 -124327 -951248
42470 -951248 -890452 94472 973888 757110 -389736 -1438488 -1620241 -987219 -157949
42461 -157949 206216 -100515 -618527 -703685 -326061 -78000 -279518 -523832 -365089 -6847
42451 -6847 87701 -84460 -201457 -242161 -495894 -1018670 -1468729 -1508845 -1134654 -594710
42441 -594710 -127832 231408 621534 1056766 1250777 989880 591347 564243 808917 681814
42431 681814 -18771 -704557 -864879 -696306 -552830 -384740 -147322 -130802 -322357 -68111
$$ packed form
42500d74325K4646J04063k27162k42778K93377O55586K52309l50114j89297N73484
42490D19789P82316L4899o45577l86691J48999j46546r59276r78554K806P13749
42480a014086L60569k45198o9455O31999R33701O09887O9895m75871r25768q26921
42470i51248O0796R84924Q79416k16778j146846j048752j81753O33022Q29270
42461a57949L64165l06731n18012q5158L77624K48061k01518k44314J58743L58242
42451f847R4548j72161j16997m0704k53733n22776m50059m0116L74191N39944
42441e94710M66878L59240L90126M35232J94011k60897l98533k7104K44674j27103
42431F81814p00585o85786j60322J68573J43476J68090K37418J6520j91555K54246
$$ plain form
42421 -68111 900110 1662720 1244413 155337 -197884 578662 1585199 2175883 2654754
42412 2654754 3229371 3357752 2645966 1595563 908603 656525 624625 877877 1383550
42403 1383550 1547536 830409 -379269 -1086877 -808920 56021 871888 1347991 1482459
42394 1482459 1315020 903400 406524 75615 107696 422283 629686 425780 34163 4410
42384 4410 501059 1062920 1186708 880343 475481 144544 -185968 -622954 -1185415 -1751155
42374 -1751155 -2031520 -1814569 -1329814 -1099438 -1290473 -1509150 -1400066 -1103642 -877207
42365 -877207 -622319 -141076 429206 827006 1065121 1211971 1033334 371650 -294554 -291401
42355 -291401 250678 442995 -166697 -969409 -1101399 -441177 475948 1162994 1467348 1441565
$$ packed form
42421f8111R68221P62610m18307j089076l53221P76546J006537N90684M78871
42412B654754N74617J28381p11786j050403o86960k52078l1900K53252N05673
42403A383550J63986p17127j209678p07608K77957Q64941Q15867M76103J34468
42394A482459j67439m11620m96876l30909L2081L14587K07403k03906l91617k9753
42384D410M96649N61861J23788l06365m04862l30937l30512m36986n62461n65740
42374a751155k80365K16951M84755K30376j91035k18677J09084K96424K26435
42365h77207K54888M81243N70282L97800K38115J46850j78637o61684o66204L153
42355b91401N42079J92317o09692q02712j31990O60222R17125O87046L04354k5783
$$ plain form
42345 1441565 1295322 1309468 1499691 1518696 1166669 819080 1006631 1684451 2264616 2303000
42335 2303000 1811930 963062 -95809 -1082060 -1638249 -1686557 -1432847 -979713 -330124
42326 -330124 164791 -67506 -937815 -1463967 -928243 106450 507747 17815 -664589
42317 -664589 -1051352 -1322691 -1585659 -1505012 -1011981 -738141 -1253272 -2251768 -2917369 -2827733
42307 -2827733 -2173648 -1369070 -782830 -597768 -585680 -226516 642514 1506744 1783562 1499321
42297 1499321 1048769 583513 76835 -236657 -26536 566357 978171 891533 545909 355532
42287 355532 470269 726756 851662 741724 641755 890554 1387098 1597330 1295635 960173
42277 960173 1116045 1604655 1877539 1714139 1250327 627931 97711 146427 936227 1841008
$$ packed form
42345A441565j46243J4146J90223J9005l52027l47589J87551O77820N80165L8384
42335B303000m91070q48868j058871r86251n56189m8308K53710M53134O49589
42326c30124M94915k32297q70309n26152N35724J034693M01297m89932o82404
42317f64589l86763k71339k62968Q0647M93031K73840n15131r98496o65601Q9636
42307b827733O54085Q04578N86240J85062J2088L59164Q69030Q64230K76818k84241
42297A499321m50552m65256n06678l13492K10121N92893M11814q6638l45624j90377
42287C55532J14737K56487J24906j09938r9969K48799M96544K10232l01695l35462
42277I60173J55872M88610K72884j63400m63812o22396n30220M8716P89800R04781
$$ plain form
42267 1841008 2111269 1804153 1510789 1423089 1304670 1134409 1054143 865789 329083 -210786
42257 -210786 -272553 -122691 -337922 -679100 -425542 292860 681080 791373 1479943 2600133
42247 2600133 2727717 1345571 -54658 -14742 842362 918327 -39802 -911511 -958541 -476850
42237 -476850 25975 347982 426974 386126 599267 1166557 1585269 1412595 875073 369546
42227 369546 -111801 -533308 -435886 312506 1017018 1171271 1316599 2002385 2580675 2172847
42217 2172847 1304196 1280428 2209263 2907445 2663336 1903950 1175693 658156 689802 1520436
42207 1520436 2369550 1947813 254433 -1214936 -1418605 -923379 -715812 -856934 -874993
42198 -874993 -680421 -491523 -425585 -588213 -1042101 -1423378 -1195215 -494816 -57998 -133105
$$ packed form
42267A841008K70261l07116k93364q7700j18419j70261q0266j88354n36706n39869
42257b10786o1767J49862k15231l41178K53558P18402L88220J10293O88570J120190
42247B600133J27584j382146j400229L9916Q57104P5965r58129q71709m7030M81691
42237d76850N02825L22007P8992m0848K13141N67290M18712j72674n37522n05527
42227C69546m81347m21507R7422P48392P04512J54253J45328O85786N78290m07828
42217B172847q68651k3768R28835O98182k44109p59386p28257n17537L1646Q30634
42207A520436Q49114m21737j693380j469369k03669M95226K07567j41122j8059
42198h74993J94572J88898O5938j62628m53888l81277K28163P00399M36818p5107
$$ plain form
42188 -133105 -240998 -163889 -223358 -318756 200746 1210535 1504827 590985 -253799 270676
42178 270676 1539244 1982619 1397567 949355 1144700 1164234 379612 -602598 -891777 -549700
42168 -549700 -305800 -445946 -540365 -210077 247364 217172 -355412 -748968 -301095 763553
42158 763553 1631400 1822478 1426698 668036 -157696 -472838 49311 705974 390852 -789428
42148 -789428 -1414083 -642729 648840 1152952 749313 181784 -173736 -419402 -519233 -379208
42138 -379208 -247542 -386182 -594011 -563393 -391956 -282266 -127611 140356 242542 73830
42128 73830 32075 312587 438636 82722 -251369 -52489 317534 373582 527487 1391484
42118 1391484 2537416 2985223 2613594 2114025 1835294 1642929 1622902 1865778 1772324 682925
$$ packed form
42188a33105j07893P7109n9469r5398N19502J009789K94292r13842q44784N24475
42178B70676J268568M43375n85052m48212J95345J9534p84622r82210k89179L42077
42168e49700K43900j40146r4419L30288M57441l0192n72584l93556M47873J064648
42158G63553Q67847J91078l95780p58662q25732l15142N22149O56663l15122j180280
42148g89428o24655P71354J291569N04112m03639n67529l55520k45666r9831J40025
42138c79208J31666j38640k07829L0618J71437J09690J54655K67967J02186j68712
42128G3830m1755K80512J26049l55914l34091J98880L70023N6048J53905Q63997
42118A391484J145932M47807l71629m99569k78731j92365k0027K42876r3454j089399
$$ plain form
42108 682925 -894882 -1737682 -1509144 -879926 -178422 858196 1924014 2017351 863034
42099 863034 -530618 -1126037 -880631 -303485 176806 206524 -280371 -646619 -172463 789616
42089 789616 1176837 797468 488761 573064 412815 -143450 -195326 682345 1535880 1471754
42079 1471754 975883 903618 1061664 805282 334229 324868 711930 789988 276068 -464296
42069 -464296 -1023979 -1233139 -1127778 -1081329 -1560511 -2354376 -2597420 -2016561 -1506732 -1875180
42059 -1875180 -2648345 -2818674 -2214186 -1409292 -797909 -493705 -666438 -1216624 -1523685
42050 -1523685 -1207505 -719878 -565566 -494116 -150372 128247 1837 -42219 479105 1002208
42040 1002208 794931 303293 401562 802422 591231 -32681 -81319 332869 73492 -967932
$$ packed form
42108F82925j577807q42800K28538O29218P01504J036618J065818R3337j154317
42099H63034j393652n95419K45406N77146M80291K9718m86895l66248M74156R62079
42089G89616L87221l79369l08707Q4303j60249n56265n1876Q77671Q53535o4126
42079A471754m95871p2265J58046k56382m71053r361L87062P8058n13920p40364
42069d64296n59683k09160J05361M6449m79182p93865k43044N80859N09829l68448
42059a875180p73165j70329O04488Q04894O11383L04204j72733n50186l07061
42050a523685L16180M87627J54312P1450L43744K78619j26410m4056N21324N23103
42040A002208k07277m91638R8269M00860k11191o23912m8638M14188k59377j041424
$$ plain form
42030 -967932 -1561763 -1243620 -1106600 -1847895 -2520385 -2140911 -1264556 -865775 -694406 10280
42020 10280 917319 1050120 456894 180548 628776 1070365 929207 680432 1071183 2051216
42010 2051216 2942576 3352378 3446606 3365509 2802702 1467354 -197607 -1218076 -1163001
42001 -1163001 -613891 -282943 -121206 200043 394239 -23860 -662159 -578128 265708 842616
41991 842616 596873 194020 321839 632358 484969 5966 -287994 -329691 -255254 144723
41981 144723 928332 1377201 764476 -452470 -1063304 -686199 -128206 -88909 -260590 -8818
41971 -8818 617875 974855 652845 -91829 -642845 -595567 -67737 491736 788269 898303
41961 898303 992393 1054846 1017999 958356 937658 834630 596883 494124 800247 1317138
$$ packed form
42030i67932n93831L18143J37020p41295o72490L79474Q76355L98781J71369P04686
42020A0280R07039J32801n93226k76346M48228M41589j41158k48775L90751R80033
42010B051216Q91360M09802R4228q1097n62807j335348j664961j020469N5075
42001a163001N49110L30948J61737L21249J94196m18099o38299Q4031Q43836N76908
41991H42616k45743m02853J27819L10519j47389m79003k93960m1697P4437L99977
41981A44723P83609M48869o12725j216946o10834L77105N57993L9297j71681K51772
41971h818O26693L56980l22010p44674n51016M7278N27830N59473K96533J10034
41961H98303R4090O2453l6847n9643k0698j03028k37747j02759L06123N16891
$$ plain form
41951 1317138 1538648 1258130 726427 235072 -142602 -374693 -391444 -350678 -698029 -1642793
41941 -1642793 -2640818 -2725626 -1527772 178753 1165215 953445 122921 -548427 -866910
41932 -866910 -992345 -886385 -466706 -58181 -117900 -570026 -937245 -1103640 -1363267 -1663267
41922 -1663267 -1478113 -695710 -11267 -17055 -364239 -306051 247870 693206 556096 -52351
41912 -52351 -708273 -1083446 -1114149 -953191 -759219 -564511 -481978 -847695 -1727587 -2404779
41902 -2404779 -2014264 -782664 52007 -216123 -990677 -1444861 -1586098 -1760993 -1860521
41893 -1860521 -1712806 -1640297 -1839644 -1727033 -767902 428022 736893 -7288 -1012936
41884 -1012936 -1754416 -2274488 -2422608 -1822086 -716172 29812 -7765 -440379 -895533
$$ packed form
41951A317138K21510k80518n31703m91355l77674k32091j6751M0766l47351r44764
41941a642793r98025q4808J197854J706525R86462k11770q30524o71348l18483
41932h66910j25435J05960M19679M08525n9719m52126l67219j66395k59627l00000
41922a663267J85154P82403O84443n788l47184N8188N53921M45336j37110o08447
41912e2351o55922l75173l0703J60958J93972J94708Q2533l65717q79892o77192
41902b404779L90515J231600Q34671k68130p74554m54184j41237j74895r9528
41893a860521J47715P2509j99347J12611R59131J195924L08871p44181j005648
41884a012936p41480n20072j48120O00522J105914P45984l7577m32614m55154
$$ plain form
41875 -895533 -1475342 -2164328 -2489916 -2142390 -1431055 -820303 -428252 -213779 -244521 -530234
41865 -530234 -911781 -1288072 -1658105 -1843193 -1515668 -656315 262582 657525 290266 -537080
41855 -537080 -1082458 -742486 184731 682192 323753 -124696 28248 211210 -383774 -1189134
41845 -1189134 -1017422 -144024 -79626 -1140330 -1807630 -1005391 384666 983959 665863
41836 665863 40525 -677717 -1336310 -1346042 -563290 78634 -208664 -911469 -1198775 -1275809
41826 -1275809 -1668754 -1919141 -1319545 -421337 -383902 -1097640 -1362004 -840238 -449079 -709250
41816 -709250 -1048160 -1025491 -1010889 -1209783 -1147017 -696337 -635073 -1468871 -2486237 -2729216
41806 -2729216 -2313103 -2043458 -2161642 -2214933 -1935484 -1576264 -1405793 -1346284 -1171195 -804646
$$ packed form
41875h95533n79809o88986l25588L47526P11335O10752L92051K14473l0742k85713
41865e30234l81547l76291l70033j85088L27525Q59353R18897L94943l67259q27346
41855e37080n45378L39972R27217M97461l58439m48449J52944J82962n94984q05360
41845a189134J71712Q73398O4398j060704o67300Q02239J390057N99293l18096
41836F65863o25338p18242o58593r732P82752O41924k87298p02805k87306p7034
41826a275809l92945k50387N99596Q98208L7435p13738k64364N21766L91159k60171
41816g09250l38910K2669J4602j98894O2766M50680O1264q33798j017366k42979
41806b729216M16113K69645j18184n3291K79449L59220J70471N9509J75089L66549
$$ plain form
41796 -804646 -393177 -163722 -151897 -112143 109106 228624 -55523 -377808 -12816 1035653
41786 1035653 1880799 1933111 1591961 1364609 960234 -68431 -1260769 -1677215 -1230188
41777 -1230188 -773591 -804449 -813301 -191424 810656 1455232 1479106 1233685 1056426 945722
41767 945722 831609 764023 703908 435867 -79747 -468660 -352151 108342 429513 562967
41757 562967 987735 1856277 2507679 2276885 1475010 961738 883011 574172 -160170 -477521
41747 -477521 279393 1391411 1568591 693091 -55498 160210 854253 1142021 915973
41738 915973 542350 -54953 -1157778 -2284420 -2399757 -1356025 -366133 -531020 -1448519
41729 -1448519 -1944982 -1798511 -1864275 -2533142 -2984616 -2366388 -1081516 -316648 -572897
$$ packed form
41796h04646M11469K29455J1825L9754K21249J19518k84147l22285L64992J048469
41786A035653Q45146N2312l41150k27352m04375j028665j192338m16446M47027
41777a230188M56597l0858q852O21877J002080O44576K3874k45421j77259j10704
41767I45722j14113o7586o0115k68041n15614l88913J16509M60493L21171J33454
41757E62967M24768Q68542O51402k30794q01875n13272p8727l08839p34342l17351
41747d77521P56914J112018J77180q75500p48589K15708O94043K87768k26048
41738I15973l73623n97303j102825j126642j15337J043732R89892j64887r17499
41729a448519m96463J46471o5764o68867m51474O18228J284872P64868k56249
$$ plain form
41720 -572897 -1191217 -1272786 -669615 11369 154136 -252653 -718339 -875390 -830218 -818699
41710 -818699 -811941 -782943 -1055862 -1801831 -2376170 -1974146 -985369 -741954 -1596843 -2246036
41700 -2246036 -1596943 -393250 -44066 -541155 -681046 54117 1030420 1712225 2216267
41691 2216267 2571184 2493489 2083133 1791603 1506795 642226 -588284 -1021346 -185185
41682 -185185 816783 741824 -180678 -805129 -697439 -433228 -575907 -1045682 -1401265 -1283770
41672 -1283770 -655248 145832 743639 1201547 1778823 2167810 1676073 465596 -219180
41663 -219180 302200 1003634 545832 -735083 -1327190 -777340 -232975 -617876 -1352613
41654 -1352613 -1367821 -606163 92182 118629 -460328 -1283348 -1972161 -2161756 -1738519 -1083344
$$ packed form
41720e72897o18320q1569O03171O80984J42767m06789m65686j57051M5172J1519
41710h18699O758K8998k72919p45969n74339M02024R88777K43415q54889o49193
41700b246036O49093J203693L49184m97089j39891P35163R76303O81805N04042
41691B216267L54917p7695m10356k91530k84808q64569j230510m33062Q36161
41682a85185J001968p4959r22502o24451J07690K64211j42679m69775l55583J17495
41672a283770O28522Q01080N97807M57908N77276L88987m91737j210477o84776
41663b19180N21380P01434m57802j280915n92107N49850N44365l84901p34737
41654a352613j5208P61658O98345K6447n78957q23020o88813j89595M23237O55175
$$ plain form
41644 -1083344 -747807 -833248 -950957 -838261 -692715 -719259 -659508 -163270 498635 574463
41634 574463 -226563 -1366033 -2224341 -2752649 -3083974 -3020047 -2446032 -1831800 -1620208 -1415458
41624 -1415458 -582719 549652 1024229 733349 521080 686909 529537 -241038 -798524
41615 -798524 -579444 -328040 -867551 -1681109 -1755265 -1187676 -851597 -934699 -951361 -890130
41605 -890130 -1167423 -1558459 -1332466 -536130 -101294 -476878 -1080512 -1366620 -1571337 -2028623
41595 -2028623 -2488928 -2567178 -2326800 -2028417 -1721789 -1386486 -1095893 -804396 -331333 256988
41585 256988 600249 524258 229440 -83392 -400177 -649762 -695738 -648141 -758896 -941443
41575 -941443 -845022 -477422 -275075 -451859 -740648 -865089 -788810 -447958 192936 719238
$$ packed form
41644a083344L35537q5441j17709J12696J45546k6544N9751M96238O61905P5828
41634E74463q01026j139470q58308n28308l31325O3927N74015O14232K11592K04750
41624a415458Q32739J132371M74577k90880k12269J65829j57372p70575n57486
41615g98524K19080K51404n39511q13558p4156N67589L36079q3102j6662O1231
41605h90130k77293l91036K25993P96336M34836l75584o03634k86108k04717m57286
41595b028623m60305p8250K40378K98383L06628L35303K90593K91497M73063N88321
41585B56988L43261p5991k94818l12832l16785k49585m5976M7597j10755j82547
41575i41443R6421L67600K02347j76784k88789j24441P6279L40852O40894N26302
$$ plain form
41565 719238 529088 -293319 -985294 -1201346 -1420439 -1936048 -2175039 -1593324 -677800 -349178
41555 -349178 -689113 -947967 -701953 -398455 -668408 -1505922 -2325569 -2686741 -2778413 -3062941
41545 -3062941 -3482511 -3380346 -2471887 -1478626 -1217236 -1371427 -989743 -63413 407633
41536 407633 47300 -291821 21179 371234 -15238 -849813 -1447265 -1822042 -2171439 -1939186
41526 -1939186 -571838 1144289 1712695 867324 -160503 -414798 -276249 -483048 -976871
41517 -976871 -1232540 -1142326 -1007233 -946238 -780341 -408265 6532 228259 193124 46676
41507 46676 -40811 -83735 -233696 -518484 -780318 -907102 -912294 -738749 -296726 175157
41497 175157 162911 -445224 -1044366 -971451 -231116 661221 1234358 1202708 456659 -698792
$$ packed form
41565G19238j90150q22407o91975k16052k19093n15609k38991N81715R15524L28622
41555c49178l39935k58854K46014L03498k69953q37514q19647l61172r1672k84528
41545c062941m19570J02165R08459R93261K61390j54191L81684R26330M71046
41536D07633l60333l39121L13000L50055l86472q34575n97452l74777l49397K32253
41526a939186J367348J716127N68406q45371j027827k54295J38549k06799m93823
41517i76871k55669R0214J35093O0995J65897L72076M14797K21727l5135j46448
41507D6676q7487m2924j49961k84788k61834j26784n192J73545M42023M71883
41497A75157j2246o08135n99142P2915P40335Q92337N73137l1650p46049j155451
$$ plain form
41487 -698792 -1613195 -1964536 -2048896 -2092707 -1759709 -824169 139766 378581 -62056 -569304
41477 -569304 -809622 -708299 -10963 1306269 2490195 2762333 2406029 2191324 1941004
41468 1941004 809942 -993267 -2000976 -1381204 -18674 778502 771783 465606 119920
41459 119920 -223542 -347315 -197381 -205475 -684823 -1255152 -1380002 -1127262 -896724 -727178
41449 -727178 -398296 45398 376376 577664 696897 511491 -191623 -1137257 -1782371 -1914638
41439 -1914638 -1683286 -1180579 -389390 521455 1202615 1422348 1153721 486455 -310909
41430 -310909 -804997 -792522 -600352 -706121 -1103621 -1281889 -807009 238844 1326108
41421 1326108 1858273 1621723 1000338 588716 483145 212729 -460495 -1031340 -897920
$$ packed form
41487f98792r14403l51341q4360m3811L32998R35540R63935K38815m40637n07248
41477e69304k40318J01323O97336J317232J183926K72138l56304k14705k50320
41468A941004j131062j803209j007709O19772J362530P97176o719l06177l45686
41459A19920l43462j23773J49934q094m79348n70329j24850K52740K30538J69546
41449g27178L28882M43694L30978K01288J19233j85406p03114r45634o45114j32267
41439a914638K31352N02707P91189R10845O81160K19733k68627o67266p97364
41430c10909m94088J2475J92170j05769l97500j78268M74880J045853J087264
41421A326108N32165k36550o21385m11622j05571k70416o73224n70845J33420
$$ plain form
41412 -897920 -255718 98200 -265283 -1027712 -1612482 -1645371 -1003202 108222 1044400 1122431
41402 1122431 327617 -654646 -1238461 -1476062 -1661580 -1759470 -1543250 -1060395 -556872 -36083
41392 -36083 664032 1289678 1137153 -61445 -1500198 -2023521 -1456377 -763272 -768885 -1170829
41382 -1170829 -1143337 -578663 -214531 -577406 -1257874 -1411851 -751999 142938 457869 -8551
41372 -8551 -693985 -1035248 -1218134 -1802433 -2629181 -2730342 -1677036 -428208 -187887 -814102
41362 -814102 -1151428 -718514 -166888 -71492 -197857 -215416 -318443 -731498 -1223743 -1507951
41352 -1507951 -1601020 -1484051 -985639 -335223 -188610 -654667 -922855 -412302 290267 300785
41342 300785 -243195 -474095 -49508 632678 1208139 1566081 1463888 719093 -217203 -592468
$$ packed form
41412h97920O42202L53918l63483p62429n84770l2889O42169J111424R36178P8031
41402A122431p94814r82263n83815k37601j85518r7890K16220M82855N03523N20789
41392c6083P00115O25646j52525j198598j438753n23323N67144O93105n613m01944
41382a170829K7492N64674L64132l62875o80468j53977O59852Q94937L14931m66420
41372h551o85434l41263j82886n84299q26748j01161J053306J248828K40321o26215
41362h14102l37326M32914N51626R5396j26365j7559j03027m13055m92245k84208
41352a507951r3069J16969M98412O50416J46613m66057k68188N10553P02569J0518
41342C00785n43980k30900M24587O82186N75461L57942j02193p44795r36296l75265
$$ plain form
41332 -592468 -339465 -110474 -242257 -333834 -68325 144858 -255591 -1141695 -1846452 -1990575
41322 -1990575 -1812187 -1683097 -1560605 -1084998 -159596 793647 1310623 1436043 1508483 1552574
41312 1552574 1352460 1062452 1100124 1316322 1012070 102785 -510098 -262878 136049 -147250
41302 -147250 -679652 -522078 109190 137507 -605104 -1124385 -869587 -453549 -474644 -645233
41292 -645233 -551006 -405866 -494195 -567965 -378484 -221642 -372981 -495914 -230281 66044
41282 66044 -155768 -673002 -777913 -395720 -198967 -525258 -817902 -463048 216689 247317
41272 247317 -782413 -2122863 -2621947 -1945276 -859167 -326527 -539121 -937949 -983267
41263 -983267 -685340 -450202 -582908 -939350 -1029352 -571800 65721 244646 -94697 -361348
$$ packed form
41332e92468K53003K28991j31783r1577K65509K13183m00449q86104p04757j44123
41322a990575J78388J29090J22492M75607R25402R53243N16976J25420P2440M4091
41312A552574k00114k90008L7672K16198l04252r09285o12883K47220L98927k83299
41302a47250n32402J57574O31268K8317p42611n19281K54798M16038k1095j70589
41292f45233R4227J45140q8329p3770J89481J56842j51339j22933K65633K96325
41282F6044k21812n17234j04911L82193J96753l26291k92644L54854O79737L0628
41272B47317j029730j340450m99084O76671J086109N32640k12594l98828m5318
41263i83267K97927K35138j32706l56442r0002M57552O37521J78925l39343k66651
$$ plain form
41253 -361348 -221752 -47722 -147061 -147464 299549 747638 649826 406486 801768 1623378
41243 1623378 1851426 1225922 651168 845768 1435959 1653426 1204190 212808 -972118
41234 -972118 -1672987 -1325688 -338736 164531 -263011 -956622 -1327071 -1618539 -2072914 -2243362
41224 -2243362 -1797666 -1264541 -1226399 -1335235 -880054 112456 1050122 1661089 2021596 2027906
41214 2027906 1524297 745220 67652 -459443 -880014 -971025 -654199 -411929 -662273 -981222
41204 -981222 -590796 525340 1545939 1737056 1018681 -199461 -1309062 -1808346 -1675945
41195 -1675945 -1232560 -460029 982520 2715177 3402536 2344445 700427 165356 804590
41186 804590 1197787 493938 -713313 -1507527 -1657072 -1368177 -849391 -346005 -51148
$$ packed form
41253c61348J39596J74030r9339m03M47013M48089r7812k43340L95282Q21610
41243A623378K28048o25504n74754J94600N90191K17467m49236r91382j184926
41234i72118p00869L47299R86952N03267m27542o93611l70449k91468m54375j70448
41224b243362M45696N33125L8142j08836M55181R92510R37666O10967L60507O310
41214B027906n03609p79077o77568n27095m20571r1011L16826K42270k50344l18949
41204i81222L90426J116136J020599J91117p18375j218142j109601m99284J32401
41195a675945M43385P72531J442549J732657O87359j058091j644018n35071O39234
41186H04590L93197p03849j207251p94214j49545K88895N18786N03386K94857
$$ plain form
41177 -51148 107075 178311 -119591 -882983 -1513775 -1450128 -1072878 -1015996 -937578 -110576
41167 -110576 989567 1064865 62154 -539005 105700 1062332 1236408 898874 758441
41158 758441 572911 -220311 -1174946 -1274092 -436288 304208 69943 -969660 -1898765 -1885918
41148 -1885918 -883539 263858 655003 361460 177611 318116 130683 -649273 -1267747
41139 -1267747 -1122763 -737953 -841889 -1194023 -1180707 -979270 -1147861 -1465112 -1213402 -450045
41129 -450045 -46211 -450304 -1183772 -1604707 -1521471 -1033830 -376465 26240 -142046 -687991
41119 -687991 -1145828 -1279782 -1019064 -254248 759928 1202609 660509 19633 482546
41110 482546 1825302 2601962 2118955 1205761 795504 717339 359789 -284283 -848747 -1292950
$$ packed form
41177e1148J58223P1236k97902p63392o30792O3647L77250N6882P8418Q27002
41167a10576J100143P5298j002711o01159O44705R56632J74076l37534j40433
41158G58441j85530p93222r54635r9146Q37804P40496k34265j039603r29105J2847
41148a885918J002379J147397L91145k93543j83849J40505j87433p79956o18474
41139a267747J44984L84810j03936l52134J3316K01437j68591l17251K51710P63357
41129d50045M03834m04093p33468m20935Q3236M87641O57365M02705j68286n45945
41119f87991m57837j33954K60718P64816J014176M42681n42100o40876M62913
41110D82546J342756P76660m83007r13194m10257p8165l57550o44072n64464m44203
$$ plain form
41100 -1292950 -1748518 -2033574 -1858886 -1301390 -683584 -178913 172058 293300 226082 260468
41090 260468 640512 1249247 1731731 1789140 1305530 432193 -393896 -793752 -850132 -865511
41080 -865511 -762913 -214545 589493 916685 487365 -54783 -11290 507227 956686 1140447
41070 1140447 1163822 987097 528741 -6012 -293183 -207169 241784 913556 1241698 503942
41060 503942 -1131577 -2375633 -2269409 -1394850 -916184 -901550 -558742 192308 562233
41051 562233 309195 139684 401659 440478 -219973 -926820 -785960 123196 1030155 1453398
41041 1453398 1334536 705421 -138020 -536110 -194615 287615 212972 -214422 -326136 -120023
41031 -120023 -183762 -636070 -927842 -719277 -271592 99307 330588 307497 -98926 -553653
$$ packed form
41100a292950m55568k85056J74688N57496O17806N04671L50971J21242o7218L4386
41090B60468L80044O08735M82484N7409m83610q73337q26089l99856n6380j5379
41080h65511J02598N48368Q04038L27192m29320n42148M3493N18517M49459J83761
41070A140447K3375j76725m58356n34753k87171Q6014M48953O71772L28142p37756
41060E03942j635519j244056J06224Q74559M78666J4634L42808P51050L69925
41051E62233k53038j69511K61975L8819o60451p06847J40860R09156R06959M23243
41041A453398j18862o29115q43441l98090L41495M82230p4643m27394j11714K06113
41031a20023o3739m52308k91772K08565M47685L70899K31281k3091m06423m54727
$$ plain form
41021 -553653 -461315 129923 423769 -44488 -763084 -990995 -654262 -162590 191817 271039
41011 271039 -31935 -521286 -674573 -327555 -47010 -373228 -1016246 -1305974 -1153666 -993864
41001 -993864 -973496 -833527 -545002 -439650 -591726 -583892 -122973 442139 469145 -236479
40991 -236479 -1155748 -1515127 -1067986 -460516 -631034 -1711673 -2770231 -2868633 -2124858
40982 -2124858 -1415261 -1249875 -1326038 -1066513 -248738 826989 1560245 1593373 1295631 1375290
40972 1375290 1796148 1614405 332169 -1179513 -1788811 -1593506 -1437504 -1423066 -1021016
40963 -1021016 -376539 -210630 -411598 -30980 1069286 1810833 1546203 935674 666621
40954 666621 462838 41170 -62733 521737 1150907 1195940 1034617 1098088 867373 -54161
$$ packed form
41021e53653R2338N91238K93846m68257p18596k27911L36733M91672L54407P9222
41011B71039l02974m89351j53287L47018K80545l26218o43018k89728J52308J59802
41001i93864K0368J39969K88525J05352j52076P834M60919N65112K7006p05624
40991b36479r19269l59379M47141O07470j70518j080639j058558r8402P43775
40982b124858P09597J65386p6163K59525Q17775J075727P33256L3128k97742P9659
40972A375290M20858j81743j282236j511682o09298J95305J56002J4438M02050
40963a021016O44477J65909k00968L80618J100266P41547k64630o10529k69053
40954F66621k03783m21668j03903N84470O29170M5033j61323O3471k30715r21534
$$ plain form
40944 -54161 -733148 -138099 1036722 1230103 315071 -417604 -379479 -309662 -742562 -1251851
40934 -1251851 -1464885 -1602426 -1707429 -1460009 -1083216 -1345394 -2264379 -2817378 -2363433
40925 -2363433 -1407455 -555847 268091 1061668 1236783 587497 -99428 -146982 35302 -215932
40915 -215932 -738583 -1057885 -1278845 -1623051 -1699150 -1150171 -496971 -370596 -361685 301434
40905 301434 1253193 1346735 452044 -237853 107969 940527 1328791 1158479 899514 814971
40895 814971 902355 1202401 1688701 2061857 2004399 1552136 1037010 754296 751712 806385
40885 806385 577119 -62574 -820194 -1236412 -1101422 -514107 308352 1068904 1433270 1348127
40875 1348127 1168904 1147558 992171 376979 -289204 -215873 624099 1291414 990412 -93467
$$ packed form
40944e4161o78987N95049J174821J93381r15032p32675L8125O9817m32900n09289
40934a251851k13034j37541j05003K47420L76793k62178r18985n52999M53945
40925b363433R55978Q51608Q23938P93577J75115o49286o86925m7554J82284k51234
40915b15932n22651l19302k20960l44206p6099N48979O53200J26375Q911O63119
40905C01434R51759R3542q94691o89897L45822Q32558L88264j70312k58965q4543
40895H14971Q7384L00046M86300L73156n7458m52263n15126k82714k584N4673
40885H06385k29266o39693p57620m16218J34990N87315Q22459P60552L64366q5143
40875A348127j79223k1346j55387o15192o66183P3331Q39972O67315l01002j083879
$$ plain form
40865 -93467 -1226105 -1905803 -1987920 -1527088 -875743 -604586 -942682 -1495477 -1773130 -1737487
40855 -1737487 -1566443 -1224790 -698184 -396343 -764949 -1525526 -1805763 -1163459 -124442
40846 -124442 470436 387455 72006 -12910 124355 148299 -141803 -577079 -832705 -814961
40836 -814961 -736122 -789925 -929162 -1109421 -1552768 -2418441 -3260130 -3275943 -2301057 -1155389
40826 -1155389 -642698 -520420 6445 939751 1342169 680466 -350455 -752611 -472249
40817 -472249 -193505 -263049 -468632 -668694 -902390 -894221 -217377 848925 1319375 725201
40807 725201 -224108 -630601 -568615 -736983 -1344779 -1950242 -2175724 -1987020 -1406047 -558437
40797 -558437 29325 -195705 -1014645 -1535670 -1297015 -843552 -947529 -1595671 -2065674 -1823072
$$ packed form
40865i3467j132638o79698q2117M60832O51345K71157l38096n52795k77653L5643
40855a737487J71044L41653N26606L01841l68606p60577k80237O42304J039017
40846a24442N94878q2981l15449q4916J37265K3944k90102m35276k55626J7744
40836h14961P8839n3803j39237j80259m43347q65673q41689j5813R74886J145668
40826a155389N12691J22278N26865R33306M02418o61703j030921m02156K80362
40817d72249K78744o9544k05583k00062k33696Q169O76844J066302M70450n94174
40807G25201r49309m06493O1986j68368o07796o05463k25482J88704N80973Q47610
40797e58437N87762k25030q18940n21025K38655M53463j03977o48142m70003K42602
$$ plain form
40787 -1823072 -1073820 -499905 -597389 -1198329 -1553909 -1003845 312774 1463276 1517202
40778 1517202 339484 -1360850 -2655923 -3066257 -2744445 -2128300 -1491191 -873801 -336826
40769 -336826 -18168 101117 187942 179092 -253723 -1123283 -1872333 -2075360 -2063582 -2344445
40759 -2344445 -2668136 -2327651 -1292058 -359387 -129033 -446148 -948482 -1493902 -1857571
40750 -1857571 -1691372 -1125448 -830452 -1118626 -1518627 -1587258 -1528412 -1563144 -1372078 -825161
40740 -825161 -627295 -1334108 -2169571 -1882401 -597998 279673 66660 -399468 -262005
40731 -262005 105709 -16800 -387738 -233001 460486 914641 665983 35807 -438024 -473492
40721 -473492 -4566 731237 1005732 119372 -1611776 -2858994 -2674682 -1602562 -978794
$$ packed form
40787a823072P49252N73915r7484o00940l55580N50064J316619J150502N3926
40778A517202j177718j700334j295073m10334L21812O16145O37109O17390N36975
40769c36826L18658J19285Q6825q850m32815q69560p49050k03027J1778k80863
40759b344445l23691L40485J035593R32671K30354l17115n02334n45420l63669
40750a857571J66199N65924K94996k88174m00001o8631N8846l4732J91066N46917
40740h25161J97866p06813q35463K87170J284403Q77671k13013m66128J37463
40731b62005L67714j22509l70938J54737O93487M54155k48658o30176m73831l5468
40721d73492M68926P35803K74495q86360j731148j247218J84312J072120O23768
$$ plain form
40712 -978794 -1302339 -1804654 -1661403 -1077770 -813044 -985851 -933039 -240907 650330 1116671
40702 1116671 1170263 1201544 1243483 1051695 745467 723683 929961 864570 486978 419560
40692 419560 922463 1351442 1169571 872160 1153894 1635754 1357885 309275 -503479
40683 -503479 -464393 124017 928465 1918620 2616875 2217252 980852 372908 1037250 1713581
40673 1713581 1195379 323875 583898 1466861 1064561 -877347 -2360761 -1961851 -635250
40664 -635250 -15158 -309188 -797490 -1269284 -1830522 -2075075 -1587847 -795418 -360440 -156831
40654 -156831 251206 537446 14160 -1156967 -2095419 -2379086 -2245859 -1833582 -1145787
40645 -1145787 -627099 -770178 -1153735 -859962 65870 580559 274051 9469 512164
$$ packed form
40712i78794l23545n02315J43251N83633K64726j72807N2812O92132Q91237M66341
40702A116671N3592L1281M1939j91788l06228k1784K06278o5391l77592o7418
40692D19560N02903M28979j81871k97411K81734M81860k77869j048610q12754
40683e03479L9086N88410Q04448R90155O98255l99623j236400o07944O64342O76331
40673A713581n18202q71504K60023Q82963m02300j941908j483414L98910J326601
40664f35250O20092k94030m88302m71794n61238k44553M87228P92429M34978K03609
40654a56831M08037K86240n23286j171127r38452k83667J33227M12277O87795
40645a145787N18688j43079l83557K93773R25832N14689l06508k64582N02695
$$ plain form
40636 512164 1238244 1265775 637124 155220 272819 743429 1099218 1059973 655280 153089
40626 153089 -343436 -1187977 -2585445 -3737956 -3406696 -1588657 174428 616093 135677
40617 135677 -185152 -198787 -494465 -1113961 -1446718 -1267647 -1070915 -1315299 -1889520 -2367508
40607 -2367508 -2404662 -1927752 -1257852 -927493 -1090019 -1311079 -1215511 -1011177 -1010532 -1029981
40597 -1029981 -765335 -394267 -208487 16815 577060 1024930 643831 -335007 -847405
40588 -847405 -453457 104353 57517 -387468 -616917 -601062 -745315 -1051861 -1014644 -360603
40578 -360603 510345 1006035 1064529 1122790 1345572 1227204 303358 -945430 -1460426 -900672
40568 -900672 22008 624360 946036 1072376 630709 -388367 -1059895 -652240 236588
$$ packed form
40636E12164P26080K7531o28651m81904J17599M70610L55789l9245m04693n02191
40626A53089m96525q44541j397468j152511L31260J818039J763085M41665m80416
40617A35677l20829j3635k95678o19496l32757J79071J96732k44384n74221m77988
40607b367508l7154M76910O69900L30359j62526k21060R5568K04334O45j9449
40597a029981K64646L71068J85780K25302N60245M47870l81099r78838n12398
40588h47405L93948N57810m6836m44985k29449J5855j44253l06546L7217O54041
40578c60603Q70948M95690N8494N8261K22782j18368r23846j248788n14996N59754
40568i00672R22680O02352L21676J26340m41667j019076o71528M07655Q88828
$$ plain form
40559 236588 604433 583265 943487 1472083 1178709 23389 -889247 -959711 -683809 -404906
40549 -404906 191175 941168 924583 8449 -535044 168496 1192626 1177370 229142 -595340
40539 -595340 -967720 -1284719 -1503583 -1199114 -563427 -273564 -426811 -498002 -289986 -113497
40529 -113497 -100722 -128267 -333536 -901284 -1421972 -1337090 -992688 -1274641 -2076395 -2181965
40519 -2181965 -1065601 166409 281419 -394223 -617254 -70731 352477 -7760 -679185
40510 -679185 -808438 -252390 430562 786692 883892 968670 1027815 870382 522328 305375
40500 305375 465225 866606 1144929 1058912 620937 -496 -591549 -977450 -1091580 -944853
40490 -944853 -559579 -45559 333822 410388 398168 628599 993159 1028112 620549 189797
$$ packed form
40559B36588L67845k1168L60222N28596k93374j155320r12636p0464K75902K78903
40549d04906N96081P49993j6585r16134n43493P03540J024130j5256r48228q24482
40539e95340l72380l16999k18864L04469O35687K89863j53247p1191K08016J76489
40529a13497J2775k7545k05269n67748n20688Q4882L44402k81953q01754j05570
40519b181965J116364J232010J15010o75642k23031N46523M23208l60237o71425
40510f79185j29253N56048O82952L56130R7200Q4778N9145j57433l48054k16953
40500C05375J59850M01381K78323q6017m37975o21433n91053l85901j14130J46727
40490i44853L85274N14020L79381P6566j2220K30431L64560L4953m07563m30752
$$ plain form
40480 189797 24632 -67676 -216708 -128168 360965 863842 1034839 1108681 1319615 1255517
40470 1255517 476902 -580390 -1090387 -997019 -904953 -955556 -656967 132751 843517 982673
40460 982673 656082 181147 -200478 -119385 715506 1857176 2287382 1591333 510675
40451 510675 27379 283112 668474 648845 257087 -25247 206900 697521 628994 -336439
40441 -336439 -1384958 -1518363 -945743 -700565 -1027604 -1169111 -791961 -471179 -460001 -174028
40431 -174028 526601 662848 -422897 -1841547 -2269710 -1582845 -558725 299567 727226
40422 727226 253999 -1054049 -1980397 -1499545 -315891 151874 -76932 183156 1071733
40413 1071733 1345800 472398 -432538 -296192 501642 1047572 1183570 1177017 983261 578896
$$ packed form
40480A89797j65165r2308j49032Q8540M89133N02877J70997P3842K10934o4098
40470A255517p78615j057292n09997R3368R2066n0603K98589P89718P10766J39156
40460I82673l26591m74935l81625Q1093Q34891J141670M30206o96049j080658
40451E10675m83296K55733L85362j9629l91758k82334K32147M90621o8527r65433
40441c36439j048519j33405N72620K45178l27039j41507L77150L20782J1178K85973
40431a74028P00629J36247j085745j418650m28163O86865J024120Q58292M27659
40422G27226m73227j308048r26348M80852J183654M67765k28806K60088Q88577
40413A071733K74067q73402r04936J36346P97834N45930J35998o553j93756m04365
$$ plain form
40403 578896 326711 332059 83424 -632176 -1142023 -922601 -527621 -627798 -760192 -105986
40393 -105986 898185 940668 -223049 -1330645 -1340353 -673663 -361036 -678960 -1110008 -1167897
40383 -1167897 -812875 -333545 -118724 -314025 -537691 -246388 460602 784395 208559
40374 208559 -836467 -1588007 -1861799 -1955484 -1972024 -1779723 -1495766 -1437945 -1552311 -1369769
40364 -1369769 -665751 225602 898892 1297118 1452217 1218198 625925 208671 497154
40355 497154 1271176 1724794 1389764 558001 -230439 -749541 -1028543 -1083320 -947004 -771534
40345 -771534 -680957 -626672 -521709 -402365 -342708 -329314 -321588 -309085 -221581 65988 530545
40334 530545 931368 1018383 678455 -112090 -1195861 -2033707 -1976063 -973040 263744
$$ packed form
40403E78896k52185N348k48635p15600n09847K19422L94980j00177j32394O54206
40393a05986J004171M2483j163717j107596r708O66690L12627l17924m31048n7889
40383a167897L55022M79330K14821j95301k23666K91303P06990L23793n75836
40374B08559j045026p51540k73792r3685j6540J92301K83957N7821j14366J82542
40364a369769P04018Q91353O73290L98226J55099k34019n92273m17254K88483
40355D97154P74022M53618l35030q31763p88440n19102k79002n4777J36316J75470
40345g71534R0577N4285J04963J19344N9657J3394P726J2503Q7504K87569M64557
40334E30545M00823Q7015l39928p90545j083771q37846N7644J003023J236784
$$ plain form
40325 263744 1036476 1320820 1433196 1410481 1087778 490506 -263452 -1191508 -2153947 -2628568
40315 -2628568 -2313476 -1726203 -1600209 -1839450 -1721069 -1058722 -469793 -440918 -778378 -1088199
40305 -1088199 -1203921 -1051523 -696992 -586575 -1054486 -1529395 -1066298 147401 770681
40296 770681 189367 -556201 -348208 420872 685106 352476 89836 35551 -147928 -299536
40286 -299536 -9352 308381 -239278 -1534647 -2383923 -2163304 -1557894 -1343012 -1348412 -1102068
40276 -1102068 -716148 -550269 -576707 -640740 -889307 -1411814 -1837249 -1795207 -1471444 -1253100
40266 -1253100 -1126098 -899066 -753807 -1031808 -1598053 -1897496 -1611327 -898304 -69564
40257 -69564 587090 713743 69018 -1054369 -1913720 -2037384 -1742472 -1767340 -2387373 -3002037
$$ packed form
40325B63744P72732K84344J12376k2715l22703n97272p53958r28056r62439m74621
40315b628568L15092N87273J25994k39241J18381O62347N88929K8875l37460l09821
40305a088199j15722J52398L54531J10417m67911m74909M63097J213699O23280
40296G70681n81314p45568K07993P69080K64234l32630k62640n4285j83479j51608
40286b99536K90184L17733n47659j295369q49276K20619O05410K14882n400K46344
40276a102068L85920J65879k6438o4033k48567n22507m25435M2042L23763K18344
40266a253100J27002K27032J45259k78001n66245k99443K86169P13023Q28740
40257f9564O56654J26653o44725j123387q59351j23664K94912k4868o20033o14664
$$ plain form
40247 -3002037 -2740357 -1528299 -346168 -142695 -622389 -595391 382162 1288303 946906
40238 946906 -370957 -1258305 -930820 -58588 253216 -197775 -678991 -527965 163643
40229 163643 815255 1039151 943800 848752 857040 806524 584500 330160 270724 453566 683959
40218 683959 650935 127152 -806857 -1715051 -2142728 -2034244 -1664009 -1196424 -612774 -100158
40208 -100158 -84400 -627984 -1141667 -1066367 -641217 -614481 -1278910 -2121573 -2404127 -1845093
40198 -1845093 -781491 109163 306339 -90037 -418872 -165639 460659 833470 648051
40189 648051 106257 -480691 -916096 -1011170 -655166 -65951 337868 418182 440973 654693
40179 654693 981255 1208832 1259431 1130465 748681 61416 -779165 -1445712 -1687710 -1548408
$$ packed form
40247c002037K61680J212058J182131K03473m79694K6998R77553R06141l41397
40238I46906j317863q87348L27485Q72232L11804m50991m81216J51026O91608
40229A63643O51612K23896r5351r5048Q288n0516k22024k54340n9436J82842K30393
40218F83959l3024n23783r34009r08194m27677J08484L70235M67585N83650N12616
40208a00158J5758n43584n13683P5300M25150K6736o64429q42663k82554N59034
40198a845093J063602Q90654J97176l96376l28835K53233O26298L72811j85419
40189F48051n41794n86948m35405r5074L56004N89215M03819Q0314K2791K13720
40179F54693L26562K27577N0599j28966l81784o87265q40581o66547k41998J39302
$$ plain form
40169 -1548408 -1290778 -1052759 -663683 5964 592118 518294 -178362 -736980 -631782 -212592
40159 -212592 -41469 -41774 182712 582806 867820 1156224 1655236 1910516 1280689 124176
40149 124176 -457980 -231126 -208089 -1057692 -2060558 -2233284 -1706259 -1249835 -1030246 -648486
40139 -648486 -30426 498527 785781 811679 303065 -878902 -2062972 -2221940 -1226746
40130 -1226746 -114423 47157 -790073 -1787012 -2085177 -1530384 -786295 -670901 -1183444
$$ packed form
40169a548408K57630K38019L89076O69647N86154p3824o96656n58618J05198M19190
40159b12592J71123l05K24486M00094K85014K88404M99012K55280o29827j156513
40149A24176n82156K26854K3037q49603j002866j72726N27025M56424K19589L81760
40139f48486O18060N28953K87254K5898n08614j181967j184070j58968R95194
40130a226746J112323J61580q37230r96939k98165N54793P44089J15394n12543
$$ [...]
##END NTUPLES=NMR SPECTRUM
##END=
