##TITLE=31Pdec_IBEP0504
 CDcl3, 24 sc
 12.4.2019
##JCAMPDX= 6.0         $$ Bruker NMR JCAMP-DX V2.0
##DATA TYPE= NMR SPECTRUM
##DATA CLASS= NTUPLES
##ORIGIN= UXNMR, Bruker Analytische Messtechnik GmbH
##OWNER= root
$$ XWIN-NMR		Version 3.5
$$ Fri Apr 12 14:09:45 2019 Russian Standard Time (UT+4h)  she@DPX200
##.OBSERVE FREQUENCY= 81.013821
##.OBSERVE NUCLEUS= ^31P
##.ACQUISITION MODE= SIMULTANEOUS
##.ACQUISITION SCHEME= undefined
##.AVERAGES= 24
##.DIGITISER RES= 17
##SPECTROMETER/DATA SYSTEM= spect
##.PULSE SEQUENCE= zgpg30
##.SOLVENT NAME= CDCl3
##.SHIFT REFERENCE= (INTERNAL, CDCl3, 0, 182.463)
##AUDIT TRAIL= $$ (NUMBER, WHEN, WHO, WHERE, WHAT)
$$ ##TITLE= Audit trail, XWIN-NMR		Version 3.5
$$ ##JCAMPDX= 5.01
$$ ##ORIGIN= Bruker BioSpin GmbH
$$ ##OWNER= she
$$ F:/spectra/data/she/nmr/P31/1/pdata/1/auditp.txt
$$ ##AUDIT TRAIL=  $$ (NUMBER, WHEN, WHO, WHERE, WHAT)
(   1,<2019-04-12 14:08:42.67 +0400>,<she>,<DPX200>,
      <created by zg, POWCHK disabled, PULCHK disabled
       configuration hash MD5:
       00 E9 B6 7A A2 85 ED C7 34 08 36 98 17 FE 4E 26
       data hash MD5: 32K
       CC 6F 2F 61 A9 C7 27 71 D1 73 72 92 F1 06 19 82>)
(   2,<2019-04-12 14:08:44.96 +0400>,<she>,<DPX200>,
      <Start of raw data processing
       efp BC_mod = 2 LB = 1 FT_mod = 6 PKNL = 1 PHC0 = -1824.511 PHC1 = 61.19899 SI = 64K 
       data hash MD5: 64K
       4F 92 73 07 44 A3 D0 54 F5 A1 63 6F 07 54 3B 73>)
(   3,<2019-04-12 14:09:02.64 +0400>,<she>,<DPX200>,
      <pk PHC0 = 17.84281 PHC1 = 0 
       data hash MD5: 64K
       B3 25 F6 66 63 6F EE 30 20 63 EE A8 9A 09 85 2F>)
(   4,<2019-04-12 14:09:08.12 +0400>,<she>,<DPX200>,
      <abs ABSG = 5 
       data hash MD5: 64K
       32 24 73 D7 0B 06 C6 37 0B 4F 17 CA 7E 94 20 CB>)
$$ ##END=
$$ 
$$ hash MD5
$$ 39 14 D7 BB 2C 30 87 E0 A8 A4 E5 F2 39 D6 B9 99
##$RELAX= 
##$RELAX= 
##$RELAX= 
##$RELAX= 
##$RELAX= 
##$RELAX= 
##$RELAX= 
##$RELAX= 
$$ Bruker specific parameters
$$ --------------------------
##$DU= <F:/spectra>
##$EXPNO= 1
##$NAME= <P31>
##$PROCNO= 1
##$TYPE= <nmr>
##$USER= <she>
##$AMP= (0..31)
100 100 100 100 100 100 100 100 100 100 100 100 100 100 100 100 100 100 
100 100 100 100 100 100 100 100 100 100 100 100 100 100 
##$AQSEQ= 0
##$AQ_mod= 1
##$AUNM= <au_zg>
##$AUTOPOS= <>
##$BF1= 81.014009
##$BF2= 200.13
##$BF3= 200.13
##$BF4= 200.13
##$BF5= 200.13
##$BF6= 200.13
##$BF7= 200.13
##$BF8= 200.13
##$BYTORDA= 1
##$CFDGTYP= 0
##$CFRGTYP= 5
##$CHEMSTR= <none>
##$CNST= (0..31)
1 1 145 1 1 1 1 1 1 1 1 1 1 1 1 1 1 1 1 1 1 1 1 1 1 1 1 1 1 1 1 1 
##$CPDPRG= <waltz16>
##$CPDPRG1= <>
##$CPDPRG2= <waltz16>
##$CPDPRG3= <>
##$CPDPRG4= <mlev>
##$CPDPRG5= <mlev>
##$CPDPRG6= <mlev>
##$CPDPRG7= <mlev>
##$CPDPRG8= <mlev>
##$CPDPRGB= <>
##$CPDPRGT= <>
##$D= (0..31)
0 1 0 0 0 0 0 0 0 0 0 0.03 2e-05 3e-06 0 0 0 0 0 0 0 0 0 0 0 0 0 0 0 0 
0 0 
##$DATE= 1555063722
##$DBL= (0..7)
120 120 120 11 120 120 24 19 
##$DBP= (0..7)
150 150 150 150 150 150 150 150 
##$DBP07= 0
##$DBPNAM0= <>
##$DBPNAM1= <>
##$DBPNAM2= <>
$$ [...]
##$SUBNAM3= <"">
##$SUBNAM4= <"">
##$SUBNAM5= <"">
##$SUBNAM6= <"">
##$SUBNAM7= <"">
##$SUBNAM8= <"">
##$SUBNAM9= <"">
##$SW= 369.568048894756
##$SWIBOX= (0..15)
0 1 3 0 0 0 0 0 0 0 0 0 0 0 0 0 
##$SW_h= 29940.119760479
##$TD= 32768
##$TD0= 1
##$TE= 0
##$TE2= 300
##$TE3= 300
##$TEG= 300
##$TL= (0..7)
0 120 53 12 22 120 120 120 
##$TP= (0..7)
150 150 150 150 150 150 150 150 
##$TP07= 0
##$TPNAME0= <>
##$TPNAME1= <>
##$TPNAME2= <>
##$TPNAME3= <>
##$TPNAME4= <>
##$TPNAME5= <>
##$TPNAME6= <>
##$TPNAME7= <>
##$TPOAL= (0..7)
0.5 0.5 0.5 0.5 0.5 0.5 0.5 0.5 
##$TPOFFS= (0..7)
0 0 0 0 0 0 0 0 
##$TUNHIN= 0
##$TUNHOUT= 0
##$TUNXOUT= 0
##$USERA1= <user>
##$USERA2= <user>
##$USERA3= <user>
##$USERA4= <user>
##$USERA5= <user>
##$V9= 5
##$VALIST= <valist>
##$VCLIST= <CCCCCCCCCCCCCCC>
##$VD= 0
##$VDLIST= <DDDDDDDDDDDDDDD>
##$VPLIST= <PPPPPPPPPPPPPPP>
##$VTLIST= <TTTTTTTTTTTTTTT>
##$WBST= 1024
##$WBSW= 4
##$XGAIN= (0..3)
0 0 0 0 
##$XL= 0
##$YL= 0
##$YMAX_a= 86409
##$YMIN_a= -86501
##$ZGOPTNS= <>
##$ZL1= 120
##$ZL2= 120
##$ZL3= 120
##$ZL4= 120
##$ABSF1= 182.463
##$ABSF2= -187.1042
##$ABSG= 5
##$ABSL= 3
##$ALPHA= 0
##$AQORDER= 0
##$ASSFAC= 0
##$ASSFACI= 0
##$ASSFACX= 0
##$ASSWID= 0
##$AUNMP= <proc_1d>
##$AZFE= 0.1
##$AZFW= 0.5
##$BCFW= 0
##$BC_mod= 2
##$BYTORDP= 0
##$COROFFS= 0
##$CY= -3
##$DATMOD= 1
##$DC= 0
##$DFILT= <>
##$DTYPP= 0
##$F1P= 0
##$F2P= 0
##$FCOR= 1
##$FTSIZE= 65536
##$FT_mod= 6
##$GAMMA= 0
##$GB= 0
##$INTBC= 1
##$INTSCL= 5.30512e-09
##$ISEN= 30
##$LB= 1
##$LEV0= 0
##$LPBIN= 0
##$MAXI= 10000
##$MC2= 0
##$MEAN= 0
##$ME_mod= 0
##$MI= 50
##$NCOEF= 0
##$NC_proc= -4
##$NLEV= 6
##$NOISF1= 182.463
##$NOISF2= 159.3651
##$NSP= 0
##$NTH_PI= 0
##$NZP= 0
##$OFFSET= 182.463
##$PC= 4
##$PHC0= -1806.668
##$PHC1= 61.19899
##$PH_mod= 1
##$PKNL= yes
##$PPARMOD= 0
##$PSCAL= 0
##$PSIGN= 0
##$REVERSE= no
##$SF= 81.0140089999434
##$SI= 65536
##$SIGF1= 159.3651
##$SIGF2= -187.1042
##$SINO= 113.3802
##$SIOLD= 16384
##$SREGLST= <1H.CDCl3>
##$SSB= 0
##$STSI= 65536
##$STSR= 0
##$SW_p= 29940.119760479
##$SYMM= 0
##$S_DEV= 0
##$TDeff= 32768
##$TDoff= 0
##$TI= <>
##$TILT= no
##$TM1= 0
##$TM2= 0
##$TOPLEV= 0
##$USERP1= <user>
##$USERP2= <user>
##$USERP3= <user>
##$USERP4= <user>
##$USERP5= <user>
##$WDW= 1
##$XDIM= 65536
##$YMAX_p= 369751270
##$YMIN_p= -4091902
$$ End of Bruker specific parameters
$$ ---------------------------------
##NTUPLES= NMR SPECTRUM
##VAR_NAME=  FREQUENCY,     SPECTRUM/REAL,   SPECTRUM/IMAG
##SYMBOL=    X,             R,               I
##VAR_TYPE=  INDEPENDENT,   DEPENDENT,       DEPENDENT
##VAR_FORM=  AFFN,          ASDF,            ASDF
##VAR_DIM=   65536,         65536,           65536
##UNITS=     HZ,            ARBITRARY UNITS, ARBITRARY UNITS
##FACTOR=    0.456856943014862, 1,           1
##FIRST=     14782.0589164792, 0,            0
##LAST=      -15158.0608439998, 0,           0
##MIN=       -15158.0608439998, -4091902,    0
##MAX=       14782.0589164792, 369751270,    0
$$ Real data points
##PAGE= N=1
##DATA TABLE= (X++(R..R)), XYDATA
$$ [...]
45890b38531K58827K75594K06983J31870P5881M705j33444k74243j99065J63725
45880B72302M69611L31434n7404j22946J98584L10797r4795n16629m42644j37617
45870B10693j13458k56629j22920J95011J98195j37044k86810l2168K05627M2110
45860i7393l11878l82059l6120M05347N00752R0857m88346o60725k53004K52620
45850i79949L39245J31036J01845K96054L23553P2452r6958L9143K26216J80103
45840F32740J2059j9488P6621Q2466r8218l24836l75601j78172O8938Q6079q6304
45829a23716o9518K68550M73395J29975l92702l70634J80514M75006J26279k95072
45819D02077j79006J97905J47943l65038o75052l31086L64016P73783O07566R8221
$$ y = [-238531, 20296, 295890, 502873, 634743, 710624, 715329, 581885, 307642, 108577, 272302, 741913, 1073347, 1015943, 892997, 1091581, 1402378, 1307583, 790954, 348310, 210693, 97235, -159394, -282314, -87303, 110892, -26152, -312962, -345130, -139503, -97393, -409271, -791330, -827450, -422103, 78649, 169506, -318840, -979565, -1232569, -979949, -640704, -509668, -407823, -111769, 211784, 284236, 187278, 226421, 452637, 632740, 644799, 625311, 701932, 784398, 686180, 361344, -14257, -192429, -123491, -37412, -123716, -193234, 75316, 548711, 678686, 285984, -84650, 95864, 570870, 697149, 402077, 223071, 420976, 568919, 203881, -471171, -802257, -438241, 335542, 943108, 1041329]
45809A041329l31791m68178l91348k49315p8387Q6196R6634r9562k59524j30688
45799g84634J38473J90665J6715m9258J01783J98952Q6157l4776N368R1192J18143
45788G8780J58106J60777r1910n07931o01024j91411K29133K00609m5265p1965
45778f82101J1364j40625l49479j42550L78407N79179K42745j34678j35182L4884
45768c38036J1508j65955k39138j42989L5108K54328M37387M00823J00441k13193
45758A40284k83810j60424n1157m423Q0196K20813L09735K61896R7906q0595j46931
45747C83490o3561K4765o0602k47599k50176K3275K90437K70643O1300n9729n4994
45736C17249q7391j45457k7021K55868L42578l0651o08498q42259n05543O7379
$$ y = [1041329, 709538, 241360, -149988, -399303, -477690, -391494, -294860, -394422, -653946, -784634, -646161, -455496, -438781, -488039, -386256, -187304, -101147, -135923, -130555, -39363, 78780, 236886, 397663, 305753, -202178, -803202, -994613, -765480, -564871, -610136, -682101, -670737, -811362, -1160841, -1303391, -924984, -345805, -103060, -237738, -372920, -338036, -326528, -492483, -731621, -874610, -839502, -585174, -147787, 253036, 353477, 140284, -143526, -303950, -355107, -359530, -279334, -58521, 251214, 513110, 611016, 530421, 383490, 319929, 344694, 284092, 36493, -213683, -190408, 100029, 370672, 431972, 372243, 317249, 229858, 84401, 57380, 313248, 655826, 625175, 16677, -825582, -1331125, -1263746]
45726a263746L84125L18564J44335J03080J01835o3518k99264k58553J53480N39433
45716a40229M62728J6408k98962k22911P334R2866Q0429J53744K38932J10451
45706E00790j82637k97816o9454K32489K48308j2382k14649j33055J09619K42258
45696D23471J72017N4937P4403J99932K06159m5945l83917m62731j57396K51128
45686C32058L51599M8377l29143l87515j04323J63080J24435q5204j24079L9986
45676B9271P9149j61131l69560k34737M8613R1547m3799L3500L28908L89036M1851
45665B32648k92660k50884l3430K8695R135J26144K88799K96955K15006J65165
45655G85573K6812k61161l98202j76616O2846m9131k37014m9022K72137J40269
$$ y = [-1263746, -879621, -561057, -416722, -313642, -211807, -275325, -574589, -833142, -679662, -140229, 322499, 338907, 39945, -182966, -175632, -82766, -2337, 151407, 390339, 500790, 318153, 20337, -49117, 183372, 431680, 419298, 204649, 71594, 181213, 423471, 595488, 650425, 724828, 924760, 1130919, 1084974, 701057, 238326, 80930, 332058, 683657, 732034, 402891, 15376, -88947, 74133, 198568, 113364, -10715, 29271, 108420, -52711, -422271, -657008, -608395, -516848, -560647, -527147, -198239, 190797, 232648, -60012, -310896, -344326, -315631, -306496, -180352, 108447, 405402, 620408, 785573, 812385, 551224, 153022, -23594, 39252, -9879, -246893, -295915, -23778, 116491]
45645A16491l18337m04016j2589K18267L8665m3254K25178L53997M9584j92295
45635C1691K2841K41628m8002n00185m88834j10929J00873P7494J24135K42471
45625c06817K13990J09611J01197K2965k79033m53348j47842K83487K85486L8443
45615a31861J02905L60781K10396k81336l77235J01852M53143K03492k63653m52431
45605g3947l89949k32603P3817M23736M67664K06847Q2510K06631J46552k28338
45595F82920l92784o7037K20324j1398m01675l98197j42131o0791o2332J56449
45585d76652L79553J91046k22591l00241O618K19662J20786l4504m7188M932N4768
45574a03811J07635O6997j02900j57314P2957K77498R8855k11302j39288K18791
$$ y = [116491, -201846, -605862, -618451, -400184, -361519, -404773, -179595, 174402, 223986, 31691, 54532, 296160, 248158, -252027, -740861, -851790, -750917, -673423, -549288, -306817, -92827, 16784, 117981, 140946, -138087, -591435, -739277, -455790, -170304, -131861, -28956, 331825, 542221, 260885, -116350, -14498, 438645, 642137, 378484, -73947, -463896, -696499, -622682, -198946, 268718, 475565, 558075, 764706, 911258, 682920, 290136, 223099, 443423, 432025, 30350, -367847, -509978, -570769, -633101, -476652, -97099, 93947, -128644, -428885, -422267, -202605, -81819, -116323, -163511, -158579, -103811, 3824, 70821, -32079, -189393, -116436, 161062, 259917, 48615, -90673, 128118]
45564A28118K83402l7647j93207Q4597L53228J99105j53313k82962j79922q1150
45554A20249l9711J7849M7472j6870r2214q1059l6485m6949r6063j37534j59315
45543e20630j06256Q6179L16450L53822J22535j91161l45322k34187P9527L65497
45533g3546L53612O6795j06946O4395K48297L5149l47381l21880J23255L97736
45523D39486K22797k8459m1899q555j15302j48504N9013K48361J53794p9839k08559
45512D92334k53073k74464j73785J0637J8968j44020j05485J94052K63352j02652
45502g4136l46511l9355L42873K05501j47291q9580J93713R3188k37135j24869
45492b23602L48361M20037R223j13593K80707M28035p9683n26666k55840K64307
$$ y = [128118, 411520, 373873, 180666, 265263, 618491, 817596, 664283, 381321, 201399, 120249, 80538, 98387, 145859, 128989, 36775, -44284, -80769, -127718, -223781, -361315, -520630, -626886, -540707, -224257, 129565, 252100, 60939, -284383, -518570, -439043, -73546, 280066, 346861, 239915, 304310, 552607, 587756, 240375, -81505, 41750, 439486, 662283, 633824, 591925, 583370, 468068, 319564, 378577, 626938, 780732, 700893, 492334, 239261, -35203, -208988, -198351, -179383, -323403, -428888, -234836, 28516, -74136, -420647, -460002, -117129, 88372, -58919, -148499, 45214, 138402, -98733, -223602, 124759, 544796, 554019, 440426, 721133, 1149168, 1069485, 542819, 286979, 551286]
45482E51286K79321o8321j94433j36827l01837n43430l74047J03803K83487J1752
45472c89246k33069j22761J58511L54103M05543K65541o3978k94620j31244K09562
45462A58342K47944m222q4802R3157Q0355k88997n38657l03229J04916K45108
45452b90085J86578J74169Q1991k76357n90326l79635K45615O64644N56875J94171
45442E67640q0715k38607l34459k65489M5983M33093O09710M41924O8613j81835
45432A065858q0940J69555O6398n01008q98652n05889L15136N86469Q4234l28282
45422b7121m390N22512M24269j08084k17855K13949M06471k9381m84157l58520
45412C37693K7354N1980k00990k04406M9406O3755k43443l23331J26009O17468
$$ y = [551286, 830607, 762286, 567853, 431026, 129189, -414241, -788288, -684485, -400998, -389246, -622315, -745076, -586565, -232462, 173081, 438622, 374644, 80024, -51220, 158342, 406286, 402064, 317262, 410419, 490774, 201777, -336880, -640109, -535193, -290085, -103507, 70662, 152653, -123704, -714030, -1093665, -848050, -183406, 373469, 567640, 486925, 248318, -86141, -351630, -305647, 127446, 737156, 1179080, 1247693, 1065858, 984918, 1154473, 1220871, 719863, -178789, -684678, -369542, 216927, 301161, -27121, -31511, 491001, 915270, 807186, 589331, 803280, 1209751, 1180370, 696213, 337693, 365047, 417027, 216037, 11631, 61037, 124792, -118651, -441982, -315973, 301495]
45402C01495N37061j9564m42925m25565k09500j02384r4666j7864J54153K87752
45392c2007K74323J48208M8498Q0494J91482K10071N6899j23514j22635O0221
45382G92040K04527J43518l9263j38137p9411L1979Q5564Q3298O3012M584j03053
45371A048658j70817j21319o8971k07835m72409n20415k02674J40840R9953k16807
45361f91796l20210j9825L75325N58393N52802M30849J10132l27548m86950j93298
45351a2126J13217m1150l96277k99090K76611O46480M39791J11397J45777K69597
45341A254227n2005o49829p81795k01191M36787M29024p8693l60020r6693K69369
45331A69181K20752j21081k30104L0550K31111N3494k34123k27493P20J14529
$$ y = [301495, 838556, 818992, 376067, -49498, -258998, -361382, -456048, -473912, -319759, -32007, 242316, 390524, 439022, 519516, 710998, 921069, 977968, 854454, 731819, 792040, 996567, 1140085, 1100822, 962685, 883274, 915253, 1000817, 1084115, 1147127, 1151711, 1048658, 877841, 756522, 687551, 479716, 7307, -513108, -715782, -574942, -474989, -691796, -1012006, -1031831, -656506, -98113, 454689, 885538, 995670, 668122, 181172, -12126, 101091, 59941, -336336, -635426, -358815, 287665, 727456, 838853, 984630, 1254227, 1202222, 552393, -229402, -430593, 6194, 435218, 356525, -3495, -100188, 169181, 389933, 268852, 38748, 69298, 300409, 353903, 119780, -107713, -106993, 7536]
45321G536J12402K24662L36073R5315l71800m88176j42535O4433j78065k99354
45311f39509J97611P68903N81194j50975m61316j03337J98641K0248j68430L5954
45301B78984K58129Q7469j45035L9489L75282K37969l41712p01562n00264r9868
45291e11119L1889j09352j77958P2590M84047N64167L2766o33797n88508K29461
45281f05814Q18843M39029l03685l76173J11369K00353k63238l99628J46007N51386
45271C18449J98416k86904j03033L94016L13899l25278p11756n26674k22103j02507
45261a053475M1846L09022M03643J66947j43336k65634k02458J131L11582M88322
45251E7590K78104j04575j73029P9257J45279j56793l79973j96059J12948K06313
$$ y = [7536, 119938, 344600, 680673, 775988, 404188, -83988, -226523, -162090, -340155, -639509, -441898, 327005, 908199, 757224, 295908, 192571, 391212, 411460, 243030, 278984, 537113, 624582, 479547, 519036, 894318, 1132287, 790575, 89013, -411251, -511119, -479230, -588582, -766540, -693950, -209903, 354264, 387030, -246767, -835275, -605814, 213029, 652058, 348373, -27800, 83569, 283922, 20684, -378944, -232937, 318449, 516865, 229961, 126928, 520944, 834843, 509565, -202191, -728865, -950968, -1053475, -1011629, -702607, -298964, -132017, -275353, -540987, -743445, -742314, -430732, 57590, 335694, 231119, 58090, 137347, 282626, 125833, -254140, -450199, -337251, -130938]
45241a30938K00601K73476K40141m6839k94808k21776m5696p3419j61430p1668
45231c32356k069j92948l26697J1976M97313M18749j98188n60210k61221K08368
45221g37283K78331K8561j44802j07305L6108J64385J23830j78420m96798l99619
45211a433012J45569O61612P55461M83337N1852m09775o56259m01655J79463M80598
45201a42809K56032n2211m7148N2675o4705j98201l0130K59237K90652J00616
45191D24008l5675j14865k39145k23638P3973K84171N996m32109l65688J51589
45181d71383M00007J18190j43217M3430L47611K74604j08849l68352k74587O2928
45171a19618L55879K95269j38252m51111j29267N54392P19840N8476o86596p27443
$$ y = [-130938, 69663, 343139, 583280, 536441, 241633, 19857, -25839, -99258, -260688, -332356, -334425, -527373, -854070, -842094, -344781, 73968, -124220, -684430, -945651, -737283, -458952, -430391, -575193, -682498, -646390, -482005, -358175, -536595, -1033393, -1433012, -1287443, -625831, 129630, 612967, 664819, 255044, -401215, -802870, -623407, -142809, 113223, 61012, 13864, 66539, 1834, -196367, -226497, 32740, 323392, 424008, 388333, 273468, 34323, -189315, -115342, 168829, 174825, -257284, -622972, -471383, -71376, 46814, -96403, -52973, 294638, 569242, 460393, 92041, -182546, -119618, 236261, 531530, 393278, -57833, -187100, 367292, 1087132, 1145608, 459012, -268431]
45161b68431k30590J10943R1817M9337J54167J99359M2760j71244k56969j70699
45151d49550L4025K11817J61475j10589k56464J8270M87757O11447K05792l26186
45141E87794m73086j49789K80983L98992J13296k71731l79787j63771Q8322J37707
45131A68930K2245j24944k56519l12958j83098P6406J95836N1557j24570q2722
45121e69837J00696K15925K27441J45882j52486o37243q65099m43279L28965P05557
45111i43478M00608j10080k52960J494K71423K80443Q9945n1793P823J54870J46703
45100e002l9716j45267l6238L9176j52911l79291k39373J97774M55548L20886
45090A5586O0741n6711o7573n9832P923R7406L5162j63519k10493K3824K55428
$$ y = [-268431, -499021, -388078, -296261, -246924, -92757, 106602, 149362, -21882, -278851, -449550, -415525, -203708, -42233, -152822, -409286, -391016, 96741, 708188, 913980, 587794, 114708, -35081, 245902, 644894, 758190, 486459, 106672, -57099, 31223, 168930, 191175, 66231, -190288, -503246, -686344, -609938, -414102, -362545, -487115, -569837, -469141, -253216, -25775, 120107, -32379, -669622, -1534721, -1978000, -1649035, -943478, -542870, -652950, -905910, -904416, -632993, -352550, -262605, -314398, -306575, -151705, -5002, -44718, -189985, -226223, -187047, -339958, -719249, -958622, -760848, -305300, 15586, 76327, 19616, -47957, -107789, -99866, -2460, 32702, -130817, -341310, -317486, -62058]
45079f2058J79423r2085k10318n8174J69470K54902J59150K464m2765R1694K56097
45068F47800K27902J6718j25192o9160j2337j75902m31209m08546L7699N89871
45058B97644P45365L41688k24226l98339j11772J55396M8459j84330j41617O1891
45048E90159N304l00103m02932j49385R4711P3178j3210J9237K935j65400k21331
45037d66837Q265K24898J19612j14147j29980O774M0066M7057K52344N03680M40981
45026I32713Q9258j94843k99558m03341m85303l04226Q4333K82443J45180j5445
45016a68789L2315J21312Q8880Q0837J93682J94588o3454k57358l0754L87332
45006E78591M38813L5843l19181k54033J1792P9555n0701p1284J09174K15860
$$ y = [-62058, 117365, 25280, -185038, -243212, -73742, 181160, 340310, 342774, 300009, 391703, 647800, 875702, 892420, 767228, 698068, 685731, 509829, 78620, -329926, -292227, 297644, 1043009, 1384697, 1160471, 762132, 650360, 805756, 854215, 669885, 528268, 590159, 595463, 295360, -107572, -256957, -162246, -89068, -102278, -83041, -80106, -245506, -466837, -458572, -233674, -114062, -228209, -358189, -351415, -311349, -264292, -11948, 491732, 932713, 1021971, 827128, 527570, 124229, -361074, -665300, -580967, -298524, -153344, -168789, -136474, -15162, 73718, 154555, 348237, 542825, 479371, 222013, 191259, 578591, 1017404, 1053247, 734066, 480033, 491825, 571380, 520679, 449395, 558569, 774429]
44996G74429R661l58280n16655l23363j5180J05280K8977K628J68885L59410L08673
44985E44465J2178k45083k48974j34310j77446l61970l55593K371L88572L70811
44975b04979j5828l16363k47381J9163J90164J95157R8781o4662k02161j37591
44965f85700J12052K35784N8207j08879J18475N31506M98925j30176o95297n43941
44955f09044R2050L96873M8560m01621l33159J12851L17608J00309r8274K7209
44945c46638J82854K3846k32895j77266P2727N6454k26347k83694M2847K96556
44935e91556J43101j29187j32708M3251J17306R2663R0077M7380m6829M4149L69085
44924D6732M92968J05375l75805l39920J13192L70235K26604J6280o6589j52777
$$ y = [774429, 784090, 425810, -90845, -414208, -429388, -324108, -295131, -292503, -123618, 235792, 544465, 556643, 311560, 62586, -71724, -249170, -611140, -966733, -964362, -575790, -204979, -220807, -537170, -784551, -765388, -575224, -380067, -281286, -345948, -548109, -685700, -573648, -337864, -279657, -388536, -270061, 261445, 760370, 630194, -65103, -609044, -516994, -120121, -71561, -473182, -806341, -693490, -375882, -275573, -373847, -346638, -163784, -139938, -372833, -550099, -477372, -420918, -647265, -930959, -888112, -591556, -448455, -577642, -710350, -667099, -549793, -457130, -367053, -319673, -366502, -322353, 46732, 539700, 645075, 269270, -70650, 42542, 412777, 639381, 655661, 589072, 436295]
44914D36295k29853j00344J42007J64194J146N4005L71720M98338K12242j22129
44904A427621j73770j17498k05280l06061j96064L5068J64295J50235N1323r7854
44894G32015j70060k0663J84551Q7410k73231m21864j85253Q688j61104l92901
44884f12412l08567m8702J04217K62482N85870P63186M14772k29450o02997n73431
44874b45032m22428k31281J41500N46741N79010J78492k45816l53986j84945O4231
44864a73514K11971P5600l36438o29897m12395J20889L84162K00141j9717M0154
44854e39044J75161Q9667j24375j76808j647K16287K77955J09537j83014l28013
44844d84294j27609K61456M61563L23483N5200j12616j64814j67896j33074q4768
$$ y = [436295, 206442, 106098, 248105, 412299, 413445, 467450, 839170, 1337508, 1549750, 1427621, 1253851, 1136353, 931073, 625012, 428948, 464016, 628311, 778546, 829869, 732015, 561955, 541292, 725843, 813253, 540022, 118158, -67095, -58407, -219511, -612412, -920979, -969681, -865464, -602982, -17112, 746074, 1160846, 931396, 328399, -245032, -667460, -898741, -757241, -210500, 368510, 547002, 301186, -52800, -237745, -173514, 38457, 114057, -222381, -852278, -1264673, -1143784, -759622, -559481, -579198, -539044, -363883, -274216, -398591, -575399, -577046, -360759, -82804, 26733, -156281, -484294, -611903, -350447, 111116, 434599, 489799, 377183, 212369, 44473, -88601, -173369]
44834a73369o6181k3940J17467K42857J46064j13058k16718m7915J16582J5220
44824b991k15373k47089p187K47335K33859o7501l75930l52371K3037L54360K74392
44813a35459o3701j83580L9061K19983P4508j53733r1746J89732K98230Q8426
44803B81721j81030k39004j06028M8501J61629K56151K68076Q9228j90928k87086
44793A01230j17633k2413k82726n47390k16740N54234Q40579K38741m32757k84457
44783a69332L07790L16435l16380o48744k75041J44813J15873O7720M02335O63763
44773F09232L56439q9329J0024M21301L63781k13999n81098l74825k5373L4493
44763E10646r4145j82696k41838k75653j40201J31725K50410J21617M4765K53713
$$ y = [-173369, -239550, -263490, -146023, 96834, 242898, 129840, -86878, -134793, -18211, -2991, -218364, -465453, -472640, -225305, 8554, -58947, -434877, -787248, -764211, -409851, -135459, -199160, -382740, -343679, -123696, -49188, -202921, -294667, -104935, 193295, 281721, 100691, -138313, -244341, -195840, -34211, 221940, 490016, 579244, 388316, 101230, -16403, -38816, -321542, -868932, -1085672, -531438, 309141, 547882, 115125, -169332, 138458, 454893, 138513, -510231, -785272, -640459, -524586, -456866, -54531, 609232, 965671, 876342, 886366, 1307667, 1671448, 1457449, 876351, 501526, 476153, 510646, 416501, 233805, -8033, -283686, -423887, -292162, -41752, 79865, 124630, 378343]
44753C78343N44972N67554K64376j33008l60036k73972L1459K00573l5688m22125
44743G62448m11041O2471M14659K24169j82763k82621j37437j66019l65915l26417
44733d08466J8458K08093k3012l06630k00874J53770K91571J23303j2257O6724
44723h9320J30514m9336l24418l72157j04411K76552N14775M66657J43138k58688
44713C33306m34899k45222J09474K88989J70388q2247k46407k27861p4672O7857
44703c41294N7374p6484j26163J1111J48443P5917j07579j62077r3308o9115l5761
44692g18936J94275M81493M33909M3071k07669o8154Q9297r3985l47212k11345
44682d05256K01909L71279J27517j94281k91179j86790k0073J13599J18337j5047
$$ y = [378343, 923315, 1490869, 1755245, 1622237, 1262201, 988229, 1019688, 1220261, 1184573, 762448, 351407, 413878, 828537, 1052706, 869943, 587322, 449885, 283866, -82049, -408466, -390008, -181915, -204927, -511557, -712431, -558661, -267090, -143787, -156044, -89320, 41194, -8142, -332560, -704717, -809128, -532576, -17801, 448856, 591994, 333306, -101593, -346815, -237341, 51648, 222036, 139789, -106618, -334479, -409151, -341294, -283920, -360404, -486567, -475456, -327013, -251096, -358675, -520752, -614060, -683175, -718936, -524661, -43168, 390741, 433812, 226143, 157989, 247286, 153301, -193911, -405256, -203347, 167932, 295449, 101168, -190011, -376801, -396874, -283275, -164938, -179985]
44672a79985j01651Q435J71736J79816J11571J40719J54535k5333j84685O764
44662B81922L26393K00955l60037o51894k93891K29701L56396K17246J87538J53541
44652F47870j85933n95417n31170o437L52649J75688j98557k72976k3874K10241
44642d27916K16075P5862j7811L5837J74088K31728J20409m0704m9523J16131
44632D34176K49517J58263j09116l19232l11932j71933j12983j82626j72538O9254
44622d69150L29864K60697j00272l23541j86112L3238K8759o8980K0184K34236
44612b41077L15711K65516K62515K55606N6193k25791k83229j48096j60285l37059
44602b39996k78406J22023L79671J50989j78384p3613L08726L74825P161l11253
$$ y = [-179985, -281636, -273201, -101465, 78351, 189922, 330641, 485176, 459843, 275158, 281922, 608315, 809270, 449233, -202661, -496552, -266851, 89545, 306791, 494329, 647870, 461937, -133480, -664650, -671087, -318438, -142750, -341307, -614283, -638157, -427916, -211841, -135979, -153790, -117953, 56135, 287863, 408272, 367568, 318045, 434176, 683693, 841956, 732840, 413608, 101676, -70257, -183240, -365866, -538404, -469150, -139286, 121411, 21139, -302402, -488514, -455276, -426517, -495497, -475313, -241077, 74634, 340150, 602665, 858271, 914464, 688673, 405444, 257348, 97063, -239996, -518402, -396379, -16708, 134281, -44103, -117716, 191010, 565835, 572996, 261743]
44592B61743k55769n1006j2325j02474j11078J8823K12574L94764M59900L02088
44582A117240O2j97780j88414j49700k42936l41522k05004J80247N51528N90513
44572A114234J61971n19884r25785o34824J50950P12884N90388O7166k75459k69665
44562A71976j76281j69571j42274J3425K11104K93261J86472n3095k32240j51750
44552d8973J14848K19559K780k30296j56059N3107K6038j70246j54378R7971K22228
44541b3421J06718L5354J13861R6899o7728p8132J19065J29258j80527l33174
44531h1827j1096L53913K65745l7097o2205O7226q6794m05760l90381m1607J69254
44520b60629J26965J42415K34225J03737j31498J2554M44917M39431j76961n93933
$$ y = [261743, 5974, -45032, -57357, -159831, -270909, -252086, -39512, 355252, 815152, 1117240, 1117302, 919522, 731108, 581408, 338472, -3050, -208054, -27807, 523721, 1114234, 1276205, 756321, -169464, -804288, -653338, 59546, 649934, 717100, 441641, 171976, -4305, -173876, -316150, -302725, -91621, 201640, 388112, 335017, 102777, -48973, 65875, 285434, 288214, 57918, -98141, -45034, -18996, -189242, -343620, -245649, -23421, 83297, 118651, 232512, 329411, 261683, 183551, 302616, 431874, 251347, -81827, -92923, 260990, 526735, 489638, 427433, 494659, 407865, 2105, -388276, -429883, -260629, -133664, 8751, 242976, 346713, 215215, 227769, 672686, 1112117, 935156, 341223]
44510C41223k49684K65285J86183j86411n5854M83947N69123m9549o26693n46367
44500A31203q7072J92245K21759K10169J30470j26585l60836k89050m6821l1842
44490e6360k46187k20950K46498O52054M11882k90160p02951m93700p2247J41320
44480f30801K53011M26150L91866n1405m23178j38542M72363N00868j52368n46176
44470A01788j22110M28496K37692m34595o70055k61372J61544K08238J72181L37141
44460A58948M87484L44031L0110j74156k34854k60125k13579p287K24648K06232
44450E61452j01958l84442l34645m2075J42654J12347J40265L92578N63499K95943
44440A345618k16313m58549l37284k08801j80632K9745M08302M51332k7899m75804
$$ y = [341223, 91539, 356824, 543007, 356596, 300742, 784689, 1353812, 1304263, 677570, 131203, 44131, 236376, 458135, 668304, 798774, 672189, 311353, 22303, -24518, -56360, -302547, -523497, -276999, 375055, 786937, 496777, -206174, -699874, -772121, -630801, -377790, 48360, 440226, 388821, -34357, -172899, 299464, 800332, 647964, 101788, -20322, 408174, 645866, 211271, -458784, -720156, -558612, -350374, -178193, 158948, 646432, 990463, 1020573, 846417, 611563, 351438, 137859, 130572, 355220, 561452, 459494, 75052, -259593, -301668, -159014, -46667, 93598, 486176, 1049675, 1345618, 1129305, 670756, 333472, 124671, -55961, -26216, 382086, 833418, 805519, 329715]
44430C29715l99482p1340M5219N7631K34832L09735o7464n18489l92448J61700
44420c10391L90887J05714j67036j75094k29919m10220l30751O2518K61747P8711
44410g23834J3813L52095N92725K78289k14039k79384J470J39317M3459k7844
44400A76067l0511r2624j24289K5109J94045J49765K9393R3955K09699M6624l19418
44389C57815m70367k63987K6133J62402J61829Q3324n3815j40931p6078K1317
44379a92358l5019j67189j30619R8452K97040L13543J73290n6648k67928k86955
44369b54391j07823p884j46261k34066L2494M05346M13249J09648m8247J3269
44359A75334o0691k80453j78471L33643O20947K32494l56856l99424Q3209M23286
$$ y = [329715, -69767, -141107, -95888, -38257, 196575, 506310, 438846, -79643, -472091, -310391, 80496, 186210, 19174, -155920, -385839, -796059, -1126810, -1064292, -802545, -723834, -710021, -357926, 234799, 513088, 299049, 19665, 21135, 160452, 203911, 176067, 145556, 52932, -71357, -46248, 147797, 297562, 326955, 420910, 630609, 677233, 357815, -112552, -376539, -350406, -188004, -26175, 57149, 3334, -137597, -213675, -192358, -227377, -394566, -525185, -426733, -129693, 183850, 357140, 300492, 32564, -254391, -362214, -370098, -516359, -750425, -717931, -312585, 100664, 210312, 162065, 175334, 114643, -165810, -344281, -10638, 610309, 842803, 485947, 86523, 169732, 593018]
44349E93018K65154r1082k32965j05997Q5258J46923J5897k02577l10535k58796
44339i5702k47253m36340o50726n62007j14740M05184O92461O66831M45479K18812
44329C21999J19379J01693Q848j59873j82814M6990K84880K49772L2410q3152
44319G40132r1681k18381m37397m28721r9168K13708K28246J00957R5474J35922
44309B39091k454k28860k15287R8786L89099L77866J35769j21227l12047m25764
44299f5028l44612M4573N72438Q06481M74092j77054n78475m57868j34947o5472
44289G4128k14664j68941J55305L27651J03594j18145P4641L67752J82857l10113
44279D74065l49281K11047N83687K12632m11402n51500k86827j81083k91065j96207
$$ y = [593018, 858172, 767090, 534125, 428128, 513386, 660309, 676206, 473629, 163094, -95702, -342955, -779295, -1430021, -1992028, -2106768, -1701584, -1009123, -342292, 103187, 321999, 441378, 543071, 551919, 392046, 209232, 256222, 541102, 790874, 823284, 740132, 648451, 430070, -7327, -436048, -535216, -321508, -93262, 7695, 103169, 239091, 236637, 7777, -207510, -108724, 280375, 658241, 794010, 672783, 360736, -65028, -409640, -365067, 207371, 1013852, 1487944, 1310890, 732415, 274547, 139600, 74128, -140536, -309477, -154172, 173479, 277073, 158928, 233569, 601321, 784178, 474065, 124784, 335831, 919518, 1132150, 720748, 169248, -117579, -298662, -589727, -785934]
44269g85934J79569M45629M01888K41316R1109j14498k65832j00196L11517N55337
44259I59905M43839J78222r7306m20875o28842l95879J70104M87924K76166j00929
44249H72329k56560k45892j85031L6999L50553L56481k7543k83692p6326J94906
44239G36224R3296j30443p2994O8368o0329k17507K74L36342K76154k2439l0508
44228I76438J63894O4444k11794j05077K50329J14192n23566p65991k57559K28226
44218f6464J03052j15210J72940N65060L88674j45743l73459k76800l01182m02847
44208d51979j50745L65873N44247K07431j38219q8092J71664K98347K50904J31347
44198A140778p1433l57825n48222m31922k8136L78079M72382K26978m6865q8775
$$ y = [-785934, -606365, -160736, 241152, 482468, 573577, 459079, 193247, 93051, 404568, 959905, 1403744, 1581966, 1484660, 1063785, 434943, 39064, 209168, 697092, 973258, 872329, 615769, 369877, 184846, 221845, 572398, 928879, 901336, 617644, 541318, 736224, 829520, 699077, 626083, 694451, 634122, 416615, 416889, 753231, 1029385, 1006946, 976438, 1140332, 1204776, 992982, 887905, 1138234, 1252426, 728860, -37131, -294690, -66464, 36588, -78622, 94318, 659378, 1048052, 902309, 528850, 252050, -49132, -451979, -602724, -236851, 307396, 514827, 376608, 288516, 460180, 758527, 1009431, 1140778, 1069345, 711520, 163298, -268624, -296760, 81319, 553701, 780679, 733814, 645039]
44188F45039o3422k76611n75725m86278k1300K11960k7640j51396K99046P86031
44178C39704N42607j92883m98429j28352K53917J80075n8079q0460K5042N5798
44168D38940M9252K2195j76466m84197n06738p0406M36959N50432K91100J8775
44158E69846l5962J08660L08664L56614J26399k05841l06166j52847q2523k37696
44148D49148l05157l4664K92623K40209j38621l69880j87865J83796L59308J99743
44138F88640j06054k52001j18610R4595J13945l7616q8507L8620Q6438j12113
44128C07337l21168k28461R5664L04293K29815J6640j30331j34393k5324J03452
44118B17524J29982J4524j39752k05422j60996n6197N9629J19340O9127j0987
$$ y = [645039, 581617, 305006, -270719, -756997, -778297, -566337, -593977, -745373, -446327, 339704, 882311, 689428, 190999, 62647, 316564, 496639, 438560, 358100, 383142, 438940, 488192, 510387, 333921, -150276, -657014, -727420, -290461, 259971, 551071, 569846, 533884, 642544, 951208, 1307822, 1434221, 1228380, 922214, 769367, 686844, 449148, 143991, 109327, 401950, 642159, 503538, 133658, -54207, 129589, 488897, 688640, 582586, 330585, 211975, 306570, 420515, 382899, 294392, 333012, 419450, 307337, -13831, -242292, -146628, 157665, 387480, 404120, 273789, 139396, 114072, 217524, 347506, 362030, 222278, 16856, -144140, -200337, -140708, -21368, 47759, 36772]
44108C6772M0727K01963K16805m4133l25912k88934K7746K50263J42785j46374
44098A11708l15711k36276r917J92128K87366L08181L06428K67266J55348J5347
44088A081868n3113j6172O7231J15041N1131j57065l73111l21881M9205L48851
44078G91985J73113l06445n35235l35299o0249M4693J43047L10426K65595q9463
44068D02168l34514j50149J34656R2181p3023Q2184M01020L55129l1269j94588
44058F83795K2496J35329j17748l16286o2908L61483M19805N1086l58929m96796
44048C21327l37233l9477J54218R1842p4729o0136R0391L4880k41796k69730J65462
44037a64981N55555L77318p2215r7086L30122N20805Q2717n70042q46671o62109
$$ y = [36772, 77499, 279462, 496267, 452134, 126222, -162712, -134966, 115297, 258082, 111708, -204003, -440279, -450196, -258068, 29298, 337479, 643907, 911173, 1066521, 1081868, 1028755, 1012583, 1079814, 1194855, 1245986, 1088921, 715810, 393929, 443134, 791985, 965098, 658653, 123418, -211881, -272130, -227437, -84390, 226036, 491631, 402168, 67654, -82495, 52161, 144342, 71319, 153503, 554523, 909652, 878383, 683795, 706291, 841620, 723872, 407586, 344678, 706161, 1125966, 1177052, 818123, 321327, -15906, -55383, 98835, 190677, 115948, 55812, 146203, 181083, -60713, -330443, -164981, 390574, 767892, 695677, 598591, 928713, 1449518, 1532235, 962193, 115522, -546587]
44027e46587k89203Q8704L90370M57678J93721j96379l43098j05355K89671M96034
44017D35556L72187O8199j66085k43341k68492k92370j68801J97182N65149N67675
44007A066859J93887j81627k90505k34629j81878r1059P9709J51519j6916k20053
43997B75307j50559J37735K92438J39769j61488l98422m53440k08427L46026Q41202
43987F60141P42963L0256o32200o50757k06069Q0876k827j08457M5400K71488
43977B30814K46934j6733k17769j68804q228l409k00573l33021j48215K11977
43967d07027L38282J12431r4852N7510M00743N47276M42104K74721K7185m16755
43957A281618p88003o15474J3554M12789K26398j00985q0179Q9547j1142k28670
$$ y = [-546587, -835790, -747086, -356716, 100962, 294683, 98304, -244794, -350149, -60478, 435556, 807743, 875942, 709857, 466516, 198024, -94346, -263147, -65965, 499184, 1066859, 1260746, 1079119, 788614, 553985, 372107, 281048, 360757, 512276, 495360, 275307, 124748, 262483, 554921, 694690, 533202, 134780, -318660, -527087, -181061, 660141, 1403104, 1433360, 801160, 150403, -55666, 25210, 22383, -86074, -40674, 230814, 477748, 461015, 243246, 74442, 66214, 62805, -137768, -470789, -619004, -407027, -68745, 43686, -51166, 6344, 407087, 954363, 1396467, 1671188, 1698373, 1281618, 493615, -121859, -108305, 304484, 530882, 429897, 349718, 439265, 428123, 199453]
43947A99453j05367K74183L37952p6719m38447k82602J62007L30861N0635l06564
43937A45392k88549J36874N20763L89829j93493o49473n63005j57859R8222J26883
43927d34416J55625K00032P6360j39405j35925J05430K35241Q9872p0208j3855
43917F8751J25186J36446N2038M106J3139N1785Q9596R157k42017l87716r0912
43906a70441M44779N95065J87289k34015k42304j06252j82726k52686K7864M19986
43896D86559M34401J06766j35288j88349k84894m20062l39351m6430J97537L38100
43886A48989M87286M89218J00839m06816m56259o0380J21446j89992m36949j10386
43876c13004M56781O03132K40093j88656l56438k69471n1895J45023J86188J51214
$$ y = [199453, 94086, 368269, 706221, 629502, 191055, -91547, 70460, 401321, 451956, 145392, -143157, -6283, 514480, 904309, 710816, 61343, -501662, -659521, -561299, -434416, -278791, -78759, -2399, -141804, -277729, -172299, 62942, 152814, 82606, 68751, 193937, 330383, 382421, 386527, 399666, 451451, 541047, 550204, 308187, -79529, -170441, 274338, 869403, 1056692, 822677, 580373, 474121, 291395, 38709, 66573, 486559, 920960, 1027726, 892438, 704089, 419195, -867, -340218, -386648, -189111, 148989, 636275, 1125493, 1226332, 819516, 363257, 302877, 424323, 234331, -202618, -313004, 143777, 746909, 987002, 798346, 441908, 172437, 120542, 265565, 451753, 602967]
43866F02967K82240N36475M99669R896m77965n05444k59248j77861k13191j9546
43856B77992L24831L81931P9201j88153j98365j30845r8801L5242K60781L17668
43846A061482J55379N1349J00801M4489j85799k37722L9666K18198m9676m05622
43836G92545l24738M7558J71390o959p9920L6449J1824j92783k04896K9242N1916
43825C31628k90818m59617p1267L93824K90659j75265k75290J24768M46852L42741
43815F58215J02748L1017M577j20127j50909P4027L14019K52051l3075k06821
43805I25722j31616N2037J63603J15551o3541j98843j18558N6235m194l22450
43795D73946m66440j52485K77430L04087m8893l03749k08436K9237J27154L7244
$$ y = [602967, 885207, 1421682, 1921351, 1931247, 1453282, 947838, 688590, 510729, 297538, 277992, 602823, 984754, 1063955, 875802, 677437, 546592, 447791, 483033, 743814, 1061482, 1216861, 1268210, 1369011, 1413500, 1227701, 989979, 1029645, 1247843, 1198167, 792545, 467807, 515365, 686755, 679796, 599876, 636325, 648149, 455366, 250470, 279712, 331628, 40810, -418807, -490074, -96250, 194409, 19144, -256146, -131378, 315474, 658215, 760963, 791980, 796557, 676430, 525521, 599548, 913567, 1165618, 1132543, 925722, 794106, 846143, 1009746, 1125297, 1061756, 862913, 744355, 800590, 796396, 473946, 7506, -144979, 132451, 436538, 387645, 83896, -124540, -95303, 31851, 69095]
43785F9095j05663j10878J21266L90080L03243j72793n21584l60851k0086J3663
43775c94508r5167R2789L70257J70185l14360k60899L85267O55645J01801l92513
43765C18497j5633O17262M35806l82099p45890l52740M3449j3134j06444J08509
43755i2417L14404K23097J12694K50598L57245R0430l68172o22142o08105m64315
43745h06683j75746K54145N34691M01597M2371j47312j08408q7581j61971j43885
43735c98782N2439K52059K84406J93607J17134R9600Q7515K7350o2022q4072L5656
43724F04890K14249K59029J14551l6976k1698P6826N7094p8674j26679j6520L7180
43713A083272j70464m90010n36992j76217K62814L70538J59112m173P3844J97595
$$ y = [69095, -36568, -147446, -26180, 363900, 667143, 494350, -27234, -388085, -408171, -394508, -489675, -396886, -26629, 143556, -170804, -431703, -46436, 609209, 711010, 318497, 302864, 920126, 1355932, 973833, 227943, -124797, -81348, -94482, -200926, -92417, 221987, 445084, 557778, 808376, 1165621, 1256051, 887879, 265737, -342368, -806683, -982429, -728284, -193593, 208004, 250375, 103063, -5345, -92926, -254897, -398782, -346343, -94284, 190122, 383729, 500863, 600463, 687978, 715328, 653306, 569234, 604890, 819139, 1078168, 1192719, 1155743, 1134045, 1210871, 1267965, 1189291, 1062612, 1046092, 1083272, 912808, 422798, -114194, -290411, -27597, 342941, 502053, 497880, 571724, 769319]
43703G69319J53758K4680k8848m9834j17402j11403O9295K33351J66287J5321
43693A124524L8308J17410k9681k56353j46167K23872K62298k35418p00530n68221
43683a69958q78M44283M86612J93783k41188n09743l29451J40791L73615K10598
43673E98464J03298L21746M34536L4418m96700n38012j74790M4191O864K7135
43663C61150J46033J33800N7528J65249K94337Q6926k65112k25681J37011J91177
43653A082418j77717l47436m3325J76491r8361m09945k11883K33095L21108K9820
43643E54265j95209j52919K5695K42001M25523L91878J09926j06603l2322R2050
43633A354285l4052k65751k95746j63963p7583L684J69818K22327R484j56219
$$ y = [769319, 923077, 947757, 918909, 869075, 751673, 640270, 709565, 942916, 1109203, 1124524, 1162832, 1280242, 1250561, 994208, 848041, 1071913, 1334211, 1098793, 398263, -169958, -170836, 273447, 760059, 953842, 712654, 202911, -126540, 14251, 387866, 598464, 701762, 1023508, 1458044, 1492462, 995762, 457750, 282960, 327151, 334015, 361150, 507183, 640983, 698511, 863760, 1158097, 1245023, 979911, 754230, 891241, 1082418, 904701, 557265, 513940, 690431, 592070, 182125, -29758, 203337, 524445, 554265, 359056, 206137, 231832, 473833, 899356, 1291234, 1401160, 1294557, 1262235, 1354285, 1320233, 1054482, 758736, 594773, 517190, 520874, 690692, 913019, 922503, 766284]
43623G66284O4141M03820L55298j4298k05905j10778o1121j36626q3656P0328
43613A047487l908k59523k42714J03239K64557K5180j44519Q9951L28955J22806
43603A331511k63457l12550q7063j6210j25160p9108J44242K07479K5973q4978
43593G40679M7189J92750J37893J0557N970N0557m3958k44776l25039j85398j281
43582C85143j2605k22004l66022k24933Q2688K24879Q3844q9144k0352K29444
43572G0938L83018L09402J12718o6574j73039j91241j30291n2929r143M6706J72194
43561D71759K98627K93625J47650k0514j42629k62988m01916m76486m10793k37663
43551g41328l1651J84862L90078M72478L13364j4614k32531j32320J67882L49947
$$ y = [766284, 830425, 1234245, 1589543, 1575245, 1369340, 1258562, 1197441, 1060815, 977159, 1047487, 1043579, 784056, 541342, 644581, 909138, 934318, 789799, 879750, 1208705, 1331511, 1068054, 755504, 668441, 652231, 527071, 447963, 592205, 799684, 825657, 740679, 787868, 980618, 1118511, 1129068, 1135038, 1185595, 1141637, 896861, 571822, 386424, 385143, 372538, 150534, -215488, -440421, -357733, -132854, -49010, -138154, -158506, 70938, 453956, 763358, 876076, 809502, 636463, 445222, 314931, 262002, 252859, 299565, 471759, 770386, 1064011, 1211661, 1191147, 1048518, 785530, 383614, -92872, -503665, -741328, -772979, -588117, -198039, 274439, 587803, 573189, 340658, 208338, 376220, 726167]
43541G26167K75470J16740P0449Q7714N028j72449k84032k46056j03947R7880
43531E72964L06718L52665Q6861l25690m79145k08907J66918K22533p3802l61629
43521B59486l20554R760L12866L31730J24210j7646Q3992K93421L70688K66764
43511A714717Q4722j15664k73544k29682L8686K01736l4280l90814l20748J41379
43501H16508L57552M9296k71494j20273K27685K46087j6569j31009k5004N060
43491A137839j29132k06519j16858R010N2106r283j73954l15577j82279K09825
43481B75178M24873K12209k1013J82543N28927L94096j40706l87718j41735P1848
43471A398502o1925j78418N0070L49112L22287K2269k54020l48609k04737J50034
$$ y = [726167, 1001637, 1118377, 1188826, 1276540, 1281568, 1109119, 825087, 579031, 475084, 572964, 879682, 1232347, 1319208, 993518, 514373, 305466, 472384, 694917, 621115, 259486, -61068, -51308, 261558, 593288, 717498, 699852, 783844, 1077265, 1447953, 1714717, 1799439, 1683775, 1410231, 1180549, 1219235, 1420971, 1386691, 995877, 675129, 816508, 1174060, 1223356, 951862, 831589, 1059274, 1305361, 1288792, 1157783, 1132779, 1137839, 1008707, 802188, 685330, 694340, 746446, 737163, 563209, 247632, 65353, 275178, 700051, 912260, 891247, 1073790, 1602717, 1996813, 1856107, 1468389, 1326654, 1398502, 1336577, 1158159, 1208229, 1557341, 1879628, 1901897, 1647877, 1299268, 1094531, 1244565]
43461A244565M07175K07856k62552m03275r1584J28248k7156j34912Q9508K09432
43451A367305j25185m32812j64268L09162K70945j51843k27264J66561M13127
43442A425728J86730j64667k97420k40701l0694L59159O27790L39720l28363o41192
43432A236090l11148J17425J30982o1700k9357J74495K15265N2950q1909q2170
43422A360923k2326L5731Q0683J19221K12679L70674L76173J2528m72843n19628
43412A553815l4342L79288K32389j65937j82958K57469O61838O72516M10520J73140
43402C957738J02116J65309K55136K75939K42780K72420M12900N53526N63549
43393F801413M43535L13842L39250O24488J037012J215273R79650O30980N22080
$$ y = [1244565, 1651740, 1859596, 1597044, 1193769, 1102185, 1230433, 1203277, 1068365, 1157873, 1367305, 1242120, 809308, 645040, 954202, 1225147, 1073304, 846040, 1012601, 1425728, 1612458, 1447791, 1150371, 909670, 878976, 1238135, 1865925, 2205645, 1877282, 1236090, 924942, 1042367, 1173349, 1111649, 1082292, 1256787, 1472052, 1525002, 1443093, 1360923, 1338597, 1374328, 1455011, 1574232, 1786911, 2157585, 2533758, 2546286, 2073443, 1553815, 1519473, 1898761, 2131150, 1965213, 1782255, 2039724, 2701562, 3374078, 3784598, 3957738, 4059854, 4225163, 4480299, 4756238, 4999018, 5271438, 5684338, 6237864, 6801413, 7244948, 7558790, 7898040, 8522528, 9559540, 10774813, 11754463, 12385443, 12907523]
43384A2907523M54216l3165q28156j298734j250687j163577j265540j113950n06830
43375E901100q0777l68351q60889p75068k87833j47084l74446l06073J89455M82642
43365C372676K52269p4195j45059j77240l43751l59672m6666K55180K23116L8934
43355B995592r649K435r1252j87821j61724j36149k00355j84489j0745P2527p8674
43344B009696j81546J5383K67851K08494q5877k74583k57157j35171Q0092L36875
43334A984057L61457K9146k86343j69859J99540L12306P8952j46653j80228j57599
43324B024776j29947R646J96839K36292J76982K19545K59156p042m85196o93879
43314A807172m59666j21405P4276K69488N12899N20674K08859k7856O5497J48504
$$ y = [12907523, 13361739, 13328574, 12500418, 11201684, 9950997, 8787420, 7521880, 6407930, 5901100, 5820323, 5451972, 4591083, 3816015, 3528182, 3381098, 3006652, 2700579, 2890034, 3372676, 3624945, 3550750, 3405691, 3228451, 2884700, 2525028, 2478362, 2733542, 2956658, 2995592, 2985943, 2988378, 2897126, 2709305, 2547581, 2411432, 2211077, 2026588, 2015843, 2088370, 2009696, 1828150, 1843533, 2111384, 2319878, 2234001, 1959418, 1702261, 1567090, 1647182, 1984057, 2345514, 2374660, 2088317, 1918458, 2117998, 2430304, 2509256, 2362603, 2182375, 2024776, 1894829, 1904475, 2101314, 2337606, 2514588, 2734133, 2993289, 2986247, 2501051, 1807172, 1347506, 1226101, 1300377, 1569865, 2082764, 2603438, 2812297, 2784441, 2849938, 2998442]
43304B998442j22365m40996l14347J10146K57400P918k10117j66509r9435j67413
43294A852724j58391N6051K07038M7995k20059k45994m8633O4926q080n3596P8369
43283A572350K29970J73574n4554k03630j47271k1957K3206O8522K44361L90886
43273B275457J83504l29133o17606l28943J91247L55975J37413l724J00455J23744
43263B088389r9412k41926n4514J86038J56897L6284J25476K42476N0580k19214
43253B271074m0274M58310N36188P24l90132n8888M87658M56635p628j26877K43636
43242C830426M56484J77095j28054l4517J67618L6379k77244l19389m9431K05507
43232D064874L12493L94383M39361K91473K3158p0949R0472K66835K97585L21999
$$ y = [2998442, 2876077, 2435081, 2120734, 2230880, 2488280, 2496198, 2286081, 2119572, 2020137, 1852724, 1694333, 1750384, 1957422, 2005417, 1785358, 1539364, 1490731, 1555657, 1547577, 1493981, 1572350, 1802320, 1975894, 1921340, 1717710, 1570439, 1548482, 1571688, 1640210, 1884571, 2275457, 2458961, 2129828, 1512222, 1183279, 1374526, 1730501, 1867914, 1864190, 1964645, 2088389, 1988977, 1747051, 1692537, 1878575, 2035472, 2071756, 2197232, 2439708, 2490288, 2271074, 2230800, 2689110, 3225298, 3226022, 2835890, 2777002, 3264660, 3721295, 3713667, 3586790, 3830426, 4286910, 4464005, 4335951, 4301434, 4469052, 4505431, 4228187, 3908798, 3859367, 4064874, 4377367, 4771750, 5211111, 5502584, 5525742, 5454793, 5545265, 5812100, 6109685, 6431684]
43222F431684M86461O84711P44110O93162O88677P83157Q85572Q98071Q32817
43213A3128422Q32727J058224J473175J808911J889340J911426K164949K517345
43205B6784519K501195J973434J342518R73019O84549J07938p15459j426809j880843
43196C0344061k217920k471656k478665k227086j971841j877807j794560j537842
43188A3766684j198445r85934r00374p71889n74796m90599o12262p44648o19789
43179F867948k48842P0351J10360l9245j57754k21013l76226o10557o61253l71431
43169D362338J9284J26722r5802l15709k62505k7123J43627J81234J73222J10225
43159D415513j15581m21891m73670j04124L29056L01123j57990m36160j84862
$$ y = [6431684, 6918145, 7602856, 8346966, 9040128, 9728805, 10511962, 11397534, 12295605, 13128422, 13961149, 15019373, 16492548, 18301459, 20190799, 22102225, 24267174, 26784519, 29285714, 31259148, 32601666, 33574685, 34259234, 34367172, 33651713, 32224904, 30344061, 28126141, 25654485, 23175820, 20948734, 18976893, 17099086, 15304526, 13766684, 12568239, 11582305, 10681931, 9910042, 9335246, 8844647, 8232385, 7487737, 6867948, 6619106, 6689457, 6799817, 6760572, 6602818, 6381805, 6005579, 5395022, 4733769, 4362338, 4381622, 4508344, 4412542, 4096833, 3834328, 3807205, 3950832, 4132066, 4305288, 4415513, 4299932, 3878041, 3404371, 3300247, 3629303, 3930426, 3772436, 3336276, 3151414]
43150C151414J62685N4318l05341k82051J27823K55208j14379l03111J78569P54117
43140C679252O05234q5629m71081l39380k32448l44533k20908K59077M73734O4371
43130C387689l79352k20297K16814K27470j01180q7119L87292P10139N28198J75306
43120D844960r866j36067l02195k79879J3606K14446P4099q2076J09781L98773
43110D845582L07758n9519j66220Q6171K05680q9393m23080l36171O6490L29125
43100D766423K71371J15641J02749K26297L39783L76111M17556N64543P34082
43091G914556O75877L12164l5176O323L28277M70921L04917K06362M34391P54375
43081A1372987R20008J099635J437574J578775J166040N43486L41825M95659L38466
$$ y = [3151414, 3314099, 3368417, 3063076, 2781025, 2908848, 3164056, 3049677, 2746566, 2925135, 3679252, 4284486, 4198857, 3727776, 3388396, 3155948, 2811415, 2590507, 2849584, 3323318, 3387689, 3008337, 2788040, 3004854, 3232324, 3131144, 3044025, 3431317, 4141456, 4669654, 4844960, 4835094, 4699027, 4396832, 4116953, 4130559, 4345005, 4419104, 4337028, 4446809, 4845582, 5153340, 5093821, 4927601, 5013772, 5219452, 5130059, 4706979, 4370808, 4437298, 4766423, 5037794, 5153435, 5256184, 5482481, 5822264, 6198375, 6615931, 7180474, 7914556, 8590433, 8902597, 8867421, 8873744, 9202021, 9672942, 9977859, 10184221, 10618612, 11372987, 12292995, 13392630, 14830204, 16408979, 17575019, 18118505, 18460330, 18955989, 19294455]
43072A9294455l27923r41134j078150r79826r41618q32098n82919n58548r43594
43063A2108645j245438r58108l41806J5750P2579J61785K48910N9717k28301j59974
43053I733759J76698K23935j03178k63735l6711Q5057k47192n98982m02723J89425
43043H756353N47309L84462k5862k67116j44750K04361L98721J88773j77349k26981
43033I637921P0135K91076K61397K57423L71879K83038n7378j33181L00748O78781
43023A1961839M80284J00584K06693O72336R00954Q41527Q55863Q54712M84250
43014A7359042J8551P5492M43043K27257o45654j127115o46040j6182j27986o06922
43004A4953486n96016k01637j82721n87131p01721k59615K03571K82618K17639
$$ y = [19294455, 18966532, 18025398, 16947248, 15967422, 15025804, 14193706, 13610787, 13052239, 12108645, 10863207, 9905099, 9563293, 9579043, 9651622, 9813407, 10062317, 10122034, 9893733, 9733759, 9910457, 10134392, 10031214, 9767479, 9730768, 9815825, 9568633, 8969651, 8566928, 8756353, 9303662, 9688124, 9662262, 9395146, 9250396, 9454757, 9853478, 10042251, 9864902, 9637921, 9708056, 9999132, 10260529, 10517952, 10889831, 11172869, 11115491, 10982310, 11283058, 11961839, 12442123, 12542707, 12749400, 13421736, 14322690, 15164217, 16020080, 16874792, 17359042, 17377593, 17453085, 17896128, 18123385, 17477731, 16350616, 15704576, 15688394, 15560408, 14953486, 14357470, 14155833, 13973112, 13385981, 12684260, 12424645, 12628216, 12910834, 13128473]
42995A3128473K71508K50815l2102l13668k54793P1958L79629N78708P01841O62676
42985A5445045M20064K16804L13769N72486O35113M92331N21194Q86901J249260
42976B0752967J257970J066836J071620J318081J513055J537143J558968J618216
42968C1694856J510584J246663J238848J740113K381323K610220K401271K200243
42960D7024121K332677K814553L582671M491645N180319N394834N432930N855227
42952H2108977O768259P812628Q821285R975623J1290257J2531486J3776611J5456299
42944A68541425J7624568J9775618K1644319K3521012K5333846K6040677K4529164
42937C27010629K0657723J4850317P232601j969974j1486389j9399643k4570541
$$ y = [13128473, 13399981, 13650796, 13618694, 13305026, 13050233, 13122191, 13501820, 14080528, 14782369, 15445045, 15865109, 16081913, 16395682, 16968168, 17603281, 18095612, 18616806, 19503707, 20752967, 22010937, 23077773, 24149393, 25467474, 26980529, 28517672, 30076640, 31694856, 33205440, 34452103, 35690951, 37431064, 39812387, 42422607, 44823878, 47024121, 49356798, 52171351, 55754022, 60245667, 65425986, 70820820, 76253750, 82108977, 88877236, 96689864, 105511149, 115486772, 126777029, 139308515, 153085126, 168541425, 186165993, 205941611, 227585930, 251106942, 276440788, 302481465, 327010629, 347668352, 362518669, 369751270, 367781296, 356294907, 336895264, 312324723]
42930C12324723k7108128k7593414k6571042k4734732k2758317k0714679j8256840
42923A44587571j5503558j3135571j1483961j0180081q917157p898649p237442
42916G0231152o556119n595399m677464m129014l725296l157696k601592k327017
42908C7461555k149796j797591j464027j435368j476156j195844p80632p05179
42900B6456962q80655p89568m14054l01315o11299q04689n30060k03840l28883
42891B1592599p21415q72883p44041p04422q54837q89753o29277l06385k27587
42882A5641999m05543o47098q17851q68506p22342l45078O5884J57475j76491
42873A1882449n74406n79990k08688P5533j8798k60936k81857n6561J92450L50201
$$ y = [312324723, 285216595, 257623181, 231052139, 206317407, 183559090, 162844411, 144587571, 129084013, 115948442, 104464481, 94284400, 85367243, 77468594, 70231152, 63675033, 58079634, 53402170, 49273156, 45547860, 42390164, 39788572, 37461555, 35311759, 33514168, 32050141, 30614773, 29138617, 27942773, 27162141, 26456962, 25576307, 24786739, 24372685, 24071370, 23460071, 22655382, 22125322, 21921482, 21592599, 20871184, 19998301, 19254260, 18549838, 17695001, 16805248, 16175971, 15869586, 15641999, 15236456, 14589358, 13771507, 12903001, 12180659, 11835581, 11901465, 12058940, 11882449, 11308043, 10728053, 10519365, 10594898, 10576100, 10315164, 10033307, 9976746, 10169196, 10519397]
42863A0519397M12662L25858J23918O5238K77324M02514L5026n45724n81384J46984
42853A1181813R84698J254449J001897O77617N21329N76622R09484J392237J578010
42844B0078156J244319Q29225Q66734J204566J316166J222937J452361K087337
42836C0301801K558669K572148K591418L064252L756704M329647N064807O369591
42828F0609037P892496Q880406R299213R814859J0528020J0433615Q485094M715736
42820A30658476J0839m702579q600855j0839680j1078750j0041962q910416q095019
42812F8400054p109394n665979m254949l395481k892468k273371j565087j135477
42804D0107848j004073q25311m63831j27005N4554J61073J82741k223k73951k99871
$$ y = [10519397, 10932059, 11257917, 11381835, 11447073, 11724397, 12126911, 12161937, 11616213, 11034829, 11181813, 12166511, 13420960, 14422857, 15100474, 15621803, 16198425, 17107909, 18500146, 20078156, 21322475, 22151700, 23018434, 24223000, 25539166, 26762103, 28214464, 30301801, 32860470, 35432618, 38024036, 41088288, 44844992, 49174639, 54239446, 60609037, 68501533, 77381939, 86681152, 96496011, 107024031, 117457646, 125942740, 130658476, 130669315, 125966736, 117365881, 106526201, 95447451, 85405489, 76495073, 68400054, 61290660, 55624681, 51369732, 47974251, 45081783, 42808412, 41243325, 40107848, 39103775, 38278464, 37814633, 37687628, 37742182, 37903255, 38085996, 38083773, 37809822, 37509951]
42794C7509951o8504l0323m94682j193456j681134j886153j981647j964809j735851
42785B6473392j446597j375691j487719j466861j219200j022748j090441j263684
42777A6100451j283497j146730j015164r24598p87574o20801n78825p26782q93819
42768H122661q37224n37766k53324k10009k89142j79147J27657K12473k10716
42759E945463p89478q91006m12353R4974J54568j02116k63477k03408r4107n8967
42749C380093p2719j05280j44277j29023l1098N4956M1473q586p921k0207j43874
42738B813537l04309l38509k21086m3174J49644L20351L43108J63822k5174j2987
42728B845223J02611Q6125j1298O5501K90697L41687J36427n012J05112J88690
$$ y = [37509951, 37441447, 37411124, 36916442, 35722986, 34041852, 32155699, 30174052, 28209243, 26473392, 25026795, 23651104, 22163385, 20696524, 19477324, 18454576, 17364135, 16100451, 14816954, 13670224, 12655060, 11730462, 10942888, 10322087, 9743262, 9016480, 8122661, 7285437, 6747671, 6494347, 6284338, 5995196, 5816049, 5943706, 6156179, 5945463, 5155985, 4264979, 3852626, 3947600, 4102168, 4000052, 3736575, 3533167, 3439060, 3380093, 3307374, 3202094, 3057817, 2928794, 2897696, 2952652, 2994125, 2985539, 2977618, 2957411, 2813537, 2509228, 2170719, 1949633, 1906459, 2056103, 2376454, 2719562, 2883384, 2858210, 2845223, 2947834, 3033959, 3022661, 3088162, 3378859, 3720546, 3856973, 3851961, 3957073, 4145763]
42718D145763n2131m41804n72988l49055j5218K13986L10153L08564K45954J71751
42708C964975R1078k6850j20377p9582J7297m0415j96841j09461K75060M86693
42698D261577J92282k47183k99719n7425J565j59708j35738J73818M15043M17592
42688D562104M18454N33797N33985L25085J79309K67047L82450L61193L70875
42679G934299N43499P01457P07710P23303Q52496R05152Q01487Q21080J094866
42670A5085349J224902Q32482J64227k94990n17408p53363r35493q38505o51005
42661A3316196p69122j088915j112315p70913n43676o51774p16739m32324p0443
42652G159975k4908k43718m24217m74419m83948m61317l70816k74312k29554j83041
$$ y = [4145763, 4093632, 3651828, 3078840, 2729785, 2714567, 2928553, 3238706, 3547270, 3793224, 3964975, 4056053, 4029203, 3908826, 3829244, 3846541, 3806126, 3609285, 3499824, 3774884, 4261577, 4453859, 4206676, 3906957, 3849532, 3851097, 3691389, 3555651, 3729469, 4144512, 4562104, 4980558, 5514355, 6048340, 6373425, 6552734, 6819781, 7202231, 7563424, 7934299, 8477798, 9179255, 9886965, 10610268, 11462764, 12367916, 13169403, 13990483, 15085349, 16310251, 17142733, 17306960, 17011970, 16494562, 15741199, 14805706, 13967201, 13316196, 12547074, 11458159, 10345844, 9574931, 9031255, 8379481, 7662742, 7230418, 7159975, 7135067, 6891349, 6467132, 5992713, 5508765, 5047448, 4676632, 4402320, 4172766, 3989725]
42642C989725j07476q1676j10992o5114P2027J07963m0079j50355k1240J98490
42632C791273K29606O8838n2446k2488M0263j7513k11467l84278k81659J89672
42622C349801P02632P29691J83441l80974m23911p8865J24129J2443j16346n5254
42612D046787M2626K1205N396J59981L87462M54344L05014J01663N495K4074O5090
42601E619137Q5007J54865L40628N20428M43193O8398k71760k32568Q8468K85225
42591G101021K19283J87323M17697O68240N57243J42932j11493N7895L90966M71963
42581A0103070K55592Q2368K36718O23641Q96681Q32959N52178L83618N17728
42572A4484553P94938Q92610P37489O23756Q21410J177378J313675J193269J218648
$$ y = [3989725, 3882249, 3800573, 3689581, 3624467, 3696494, 3804457, 3764378, 3614023, 3592783, 3791273, 4020879, 4089717, 4037271, 4014783, 4055046, 4037533, 3826066, 3441788, 3160129, 3349801, 4052433, 4782124, 4965565, 4584591, 4160680, 4081815, 4205944, 4218387, 4102041, 4046787, 4089413, 4110618, 4116014, 4275995, 4663457, 5117801, 5422815, 5524478, 5529973, 5554047, 5619137, 5704144, 5859009, 6199637, 6720065, 7163258, 7231656, 6959896, 6727328, 6815796, 7101021, 7320304, 7507627, 7925324, 8593564, 9150807, 9293739, 9182246, 9240141, 9631107, 10103070, 10358662, 10441030, 10677748, 11301389, 12198070, 13031029, 13583207, 13966825, 14484553, 15279491, 16172101, 16909590, 17533346, 18354756, 19532134, 20845809, 22039078, 23257726]
42563B3257726J665109K256994K508223K327083K059569K032327K279257K660766
42555D1047054L025996L269024L408204L589035L855404M001390L850434L567972
42547F9614513L412131L261215K747813J841576R05165J31336o52635j511300
42539G9749814k182326k546301k901163l475683m023056m224440m179775m137632
42531E2079438m023967l649344l161877k867965k760714k623202k445066k331822
42523B8215481k162194j790357j457977j505973j757729j719065j358994j123466
42515A5339726j143377j048773p12329n38388p21506q07072m21701L3304n8105
42506I921779n91932r09671p24796l78831k34698k65359k86177k45269j88473
$$ y = [23257726, 24922835, 27179829, 29688052, 32015135, 34074704, 36107031, 38386288, 41047054, 44073050, 47342074, 50750278, 54339313, 58194717, 62196107, 66046541, 69614513, 73026644, 76287859, 79035672, 80877248, 81782413, 81913749, 81261114, 79749814, 77567488, 75021187, 72120024, 68644341, 64621285, 60396845, 56217070, 52079438, 48055471, 44406127, 41244250, 38376285, 35615571, 32992369, 30547303, 28215481, 26053287, 24262930, 22804953, 21298980, 19541251, 17822186, 16463192, 15339726, 14196349, 13147576, 12435247, 11896859, 11175353, 10368281, 9946580, 9979884, 9921779, 9329847, 8420176, 7695380, 7316549, 7081851, 6816492, 6530315, 6285046, 6096573]
42497F096573j58072j90187k74392l20776k80662k35395k46006k29878j39740
42488D021465j19335k73726m26393l58624j69957j08530j38086j6199K29052K70910
42478B910577o673l00662l01173m1070K66257M65834M28372P9217l67697m91086
42468B641896k03016N2941q5981l46874k42835J45978K80738K501k34339p9864
42458A931145K04749K01001m8487j90711j08272J2723L6156K660k3647J4492K05903
42447B237712M86697N28304J32690l42475l54124L3715J82491j86635n68365m37354
42437A712656n345J71802K0986p8546L6482J57173J57311J66451K51889K82213
42427B873072J74346j124j96361m04987m90515k81724J16120L71384L39895J87580
$$ y = [6096573, 5938501, 5748314, 5473922, 5153146, 4872484, 4637089, 4391083, 4161205, 4021465, 3902130, 3628404, 3202011, 2843387, 2673430, 2564900, 2426814, 2410615, 2639667, 2910577, 2903904, 2603242, 2302069, 2260999, 2527256, 2993090, 3421462, 3500679, 3132982, 2641896, 2438880, 2491821, 2405840, 2058966, 1816131, 1962109, 2242847, 2245348, 2011009, 1931145, 2135894, 2336895, 2288408, 2097697, 1989425, 2002148, 2038304, 2040964, 2017317, 2031809, 2237712, 2724409, 3252713, 3385403, 3042928, 2688804, 2722519, 2905010, 2718375, 2150010, 1712656, 1707311, 1879113, 1900099, 1821553, 1858035, 2015208, 2172519, 2338970, 2590859, 2873072, 3047418, 3046294, 2849933, 2444946, 1954431, 1672707, 1788827, 2160211, 2500106, 2687686]
42417B687686P1244m2877j97791l32127l93126l51690j32624K17510L84491J69518
42407B080214p4335J25382N29350M06392l12148p88696m78403J02666K52711R7718
42397A940851J28680K66033J40752o5639J01743M49111L45342j72264l50739P3369
42387B857239M12595R3517m78027n61873j15769K96442L25548J22504l3559l1793
42377B886824Q0661J69350J16063l3370j18222r8932n9624M6254L52889O90567
42367D032460O10175L8282m27519k31985L61464O12097K94633p5749j4798L33235
42357E532295N07196L44274P3212m1766O4393L09517N47250N83749K98976j37020
42347H082076l02924K4265N04683N60546J11037k83024j56659K44894L59776J03294
$$ y = [2687686, 2758930, 2716053, 2518262, 2186135, 1793009, 1441319, 1308695, 1526205, 1910696, 2080214, 2005879, 2131261, 2660611, 3067003, 2754855, 1966159, 1487756, 1590422, 1843133, 1940851, 2069531, 2335564, 2476316, 2410677, 2512420, 2961531, 3306873, 3134609, 2783870, 2857239, 3269834, 3363351, 2885324, 2323451, 2207682, 2504124, 2829672, 2952176, 2918617, 2886824, 2967485, 3136835, 3252898, 3219528, 3101306, 3002374, 2942750, 2989004, 3341893, 4032460, 4642635, 4680917, 4253398, 4021413, 4382877, 4994974, 5289607, 5213858, 5199060, 5532295, 6039491, 6383765, 6456977, 6415211, 6479604, 6789121, 7336371, 7920120, 8219096, 8082076, 7779152, 7803417, 8308100, 8868646, 8979683, 8696659, 8540000, 8784894, 9144670, 9247964]
42337I247964j14937p5386k0139j79485m01356m17760k29023o0959r2772l11060
42327G345087n06211m25253j05080K5984l39225q55766r01942m55110j04700j33031
42317C544753j55571J11306L13782Q4233k93094l38331j26570n3972j42039j33824
42307B810673q1425k53715n47894n47923j75053J94870K90394K01113O3102r6730
42297A857412j76560o9341M2523j34919m83558n41689j80222K01551K74894J69704
42287I59795J05510L7485r5829j13804J30112M41657N10385K98557L8549k7928
42277B284489J82483N23068O62288M04149j2588j83852j03723j22341l26460m00035
42267B907478k15312q6092k09137l13784j73890l8146j71760l54677k71664o8478
$$ y = [9247964, 9133027, 9057641, 9037502, 8858017, 8456661, 8038901, 7809878, 7748919, 7656147, 7345087, 6838876, 6413623, 6308543, 6334527, 5995302, 5139536, 4237594, 3782484, 3677784, 3544753, 3389182, 3500488, 3814270, 3898503, 3605409, 3267078, 3140508, 3086536, 2944497, 2810673, 2729248, 2475533, 1927639, 1379716, 1204663, 1399533, 1689927, 1891040, 1954142, 1857412, 1680852, 1611511, 1654034, 1519115, 1035557, 493868, 313646, 515197, 790091, 959795, 1065305, 1102790, 1006961, 893157, 1023269, 1464926, 1975311, 2273868, 2312417, 2284489, 2466972, 2990040, 3652328, 4056477, 4043889, 3860037, 3756314, 3633973, 3307513, 2907478, 2692166, 2606074, 2396937, 2083153, 1909263, 1871117, 1699357, 1344680, 1073016, 1004538]
42257A004538m2188p0928J11375L04227J08547l14763l80922J3199L11476J44558
42247A189119j73173j94636M6002K19201J73453j8530k40898l49670k02046J40475
42237E89297L80806L04159K2720j82052j57493K4479J66103J27585n325q231J27388
42226A389436J10426j72569l46588q3082K86295K13700j62667k17409R9549J81051
42216A298142j13046j17274M46857P78186J79710p32401q68305k63101J24117
42207G32885k6557o4508L58234O74197L87590j20069k44319m3333L5287q9799
42197A599608j48949m6325O2354P8711K2455j02255k49983k72029j25318R240
42187H27509J7953O9128K90107M28091J60969l63908o36781m13028L8278L17530
$$ y = [1004538, 962350, 891422, 1002797, 1307024, 1415571, 1100808, 719886, 733085, 1044561, 1189119, 1015946, 821310, 867312, 1086513, 1259966, 1241436, 1000538, 650868, 448822, 589297, 970103, 1274262, 1296982, 1114930, 957437, 981916, 1148019, 1275604, 1270279, 1262048, 1389436, 1499862, 1327293, 980705, 897623, 1183918, 1397618, 1234951, 1017542, 1117091, 1298142, 1185096, 1067822, 1514679, 2292865, 2472575, 1740174, 871869, 608768, 732885, 706328, 641820, 1000054, 1674251, 2061841, 1941772, 1697453, 1654120, 1689407, 1599608, 1450659, 1404334, 1466688, 1545399, 1567854, 1465599, 1215616, 943587, 818269, 827509, 845462, 914590, 1204697, 1632788, 1793757, 1429849, 793068, 380040, 418318, 735848]
42177G35848K92719R5423p6135j02072k4645q673j31428k58535k33204j04449
42167A84849k5534j8335j3101l1129j14910j46753J6613K55417K88152P8851j00885
42156C73235o8319M0259K2741r6441j36189K710K37382L51075J53907k67802n16467
42145I6091l14900P0022J30722j55181k82572l098K79835J56597j45602j64963
42135c33049M6408P4508j18260j54574P0863K12647J11271R4436L70354N55478
42125I30082K16068m02831o55723l76011j8032O7155L9914J33812K30853J46271
42115C11558K9954J23462K93868K08815q1979j59535J03105L05427J44817r3506
42105A185986k61K92488L48616J61121J27467L11238K92943p7814l21285o3846
$$ y = [735848, 1028567, 1123990, 1047855, 945783, 921138, 912465, 781037, 522502, 289298, 184849, 159315, 140980, 127879, 96750, -18160, -164913, -148300, 107117, 395269, 474120, 373235, 304916, 345175, 367916, 271475, 135286, 137996, 375378, 726453, 880360, 612558, 96091, -218809, -148787, -18065, -173246, -455818, -458916, -179081, -22484, -168086, -333049, -286641, -212133, -330393, -484967, -414104, -201457, -90186, 4250, 374604, 930082, 1146150, 743319, 87596, -288415, -306447, -239292, -199378, -65566, 165287, 311558, 341512, 464974, 758842, 967657, 885678, 726143, 829248, 1134675, 1279492, 1185986, 1185725, 1478213, 1826829, 1987950, 2115417, 2426655, 2719598, 2641784, 2320499, 2256653]
42095B256653L05392J96146k61913m21063j03022J96890J10907j46952k67451
42086A865587k85093k88493j31456K24419M12364J04607m46714o82772m27800
42077C44649O859K78536K57744m3119m17129m45107M8403N67882M40078k35025
42067H03771o31408l31145J20943Q4380k61315l34637r9341J5200n1853Q8834
42057e96571M87727O24300K18897k28577j15967L66342M93848M2213m11864l15804
42047E64544J12353K28794j37185m73349l07076J62183L73586J75143n3882m4840
42037F00271j6695k19029m30133k66773J89994M74148L64641N8058k37118m52182
42027F5182m08141P2169O68851P10884R3329m35050k74423J92469K65218J1839
$$ y = [2256653, 2562045, 2758191, 2496278, 2075215, 1972193, 2169083, 2279990, 2133038, 1865587, 1580494, 1292001, 1160545, 1384964, 1797328, 1901935, 1455221, 772449, 344649, 351508, 630044, 887788, 844669, 427540, -17567, 30836, 598718, 1038796, 803771, 172363, -158782, -37839, 46541, -214774, -549411, -648752, -633552, -685405, -596571, -108844, 515456, 734353, 505776, 389809, 756151, 1249999, 1292212, 880348, 564544, 676897, 905691, 768506, 295157, -11919, 150264, 523850, 698993, 645111, 600271, 583576, 364547, -65586, -332359, -142365, 331783, 696424, 754482, 517364, 65182, -342959, -270790, 398061, 1108945, 1202274, 767224, 492801, 685270, 950488, 962327]
42017I62327J2689K66700J66803m01151p23501l13570L23233M13208k7242l40367
42007C39129j83439J40373K31055P5478p6108p1361O608j9839j81050k79330j38790
41996a57274Q5077M3416k99547n31900l19518J35185L75676K90391J76050K57552
41986E5108L96301L33419O0694j59280j04917J43842K95126J79132q8090k97877
41976H13458l65806k66181M2765M08837M21035o5387m91627k04237N17870O62660
41966A473387j19953r50543r04972k03273K92901L05999K21711K39979J61075
41957E16311n5274j55163p0897k3781p6598m0228R6608Q6791j11335k01608l8790
41946g3964J13524O460k04997k03585N6111L19631L19715K0862l18855l50182
$$ y = [962327, 975016, 1241716, 1408519, 1007368, 283867, -29703, 293530, 706738, 679496, 339129, 155690, 296063, 527118, 602596, 526488, 455127, 461735, 441896, 260846, -18484, -157274, -72197, -28781, -328328, -860228, -1179746, -1044561, -668885, -378494, -202444, 55108, 451409, 784828, 845522, 686242, 581325, 725167, 1020293, 1199425, 1111335, 813458, 447652, 181471, 224236, 633073, 1054108, 988721, 497094, 292857, 810727, 1473387, 1353434, 402891, -502081, -705354, -412453, -106454, 115257, 355236, 516311, 461037, 305874, 234977, 211196, 134598, 94370, 190978, 277769, 166434, -35174, -73964, 39560, 46020, -158977, -362562, -306451, 13180, 332895, 353757, 34902, -315280]
41936c15280k7622K87474K88188J18340N2269N855k27547m45438k74918J41864
41926c96815K80627N2862j10522n0790j03646l67169m14183k6407L85459M36058
41916c14526K80610J23576j93557o63770p60419j95026M54700N09568J75414R4265
41906d89165K71620K20537o0219q3607K01251K72384p3627l80348k75648J4582
41896c82240J33643J12017J65468L17598M32556L79367P2716l88287o10788k89137
41886e7087K70890M17132L8087k46735K4544M85687M71511p0078n59215n53909
41876B20827k14600J9871m448n2648R1332K80870K24402l0802j23302N2367J52387
41865F16256l7755j99110J995L16615K89860j4066j82726j72225k80635m96084
$$ y = [-315280, -342902, -55428, 232760, 351100, 403369, 409224, 181677, -263761, -538679, -396815, -116188, -63326, -173848, -224638, -328284, -695453, -1109636, -1136043, -750584, -314526, -33916, 89660, -103897, -767667, -1528086, -1723112, -1268412, -758844, -583430, -489165, -217545, 2992, -57227, -140834, 60417, 332801, 259174, -121174, -396822, -382240, -248597, -136580, 28888, 346486, 779042, 1158409, 1231125, 842838, 232050, -57087, 213803, 630935, 669022, 422287, 446831, 932518, 1404029, 1333951, 774736, 220827, 6227, 26098, 21650, -30998, 60334, 341204, 565606, 534804, 411502, 463869, 616256, 578501, 379391, 381386, 698001, 987861, 973795, 791069, 618844, 338209, -157875]
41855a57875m65586j24436J88428K80432K64585J65001r1656k79056o2965L54280
41845G1152M04639N6668j17698R0817K18478L196j80314q4889n3081k95274m04921
41834b91227q9029K60306K48198J10678J22043J7888l64232n30351j66933R8637
41824e84022l34245q60089m94374N03321R55151N32379P4701J42746L31766K11427
41814D78761j1187p0712r7640j82278j36249N8551J43241Q5552J02820J06885
41804D77744j85807n20648l05639K86344L35431l65845q07774k55726O10391P51126
41794A9597K48167p6086K1308J16079L664j30110k28871l61687l42785K5672M48579
41783b56473M43801N9879k21099j92576m9989P6475K23955L14915K26127O2444
$$ y = [-157875, -623461, -747897, -559469, -279037, -14452, 150549, 58893, -220163, -283128, 71152, 475791, 532459, 414761, 505578, 724056, 727252, 546938, 462049, 408968, 113694, -291227, -380256, -119950, 128248, 238926, 360969, 378857, 14625, -515726, -682659, -584022, -918267, -1778356, -2272730, -1769409, -814258, -281879, -207178, -64432, 267334, 478761, 467574, 396862, 299222, 116944, -19305, 39246, 182487, 268039, 370859, 477744, 291937, -228711, -534350, -248006, 87425, -278420, -1086194, -1341920, -731529, 19597, 267764, 191678, 212986, 329065, 332729, 202619, -26252, -387939, -730724, -705052, -256473, 187328, 247207, 26108, -166468, -216457, -139982, 83973, 398888, 625015, 687459]
41773F87459k7028j50440l86418m34524n9518L57585L19713N3271J36964M43894
41763I40958L01702k77956m52017J20949O59973M21746k32887m93850k67670o7496
41753F53452j28889k64708l68887m81390m64417j28928L39993N10703K83700Q118
41743d1253j2613J45645K32801J43374k8546j19771n8020M8997L8046o3023o1086
41732B24551O5532Q0401j17356k62773j21988J08126J02285p3003j04854J3286
41722h5793k2440k88853m81194l72748j08093O7255R8295L8777o2890p9019J43023
41711a153680M96712O26745M01829J51162K02247L80553K70671j31608l69712
41702H74919j60554K09480K59206r3152m75208n28803k89357q1624j16467k57247
$$ y = [687459, 660431, 509991, 123573, -310951, -370469, -12884, 306829, 360100, 497064, 940958, 1242660, 964704, 512687, 633636, 1293609, 1715355, 1482468, 988618, 720948, 653452, 524563, 259855, -109032, -590422, -1054839, -1183767, -843774, -333071, -49371, -41253, -53866, 91779, 324580, 467954, 439408, 319637, 261617, 310614, 348660, 285637, 224551, 290083, 370484, 253128, -9645, -131633, -23507, 78778, 5775, -99079, -85793, -108233, -397086, -878280, -1251028, -1359121, -1291866, -1193571, -1154794, -1217684, -1296703, -1153680, -656968, -30223, 371606, 522768, 725015, 1105568, 1376239, 1244631, 874919, 714365, 923845, 1183051, 1089899, 614691, 85888, -203469, -285093, -401560, -658807]
41692f58807k08670R7499L95615M10484J98585M6741P3141R4725o5737k95247
41682H8329l39445j57635K3466K3664m1348Q8675M39015O61323L72622l40925
41672H17741q74590p13441n7826L67262J80800k20011k60264K5367J39203p3187
41662f68946k03660N0953L99756L79685J1402k54898j33179K00351L65271J76169
41652C22904j87976l38265q0626L03123L51074M0233j66942j9246J31230r6688
41642B58821m85003n63310l21424j02962J5900K03906L58147K12448o4655j5120
41632e03252K97177K81497j95909m96500j94384K47147K13307j80405m24117l71065
41622a326504j59581J90968N63462N28547m3102n08045k51275L48247M75224J32137
$$ y = [-658807, -867477, -769978, -374363, 36121, 234706, 281447, 354588, 449313, 383576, 88329, -251116, -408751, -385285, -361621, -402969, -314294, 124721, 786044, 1158666, 817741, -56849, -770290, -828116, -460854, -280054, -500065, -760329, -734962, -595759, -668946, -872606, -821653, -421897, -42212, -30810, -285708, -418887, -218536, 146735, 322904, 134928, -203337, -283963, 19160, 370234, 410467, 243525, 224279, 355509, 258821, -226182, -789492, -1110916, -1213878, -1197978, -994072, -635925, -423477, -488132, -503252, -206075, 75422, -120487, -616987, -811371, -564224, -350917, -531322, -955439, -1326504, -1486085, -1295117, -731655, -203108, -246210, -754255, -1005530, -657283, -182059, -49922]
41612d9922L239K23418K15423k01851m63955k40737N9287P2468J9035R8065N3173
41601b12357k23301l06291M2395L55188J96335j16678j03663P1732L0940l8254
41591c03954K34499N82985M58421j2320k07174k8868L2831j75586k63190p9988
41581B37656L0956q0034j22636o408n2990l07844l07467J12256M09635J88371
41571A01495j27575k0124K32523N7545l98084m99034j58101J15532J36927K46867
41561c12029N00986M18412j55544n86862l23181K52142L87123N3707j45565M18
41551H9607O0613k00849l79730j20679K45619J93863j81670l32071p0285K66486
41541d29096M12122M28817L30561j9010m47577m27599J62183O47431L92536k71756
$$ y = [-49922, -46683, 176735, 392158, 190307, -273648, -514385, -455098, -382630, -363595, -265530, -212357, -435658, -741949, -699554, -344366, -148031, -264709, -368372, -296640, -265700, -303954, -69455, 513530, 971951, 959631, 752457, 723589, 756420, 580834, 317644, 237656, 268612, 188578, 65942, 59534, 6544, -301300, -608767, -496511, -86876, 101495, -26080, -46204, 186319, 243864, -154220, -653254, -811355, -695823, -558896, -312029, 188957, 607369, 451825, -135037, -458218, -206076, 181047, 234754, 89189, 89607, 150220, -50629, -430359, -551038, -305419, -111556, -293226, -625297, -695582, -429096, -16974, 411843, 742404, 723394, 275817, -151782, 10401, 657832, 1050368, 778612]
41531G78612m82987l4769M42543M51020J86216O637j12445l11571m48836l42073
41521A32347j59518j96609l77854l12454J49108O48773O87041J67675m61386o13656
41511c36533j53943M31195N38193R6784m09228n31705k74285P6192K85726K63168
41501a4436M3501j86911k13984n4060N8188Q626n5890k525R2438J37388J86958
41490g07K60365K20856K4378j11683q862J59324Q3069k55184n60869n65730k56872
41479a011915J34691K81133L9923l20614l64535m6689K18219J61768K2482J00215
41469g85322K82913L10203K11051J37521K9796j82064k95485j56764j4162j05253
41459e67566j59080J45344M64742K15537m03430n62197j9358N44237N73446L12200
$$ y = [778612, 295625, 260856, 703399, 1154419, 1340635, 1347272, 1234827, 923256, 474420, 132347, -27171, -223780, -601634, -914088, -764980, -116207, 570834, 738509, 277123, -336533, -490476, -59281, 478912, 575696, 166468, -365237, -639522, -563330, -277604, -14436, 29065, -157846, -371830, -425890, -367702, -359076, -414966, -417491, -325053, -187665, -707, 259658, 480514, 504892, 393209, 384347, 543671, 626740, 371556, -189313, -755043, -1011915, -877224, -596091, -556168, -876782, -1241317, -1288006, -1069787, -908019, -885537, -785322, -502409, -192206, 18845, 156366, 186162, 4098, -291387, -448151, -462313, -567566, -726646, -581302, -116560, 98977, -304453, -866650, -886008, -341771, 231675, 543875]
41449E43875J65191O7933j16478j67030N3114K03475L869k46059j83165l5116
41439B89609k01943m99607m40856o9516J20265R904j6723K11620L89881L02254
41429I4888J47027J20096J00829l1895j23041k2003J29101J22507M9o7361n5645
41418D14552n0345n4223q461O7703R3721L6355p9088k03060k50348j39871Q1643
41407i1422K21239J17133j80390m15460l13813J46529N84909M94339j45175o79382
41397b61493n07316J04638L47393j396k96132m4683L48218K67582j39596k60410
41387d43195K022K01066J67202J54266J62392j31221n85586n13840K15676P08072
41377f3146K66251n06932n82269k0266K91241J35477J50850N18703N61484l0628
$$ y = [543875, 709066, 776999, 660521, 493491, 546605, 750080, 753949, 507890, 324725, 289609, 87666, -411941, -852797, -922313, -802048, -792144, -808867, -597247, -207366, 94888, 241915, 362011, 462840, 430945, 307904, 285901, 415002, 537509, 537558, 470197, 414552, 364207, 309984, 301523, 369226, 462947, 499302, 420214, 217154, -33194, -173065, -91422, 129817, 246950, 66560, -348900, -662713, -516184, 68725, 563064, 417889, -261493, -768809, -664171, -316778, -318174, -614306, -658989, -310771, -43189, -182785, -443195, -441173, -240107, -72905, 81361, 243753, 112532, -473054, -986894, -771218, -63146, 203105, -303827, -886096, -906362, -615121, -479644, -328794, 189909, 751393, 720765]
41367G20765n48039l68000R9983K12265J25109K71831M01480L7994n04788n22545
41357g3945j13237j5422l37301m10650J6393L83856L34949K40769L71404L63458
41347G60274k9038l75063k89596r1042j64268k30806R8827N10380M30213l7242
41337E82639k98261j69303M5669J82264K90636K40450j07160m30515k85821J38098
41327A88696K37650n2044j87846M3947K11975K8637k07343k21999k08900l15865
41317d83092k49490J64546M92392K83006j86877l00112j4313J55249k7265k24600
41307c90556j14899J63365K93927J99595K2125r9699r5181L8072J83074J69306
41297C69129k2852k31221l51261m62410n99330n49643j07914N13927P96243N22606
$$ y = [720765, 172726, -195274, -95291, 116974, 242083, 513914, 915394, 953388, 448600, -73945, -187182, -202604, -539905, -950555, -934162, -550306, -215357, 25412, 396816, 760274, 731236, 356173, 66577, -24465, -188733, -419539, -320712, 189668, 619881, 582639, 284378, 115075, 160744, 343008, 633644, 874094, 766934, 336419, 50598, 188696, 426346, 374302, 186456, 230403, 442378, 471015, 263672, 41673, -167227, -483092, -732582, -568036, -75644, 207362, 20485, -279627, -293940, -138691, -165956, -390556, -505455, -342090, -48163, 151432, 173557, 73858, -21323, 16749, 199823, 369129, 346277, 115056, -236205, -698615, -1297945, -1847588, -1955502, -1441575, -645332, -122726]
41287a22726O8524p9832Q0752J89969J06818M4232J27457J73635M1685j05153
41277E25361r9123p9673k30757l93197k75896K5793Q0211k54973n58364l74168
41267a634786J56982M39993K02108j06867R1525O15732O40820j17382p88797m38422
41257i39094N30331Q33727J35822m90956k20625L35676K27851l18677l91248J03405
41247a93788M26474K72170O1640J2120j53541m54118m60331q4506J78802O3903
41237c31175p5407M4328J81848J04295n832J2449q688j39423j45308P600j0150
41226c65463k46746k46867J61585M51815K13774j73114j85985L5886P9366j0260
41216b86009L4404J32737R9663R2579K43885K21651k26187o46434m79564J5698
$$ y = [-122726, -54202, -134034, -53282, 136687, 243505, 287737, 415194, 588829, 630514, 525361, 426238, 346565, 115808, -277389, -553285, -527492, -447281, -702254, -1260618, -1634786, -1477804, -1037811, -835703, -942570, -851045, -235313, 405507, 288125, -500672, -939094, -408763, 424964, 560786, 69830, -150795, 184881, 412732, 94055, -297193, -193788, 232686, 504856, 566496, 578616, 425075, -29043, -489374, -573880, -395078, -331175, -406582, -362254, -180406, -76111, -81943, -69494, -78182, -217605, -362913, -355313, -365463, -612209, -859076, -697491, -245676, -31902, -205016, -391001, -355115, -275749, -286009, -251605, -118868, -19205, 73374, 317259, 538910, 312723, -333711, -813275, -797577]
41206g97577J55733r1607j85809m639M9699j00150m3532L27093N56981L44760
41196B10952m7311k71956l02587k19578l1792J61178K03734J41286R8367m0048
41186i7755l91995o28487l29081K48837L97320J2346k46862o964K85758J61002
41176e95881j54388j88012P9636L40573M13632K73592k7135k30962n0395L20558
41166A81218L17328j36026l94113m8201M19681L98015O7415j7330J28878P2670
41156I89535j81034j95832Q3851J83061j40605n19506n41047k79882n9166J4484
41146f46141O1477J68772K98250L50897K29190o5254l44573l61908r1378K06369
41136a94299K55961M6592j94876k56906j30854K6819P9540L4795j2797j2347J4203
$$ y = [-797577, -641844, -733451, -919260, -923899, -874200, -974350, -1017882, -690789, -133808, 210952, 163641, -108315, -410902, -630480, -662272, -501094, -297360, -156074, -57707, -97755, -489750, -1118237, -1447318, -1198481, -801161, -788815, -1035677, -1042641, -756883, -595881, -750269, -938281, -858645, -518072, -104440, 169152, 142017, -88945, -139340, 181218, 498546, 362520, -31593, -79794, 339887, 737902, 805317, 787987, 916865, 989535, 808501, 612669, 696520, 879581, 738976, 219470, -321577, -601459, -660625, -646141, -584664, -415892, -117642, 233255, 462445, 397191, 52618, -309290, -400668, -194299, 61662, 108254, -86622, -343528, -474382, -447563, -368023, -333228, -346025, -358372, -344169]
41125c44169L1909J9876k0392k3551R5647K66629K45318o3966l67923k89585J30129
41114c20078M63565M10280O1351l19871n32878m70192j82538O8159P2233j4832
41104g64801J04189L58661L71072M9757k57078k78049j17143O3363K66911M23936
41094B20818L19181m5395l56699m34709m19975l68593r7893L34749M69482J07296
41084b71738k72424j54351K98527N71334N04554K50455j42672o00110p49181l39834
41074i05440K32194L70021J30218P9596L51974M41388M0666m37748m31867J1705
41064a17293L26815J43502k78729l61018P7051N15565L49044k49491m71672N321
41054f0905N19115L52469k85380o59479n23106k01975M4553J73021Q5355k02764
$$ y = [-344169, -312260, -292384, -312776, -336327, -240680, 25949, 271267, 207301, -160622, -450207, -320078, 143487, 553767, 615118, 295247, -237631, -707823, -890361, -822202, -749969, -764801, -660612, -301951, 69121, 118878, -138200, -416249, -533392, -470029, -203118, 220818, 539999, 494604, 137905, -296804, -716779, -1085372, -1183265, -848516, -379034, -271738, -544162, -698513, -399986, 171348, 675902, 926357, 783685, 183575, -565606, -905440, -673246, -303225, -173007, -93411, 258563, 699951, 740617, 302869, -128998, -117293, 209522, 353024, 74295, -286723, -209672, 305893, 654937, 405446, -66226, -60905, 458210, 810679, 525299, -134180, -657286, -859261, -814708, -641687, -556332, -759096]
41044g59096k94397R1781N16434L58446j68418k67170K01271N04974J88063l06045
41034F5843l94468j02342K19207L72672K62586j20404m42677k74667K04499L16836
41024A07085q1409l19068K3314M38821L38456n0301j82920o1764O430N4396K07040
41013D80080J93584j89294m59368o5246O00017O17105j07989p20265o85427l81684
41003g18487k40680p9098L26767O38835M62566M3125q4739R3002J17554j80860
40993C77985m35543l14465J4363J45945l1776k43550k01594N0794K06240P1836
40983c59765j80319k05294P8908L48306K44128j65090m12817j64764L64712O22905
40973A70910L30653k18783n10070l58355k4589J48049P7151p1081j08090P424
$$ y = [-759096, -1053493, -961712, -445278, -86832, -255250, -522420, -321149, 183825, 371888, 65843, -328625, -430967, -211760, 160912, 423498, 303094, -139583, -414250, -209751, 107085, 25676, -293392, -270078, 168743, 507199, 456898, 273978, 212214, 218644, 273040, 480080, 673664, 484370, 25002, -40244, 559773, 1176878, 1068889, 348624, -336803, -718487, -959167, -1038265, -711498, -72663, 389903, 433028, 348289, 441291, 558845, 377985, -57558, -372023, -357660, -211715, -243491, -487041, -688635, -637841, -431601, -359765, -540084, -745378, -666470, -318164, -74036, -239126, -651943, -816707, -451995, 170910, 501563, 282780, -227290, -585645, -610234, -462185, -385034, -456115, -564205, -556781]
40963e56781J51910J54924k0828k14877k30961m8647J75758K83188K26016O3222
40953a7076p4856p0486M4031R1269k7993k02593k84361k59617j41390J12734L96064
40942d34274L98275L4257k91785k10853K7778m0842k77975j21609M38225P25456
40932B46653L80338j13987j92133K9138J03438n3720k08001k18472p0752K19415
40922A21917M57622L31924j16639m21314l41020j87355k16831j77208J36661L66673
40912d5570J65653j45326j09823N7306r6498l37483q3439M95385N98124N0542
40902E48871m02569k48893J10263J32372p7441j47297p8854o6808o3432N6254
40892b37534J65293Q6038p8332j12487j8882P0859J46943K41223K36797L016l45721
$$ y = [-556781, -404871, -249947, -270775, -485652, -716613, -765260, -589502, -306314, -80298, -17076, -91932, -162418, -118387, -27118, -55111, -257704, -542065, -801682, -943072, -830338, -434274, -35999, -1742, -293527, -504380, -476602, -517444, -795419, -917028, -478803, 246653, 626991, 513004, 320871, 350009, 453447, 399727, 191726, -26746, -97498, 121917, 579539, 911463, 794824, 373510, 32490, -154865, -371696, -548904, -412243, -45570, 120083, -25243, -135066, -77760, -174258, -511741, -595180, -99795, 498329, 548871, 146302, -102591, 7672, 140044, 62603, -84694, -163548, -230356, -293788, -237534, -72241, 13797, -64535, -177022, -195904, -125045, 21898, 263121, 499918, 502934, 157213]
40881A57213n15218l43328M1887L46932L68706J74820J2130p177j3410p5080J068
40870A48543L24434N84455M25509J4353j90300j32146j30375k11660n5030L15724
40860A093507L95467j1571m04410l14305K5948J04020j44603m01017m64518l41758
40850d63240p2409K24217L35898K43040J90540K66199K09493j11305l73345k73248
40840A75840q774P3659J6111M4617J09501N8556J7658J39683J97931p2214m08250
40829C44318l32527Q7807L36446K38881J05938J00729L5948j24326j22001P2528
40819G43741J03105j81061m17572k77020N4036K10459J52569N3500m8411j94035
40809A99311k97385k54205j14777L0231J62818J94497l4619m05805m51027N2793
$$ y = [157213, -358005, -701333, -659446, -312514, 56192, 231012, 243142, 235965, 222555, 147475, 148543, 472977, 1057432, 1482941, 1497294, 1306994, 1174848, 1044473, 832813, 777783, 1093507, 1488974, 1477403, 1072993, 758688, 784636, 888656, 744053, 343036, -121482, -463240, -535649, -311432, 24466, 267506, 458046, 724245, 933738, 822433, 449088, 175840, 167066, 240725, 256836, 301453, 410954, 469510, 487168, 626851, 824782, 752568, 344318, 11791, 99598, 436044, 674925, 780863, 881592, 917540, 793214, 671213, 743741, 846846, 665785, 248213, -28807, 25229, 235688, 388257, 441757, 393346, 199311, -98074, -352279, -467056, -436825, -274007, -79510, -114129, -519934, -970961, -918168]
40799i18168O31620O27787M7273m74635m93568j65806J59836L56177M06493K43566
40789D20575o7413k36881j07995N9547o1490l42520l41628M0839L76412K89608
40779B9054n2687k31599j42659l085P0771J59692K34218J00311k36611m50634
40769e23229l33917j26409j57788l24118k26066K23215O25134N87173J76168k01486
40759b81323k30376O3362L71426L67847K9993k70989j38272L36430N86354K22329
40749A056781m50617p50922m10895J47370L65261J83323k4799k1515M9055N262
40739A48304n0741O1540K47413K49396N2393q7754l3403O9264P3244L4699K7933
40728G92288j7681j51706k65931k74280k50078k37004j26395R4549J89516J3942
$$ y = [-918168, -286548, 341239, 388512, -86123, -579691, -745497, -585661, -229484, 177009, 420575, 353162, 116281, 8286, 67833, 6343, -336177, -677805, -636966, -260554, 29054, -23633, -255232, -397891, -400976, -330205, -170513, 63705, 164016, -72595, -523229, -857146, -983555, -1141343, -1465461, -1691527, -1468312, -843178, -256005, -79837, -281323, -511699, -448337, -76911, 290936, 320929, 49940, -88332, 248098, 834452, 1056781, 606164, -144758, -555653, -408283, -43022, 140301, 115502, 93987, 143042, 148304, 97563, 159103, 406516, 655912, 708305, 620551, 587148, 656412, 729656, 764355, 792288, 774607, 622901, 356970, 82690, -167388, -404392, -530787, -436238, -246722, -232780]
40718b32780j81416q4277J85138K42341J3801j97117j91022q5224k0286L3854
40708e16988J01649R5580j0315r9940r6624o8011q7108j15040n7052J42911M15065
40697b95873N04687J84255l13748l57948K47692P70854M25628m39784p23781j37308
40687a35326M04841J97989k45044j15628M14829N61683J68422j93899k01080j19317
40677G37470j66228j69962p466J20918M2959j34136k76260l97744m54457k89564
40667i94470N0515K36557Q0734j89966k54717r0745J08158K05250J54945m2742
40657g36481k42980j83721J87619N47427N54630K73542M4107J6293L0477o9068
40647D21845k15675k61441j87575r4186m7974n288J12357K80564L47989K08218
$$ y = [-232780, -414196, -498473, -313335, -70994, -57193, -254310, -445332, -530556, -550842, -516988, -415339, -319759, -330074, -430014, -526638, -594649, -681757, -796797, -853849, -710938, -295873, 208814, 393069, 79321, -278627, -30935, 739919, 1165547, 725763, 1982, -135326, 269515, 467504, 222460, 106832, 521661, 1083344, 1251766, 1057867, 856787, 737470, 571242, 401280, 393814, 514732, 557691, 423555, 147295, -250449, -704906, -994470, -943955, -707398, -626664, -816630, -1071347, -1162092, -1053934, -848684, -693739, -736481, -979461, -1163182, -975563, -428136, 126494, 400036, 444143, 460436, 490913, 421845, 206170, -55271, -242846, -337032, -385006, -390294, -277937, 2627, 350616, 558834]
40637E58834l0820j59074j44421j44778k01693j29660J52834L79270K55768r5699
40627D40561k85406j93707p2271r7219j24647Q103K06833L07562L21416L07622
40617H18847J96096l9198j91897p9694J12312L9588k84036m68232k72228J14769
40607e3673L70799L68782J45180j88583l94908k42214J47792L31756J14299j61430
40597D37800j32978K5109q8358m11554m67676p2512M02894N43607L35703L642
40587E75677k96018m71463m31694k07474J7895J33789K25410L70256M60217L50216
40577G26811P1358k10766l59485l16866r7321J87859L77914L84819K14535r4908
40567H83950m28084n43942k89915J34569L48892K41283K8050j20938k25646k55604
$$ y = [558834, 528014, 368940, 224519, 79741, -121952, -251612, -98778, 280492, 536260, 440561, 155155, -38552, -110823, -208042, -332689, -324586, -117753, 189809, 511225, 818847, 1014943, 975745, 783848, 704154, 816466, 856054, 572018, 103786, -168442, -53673, 317126, 685908, 831088, 642505, 247597, 5383, 153175, 484931, 599230, 437800, 304822, 329931, 241573, -169981, -637657, -710169, -307275, 236332, 572035, 575677, 279659, -191804, -623498, -830972, -813077, -679288, -453878, -83622, 376595, 726811, 798169, 587403, 227918, -88948, -186269, 1590, 379504, 764323, 978858, 883950, 455866, -88076, -377991, -243422, 105470, 346753, 374803, 253865, 28219, -227385]
40557b27385j03506J17971J18515j03763k08224o5022N2853J3114P5769L20485
40547i193L47737l1068l21819j19803J28803j51785n80831l39611M30941P30296
40537H3667K26948k81666j75372J31626O6885j64283j11606O4662n4517l50273
40527e63929l82634j50748l3864j23958j56141k4281J07217J69177K54931L39893
40517e64337K92918J57831J11173J57723J47564N4811k8346j06429k10410k06917
40507a94419J013J73766J4073l03340l05878N0576K80238J11338j13850j8060
40497c04543K21227K11552N421n854K39601L37648L6613l40635l21527M4148K31248
40486C54899l5373l83379k98753J59614M47352K84067k8007j18330m1706m5396
$$ y = [-227385, -330891, -212920, -94405, -198168, -406392, -471414, -418561, -405447, -329678, -9193, 338544, 307476, -14343, -134146, -5343, -157128, -737959, -1077570, -646629, 83667, 310615, 28949, -146423, -14797, 52088, -112195, -223801, -159139, -213656, -563929, -946563, -1097311, -1131175, -1255133, -1411274, -1435555, -1328338, -1159161, -904230, -564337, -271419, -113588, -2415, 155308, 302872, 357683, 329337, 222908, 12498, -194419, -193406, -19640, -5567, -308907, -614785, -564209, -283971, -172633, -286483, -304543, -83316, 128236, 133657, 127803, 367404, 705052, 741665, 401030, 79503, 123651, 354899, 319526, -63853, -362606, -202992, 244360, 528427, 500420, 382090, 340384, 294988]
40476B94988j19679q0775P3516J97161K64733L13313K30349o9721l36973k26984
40466E39928J57751L44265J63790k3069Q8097K76597J47047k82164o04634n43360
40456B64248k34288l250J2538l1983M5880J59278O6662j99376k70389K8888L55278
40445A93486L30402J01647M1550J09210M429j94162j34672J11359R7734j94249
40435D66734k72429o765J13858j30096k52916P6326M16459L30254J49859L07884
40425A199168M57387N7650n69257o47456j77275J28818L2791l790J84275J42179
40415H04490l03389o08246l45142J36826K76694N1863j89631k49507j14359J79617
40405c60784M32339L47444l9410l05172k13248m363P4289J31546K78993L29040
$$ y = [294988, 175309, 94534, 168050, 365211, 629944, 943257, 1173606, 1103885, 766912, 539928, 697679, 1041944, 1205734, 1182665, 1270762, 1547359, 1694406, 1412242, 807608, 264248, 29960, 26710, 39248, 7265, 53145, 212423, 279085, 79709, -190680, -161792, 193486, 523888, 625535, 667085, 776295, 780724, 586562, 451890, 563249, 660983, 466734, 194305, 187540, 301398, 171302, -81614, -5288, 411171, 741425, 891284, 1199168, 1656555, 1714205, 1144948, 497492, 320217, 449035, 481826, 478036, 662311, 804490, 501101, -107145, -452287, -315461, -38767, 13096, -176535, -426042, -540401, -360784, 71555, 418999, 379589, 74417, -138831, -143194, -68905, 62641, 341634, 670674]
40395F70674J63692K7844J02974J41942q3160l07353k03599o510j79690o20151
40385b93337p31696k76962K99948M74658K26931p1611j21976M1690J51491M9071
40375b51793p5149O1748L41915L34161k0501k42190q5156J2012l03703n55090
40365g83746j39118N50270N55814j62148n76911j15791N08743M18320j60950l64444
40355b69961L040L10617J06533l26313m85910k78717L5766K43176L08614K52815
40345a00340J06559p334Q6614L68080M88615J05567n92527r31338n20542J98052
40335g98594M49829P0235l74570l77803m4433K23691K64325J95117J40253J18824
40325a33126J01251M6591n7395j49755j71336j68167j95115j62955L1902K61556
$$ y = [670674, 834366, 862210, 965184, 1107126, 1023966, 716613, 513014, 506504, 326814, -293337, -1025033, -1301995, -1002047, -527389, -300458, -372069, -494045, -452355, -300864, -251793, -326942, -265194, 76721, 410882, 390381, 148191, 63035, 75047, -228656, -783746, -922864, -372594, 183220, 21072, -555839, -671630, -162887, 255433, 94483, -269961, -266921, 43696, 150229, -176084, -661994, -940711, -904945, -661769, -353155, -100340, 6219, -1115, 85499, 453579, 942194, 1047761, 455234, -476104, -996646, -798594, -348765, -278530, -653100, -1030903, -1075336, -851645, -587320, -392203, -251950, -133126, -31875, 14716, -42679, -192434, -363770, -531937, -727052, -890007, -858105, -596549]
40315e96549K80883P9495j22669k21647k88143k77472l6117L13918L69209J3965
40305d85127l23359k29198J30958K79168P2423j92936k20443j8086J98100K44055
40295e44445J25835J9499M4189Q5815j435q3016P4740L17825K01699k95437n81144
40284f35875k41279L38189M97154J70209j63781j97546m5221J05023J83157J22596
40274A32626q7296k34648q7592K18864K91419K0288k52818j94731J00851K68108
40264A75071J14371j90520l25363j67183Q9971J91950J38709J08058J21030L2082
40254B88176j31036j35214M3604J11630n8727j84928n8508R1106M6278M6044L29228
40243C87653N43683J86529n27139q34744m53123R7775K60405O5998j06035q485
$$ y = [-596549, -315666, -236171, -358840, -580487, -868630, -1146102, -1182219, -868301, -499092, -485127, -808486, -1037684, -906726, -627558, -555135, -748071, -968514, -986600, -788500, -544445, -418610, -399111, -354922, -269107, -270542, -353558, -278818, 39007, 240706, -54731, -635875, -877154, -538965, -41811, 128398, -35383, -232929, -278150, -173127, 10030, 132626, 45330, -189318, -276910, -58046, 233373, 253661, 843, -193888, -93037, 175071, 289442, 98922, -226441, -393624, -303653, -111703, 27006, 135064, 256094, 288176, 157140, 21926, 65530, 177160, 118433, -66495, -125003, -33897, 12381, 58425, 387653, 931336, 1117865, 590726, -244018, -697141, -599366, -338961, -272963, -378998, -387483]
40233c87483L31740O35129N04819j24514o86523n39033J58037N69658K71909k58026
40223D75713l98021j63645L3425K7937l6772m7985j2196O6873J73441K24081J61063
40212E03914K7160r9981j48559o1778O9453k4320m21071p05216m18419K25689
40202a053128N35024K91069M875Q0334K49457J25225j47466j85619J6293J62287
40192G8351J26738M570j39968k74241k88170j40321Q558M062r6933j71939j93650
40181a082943j21179J12993L56150K79400j22392l83886j77758K25713L88432
40172e25470K97653K03613J41349n470j69128j97939j38020r5605R629K41141
40162b38247L92705K81456J05409J46520K92080K32655j8905j98451k43169k74875
$$ y = [-387483, -55743, 579386, 1084205, 959691, 273168, -265865, -107828, 461830, 733739, 475713, 77692, -85953, -52528, -24591, -61363, -109348, -121544, -54671, 118770, 342851, 503914, 531074, 431093, 282534, 220756, 290209, 265889, -155182, -860398, -1278817, -1053128, -518104, -227035, -222160, -141826, 107631, 232856, 85390, -100229, -83936, 78351, 205089, 209659, 69691, -204550, -492720, -633041, -624483, -620421, -717354, -889293, -1082943, -1204122, -1091129, -734979, -455579, -577971, -961857, -1139615, -913902, -525470, -227817, -24204, 117145, 111675, -57453, -255392, -393412, -489017, -479388, -238247, 154458, 435914, 541323, 687843, 979923, 1212578, 1193673, 995222, 752053, 477178]
40152D77178k55194p1110J32541J19599j8779j7797Q1140M0344p6017j4824R5245
40141D92326j48537o65810q12891k87103L61876M43764J3883k95506j25391K60750
40131g62639M18459K53080L4055j2884J2888j01289k89756k76355m0637J22117
40121f42961J18097K16736M60800M02336j43748n53392k24282M11244M61583o8045
40111D38368l50421r2628J03543j34130l62601j82859J00466J05750l536R760
40101c68288n3826l60747n63344l25090P6998J98522J26768K10391L93463L66717
40091b98436J65369P7781Q9140q0545m29203n95537l56092J02784M28615M30507
40081d65617K09778Q3515K55213M93433L77001o6085l25376j59743N7008j1567
$$ y = [477178, 221984, 150874, 283415, 403014, 384235, 366438, 447578, 487922, 411905, 397081, 492326, 343789, -322021, -1134912, -1422015, -1060139, -616375, -602492, -897998, -1023389, -762639, -344180, -91100, -57045, -69929, -57041, -158330, -448086, -724441, -765078, -642961, -524864, -308128, 152672, 555008, 411260, -142132, -366414, 44830, 506413, 438368, 87947, -4681, 98862, -35268, -397869, -580728, -480262, -374512, -378048, -368288, -422114, -782861, -1346205, -1671295, -1594297, -1395775, -1269007, -1058616, -665153, -298436, -133067, -55286, 33854, -46691, -475894, -1071431, -1427523, -1324739, -896124, -465617, -255839, -172324, 82889, 576322, 953323, 887238, 561862, 402119, 459127, 447560]
40071D47560j46836p0063K4393r6492j76808N6827K75884L8604m06369m86598
40061e39898k38499j51999k57471j47157J64690K16301j6105j1708L44875M74395
40051a62576N6067m10462l72278J1365K65501K85258K29470J33155J3734K9254
40041G8488J84781J87246j01118l79209l67066k10025j18427K2487L06637M31989
40031C5783J35120k74362l03848p553J54836M4571n8941r084L6357j1391n3957
40020c12469q5062j97860k80669r4875K70458L98153J23993k12389k52726o3853
40010g07299Q6249J41102K15656L12876L12075J72555j2391j34320j53495j04742
40000A28266o8467q3268p7252K6614J46016J19773l4533j18022o2624n8780k53984
$$ y = [447560, 300724, 230661, 255054, 158562, -18246, 38581, 314465, 353069, -53300, -539898, -778397, -930396, -1187867, -1335024, -1170334, -954033, -970138, -981846, -636971, -162576, -106509, -516971, -889249, -877884, -612383, -327125, -97655, 35500, 49234, 78488, 263269, 450515, 349397, -29812, -396878, -606903, -725330, -702843, -396206, 35783, 170903, -103459, -407307, -414860, -260024, -215453, -274394, -283478, -247121, -258512, -312469, -397531, -595391, -876060, -970935, -700477, -302324, -178331, -390720, -643446, -707299, -621050, -479948, -264292, 48584, 360659, 533214, 520823, 386503, 233008, 128266, 59799, -23469, -100721, -74107, 71909, 191682, 157149, 39127, -23497, -82277, -336261]
$$ [...]
##END NTUPLES=NMR SPECTRUM
##END=
