##TITLE=31Pdec_IBEP0104
 CDCl3, 24 sc
 2.4.2019
##JCAMPDX= 6.0         $$ Bruker NMR JCAMP-DX V2.0
##DATA TYPE= NMR SPECTRUM
##DATA CLASS= NTUPLES
##ORIGIN= UXNMR, Bruker Analytische Messtechnik GmbH
##OWNER= root
$$ XWIN-NMR		Version 3.5
$$ Tue Apr  2 14:35:50 2019 Russian Standard Time (UT+4h)  she@DPX200
##.OBSERVE FREQUENCY= 81.013821
##.OBSERVE NUCLEUS= ^31P
##.ACQUISITION MODE= SIMULTANEOUS
##.ACQUISITION SCHEME= undefined
##.AVERAGES= 24
##.DIGITISER RES= 17
##SPECTROMETER/DATA SYSTEM= spect
##.PULSE SEQUENCE= zgpg30
##.SOLVENT NAME= CDCl3
##.SHIFT REFERENCE= (INTERNAL, CDCl3, 0, 182.463)
##AUDIT TRAIL= $$ (NUMBER, WHEN, WHO, WHERE, WHAT)
$$ ##TITLE= Audit trail, XWIN-NMR		Version 3.5
$$ ##JCAMPDX= 5.01
$$ ##ORIGIN= Bruker BioSpin GmbH
$$ ##OWNER= she
$$ F:/spectra/data/she/nmr/P31/1/pdata/1/auditp.txt
$$ ##AUDIT TRAIL=  $$ (NUMBER, WHEN, WHO, WHERE, WHAT)
(   1,<2019-04-02 14:34:57.92 +0400>,<she>,<DPX200>,
      <created by zg, POWCHK disabled, PULCHK disabled
       configuration hash MD5:
       00 E9 B6 7A A2 85 ED C7 34 08 36 98 17 FE 4E 26
       data hash MD5: 32K
       16 80 C8 68 33 15 46 CE 44 01 8E 88 C5 B3 FC E6>)
(   2,<2019-04-02 14:35:00.62 +0400>,<she>,<DPX200>,
      <Start of raw data processing
       efp BC_mod = 2 LB = 1 FT_mod = 6 PKNL = 1 PHC0 = -1792.832 PHC1 = 40.39897 SI = 64K 
       data hash MD5: 64K
       BB 18 5A 76 07 88 75 D2 1A 6D E2 73 C9 ED 0E A1>)
(   3,<2019-04-02 14:35:12.65 +0400>,<she>,<DPX200>,
      <pk PHC0 = -4.57176 PHC1 = 0 
       data hash MD5: 64K
       C1 A6 26 7A AB E2 C9 94 C7 3C 94 3D 8A 94 13 70>)
(   4,<2019-04-02 14:35:15.76 +0400>,<she>,<DPX200>,
      <abs ABSG = 5 
       data hash MD5: 64K
       74 54 30 0E C2 8D F1 84 51 F2 B8 9E FA 77 59 35>)
$$ ##END=
$$ 
$$ hash MD5
$$ 31 35 75 FC 89 2F 3E 30 15 14 7E 07 5B 59 1D 7E
##$RELAX= 
##$RELAX= 
##$RELAX= 
##$RELAX= 
##$RELAX= 
##$RELAX= 
##$RELAX= 
##$RELAX= 
$$ Bruker specific parameters
$$ --------------------------
##$DU= <F:/spectra>
##$EXPNO= 1
##$NAME= <P31>
##$PROCNO= 1
##$TYPE= <nmr>
##$USER= <she>
##$AMP= (0..31)
100 100 100 100 100 100 100 100 100 100 100 100 100 100 100 100 100 100 
100 100 100 100 100 100 100 100 100 100 100 100 100 100 
##$AQSEQ= 0
##$AQ_mod= 1
##$AUNM= <au_zg>
##$AUTOPOS= <>
##$BF1= 81.014009
##$BF2= 200.13
##$BF3= 200.13
##$BF4= 200.13
##$BF5= 200.13
##$BF6= 200.13
##$BF7= 200.13
##$BF8= 200.13
##$BYTORDA= 1
##$CFDGTYP= 0
##$CFRGTYP= 5
##$CHEMSTR= <none>
##$CNST= (0..31)
1 1 145 1 1 1 1 1 1 1 1 1 1 1 1 1 1 1 1 1 1 1 1 1 1 1 1 1 1 1 1 1 
##$CPDPRG= <waltz16>
##$CPDPRG1= <>
##$CPDPRG2= <waltz16>
##$CPDPRG3= <>
##$CPDPRG4= <mlev>
##$CPDPRG5= <mlev>
##$CPDPRG6= <mlev>
##$CPDPRG7= <mlev>
##$CPDPRG8= <mlev>
##$CPDPRGB= <>
##$CPDPRGT= <>
##$D= (0..31)
0 1 0 0 0 0 0 0 0 0 0 0.03 2e-05 3e-06 0 0 0 0 0 0 0 0 0 0 0 0 0 0 0 0 
0 0 
##$DATE= 1554201297
##$DBL= (0..7)
120 120 120 11 120 120 24 19 
##$DBP= (0..7)
150 150 150 150 150 150 150 150 
##$DBP07= 0
##$DBPNAM0= <>
##$DBPNAM1= <>
##$DBPNAM2= <>
$$ [...]
##$SUBNAM3= <"">
##$SUBNAM4= <"">
##$SUBNAM5= <"">
##$SUBNAM6= <"">
##$SUBNAM7= <"">
##$SUBNAM8= <"">
##$SUBNAM9= <"">
##$SW= 369.568048894756
##$SWIBOX= (0..15)
0 1 3 0 0 0 0 0 0 0 0 0 0 0 0 0 
##$SW_h= 29940.119760479
##$TD= 32768
##$TD0= 1
##$TE= 0
##$TE2= 300
##$TE3= 300
##$TEG= 300
##$TL= (0..7)
0 120 53 12 22 120 120 120 
##$TP= (0..7)
150 150 150 150 150 150 150 150 
##$TP07= 0
##$TPNAME0= <>
##$TPNAME1= <>
##$TPNAME2= <>
##$TPNAME3= <>
##$TPNAME4= <>
##$TPNAME5= <>
##$TPNAME6= <>
##$TPNAME7= <>
##$TPOAL= (0..7)
0.5 0.5 0.5 0.5 0.5 0.5 0.5 0.5 
##$TPOFFS= (0..7)
0 0 0 0 0 0 0 0 
##$TUNHIN= 0
##$TUNHOUT= 0
##$TUNXOUT= 0
##$USERA1= <user>
##$USERA2= <user>
##$USERA3= <user>
##$USERA4= <user>
##$USERA5= <user>
##$V9= 5
##$VALIST= <valist>
##$VCLIST= <CCCCCCCCCCCCCCC>
##$VD= 0
##$VDLIST= <DDDDDDDDDDDDDDD>
##$VPLIST= <PPPPPPPPPPPPPPP>
##$VTLIST= <TTTTTTTTTTTTTTT>
##$WBST= 1024
##$WBSW= 4
##$XGAIN= (0..3)
0 0 0 0 
##$XL= 0
##$YL= 0
##$YMAX_a= 28734
##$YMIN_a= -31577
##$ZGOPTNS= <>
##$ZL1= 120
##$ZL2= 120
##$ZL3= 120
##$ZL4= 120
##$ABSF1= 182.463
##$ABSF2= -187.1042
##$ABSG= 5
##$ABSL= 3
##$ALPHA= 0
##$AQORDER= 0
##$ASSFAC= 0
##$ASSFACI= 0
##$ASSFACX= 0
##$ASSWID= 0
##$AUNMP= <proc_1d>
##$AZFE= 0.1
##$AZFW= 0.5
##$BCFW= 0
##$BC_mod= 2
##$BYTORDP= 0
##$COROFFS= 0
##$CY= -3
##$DATMOD= 1
##$DC= 0
##$DFILT= <>
##$DTYPP= 0
##$F1P= 0
##$F2P= 0
##$FCOR= 1
##$FTSIZE= 65536
##$FT_mod= 6
##$GAMMA= 0
##$GB= 0
##$INTBC= 1
##$INTSCL= 5.30512e-09
##$ISEN= 30
##$LB= 1
##$LEV0= 0
##$LPBIN= 0
##$MAXI= 10000
##$MC2= 0
##$MEAN= 0
##$ME_mod= 0
##$MI= 50
##$NCOEF= 0
##$NC_proc= -5
##$NLEV= 6
##$NOISF1= 182.463
##$NOISF2= 159.3651
##$NSP= 0
##$NTH_PI= 0
##$NZP= 0
##$OFFSET= 182.463
##$PC= 4
##$PHC0= -1797.404
##$PHC1= 40.39897
##$PH_mod= 1
##$PKNL= yes
##$PPARMOD= 0
##$PSCAL= 0
##$PSIGN= 0
##$REVERSE= no
##$SF= 81.0140089999434
##$SI= 65536
##$SIGF1= 159.3651
##$SIGF2= -187.1042
##$SINO= 113.3802
##$SIOLD= 16384
##$SREGLST= <1H.CDCl3>
##$SSB= 0
##$STSI= 65536
##$STSR= 0
##$SW_p= 29940.119760479
##$SYMM= 0
##$S_DEV= 0
##$TDeff= 32768
##$TDoff= 0
##$TI= <>
##$TILT= no
##$TM1= 0
##$TM2= 0
##$TOPLEV= 0
##$USERP1= <user>
##$USERP2= <user>
##$USERP3= <user>
##$USERP4= <user>
##$USERP5= <user>
##$WDW= 1
##$XDIM= 65536
##$YMAX_p= 323119085
##$YMIN_p= -11944226
$$ End of Bruker specific parameters
$$ ---------------------------------
##NTUPLES= NMR SPECTRUM
##VAR_NAME=  FREQUENCY,     SPECTRUM/REAL,   SPECTRUM/IMAG
##SYMBOL=    X,             R,               I
##VAR_TYPE=  INDEPENDENT,   DEPENDENT,       DEPENDENT
##VAR_FORM=  AFFN,          ASDF,            ASDF
##VAR_DIM=   65536,         65536,           65536
##UNITS=     HZ,            ARBITRARY UNITS, ARBITRARY UNITS
##FACTOR=    0.456856943014862, 1,           1
##FIRST=     14782.0589164792, 0,            0
##LAST=      -15158.0608439998, 0,           0
##MIN=       -15158.0608439998, -11944226,   0
##MAX=       14782.0589164792, 323119085,    0
$$ Real data points
##PAGE= N=1
##DATA TABLE= (X++(R..R)), XYDATA
$$ [...]
47965 -55006 284029 435199 237850 -77363 -431197 -812524 -918857 -584482 -355493 -875801
47955 -875801 -1810580 -2154058 -1586492 -770089 -280154 -29642 148027 143316 -4065 -51248
47945 -51248 -109841 -522651 -1032468 -946146 -373201 -296825 -966857 -1304580 -648954 -63115
47935 -63115 -818121 -2340014 -2932354 -2099917 -871631 -37496 589482 1075107 858233
47926 858233 -167419 -1064890 -979424 -190465 490362 788012 880584 766132 388421 97150
47916 97150 293659 677853 450478 -592776 -1606838 -1610966 -644508 278525 340937 -207650
47906 -207650 -489102 -126674 365684 337413 -199698 -748939 -1053599 -1286508 -1580848 -1717394
47896 -1717394 -1384147 -570948 380131 1037430 1180096 916303 530861 235460 123493
47887 123493 273887 660381 974040 864511 429302 94824 -96560 -591970 -1470604 -2039937
47877 -2039937 -1767378 -1143522 -1005103 -1372468 -1657911 -1717585 -1856415 -1944167 -1458747 -482010
47867 -482010 214800 272323 143297 192094 240063 309850 888238 1890207 2222196 1172155
47857 1172155 -413013 -1208517 -1160895 -1195195 -1538821 -1456300 -622456 310393 757714 909713
47847 909713 1016565 771513 -21773 -759975 -705488 -32911 408161 218837 -222847 -505827
47837 -505827 -698206 -989224 -1261113 -1272066 -1021206 -716970 -550455 -672046 -1198493 -1974109
47827 -1974109 -2435531 -2066468 -1070763 -318774 -428656 -1047117 -1242505 -533998 657630
47818 657630 1517794 1558529 843025 -195636 -979251 -1040747 -360182 538627 1011559 875275
47808 875275 479739 218295 138337 108137 170876 482017 916464 1007845 443592 -509230
47798 -509230 -1254303 -1485061 -1384140 -1252285 -1160085 -999387 -672875 -166002 373668 568737
47788 568737 96160 -788673 -1270712 -806015 210317 882432 805310 329872 -55204 -229748
47778 -229748 -306518 -342414 -333660 -290616 -192321 17107 348309 776503 1255625 1559101 1274934
47767 1274934 321955 -599785 -553750 513522 1611076 1851116 1369496 850546 535934
47758 535934 134426 -506352 -1094240 -1231312 -773217 86920 856224 996469 451091 -178472
47748 -178472 -316043 -176143 -424095 -1101288 -1455862 -1072215 -627291 -990454 -1865084 -2030194
47738 -2030194 -1010863 153100 224144 -587976 -932898 -136113 1002021 1403074 1034272
47729 1034272 555618 171817 -397382 -1008374 -1037486 -415261 25552 -360301 -1145281 -1510429
47719 -1510429 -1361351 -1189920 -1159233 -1017081 -782058 -791610 -995104 -869681 -275114 198763
47709 198763 114426 -69163 353805 1254820 1812947 1608217 1016737 524750 217717 90225
47699 90225 297941 760306 965880 651046 357506 742425 1496775 1585244 583685 -825842
47689 -825842 -1804578 -2168151 -2020595 -1286928 -128253 734055 789791 495771 601797 1011850
47679 1011850 1041806 570491 67938 -423109 -1332260 -2435339 -2713806 -1806646 -732543
47670 -732543 -509427 -734232 -308090 892743 1895176 1968038 1360319 736253 412008
47661 412008 175416 -457153 -1696597 -2958380 -3200969 -2142698 -753144 -52710 139244
47652 139244 590552 1207314 1147519 262183 -566669 -683537 -388715 -138631 179998 757245
47642 757245 1311384 1537622 1588134 1602365 1214395 108954 -1237220 -1954705 -1771128 -1108895
47632 -1108895 -333698 530147 1303200 1436662 630890 -583062 -1239525 -938418 -243080
47623 -243080 23731 -259554 -459033 -37900 842370 1671287 2195560 2401299 2181783 1449808
47613 1449808 464643 -330622 -718860 -655842 -35266 1023366 1855309 1842762 1257434 870343
47603 870343 769418 341952 -476154 -816549 -102073 1093770 1856525 1960851 1667274
47594 1667274 1170574 773732 943468 1557608 1703370 919783 50218 62186 590741 622597
47584 622597 165524 95127 568442 787033 378364 -80204 -99268 125969 364953 667635
47574 667635 782102 192884 -914632 -1616255 -1549105 -1346198 -1367313 -1046786 -169334 261512
47564 261512 -557847 -1752051 -1890125 -1060174 -588479 -988704 -1474582 -1490701 -1468478 -1769615
47554 -1769615 -1949998 -1568778 -932435 -527987 -336894 -173230 -153657 -362573 -517771 -420152
47544 -420152 -314519 -374963 -280034 191105 558713 261982 -416734 -717233 -521096 -418019
47534 -418019 -698155 -969311 -879931 -583949 -280454 108079 472577 283009 -683573 -1747099
47524 -1747099 -2018403 -1508208 -1000658 -886052 -697881 38497 995964 1450146 1245705
47515 1245705 967822 1175571 1761166 2169243 2067321 1626462 1189739 863986 563418
47506 563418 345228 444637 879852 1236565 1096141 606543 345958 579333 932701 955294
47496 955294 748443 751345 1043840 1230835 1051474 744206 608572 489587 61491 -481197
47486 -481197 -473923 297254 1069626 879963 -230096 -1159522 -962870 178152 1300117
47477 1300117 1657416 1180717 279946 -414403 -319182 583543 1495796 1527900 753449 110352
47467 110352 162370 508549 667193 894816 1541242 2095705 1745045 727719 218935 709403
47457 709403 1322891 1126608 413695 108612 419223 772581 780036 542523 131607 -496558
47447 -496558 -1015429 -845817 4030 761098 844718 546294 432086 509690 439048 241271
47437 241271 243734 448569 469816 111611 -398232 -792458 -1030828 -1136662 -1098302 -993688
47427 -993688 -907399 -699050 -224995 160239 -197355 -1339143 -2422824 -2676019 -2232881
47418 -2232881 -1666328 -1125930 -503986 -124310 -485514 -1325983 -1660482 -955523 263927
47409 263927 1182256 1556756 1564191 1302485 841085 394078 57857 -307847 -603519 -314276
47399 -314276 701001 1635559 1615277 924907 625605 1040644 1410630 1130746 507880 437
47389 437 -508092 -1159025 -1481505 -1001816 -114984 330083 97983 -384269 -820825 -1184004
47379 -1184004 -1179501 -410211 777454 1389102 1073152 654826 910958 1414515 1283833 659803
47369 659803 550115 1266127 1891699 1589341 744666 316068 497455 634970 285657 -255020
47359 -255020 -544249 -592243 -612428 -513161 -13282 833661 1552036 1743989 1501118 1251599
47349 1251599 1311947 1637639 1896858 1704198 883656 -344810 -1434008 -1886232 -1650566
47340 -1650566 -1146401 -871607 -975051 -1188056 -1148225 -790749 -413917 -320408 -411691 -265292
47330 -265292 306873 909892 951761 309836 -592659 -1315439 -1702010 -1636826 -936377 245928
47320 245928 1236878 1466988 1096404 640322 189550 -448245 -964380 -683932 308332 925197
47310 925197 465862 -315964 -201304 797786 1487755 1093880 48914 -849726 -1320001
47301 -1320001 -1408350 -1105474 -578482 -312707 -539809 -806011 -521657 275347 1067251 1536713
47291 1536713 1674331 1380834 498169 -693512 -1433241 -1165143 -108709 981402 1535386
47282 1535386 1582342 1506079 1469434 1193705 430992 -460981 -768884 -343511 106542 -91570
47272 -91570 -693742 -922622 -529752 -55085 -99241 -706437 -1463016 -1916966 -1908552 -1705194
47262 -1705194 -1739723 -2045353 -2173286 -1921752 -1772865 -2107007 -2347880 -1680736 -478077
47253 -478077 -54045 -819254 -1614243 -1344111 -480126 -248538 -884099 -1479523 -1299177 -524249
47243 -524249 233942 607762 670483 833857 1445385 2183065 2132674 926269 -499312 -924381
47233 -924381 -434608 -205788 -700229 -958373 -44592 1510531 2301949 1697070 321785
47224 321785 -903852 -1654442 -2088488 -2311783 -2252732 -1962883 -1761220 -1883904 -2035799 -1571680
47214 -1571680 -302089 1106064 1824482 1776255 1459895 1015356 67856 -1400449 -2641261
47205 -2641261 -2956381 -2493292 -1843425 -1226969 -557908 -26379 6822 -340102 -475098 -104112
47195 -104112 421345 683310 758128 967668 1338104 1575033 1422958 818877 -169543 -1268085
47185 -1268085 -1917834 -1636135 -619901 239074 198458 -535963 -1071600 -870980 -283947
47176 -283947 33515 -38006 -48369 376201 1148442 1943416 2532120 2850001 2949878 2942614
47166 2942614 2812645 2301186 1238946 41399 -472182 31334 945143 1430593 1389641
47157 1389641 1396141 1749049 2000898 1576691 602838 -160705 -216093 55049 -136860 -937089
47147 -937089 -1564725 -1300893 -506652 -192262 -617954 -908998 -299233 775269 1283229
47138 1283229 927133 296921 -102639 -353703 -657952 -947824 -1132425 -1304292 -1505198
47129 -1505198 -1604003 -1564791 -1548409 -1613812 -1610691 -1504762 -1502803 -1686906 -1825801 -1743776 -1574833
47118 -1574833 -1414639 -1027007 -230344 639241 1017295 767907 258584 -137429 -330638
47109 -330638 -359111 -231905 9959 221034 184820 -267194 -1025262 -1572305 -1373385 -555128
47099 -555128 85745 -30747 -666546 -1287916 -1770006 -2142588 -2053799 -1192147 -40739 574166
47089 574166 672846 1061181 1952191 2493596 2039815 1145103 749844 976549 1337912 1613890
47079 1613890 1790378 1512994 450704 -921273 -1661901 -1490262 -941968 -457389 -33848
47070 -33848 202434 -62393 -550376 -377106 673260 1523013 1120117 -77888 -684778
47061 -684778 -192711 572717 743899 382787 -23427 -357771 -729719 -958324 -725276 -108364
47051 -108364 476574 866812 1291567 1780328 1795724 855698 -574027 -1295189 -732390 247626
47041 247626 295918 -759926 -1716590 -1534269 -555103 134976 144824 55047 427002 1090168
47031 1090168 1496600 1376615 885330 384086 226786 524829 959115 1010979 544667 21850
47021 21850 -6097 506595 1152905 1595307 1842347 2047487 2225619 2246644 2034024 1669474
47011 1669474 1257979 747317 23505 -771912 -1204142 -998434 -409474 65677 225142
47002 225142 162202 -113723 -631012 -1068150 -936361 -299582 183137 185088 173502 547338
46992 547338 820592 319174 -610646 -886979 -185378 591220 550407 -96437 -538545 -505145
46982 -505145 -441790 -773234 -1382582 -1753140 -1403988 -301843 953812 1476706 854553
46973 854553 -449284 -1532026 -1805323 -1329915 -670310 -510841 -1089710 -1809087 -1726996
46964 -1726996 -711800 230212 166278 -550603 -832935 -401980 -62063 -401184 -957781
46955 -957781 -1005310 -593510 -317622 -384686 -419954 -84153 523977 1058781 1216343 837134
46945 837134 -6342 -956358 -1579024 -1712968 -1557980 -1419738 -1411496 -1374746 -1065335 -477601
46935 -477601 19201 -1051 -541498 -1182605 -1594764 -1821394 -1958681 -1845933 -1328844 -641751
46925 -641751 -219204 -174220 -189737 81962 651357 1179779 1249395 750127 62718 -320282
46915 -320282 -414484 -692735 -1292117 -1683338 -1427400 -845166 -483451 -293722 57220 357615
46905 357615 96545 -555747 -802199 -341236 274223 541650 578294 591713 489539 291455
46895 291455 228662 116023 -601956 -1735063 -2123478 -1228436 -173276 -248007 -968041 -790396
46885 -790396 516021 1479596 1033805 -87893 -479895 229855 1305653 1958743 1948741
46876 1948741 1452823 777911 143576 -368808 -579988 -134089 933871 1732105 1293036
46867 1293036 -107624 -1091403 -849364 -24517 378221 286649 260366 452019 541913 424061
46857 424061 328755 347845 307611 76819 -334640 -896904 -1474765 -1734410 -1453645 -852399
46847 -852399 -343244 -34869 261359 615938 838041 729425 314973 -137756 -259070 96968
46837 96968 573977 602667 116004 -301032 -169262 284018 533326 439273 203113 -36721
46827 -36721 -156543 99812 704413 993526 330910 -917292 -1628460 -1231471 -321198 151717
46817 151717 -82375 -557101 -770318 -735879 -910645 -1596983 -2401311 -2507241 -1679488 -711772
46807 -711772 -499119 -897489 -1021942 -554254 -116127 -232879 -525928 -289272 483070 1045554
46797 1045554 796257 -27340 -613184 -491474 -82342 -139137 -670373 -826832 -85574 906227
46787 906227 1139498 551768 -73139 -293670 -410570 -727709 -1076312 -1165218 -889387 -264111
46777 -264111 454883 660168 15376 -852760 -964061 -274214 375355 556678 595086 558225
46767 558225 21186 -825997 -982970 -162545 531931 235863 -323641 -65243 687404 839752
46757 839752 325471 25780 211715 269417 -131207 -676023 -1189629 -1769711 -2104640 -1644277
46747 -1644277 -609209 51015 -78117 -403448 -280039 275436 960919 1561994 1815783
46738 1815783 1598161 1332990 1497877 1736433 1356197 699761 852168 1763001 1990940
46729 1990940 883972 -310929 -397244 -24971 -279042 -525204 658062 2914678 4246918
46720 4246918 3742233 2605233 2156140 2214528 2072865 1845440 1931635 1988925 1471000 722432
46710 722432 567063 999841 1164395 659643 114074 239983 888686 1374416 1345527 956936
46700 956936 416248 -220108 -841276 -1239649 -1375247 -1428483 -1457877 -1231902 -596655 186836
46690 186836 745692 1082434 1403251 1562787 1183394 415331 35665 472353 1157149 1273013
46680 1273013 816179 424519 412483 570273 779468 1143313 1450800 1189328 339607 -410887
46670 -410887 -593227 -622271 -1124563 -1985383 -2537179 -2428305 -1842689 -1085252 -448512 -306982
46660 -306982 -761155 -1237165 -1013240 -173742 528256 811052 1173621 1829273 2093650 1409390
46650 1409390 398593 107999 516139 645557 95682 -411533 -234634 208817 137661
46641 137661 -437286 -811378 -575571 -1502 464598 678954 756336 832921 935412 967148
46631 967148 839682 655169 621786 733973 747011 554446 317691 95293 -295835 -806453
46621 -806453 -933017 -372911 399607 688918 499355 401021 622478 803717 586156 -51813
46611 -51813 -989167 -1961020 -2397768 -1870629 -790019 -95293 -103172 -201077 147394 662361
46601 662361 784132 430059 -134335 -753389 -1329681 -1629148 -1484398 -994854 -349206 283519
46591 283519 604806 357571 -199836 -450566 -209509 161346 539320 1181684 1791616 1405531
46581 1405531 -84273 -1146858 -386677 1444238 2343293 1669236 664684 407552 469613
46572 469613 -20192 -958768 -1532594 -1354679 -818313 -563572 -837895 -1194325 -837832 394014
46562 394014 1528956 1490711 550444 34726 542927 1306601 1594909 1845182 2744275 3854892
46552 3854892 4043974 3049862 1844449 1383245 1568849 1661630 1353185 1096300 1400260
46543 1400260 2064196 2391696 2186886 2155026 2972421 4218327 4750070 4077324 2841762
46534 2841762 1893179 1416782 1126892 844069 610789 517676 579761 600656 226680 -531103
46524 -531103 -973767 -426044 822957 1884108 2465343 2943132 3283620 2876408 1677110
46515 1677110 547990 49281 -221692 -635411 -816523 -522017 -299662 -512580 -565503
46506 -565503 45397 738687 865445 903940 1492396 2015691 1539496 618147 626920 1536790
46496 1536790 1930760 1260282 546279 562768 754777 438950 -172320 -704344 -1260024 -1731286
46486 -1731286 -1511168 -563295 149528 -2159 -406414 -328793 -77358 -236773 -533641 -424600
46476 -424600 -199888 -487835 -1087428 -1288772 -1078109 -1059604 -1303845 -1183778 -421006 423634
46466 423634 643669 99177 -783978 -1352047 -1168664 -488757 -88772 -258809 -310673 414767
46456 414767 1478104 1991249 1964109 2075356 2290675 1807646 526863 -479142 -428897
46447 -428897 76166 41773 -466657 -610452 -176282 95699 -383483 -1192790 -1411020 -730467
46437 -730467 233616 761348 914531 1320316 2108571 2525775 1908101 656682 -272825
46428 -272825 -613159 -867941 -1234034 -1220591 -560719 192913 409881 201892 13447 -181602
46418 -181602 -661759 -1178697 -1092550 -338527 325774 292866 -84352 -34038 497525 736717
46408 736717 203731 -489811 -371041 547223 1206593 906264 198451 -9809 243919 242409
46398 242409 -129396 -222448 217828 591739 460834 258843 464729 703794 386958 -189428
46388 -189428 -215261 347543 693311 422578 58083 58721 31266 -595762 -1596195 -2199963
46378 -2199963 -2054041 -1403186 -479956 685960 1789095 2141229 1386899 67115 -850880
46369 -850880 -916935 -465025 -47521 133914 238298 472518 879089 1326481 1634555 1745227
46359 1745227 1742765 1636252 1239066 481180 -239460 -379827 -12301 113849 -490932 -1375301
46349 -1375301 -1737133 -1442693 -1032984 -877442 -833418 -738415 -710662 -789394 -709374 -299438
46339 -299438 204190 514272 718565 1070172 1545464 1916119 2147593 2417911 2750851 2877567
46329 2877567 2528152 1740802 858152 284081 209143 482584 752029 763089 516229 185457
46319 185457 -4419 119965 477634 624443 134277 -794872 -1385315 -1103748 -196938 768800
46309 768800 1565800 2165842 2264212 1523559 256260 -691866 -908476 -851425 -1097757 -1514765
46299 -1514765 -1508064 -864885 37051 793952 1370746 1826645 1936089 1366919 220342 -816302
46289 -816302 -1012890 -297366 660146 1089146 796147 200776 -172599 -117256 251867 691989
46279 691989 969029 985149 921894 1142434 1745035 2249822 1993076 943944 -100456 -366509
46269 -366509 3964 245168 86722 101828 749115 1549903 1712299 1307188 1184007 1723069
46259 1723069 2335243 2451999 2420533 2924160 3915171 4765523 5339873 6270832 8078440
46250 8078440 10574553 13338398 16200931 18789837 20045064 18984225 15997457 12720426
46242 12720426 10338641 8540662 6548608 4630647 3788420 4137376 4547701 4127016 3233939
46233 3233939 2571565 2053413 1299281 629453 569531 710519 192741 -716506 -708949 609557
46223 609557 1931586 1968646 1063392 407973 433855 809687 1418529 2336467 3142667 3198766
46213 3198766 2562701 1902898 1566145 1359768 1129417 874296 389430 -490604 -1327295
46204 -1327295 -1471495 -1039433 -806524 -1096258 -1469904 -1543972 -1345753 -799893 235852
46195 235852 1204360 1082626 -154633 -1151864 -838608 258506 1010782 1270295 1624262
46186 1624262 2135019 2321308 2133082 1994862 1928430 1481486 628565 14639 86770 536773
46176 536773 829022 846542 809588 904852 1174707 1505666 1632763 1430877 1237375 1526951
46166 1526951 2175587 2444745 1901723 1015380 562948 713516 1023697 1133662 1044998 769681
46156 769681 202333 -452763 -538201 322473 1515333 2000179 1638395 1382083 1869094 2446260
46146 2446260 2194530 1440212 1324767 2029849 2483545 2027030 1336077 1177673 1185296 664499
46136 664499 -104770 -353811 -157797 -221329 -525929 -275531 709898 1534098 1510904 1144888
46126 1144888 1345155 2176600 2889037 2897954 2315310 1617995 1073889 524166 -309175 -1316486
46116 -1316486 -1994845 -2104368 -2031535 -2145381 -2116270 -1461735 -546905 -254647 -646121 -787154
46106 -787154 -161762 526055 433596 -165086 -329580 214914 825912 892279 531479 319536
46096 319536 638936 1353052 1987036 2194690 2021020 1652234 1088879 327372 -322193 -526758
46086 -526758 -418450 -301642 -21894 703702 1418221 1267073 320047 -406999 -521624 -776305
46076 -776305 -1516943 -1775922 -821139 398551 556009 -61150 -219034 145208 34953
46067 34953 -581101 -529375 516907 1266191 703577 -474602 -1084911 -1105483 -1216979 -1472009
46057 -1472009 -1401366 -995348 -698501 -674379 -795545 -1165993 -1974876 -2909341 -3279762 -2743323
46047 -2743323 -1556633 -235165 698105 832800 179465 -738941 -1426619 -1877286 -2221066
46038 -2221066 -2265995 -1874117 -1456957 -1425573 -1351846 -476823 941495 1624763 877761 -503576
46028 -503576 -1290021 -1178625 -667321 -170264 107108 -152405 -1026677 -1835860 -1753559 -990404
46018 -990404 -640509 -1130192 -1530255 -886875 322409 762852 15074 -973192 -1234359
46009 -1234359 -898334 -703145 -922372 -1205879 -1193125 -868448 -440155 -184307 -296604 -623259
45999 -623259 -672905 -198676 361556 372310 -180029 -755946 -1078258 -1375637 -1739202 -1766102
45989 -1766102 -1129381 -141562 565054 688314 345651 -227741 -768086 -965685 -702337
45980 -702337 -253384 -23874 -135190 -424047 -720098 -924241 -921590 -633408 -116263 499726
45970 499726 1061375 1315605 1034162 395625 -19977 119540 487865 616120 533521 507635
45960 507635 443906 113057 -191749 93782 867284 1341311 1132440 731945 609189 487780
45950 487780 -7893 -527069 -471338 29543 329954 310453 475362 965304 1199290 786730
45940 786730 201621 95332 349707 357978 24075 -115801 221439 596015 466396 -99536
45930 -99536 -611838 -798111 -741631 -545811 -232887 26186 -76844 -584495 -1062091 -979538
45920 -979538 -292551 436178 533973 -112143 -856980 -866581 26361 1134674 1666218 1460273
45910 1460273 791070 -250851 -1677674 -3010889 -3420089 -2692372 -1601907 -1017545 -989015
45901 -989015 -975819 -612918 57838 763482 1076085 682365 -53934 -207073 574328 1466243
45891 1466243 1563640 1124654 968533 1026908 505182 -633084 -1413139 -1223098 -476591 318859
45881 318859 1172655 1934230 2018573 1407375 1044926 1502671 1996234 1550816 507092 -38846
45871 -38846 213064 727610 1222514 1731660 1830524 962282 -393809 -914570 -66028 1255227
45861 1255227 1975084 2019605 1954192 2100578 2374959 2529264 2289532 1677181 1325656 1939931
45851 1939931 3275720 4268400 4444262 4582578 5590310 7301008 8923719 10266575 11924225
45842 11924225 14410530 17489449 20214084 21394871 20333296 17443551 13964184 10831119
45834 10831119 8090669 5572715 3630971 2739503 2673696 2636316 2120780 1304504 696381
45825 696381 672423 1205788 1789796 1790576 1109047 313793 -35195 118909 673613 1691700
45815 1691700 2970004 3756332 3510096 2683024 2163913 2146653 2120640 1801570 1417976 1112387
45805 1112387 684017 37541 -568811 -825364 -618177 -29112 586174 676899 79954 -619084
45795 -619084 -756511 -441786 -230847 -187769 44291 383810 324571 -163955 -520743 -490787
45785 -490787 -413925 -502663 -599661 -806782 -1493337 -2383218 -2520201 -1610202 -585785 -275325
45775 -275325 -291947 66656 552706 500371 102923 175674 883687 1590820 1889051 1995178
45765 1995178 2095638 1958418 1339123 373912 -464620 -583672 298542 1599006 2138441
45756 2138441 1475423 565986 447986 714903 207945 -1074549 -1888850 -1585890 -915428
45747 -915428 -700825 -722710 -414210 164902 631800 900457 925864 413198 -608612 -1429333
45737 -1429333 -1532418 -1425778 -1909126 -2805050 -3144356 -2493385 -1443573 -791770 -770088
45728 -770088 -1076906 -1164178 -496483 940597 2303597 2565098 1694173 731672 492540
45719 492540 629480 308685 -551218 -1211592 -1174803 -822126 -837582 -1316301 -1738369 -1708646
45709 -1708646 -1380988 -1066244 -747197 -284667 94600 -22001 -546961 -863691 -667179
45700 -667179 -377334 -393551 -383078 170400 1035311 1511789 1495164 1533498 1799473 1776086
45690 1776086 1205046 616856 484422 466777 38179 -660790 -1238291 -1836526 -2695390 -3273142
45680 -3273142 -2776391 -1486613 -566757 -429272 -294294 331887 792434 511278 156838
45671 156838 654065 1653627 1996235 1362568 498578 -10742 -257220 -381571 -349648 -380478
45661 -380478 -708298 -837080 37226 1659959 2717204 2549912 1967373 1894754 2110427
45652 2110427 1973891 1596001 1437934 1326526 772504 -63117 -527282 -411755 -92245
45643 -92245 78896 -11087 -361874 -701445 -540238 118980 582496 538775 711638 1636191
45633 1636191 2424940 1880670 405158 -482618 -314681 -8617 -74327 55260 628874
45624 628874 902565 397052 -338394 -782541 -1158288 -1484794 -1053979 323897 1559087
45615 1559087 1723873 1422604 1719586 2415073 2474179 1638583 524203 -498520 -1451774
45606 -1451774 -2037935 -1836991 -1154499 -785132 -938925 -1122447 -985255 -574592 85617
45597 85617 871172 1123674 196384 -1516809 -2832480 -3113814 -2710202 -2112430 -1443568
45588 -1443568 -861189 -684889 -875291 -955265 -638024 -95958 397270 587856 122093 -1003923
45578 -1003923 -1933946 -1706944 -602257 97833 -162725 -617936 -591665 -523118 -978644 -1443508
45568 -1443508 -949651 484389 1786811 2068372 1416397 556009 104310 114843 139880
45559 139880 -214536 -789192 -1122451 -1101756 -966894 -760192 -372797 -140149 -621229 -1568724
45549 -1568724 -1912135 -1170306 -160778 178185 -41053 -250937 -484208 -1047418 -1689572
45540 -1689572 -1954235 -1962078 -2014688 -1818343 -1036802 -266858 -338869 -796393 -333303 1099300
45530 1099300 1905050 1074163 -325652 -688946 -9429 532559 503231 539272 932637 1077480
45520 1077480 559609 -156804 -576129 -955944 -1654431 -2258733 -2100622 -1327920 -696436
45511 -696436 -422816 -34905 604758 986058 936208 1063421 1664551 1939838 1107603 -246204
45501 -246204 -912527 -823856 -965359 -1595930 -1766666 -906549 226440 753230 901475 1270232
45491 1270232 1607793 1246429 320603 -361729 -482038 -471614 -690692 -1018148 -1238491 -1264367
45481 -1264367 -998031 -500437 -247647 -651175 -1327219 -1439784 -855946 -365094 -550116
45472 -550116 -993168 -938388 -315575 317131 585135 605949 586621 549873 555172 836208 1433575
45461 1433575 1869483 1588202 763134 247401 491192 924538 837428 462496 486308 756515
45451 756515 437048 -514282 -1077034 -726493 -262964 -513053 -1126668 -1417422 -1536712 -1852398
45441 -1852398 -1903675 -1140524 -181819 -76855 -620297 -681402 -62277 287498 -53364 -390233
45431 -390233 -215385 127200 392348 846298 1298323 915673 -366111 -1310219 -987573
45422 -987573 -8906 569362 665586 688948 520326 -19228 -375525 -17655 486716 181980
45412 181980 -830983 -1611847 -1749748 -1600191 -1419233 -1179411 -1033170 -1061936 -788175 126905
45402 126905 953054 745017 -51672 -111319 644105 839456 -98484 -916061 -482553 506036
45392 506036 799765 547131 690304 1088229 720428 -406232 -960111 -187929 970870
45383 970870 1190583 427505 -283369 -195740 539793 1333089 1712613 1544068 1063791 667557
45373 667557 482085 274038 -63559 -190034 224270 930614 1378026 1434370 1408942 1406390
45363 1406390 1146077 521308 -129203 -523390 -797274 -1072333 -1046834 -452047 330213 596991
45353 596991 202677 -290620 -306481 250361 1120375 1887304 2045606 1330779 131191 -777816
45343 -777816 -1050174 -1001991 -925874 -601547 214519 1141745 1459044 984942 364066 397771
45333 397771 1203809 2082177 2197371 1392557 280646 -477647 -796539 -941310 -974172 -793644
45323 -793644 -541598 -477993 -487276 -208281 303866 549998 329342 26325 12004 215730
45313 215730 416889 475309 172917 -578520 -1229112 -1013179 -156181 144820 -588693 -1268287
45303 -1268287 -767976 438337 1051812 777261 357812 168610 -118782 -588426 -838306
45294 -838306 -769533 -748224 -854081 -734292 -341654 -112235 -259237 -521680 -718870 -941801
45284 -941801 -1152105 -1254687 -1571107 -2448270 -3330601 -3142502 -1853853 -766622 -844912
45275 -844912 -1595935 -2086693 -2228201 -2380805 -2406570 -1958856 -1273278 -864976 -676578 -205357
45265 -205357 662771 1498929 1910136 1852825 1501021 1140227 1013991 1007110 751367 287107
45255 287107 199782 741022 1276929 1107451 441155 12293 66238 276324 357857 220093
45245 220093 -166396 -503443 -164033 904039 1720504 1507851 929754 1092853 1698969
45236 1698969 1494111 464173 95498 1084802 2181932 2040961 1071011 501512 510836
45227 510836 393156 1544 -120106 201886 550003 653091 546554 113324 -751400 -1590194
45217 -1590194 -1775466 -1437544 -1248360 -1292343 -1003018 -336534 -84157 -653999 -1349557 -1362595
45207 -1362595 -819192 -296421 88279 456142 547263 73295 -637117 -1067888 -1336421 -1847841
45197 -1847841 -2335290 -2087113 -1102232 -176761 288300 763467 1616953 2407312 2547858
45188 2547858 2084820 1404708 688717 66306 -197760 -124238 -156917 -416652 -320831 490687
45178 490687 1341195 1330187 577003 -110897 -491390 -927317 -1353215 -1190966 -388442 343758
45168 343758 557055 551858 584730 369678 -217395 -610864 -273328 506843 1014111 963972
45158 963972 572650 93189 -332176 -594841 -691913 -674015 -393785 326843 1135927 1268210
45148 1268210 522273 -353036 -608982 -392872 -309774 -531854 -797733 -917338 -812293 -382667
45138 -382667 244028 674377 841058 1191680 1847933 2111887 1417236 279295 -405573
45129 -405573 -546506 -559103 -362256 320003 986047 855653 265485 375476 1328999 1856729
45119 1856729 1087392 -273689 -1090239 -1229352 -1228444 -1255986 -1099421 -692534 -62038 831537
45109 831537 1696662 1814226 908577 -247562 -645459 -163492 582518 1133222 1367842
45100 1367842 1138090 419753 -309270 -494884 -303675 -434352 -1083645 -1621943 -1463798
45091 -1463798 -848836 -496848 -711587 -1082944 -1034523 -486023 137207 499301 712898 936494
45081 936494 901083 296838 -499985 -709317 -232211 203427 190222 207614 645322 1033855
45071 1033855 926989 870427 1535147 2326640 1994149 527341 -690012 -808890 -534825
45062 -534825 -772553 -1204219 -992154 -280589 -64917 -730862 -1510307 -1504626 -702053 230401
45052 230401 783827 952112 942589 854801 676260 433066 250987 285240 582435 948922
45042 948922 992279 486560 -215215 -365557 335640 1263324 1570642 1220402 858460 778034
45032 778034 671689 465798 577919 1001960 980563 220981 -326053 197195 1034445 763272
45022 763272 -556523 -1443109 -1199918 -789972 -1175891 -1931762 -2105891 -1583968 -931475
45013 -931475 -562138 -685609 -1460724 -2546082 -3036706 -2513022 -1682299 -1340750 -1222614
45004 -1222614 -651011 153137 388167 52452 -9576 532090 987122 702072 -77954 -633047
44994 -633047 -515537 248644 1148062 1273978 62350 -1808204 -2821632 -2233526 -833238
44985 -833238 132290 294068 117729 41858 135323 289797 292606 -102461 -800954 -1218369
44975 -1218369 -848547 104854 916293 1067213 612471 -18225 -376771 -300116 -55700 -69746
44965 -69746 -402593 -701370 -775470 -875995 -1159665 -1236534 -675766 249428 782086 584357
44955 584357 38790 -329504 -385888 -325936 -395085 -739161 -1298984 -1758568 -1724988 -1025652
44945 -1025652 157973 1335769 1897217 1565501 830140 593297 1091209 1483132 907792
44936 907792 -341915 -1207176 -1206656 -787303 -441702 -166514 104356 167911 -82093 -412172
44926 -412172 -610321 -731226 -832726 -855570 -881854 -1056441 -1111980 -522097 604054 1330262
44916 1330262 1004698 124177 -345782 -134330 303181 566534 600855 432363 106041 -234738
44906 -234738 -557681 -1046883 -1707891 -2180270 -2299148 -2441046 -2821355 -2882699 -2068205 -867611
44896 -867611 -268070 -326898 -148063 743325 1843744 2539562 2673964 2123236 763710
44887 763710 -786138 -1305523 -440659 665099 819285 241835 -86137 38252 921
44878 921 -448842 -846973 -802143 -453109 -95619 117939 61721 -333445 -865510 -1191260
44868 -1191260 -1163955 -817269 -198822 458793 664017 241668 -223103 -68221 480673 667199
44858 667199 426129 482118 1139319 1762900 1769448 1436598 1285756 1245788 986567 649102
44848 649102 619328 818513 812903 535319 377856 551406 765488 629436 120093 -383349
44838 -383349 -398309 193593 800106 504953 -842672 -2165271 -2288197 -1394105 -740953
44829 -740953 -943765 -1265088 -866053 -64291 193280 -352262 -1116391 -1581879 -1719560 -1575087
44819 -1575087 -1071452 -356464 141858 217607 113478 107227 210393 409609 801899 1245860
44809 1245860 1266145 669377 -41384 -289714 -247288 -553160 -1323931 -1967547 -2022441 -1689960
44799 -1689960 -1372615 -1120069 -813568 -574371 -617525 -830520 -813357 -337636 417615 1085574
44789 1085574 1438863 1490087 1343514 990971 329119 -545045 -1193015 -1259916 -1011774 -1071649
44779 -1071649 -1480203 -1415697 -211759 1579044 2587739 2077338 632318 -639484 -1242971
44770 -1242971 -1462802 -1665732 -1771806 -1456930 -692261 98121 474639 489916 602121 1052327
44760 1052327 1507214 1474060 964404 535289 661685 1224204 1666563 1556407 941616 230264
44750 230264 -216718 -391683 -565461 -904980 -1192824 -989639 -106728 1108634 2005514
44741 2005514 2173531 1745646 1152452 652534 220649 -152616 -297234 -110487 241704
44732 241704 545117 772251 899776 741973 303764 65422 408239 871693 617386 -282087
44722 -282087 -685894 160557 1557855 2189957 1637063 569603 -266381 -699059 -885362
44713 -885362 -948839 -957977 -959661 -941769 -895216 -885206 -963686 -1106570 -1293996 -1462514 -1335283
44702 -1335283 -628158 435343 1178043 1237256 905776 529129 97089 -249355 28896
44693 28896 987366 1630714 1064192 -132069 -571929 85784 883948 1104818 1056950 1140260
44683 1140260 1083153 572177 -66105 -354587 -381173 -553167 -939540 -1228598 -1133521 -604924
44673 -604924 151837 719551 761356 387072 22028 -105997 -102030 -100026 -175976 -483167 -1052740
44662 -1052740 -1541082 -1647062 -1666123 -2056964 -2574621 -2541116 -1921996 -1316819 -864953 -130705
44652 -130705 733077 792681 -188117 -1032724 -614710 697813 1750459 2090474 2013465 1721861
44642 1721861 1267668 934229 919096 934592 735548 657314 985444 1218009 716914 -237692
44632 -237692 -835069 -935792 -1090445 -1492161 -1681757 -1305537 -551789 187459 620607 600709
44622 600709 296509 172494 399408 534743 216166 -187897 -171337 30864 -186101 -836907
44612 -836907 -1417857 -1664872 -1586779 -1065031 -152011 538181 514829 189846 184140 247714
44602 247714 -175066 -709226 -578114 -116079 -380352 -1268190 -1478372 -614746 107897 -201250
44592 -201250 -771228 -526722 292360 735942 544510 105871 -336177 -661204 -611840 -254619
44582 -254619 -211650 -799664 -1419218 -1421999 -1119986 -1272449 -1932078 -2426823 -2238716 -1406687
44572 -1406687 -298464 620169 1031777 1061267 1053105 983011 602425 192605 351404 829271
44562 829271 584727 -556889 -1377024 -1074240 -502081 -653457 -972067 -455171 414057
44553 414057 385009 -404912 -613294 126647 785985 819405 965875 1762226 2544000 2519374
44543 2519374 1832165 987862 118896 -590308 -589141 212643 952119 863235 315411 127885
44533 127885 322339 346988 222908 562654 1451427 2145209 2156840 1963943 2126060 2180320
44523 2180320 1219520 -478776 -1306725 -319770 1286186 1564831 359538 -640619 -404958
44514 -404958 168740 26213 -268796 329130 1290748 1065556 -567748 -2092103 -2326175
44505 -2326175 -1743905 -1396619 -1490364 -1528579 -1202145 -674300 -366673 -653885 -1386733 -1753645
44495 -1753645 -1189720 -345064 -377805 -1282424 -1840206 -1380392 -575160 -142893 168602 688662
44485 688662 898338 295638 -501636 -488245 280866 829535 604052 -56472 -608204 -798854
44475 -798854 -596669 -181798 92185 153439 418889 1128889 1788455 1792020 1295113 863019
44465 863019 538960 -21605 -658963 -736566 -100162 651460 957596 804632 367166 -296895
44455 -296895 -1026641 -1497709 -1571842 -1387428 -1050264 -598539 -279030 -392123 -759884 -782691
44445 -782691 -180373 674938 1271726 1453624 1330425 1097110 1049578 1372948 1780611 1767028
44435 1767028 1339158 1024152 981556 680308 -189051 -1027055 -1092485 -564099 -204671 -204069
44425 -204069 -47366 522729 1116748 1419998 1667404 2059702 2207765 1659485 706412 131431
44415 131431 226631 556062 746056 997819 1534019 1946654 1621856 729318 270350 933873
44405 933873 2214114 2960075 2682970 2042296 2007566 2738135 3439479 3294019 2375367 1486336
44395 1486336 1142363 1031530 686872 362481 695910 1564267 1980989 1449041 805315
44386 805315 1098908 2010875 2214950 1284966 395819 756390 1968494 2560526 1872091
44377 1872091 742965 276359 490706 559465 75496 -469161 -539216 -404599 -711627 -1419854
44367 -1419854 -1735896 -1207349 -356396 80105 81703 39862 -89235 -607724 -1174828 -900953
44357 -900953 422643 1823991 2241694 1644708 720281 -58264 -562877 -637022 -263325
44348 -263325 68316 -187143 -800137 -942734 -286562 547339 770810 266159 -475143 -865023
44338 -865023 -557824 294818 952047 678426 -330364 -1034416 -833629 -300039 -250677 -596244
44328 -596244 -708017 -527597 -526787 -742079 -696278 -331361 -205203 -518924 -669064 -143450
44318 -143450 727854 1339729 1631883 1901034 2236192 2601071 3069918 3494908 3343462 2429412
44308 2429412 1450412 1180054 1439858 1551410 1507490 1851628 2533798 2814771 2409834 1887736
44298 1887736 1715849 1671109 1489956 1398224 1620542 1952587 2177510 2364029 2437797 2054817
44288 2054817 1267485 701685 647964 613156 270213 152234 703791 1272629 936724 -94420
44278 -94420 -839010 -1005110 -1099495 -1214957 -787270 256710 1035572 801471 -120737 -831242
44268 -831242 -843099 -327961 217553 334054 -55973 -550585 -768978 -839124 -969353 -774159
44258 -774159 206691 1366771 1390555 75165 -1103696 -829967 354775 897586 248879
44249 248879 -761093 -1230486 -1039070 -486550 142222 504271 283799 -379722 -902676
44240 -902676 -916526 -669599 -595177 -703967 -659026 -362215 -163520 -337537 -545381 -183937
44230 -183937 664285 1080939 506050 -264868 37909 1351260 2170179 1519366 272421
44221 272421 -74786 618176 1169499 812523 35502 -401761 -536299 -871389 -1404665 -1534316
44211 -1534316 -932062 -125182 49646 -538083 -1172530 -1275610 -1163384 -1443256 -1953032
44202 -1953032 -1953739 -1331994 -844757 -948520 -1137592 -878056 -505549 -569318 -851812 -799563
44192 -799563 -523642 -565247 -944228 -1257236 -1510855 -1980335 -2356996 -1994324 -1058107 -477007
44182 -477007 -548604 -533768 12088 417376 -39293 -985718 -1533486 -1440844 -1060896 -609796
44172 -609796 -179145 -127636 -726128 -1538924 -1757904 -1137384 -191463 469419 672271 663572
44162 663572 816862 1207452 1351700 731771 -274489 -601041 13030 486018 -9209
44153 -9209 -701297 -486034 129219 -244069 -1484431 -1920220 -892615 224768 205914 -255918
44143 -255918 31534 727235 678674 -42340 -265574 371248 962340 855767 527716 657337
44133 657337 1183477 1627978 1730137 1477586 1028091 798648 1109566 1571566 1396175 522523
44123 522523 -177393 -109789 268211 325474 274251 633222 1113114 880787 -160180 -1111525
44113 -1111525 -1233013 -757348 -328436 -135072 15208 90901 -186978 -774564 -1110790 -701336
44103 -701336 268824 1114953 1383871 1201795 920278 714793 646807 786662 981743 789302
44093 789302 79220 -502489 -250645 495085 656840 -69633 -782787 -778975 -571879 -861377
44083 -861377 -1188775 -617093 583226 1035425 111590 -1275856 -2003139 -1987736 -1664471
44074 -1664471 -1003781 190456 1452222 1957922 1592933 1080703 1003000 1210244 1299379
44065 1299379 1167888 847788 208559 -770316 -1635672 -1789822 -1173702 -311245 340495
44056 340495 766469 1061305 1129578 984068 999320 1419816 1796537 1451889 509023 -89711
44046 -89711 239808 1014316 1409105 1236338 839397 437059 84541 -2994 311696 628096
44036 628096 357090 -419532 -902562 -502875 523875 1437412 1691840 1220620 410399
44027 410399 -83296 209733 1133530 2053765 2449717 2179744 1281458 -74688 -1367185
44018 -1367185 -1888057 -1406460 -478514 114384 131201 -63154 -97085 -58329 -268264 -685745
44008 -685745 -840749 -584657 -563230 -1315915 -2061074 -1386158 552974 1667795 606060
43999 606060 -1221620 -1539257 -358254 405951 74309 31 1007810 2001658 1937103
43990 1937103 1488980 1565950 1551597 520323 -777988 -819757 292847 921589 264532
43981 264532 -762028 -1120440 -887507 -576561 -256540 161551 478836 544738 588174 830592
43971 830592 1072442 961693 515585 209691 586321 1717982 2980512 3539539 3200713
43962 3200713 2554422 2187450 2154453 2389870 3045056 4010708 4688353 4811531 5014442 6002389
43952 6002389 7670834 9690245 12324132 15700362 18714464 19779099 18555937 16055877
43944 16055877 13232727 10445350 8096558 6628470 5798376 4967921 4201728 4111430 4555547
43935 4555547 4567574 3772069 2853749 2387371 2203740 2155332 2440615 2823864 2602867 1791262
43925 1791262 1303748 1501385 1624003 1215580 969567 1398547 1751227 1218618 311828
43916 311828 -4290 206051 308845 383504 876334 1431115 1248145 378768 -385509 -751345
43906 -751345 -1062303 -1305179 -971726 1382 972453 1411595 1343371 929603 244457 -438614
43896 -438614 -682332 -349802 297170 913774 1170014 764013 -178273 -907423 -803278 -214293
43886 -214293 -34621 -550978 -1221706 -1512857 -1434423 -1269332 -1213420 -1277268 -1232578 -787145
43876 -787145 -103908 133108 -427054 -1177804 -1254476 -586171 214266 685813 737639 410952
43866 410952 16851 121019 724202 884723 -47765 -1250564 -1441882 -718295 -247158
43857 -247158 -344404 -166344 624632 1232542 1130320 878431 975575 925870 159258 -907520
43847 -907520 -1426369 -1141380 -313618 752777 1563503 1467971 505387 -314950 -239826 206015
43837 206015 111425 -374942 -327581 493766 1335949 1581928 1416650 1207550 848724 54732
43827 54732 -1035458 -1865131 -1980598 -1427587 -710331 -413293 -776942 -1544086 -2168088 -2179284
43817 -2179284 -1474366 -387738 561480 1097753 1291538 1178851 566675 -484892 -1250775
43808 -1250775 -931282 369913 1712267 2401846 2603578 2830545 3243968 3583520 3478924
43799 3478924 2757401 1694615 915766 761912 897892 899012 941716 1340215 1690943 1326888
43789 1326888 540441 408887 1272181 2295176 2765509 2882380 2904913 2505859 1562996
43780 1562996 739812 568119 644565 438958 218642 348837 278871 -760713 -2346537
43771 -2346537 -3114908 -2402904 -911329 285373 792495 895728 972060 1048984 820687
43762 820687 165835 -409841 -287970 251278 215463 -632976 -1299586 -1063226 -623185 -945802
43752 -945802 -1694683 -1846053 -1371792 -1169752 -1554748 -1921622 -1858641 -1584016 -1220501 -575909
43742 -575909 194392 526646 258294 -167228 -433987 -664023 -932038 -1125747 -1341831 -1744709
43732 -1744709 -2001709 -1615227 -892221 -743685 -1315131 -1665505 -1157283 -371588 -156329
43723 -156329 -442445 -595680 -446379 -345995 -473643 -617605 -560555 -368802 -335548 -701170
43713 -701170 -1270029 -1389256 -683617 255462 453411 -143125 -579190 -273594 191522 14509
43703 14509 -691395 -1193883 -1145545 -802735 -529331 -510822 -767038 -1113037 -1250313 -1094617
43693 -1094617 -822653 -504820 -26433 514111 763080 660695 577297 656363 509473 -102305
43683 -102305 -760355 -975977 -861621 -760812 -601034 -136782 480568 931350 1286941 1770889
43673 1770889 2122721 1798927 800064 -215704 -726328 -864574 -1051541 -1417242 -1710137
43664 -1710137 -1628281 -1185628 -780755 -780770 -982575 -741355 204292 1319416 1920688 1950876
43654 1950876 1821395 1802532 1966883 2439706 3160384 3546310 2989020 1722948 701948
43645 701948 502470 771407 898550 820164 882181 1177298 1365804 1142277 677577 476068
43635 476068 777740 1202848 1174141 678975 301067 360360 410478 -38575 -611890 -464716
43625 -464716 489290 1361891 1460856 1147295 1201403 1730987 2167885 2164612 2002728 2043903
43615 2043903 2146852 1867281 1091228 237190 -195834 -157340 -53657 -262614 -692136 -847759
43605 -847759 -360374 555167 1234251 1214675 693689 247057 194060 420620 712877 915883
43595 915883 774923 102194 -712809 -855021 -106023 729044 884548 688337 926343 1549592
43585 1549592 1861736 1777832 1905106 2344035 2430042 1918140 1447616 1413904 1312464 780682
43575 780682 409366 741636 1205358 974408 358214 328872 978972 1445331 1246127 766520
43565 766520 397318 49832 -312049 -388977 -53305 403032 743732 1055633 1362616 1411376
43555 1411376 1091943 769035 939040 1652526 2367123 2382693 1576122 746302 874723 1859013
43545 1859013 2475933 1987934 1203260 1258563 1876008 1843182 988623 507587 1165212 2250300
43535 2250300 2746825 2658371 2573988 2608040 2503556 2402515 2801754 3821212 5010438 5949308
43525 5949308 6814006 8297789 10968886 14584986 18079737 20426972 21436823 21434533 20376257
43516 20376257 17896476 14290114 10794628 8514517 7383271 6458048 5016772 3211325
43508 3211325 1860185 1673984 2459421 3119008 2751737 1670053 913647 888118 1086046
43499 1086046 1104101 1159037 1400682 1458978 1069036 592291 522912 888737 1398927 1737257
43489 1737257 1535133 640338 -353171 -505110 217267 768588 497100 48181 276588
43480 276588 992846 1461060 1479978 1210553 551837 -413145 -859722 -131754 1086363 1504476
43470 1504476 969714 513295 733248 1115324 1069897 744687 543059 538225 642227 822059
43460 822059 961895 966572 1053924 1438816 1751042 1412623 643643 370903 943554 1636273
43450 1636273 1741385 1528597 1699628 2379934 3119436 3570834 3730971 3672315 3363616 2728720
43440 2728720 1785001 795122 205001 205663 453579 519229 464208 588738 822086 928039
43430 928039 1124342 1733136 2274248 1835886 541275 -294482 110881 981404 1238919
43421 1238919 982766 963947 1230727 1217698 826631 535292 579882 784222 1116201 1708970
43411 1708970 2337888 2532089 2287407 2108082 2226777 2288458 1989279 1622170 1736688 2447043
43401 2447043 3218398 3287615 2377028 1098431 445918 700701 1132125 1071621 879806 1312757
43391 1312757 2250798 2789391 2490922 1808711 1254244 910488 912838 1603861 2843380 3858954
43381 3858954 4277902 4758948 6068901 8007162 9827737 11287870 12538230 13250086 12741417
43372 12741417 11060651 9210303 7999321 7181680 6063738 4583484 3380161 2956901
43364 2956901 3112599 3188236 2680309 1618300 488344 -161888 -97404 531543 1357298
43355 1357298 1960299 2012928 1499471 803144 366613 209239 -30575 -500913 -810134 -486798
43345 -486798 367264 1124449 1332251 1175315 1149823 1390999 1493439 1058123 299860 -92685
43335 -92685 249930 934615 1328693 1339062 1359289 1541065 1560270 1209002 789076 642183
43325 642183 617545 369867 -31088 -182348 83198 583742 1150345 1698267 1987340 1769419
43315 1769419 1234718 876565 796699 582654 53244 -340871 -172956 313238 626023 764524
43305 764524 1030515 1327221 1249684 855235 761320 1296873 1999773 2228917 1982126 1812569
43295 1812569 2077720 2510083 2498222 1685016 339188 -819858 -1240871 -980012 -417529
43286 -417529 351031 1512647 2898485 3783736 3624157 2731073 1886048 1476994 1370268
43277 1370268 1447900 1746708 2058822 1960364 1475641 1245739 1656660 2163733 1993518 1289021
43267 1289021 917068 1151249 1268095 757369 291909 852581 2208413 3029582 2565187
43258 2565187 1555722 1182493 1593069 1940704 1654895 1137044 1116406 1709457 2386959
43249 2386959 2699321 2703202 2627532 2437541 2010576 1573395 1533284 1826745 1894040 1535824
43239 1535824 1355190 1926472 2873441 3331301 3095387 2676314 2372479 2072103 1990958 2696529
43229 2696529 4063354 5004561 4774265 3919186 3376502 3202833 2876927 2387212 2207241
43220 2207241 2431151 2676186 2713419 2550493 2051601 1181201 531263 852630 2006886
43211 2006886 3051809 3457406 3605204 3970178 4455141 4747656 4766582 4512235 3979307
43202 3979307 3458464 3437697 3923557 4288376 4094028 3714923 3839362 4603194 5466909 5802625
43192 5802625 5497540 5109873 5375979 6381654 7448229 8161293 9100643 10889985 12922430
43183 12922430 14093302 14710225 16422711 19940339 23996698 27119322 29290726 31044783
43175 31044783 31944446 31113926 28700174 25718645 22785711 19923050 17287665 15140837
43167 15140837 13276726 11343903 9589358 8483302 7778215 6801247 5587527 4844115
43159 4844115 4778668 4819782 4608175 4456577 4616335 4798241 4696921 4427324 4204902 4071612
43149 4071612 4103044 4411381 4790322 4805141 4367840 3816392 3366461 2930007 2504519 2236643
43139 2236643 2048280 1727251 1447525 1621672 2133504 2342904 2052161 1839141 2107793
43130 2107793 2375582 1968208 1047728 459771 687110 1297124 1458354 907611 344283
43121 344283 682566 1843274 2689443 2479097 1885069 1961813 2564046 2691616 2112707 1544126
43111 1544126 1269790 788516 76465 15451 1035734 2302363 2852325 2728830 2427803
43102 2427803 2039089 1580670 1434222 1753724 2085452 2199226 2596725 3523291 4226102
43093 4226102 4009351 3344848 3043729 2954025 2466610 1777728 1574756 1834729 1969425 1886513
43083 1886513 1937893 2096353 2162030 2505186 3575523 4921628 5764599 6307234 7319669
43074 7319669 8642424 9433434 9850707 11029142 13147178 14908233 15372847 15039065 14614003
43065 14614003 13982496 13047553 12382524 12201001 11700693 10326310 8793292 7956831 7511597
43056 7511597 6787000 6040770 5865937 5969426 5715225 5383878 5687246 6387189 6617034
43047 6617034 6350408 6311444 6518685 6200792 5271652 4636967 4716062 4819241 4483870 4370726
43037 4370726 5141625 6289235 6871299 6799679 6632160 6569031 6467214 6532693 7151697 8087634
43027 8087634 8549727 8153889 7309961 6583595 6127722 5848135 5710058 5681145 5650375 5587223
43017 5587223 5608582 5793259 6107312 6560258 7190937 7805941 8024846 7804064 7671215 8102015
43007 8102015 8783839 8903632 8225010 7488392 7491165 8033454 8152473 7346957 6211827 5761318
42997 5761318 6392614 7677790 8952294 9847044 10347337 10645384 11037286 11791091 12947143
42988 12947143 14227897 15181731 15464984 15076730 14376688 13795868 13427809 12961192 12138884
42979 12138884 11219371 10772110 10985501 11409794 11525355 11361447 11299551 11401102 11340942 11111685
42969 11111685 11383062 12759705 14829976 16419205 16911646 17002730 17951089 20310561 23581995
42960 23581995 26860193 29509957 31348374 32526328 33255243 33430084 32574339 30422250
42952 30422250 27505969 24839917 22999365 21811025 20946415 20401495 20261918 20419464 20799366
42943 20799366 21562771 22788907 24205414 25550871 27014174 28977902 31422330 33866996
42935 33866996 35867475 37415214 38967104 41206416 44550325 48712432 53023127 57395334
42927 57395334 62601529 69265501 77040741 85363538 94647822 105987443 119928433 136446921
42919 136446921 156063088 179860736 207989575 238842437 269780624 297479472 317139517
42912 317139517 323119085 312421019 287616853 255227918 221195385 188594149 158927216
42905 158927216 133479258 112626471 95293855 80377012 68094278 59038030 52526644
42898 52526644 47005164 41791803 37375681 34054988 31290844 28574325 26051663 23958289
42890 23958289 22132136 20451932 19140453 18213794 17182004 15785695 14542335 13979978
42882 13979978 13726624 13051514 12062318 11585378 11881579 12258831 12179425 12084102 12682113 13857750
42872 13857750 14797062 15026194 14880412 14949865 15399865 15964935 16441966 17002768 17956624
42863 17956624 19267744 20492676 21308993 21904510 22547136 22888628 22145841 20071261 17350788
42854 17350788 14877715 13023982 11824172 11345851 11383723 11200665 10294692 9285503 9285132
42845 9285132 10316954 11128991 10891544 10367842 10815847 12253926 13610233 14355291 15084456
42836 15084456 16352387 17774660 18788961 19754486 21628645 24777716 28737432 33128126
42828 33128126 38251894 44710395 52979888 63518965 76549902 90968207 103644658
42821 103644658 110603363 109408766 100560500 86883100 71923449 58613661 48452871
42814 48452871 41220742 35595422 30483751 25834780 22122635 19364617 17049499 14895633
42806 14895633 13172235 12132104 11500402 10787103 9894915 9149854 8842019 8983663 9434478
42797 9434478 9954585 10125422 9587129 8546330 7752770 7675813 7932141 7903475 7696744 7898335
42787 7898335 8432461 8448990 7623023 6780704 6657943 6762213 6366155 6050536 6952024 8619539
42777 8619539 9143077 7893802 6765731 7717252 10070024 11482975 11022186 9935252 9584372
42768 9584372 9942689 10348430 10608017 10821285 10877222 10693938 10518107 10602776 10965213 11707266
42758 11707266 13085421 14922671 16409524 16936606 16846035 17008635 17908854 19411698 21086065
42749 21086065 22408050 22977154 22966568 23121450 23877425 24669920 24565088 23447027 22118715
42740 22118715 21263548 20742133 19986033 18757923 17408756 16550497 16473852 16760009 16608634
42731 16608634 15784148 15069903 15429215 16807007 18171709 18753278 18836429 19241451 20405263
42722 20405263 22146213 24000881 25545716 26639290 27658622 29392729 32433885 36673727
42714 36673727 41566744 46875435 52969895 60315496 68780585 77570931 85785410 92818948
42706 92818948 98111225 100747771 99747845 94903077 87112027 77760590 67976857 58555725
42698 58555725 50166575 43187638 37492019 32780424 29026329 26257563 24073328 21875001
42690 21875001 19548798 17446135 15689261 14021822 12399519 11109677 10102727 8854953
42682 8854953 7285555 6208255 6288424 6998849 7291479 7007624 6881101 7299129 7866141
42673 7866141 8246379 8657376 9285184 9889108 10342184 10967012 11869652 12442833 12110736
42664 12110736 11208051 10475034 9908505 8848337 7191286 5758412 5167367 4922384 4106876
42655 4106876 2682528 1610543 1725260 2826749 3943280 4292040 3915424 3475575 3488034
42646 3488034 3772854 3700910 2951575 1891119 1168173 1081544 1404439 1659034 1462427 785126
42636 785126 31634 -271090 -17776 378880 559204 646647 882989 1120076 1088533 987871
42626 987871 1272426 1865658 2143149 1822044 1335568 1100444 943594 612211 353737 474387
42616 474387 708464 642668 493009 749723 1199657 1138671 635652 683492 1683005 2564725
42606 2564725 2124334 725904 -146328 196033 1000393 1321441 1092412 723869 369641
42597 369641 65017 85084 584660 1138879 1168733 706509 304303 278038 456366 587742
42587 587742 548546 217640 -339220 -576019 28056 1050958 1379253 654490 -210525 -398830
42577 -398830 -344261 -774209 -1225447 -644223 741850 1398827 597621 -532714 -622406 145517
42567 145517 631980 483923 310492 412029 356499 -47543 -197810 439293 1406087 1730336
42557 1730336 1179009 574823 744034 1455194 1725011 1108807 261366 1648 231951
42548 231951 284415 61827 92749 479983 657451 454147 532311 1237322 1800418 1449661
42538 1449661 677386 475759 784969 766098 341709 293104 837550 1279661 1308970 1547908
42528 1547908 2374819 3168854 3302301 3067876 2965775 2770773 2068976 1221116 1025918
42519 1025918 1712468 2862087 4029375 4888418 5107668 4722447 4404082 4763468 5571531
42510 5571531 6198370 6566962 7051084 7657555 8054876 8356080 9126276 10470758 11707541
42501 11707541 12161617 11877690 11389861 11098283 10965370 10600855 9678095 8457543 7666049
42492 7666049 7530200 7269907 6094212 4390928 3205958 2756224 2334531 1626368 1115103
42483 1115103 998326 728032 81557 -215660 414848 1388658 1753974 1483936 1267623
42474 1267623 1412639 1656296 1784940 1789953 1619469 1353272 1398906 1924450 2301652 1728434
42464 1728434 272927 -1243509 -2203337 -2456698 -1926393 -757421 274616 387190 -148746
42455 -148746 -416518 -344001 -758295 -1730917 -2057435 -1045065 208757 283011 -567913 -966312
42445 -966312 -440815 289080 769229 1252116 1654504 1371266 482052 -21675 232705 319428
42435 319428 -381802 -933351 -283649 844214 913226 8103 -251374 739324 1692605 1594448
42425 1594448 1275467 1855378 2766780 2632928 1443766 475406 302973 220854 -292535
42416 -292535 -740897 -584826 -76052 347204 731922 1194490 1471430 1374832 1170233 1066658
42406 1066658 847706 426476 195288 336880 398379 158926 285226 1295872 2406347
42397 2406347 2443673 1609773 1206075 1679204 2127117 1938664 1736472 2162433 2730159 2650098
42387 2650098 2071487 1665397 1472356 1033528 379540 27202 60281 -18807 -431654 -757882
42377 -757882 -608057 -157269 205152 350263 320943 138896 -39923 108015 622200 983818
42367 983818 666506 -107196 -513279 -85528 766840 1337802 1455446 1459636 1513691 1365250
42357 1365250 886206 453448 470579 730610 645432 45957 -616019 -879273 -732768 -397898
42347 -397898 -11777 320748 469288 460400 469998 493327 322367 16344 19330 514921 1007538
42336 1007538 942205 477577 196032 236376 211342 -91136 -415312 -484989 -352610 -241207
42326 -241207 -334579 -715619 -1220610 -1435535 -1202625 -1029440 -1523060 -2473119 -3062105 -3013327
42316 -3013327 -2867655 -2941001 -2736615 -1837016 -767833 -338853 -510750 -582842 -285227 -9199
42306 -9199 -13299 -49124 110216 299466 322735 289651 371101 524669 682604 965816 1469426
42295 1469426 1993999 2212742 2030475 1638186 1310269 1272766 1627020 2182633 2434609 1969439
42285 1969439 946653 -27404 -575008 -862404 -1102955 -1065962 -487872 210832 252106 -326657
42275 -326657 -492051 347523 1290963 1056984 -200326 -1093336 -937764 -487620 -516500 -689166
42265 -689166 -440809 -134119 -456582 -1169423 -1393580 -922988 -398898 -245115 -220984 -84196
42255 -84196 28350 39035 126351 282441 209374 -134689 -375189 -329112 -312783 -572445 -795024
42244 -795024 -489467 385326 1356175 1788342 1279231 52916 -1003526 -1131874 -600718
42235 -600718 -336089 -609704 -743192 -297090 224283 295148 252394 574430 863208 407728
42225 407728 -572350 -1141838 -992329 -723708 -753692 -768567 -487161 -254577 -467169 -904169
42215 -904169 -1080950 -961126 -897747 -1029310 -1103843 -872728 -396695 65287 292704 177087
42205 177087 -301038 -1030246 -1718547 -2036965 -1915000 -1593248 -1266103 -849815 -364003 -319937
42195 -319937 -1172107 -2383400 -2736851 -1896279 -1027967 -1338315 -2495053 -3179663 -2852003
42186 -2852003 -2161551 -1742238 -1446404 -933020 -346968 -111585 -441094 -1242103 -2174742
42177 -2174742 -2722809 -2547230 -1865388 -1218386 -889703 -837073 -1018536 -1304931 -1221402 -414929
42167 -414929 637877 1053736 725915 392718 431835 389092 -32780 -350593 -146237 169225
42157 169225 26521 -411263 -609239 -450252 -117028 351675 803469 726092 -69787 -888641
42147 -888641 -967291 -553601 -461571 -822351 -1062449 -950712 -827147 -814065 -621935 -255342
42137 -255342 -158988 -442968 -622924 -414877 -220931 -485255 -1010978 -1259850 -1012852 -459847
42127 -459847 100794 431878 461655 388583 476118 653737 565794 74818 -562882 -1056230
42117 -1056230 -1279343 -1083960 -345535 653015 1276693 1183909 618107 -51742 -677599 -1062877
42107 -1062877 -851057 -59186 633179 557465 -171232 -880392 -1141328 -1018596 -705289 -293138
42097 -293138 137649 472343 587262 284887 -635326 -2023680 -3244296 -3646387 -3104542
42088 -3104542 -1956246 -611958 542458 1110001 969176 536138 374633 535864 601268
42079 601268 398394 324252 816282 1760879 2621994 3011426 2947962 2621396 2094649 1323454
42069 1323454 409247 -296770 -442076 -4283 717293 1413870 1925859 2097440 1712455
42060 1712455 736648 -481984 -1390965 -1604865 -1147528 -485099 -270730 -763611 -1461651
42051 -1461651 -1651357 -1390799 -1465154 -2148877 -2621067 -2149501 -1333174 -1328140 -2086179 -2349551
42041 -2349551 -1482570 -331078 127364 113008 362783 787378 688132 -6894 -614106 -768907
42031 -768907 -851929 -1202992 -1574731 -1641998 -1528678 -1481681 -1414000 -1151042 -870943 -937063
42021 -937063 -1430103 -2102596 -2647110 -2784590 -2287139 -1229938 -127709 450105 361053
42012 361053 -154433 -814341 -1373404 -1597526 -1510555 -1501425 -1808577 -2052680 -1720338 -971210
42002 -971210 -420761 -187676 203856 915942 1482968 1605387 1557333 1467919 911268 -248326
41992 -248326 -1220707 -1196963 -463006 84988 162087 90277 -71436 -480843 -765934 -302661
41982 -302661 707734 1351436 1349627 1395775 1881532 2215000 1892528 1405529 1393185 1552004
41972 1552004 1192452 431292 -22873 -40772 -194028 -721468 -1112961 -897107 -288791 195958
41962 195958 382132 424945 404758 222201 -142513 -450920 -402087 -31835 196256 -108518
41952 -108518 -684849 -799154 -102866 912572 1436032 1109000 194671 -744175 -1176653
41943 -1176653 -887620 -166516 436465 656788 633251 487341 182057 -105072 22879 538711
41933 538711 800711 354379 -476653 -1132936 -1496895 -1651392 -1509548 -1226703 -1425307 -2263754
41923 -2263754 -2738311 -1839604 -155876 664780 7420 -1116701 -1651111 -1662143 -1591958
41914 -1591958 -1271805 -338500 892531 1608621 1373086 480262 -387571 -689000 -457167
41905 -457167 -317076 -787297 -1535060 -1729774 -1178905 -580445 -471735 -477962 57492 1110571
41895 1110571 2005751 2137588 1421480 304081 -485476 -500687 -70240 64982 -315030
41886 -315030 -741075 -879530 -961707 -1195463 -1356753 -1298973 -1294636 -1458149 -1372831 -776552
41876 -776552 -117440 105062 78031 175407 200389 -176983 -640721 -690812 -569320 -822833
41866 -822833 -1120423 -533869 895613 1838367 1288338 -246576 -1565263 -2125200 -2085497
41857 -2085497 -1590946 -717847 138450 503069 446256 472623 729362 768496 269366 -387769
41847 -387769 -615954 -475059 -564047 -1029618 -1186737 -470715 585851 881788 156324 -706111
41837 -706111 -850304 -360580 196239 561794 766550 815834 832148 1096024 1505500 1440861
41827 1440861 693844 54748 272917 841958 688048 -203768 -847096 -844559 -828879 -1158358
41817 -1158358 -1262273 -705756 51214 507660 865484 1266092 1131639 161994 -680799
41808 -680799 -263088 1026756 1763336 1468026 985345 882399 679334 21330 -494251
41799 -494251 -341341 -75417 -473534 -1227257 -1413765 -960025 -682846 -916880 -1030028 -533973
41789 -533973 120319 308844 213133 450152 1043247 1341438 882306 -97411 -991753 -1331815
41779 -1331815 -998277 -269051 305066 327795 -101035 -626972 -1109597 -1580978 -1878480 -1752700
41769 -1752700 -1343317 -1105904 -1177872 -1248181 -1187972 -1333134 -1881197 -2445665 -2565476 -2291429
41759 -2291429 -1874389 -1237211 -288849 497292 477519 -219488 -757101 -716974 -603412 -962131
41749 -962131 -1484304 -1454295 -839913 -400759 -674746 -1302097 -1600521 -1505195 -1510439 -1757113
41739 -1757113 -1717006 -1035672 -236624 -73303 -423891 -479083 -14960 224548 -328088 -1133413
41729 -1133413 -1200128 -290823 960709 1871075 2238755 2236302 2138136 2085840 1948226 1565251
41719 1565251 1170066 1185308 1485183 1395763 700147 64819 72386 434999 676035 935686
41709 935686 1396393 1535751 867009 -56816 -389509 -354945 -731090 -1250839 -852247 447510
41699 447510 1275504 819018 -184941 -820262 -1206656 -1723555 -2055825 -1838442 -1487365
41690 -1487365 -1552886 -1803073 -1707877 -1380220 -1333253 -1666613 -2104433 -2489183 -2680097 -2344334
41680 -2344334 -1444330 -602298 -395922 -575097 -517730 -163161 71945 37925 -64898 -135964
41670 -135964 -160435 73040 715011 1453936 1833363 1817402 1619896 1187953 350572 -673385
41660 -673385 -1410116 -1701414 -1751172 -1706322 -1535867 -1195546 -622358 226220 1053280 1271436
41650 1271436 741996 115088 -9874 101885 -127250 -584157 -675598 -299605 98899 336374
41640 336374 684306 1259213 1801248 2097708 2143240 1875604 1207957 330959 -408728 -897692
41630 -897692 -1196723 -1254436 -1078559 -996834 -1274864 -1641861 -1677165 -1484518 -1465040 -1607268
41620 -1607268 -1564191 -1268950 -897784 -406171 258039 652330 284140 -505626 -825917 -410871
41610 -410871 149752 341861 211982 -66362 -394671 -484056 -100206 376650 350605 -3652
41600 -3652 51723 550010 650447 -37967 -845173 -1117814 -1098874 -1261379 -1467776 -1344650
41590 -1344650 -965393 -640961 -423603 -232712 -136773 -196538 -344314 -613515 -1121754 -1709815
41580 -1709815 -2032744 -2060857 -1955729 -1465401 -205610 1337954 1965443 1253679 105601
41571 105601 -545587 -769239 -951468 -948440 -555546 -105519 63478 134865 218749 -113194
41561 -113194 -1023690 -1760437 -1571076 -775250 -204167 -27682 162037 552052 1104149 1904804
41551 1904804 2793763 3080172 2396897 1440837 1082273 1126014 790273 63565 -324322 -53488
41541 -53488 535820 1163147 1735563 1918424 1440260 738784 489041 562292 249578 -561198
41531 -561198 -1264406 -1556568 -1734284 -1944515 -1957941 -1768297 -1638953 -1469212 -892970 -112183
41521 -112183 164294 -226774 -689530 -888944 -1165745 -1638257 -1691324 -832244 532623 1600186
41511 1600186 1955322 1524216 325500 -1239933 -2284648 -2178697 -1228863 -261287 293361
41502 293361 579309 737839 545443 -236377 -1304495 -1883239 -1568557 -944849 -897782 -1317508
41492 -1317508 -1172625 -112306 863024 915106 667361 1043587 1589564 1255433 332603
41483 332603 78365 607049 792640 378060 470642 1453972 2049122 1306792 129382 -251156
41473 -251156 -133167 -463808 -1035009 -940492 -292873 -155458 -937849 -1922225 -2346058 -2141437
41463 -2141437 -1646138 -1244808 -1232932 -1525177 -1657015 -1474441 -1446779 -1799677 -1852784 -973590
41453 -973590 205772 421684 -535447 -1608951 -1906595 -1552418 -1031352 -421808 420348
41444 420348 1356522 1949140 1846159 1165806 545314 584672 1117104 1361476 940330 251924
41434 251924 -376384 -1166287 -2026053 -2030294 -664334 983240 1346224 419919 -355698 -102205
41424 -102205 639084 1038953 943949 548352 16985 -309981 -103648 338870 385755 148017
41414 148017 465340 1545400 2434363 2281353 1441616 823334 701783 688567 414852 -245953
41404 -245953 -1255195 -2258078 -2688734 -2433074 -2061744 -2006167 -1857263 -993008 336904
41395 336904 1128677 818458 -83277 -666890 -657169 -588514 -1009413 -1677077 -1749504 -858613
41385 -858613 265043 544680 -217475 -1236293 -1741785 -1617851 -1118068 -535294 -251709
41376 -251709 -535977 -1065662 -1152946 -690087 -377614 -722982 -1302761 -1389250 -877344 -187073
41366 -187073 360659 638807 551044 254413 245756 736277 1191970 985018 263734 -337015
41356 -337015 -596105 -690524 -476966 403357 1613569 2088637 1285213 -53407 -781205
41347 -781205 -623443 -165568 119695 312278 581117 755714 532235 -118627 -911414 -1528463
41337 -1528463 -1849768 -1938787 -1858415 -1527010 -819236 132567 831991 820648 242021 -201341
41327 -201341 -35932 377271 304077 -331748 -742075 -273516 667889 1001801 175305 -1304480
41317 -1304480 -2494246 -2872873 -2533742 -1836577 -1118667 -652600 -612057 -912872 -1142749
41308 -1142749 -851051 -43921 715801 881509 511132 58711 -295965 -705584 -1067944
41299 -1067944 -929806 -180800 651938 1085697 1173469 1001004 303551 -884360 -1791562
41290 -1791562 -1860334 -1634866 -1823710 -1928156 -942256 807641 1838001 1628066 1247308
41281 1247308 1476570 1578900 648784 -894657 -2064529 -2707059 -3151200 -3107025 -2016063
41272 -2016063 -191631 1343814 2020638 2001852 1545278 838750 261055 38514 -223376
41263 -223376 -962837 -1794656 -1966549 -1502365 -1056623 -766873 -221525 407058 262805 -849392
41253 -849392 -1947557 -2156216 -1735403 -1358480 -1123029 -888747 -919550 -1411315 -1859428 -1725944
41243 -1725944 -1415166 -1698131 -2316911 -2145967 -915107 143923 -135675 -1316490 -2054727
41234 -2054727 -1911632 -1656857 -1859700 -2022209 -1433436 -293944 511630 456848 -262638
41225 -262638 -1171122 -1823302 -1834048 -1191687 -564351 -722434 -1497200 -1815015 -991531 445199
41215 445199 1446461 1514282 848927 -50357 -564103 -246382 548473 746481 -172996 -1331683
41205 -1331683 -1494652 -666748 40493 -55483 -543752 -737644 -447497 118866 600613 556642
41195 556642 -105956 -690526 -305394 962529 2042442 2182653 1656740 1009402 299947
41186 299947 -538578 -1193249 -1326451 -1052211 -646153 -118572 547680 1054011 1073330 661802
41176 661802 110147 -357526 -533366 -266973 153653 103471 -483495 -734804 95681 1471617
41166 1471617 2080432 1361162 -9875 -1070819 -1466646 -1380445 -1095640 -801922 -532561
41157 -532561 -180900 242432 434486 160806 -288842 -365837 37801 526577 829879 1045368
41147 1045368 1158150 810623 -131884 -1111873 -1362458 -741886 178067 743790 693069 124909
41137 124909 -657266 -1238776 -1313197 -945318 -493584 -240043 -248623 -556553 -1178718 -1793912
41127 -1793912 -1805564 -1078149 -365453 -514730 -1323171 -1714920 -1117450 -123116 403065 324307
41117 324307 10728 -349531 -689851 -698558 -149997 559952 772155 385801 -138123 -470917
41107 -470917 -621332 -568105 -239166 174657 373061 354922 229935 -171129 -905402 -1389322
41097 -1389322 -1063232 -412224 -351218 -643940 -103837 1416346 2476178 2008511 693468
41088 693468 -317684 -966979 -1665228 -2053108 -1524135 -370617 631366 1256898 1502927
41079 1502927 885986 -731596 -2136728 -1966052 -663080 109912 -128149 -292810 217155
41070 217155 633739 402977 244068 875553 1744997 1857957 1135325 240135 -335576 -406133
41060 -406133 96813 841131 1106648 614794 -77251 -401929 -461660 -486453 -278913 221711
41050 221711 434520 -92223 -856086 -1038522 -597603 -77884 274468 478906 249981 -685912
41040 -685912 -1827146 -2234704 -1654370 -681369 165419 890150 1513545 1783246 1594093
41031 1594093 1220762 941817 790037 776675 980691 1278287 1321359 950634 391312 -66668
41021 -66668 -359834 -540802 -599562 -527520 -453231 -625623 -1235723 -2150736 -2807900 -2606047
41011 -2606047 -1553973 -341073 350600 353882 -212525 -1162735 -1948551 -1756994 -526050
41002 -526050 564630 376338 -668861 -1151440 -586413 109435 116532 -281515 -498704 -579845
40992 -579845 -762645 -724279 43210 1366093 2430730 2611308 1981376 1160968 859479
40983 859479 1339498 2097369 2261670 1491278 303148 -562936 -802077 -489077 177011
40974 177011 799737 853478 225745 -516624 -717283 -335068 142414 277883 -1089 -402365
40964 -402365 -400742 322949 1377379 1951997 1825387 1629009 1801455 1845031 1184393 287104
40954 287104 139439 807139 1316583 1005532 314602 68978 500281 1190705 1596409 1424160
40944 1424160 759295 -16351 -554537 -777531 -693589 -212698 584471 1268045 1547472 1677368
40934 1677368 1912080 1882729 1174719 244210 -100428 -6702 -379926 -1310575 -1776081 -1238862
40924 -1238862 -488424 -331808 -421521 -166976 33364 -514077 -1425804 -1645025 -981323 -294480
40914 -294480 -221485 -533965 -738094 -596774 -69756 610464 842072 280938 -497468 -645131
40904 -645131 -272333 -237825 -709893 -853986 -174254 722578 1109206 1100595 1100886 946703 267435
40893 267435 -721714 -1418845 -1577438 -1341890 -778534 102418 966035 1268499 827407 74510
40883 74510 -265023 261579 1374564 2145184 1884002 1017625 652248 1159914 1748428 1637642
40873 1637642 995602 320411 -385869 -1173847 -1486285 -805025 372596 1022852 855187
40864 855187 356000 -152678 -639927 -758883 -131208 733589 798798 -32991 -744704 -741401
40854 -741401 -580486 -762475 -819349 -313252 142374 -178812 -763950 -530686 444829 958905
40844 958905 442169 -320864 -510308 -444912 -882644 -1697933 -1949460 -1133931 178153 1057043
40834 1057043 1190005 922716 575562 133808 -320684 -300706 535345 1666491 2059133
40825 2059133 1361749 336461 -120467 -9489 46668 -221319 -508689 -554535 -476181 -417070
40815 -417070 -258525 124194 555920 733345 623960 527693 713068 1073637 1243077 1070992
40805 1070992 840656 846697 868118 381539 -660854 -1614783 -1886012 -1603869 -1315149 -1249924
40795 -1249924 -1191969 -916733 -451699 10512 209747 -64417 -696287 -1186032 -1141863 -764619
40785 -764619 -596360 -867655 -1342094 -1697089 -1756208 -1443464 -882897 -529938 -815329 -1561123
40775 -1561123 -2047060 -1768965 -926176 -132734 116348 -291969 -1023418 -1431050 -1089251
40766 -1089251 -308827 177640 127859 9055 160208 227023 -166327 -575243 -198922 897694
40756 897694 1662199 1352381 469745 34051 241966 347965 -174157 -864688 -908936 -208594
40746 -208594 538731 704184 309977 -244492 -671859 -888769 -928984 -969555 -1207762 -1486325
40736 -1486325 -1263887 -268317 953144 1480987 1024689 230886 -18889 577729 1605703
40727 1605703 2371254 2428939 1844340 1031191 338433 -119363 -248184 91942 735741 1108620
40717 1108620 855844 369870 244963 361527 81420 -649513 -1034446 -511840 400836
40708 400836 754097 363378 -55387 155938 845155 1316715 1179173 779157 710169 958884
40698 958884 847786 11617 -917695 -1043523 -391299 223254 407112 548508 857272 830599
40688 830599 99307 -778709 -926299 -226162 660137 1111509 1019976 678915 524594 768456
40678 768456 1046475 747973 -70494 -544362 -136337 559714 638537 61313 -563866 -929973
40668 -929973 -1027069 -588044 516551 1510227 1375317 358195 -203943 180088 407214
40659 407214 -500719 -1831591 -2164423 -1335717 -491937 -417284 -705075 -668629 -336311 -205943
40649 -205943 -441997 -716925 -728344 -590861 -648558 -991823 -1275820 -1106642 -573291 -238080
40639 -238080 -530605 -1267580 -1854349 -1869947 -1384734 -793154 -414750 -222126 44953 454285
40629 454285 677073 390973 -204669 -574253 -532193 -381403 -303450 -63548 425488 673219
40619 673219 198480 -703428 -1291242 -1378352 -1477090 -1898960 -2249815 -2077371 -1586114 -1270668
40609 -1270668 -1071153 -431030 763395 1796918 1975532 1553261 1386742 1782902 2179619
40600 2179619 2060688 1688879 1604375 1780701 1767964 1454457 1121920 824570 346750 -131753
40590 -131753 -7031 783166 1359000 987774 145943 -126025 356992 858181 948284 995423
40580 995423 1261361 1265387 524855 -553737 -1085049 -770391 -52761 643761 1275159 1741560
40570 1741560 1644808 805816 -270724 -825274 -671119 -311288 -219193 -267233 -18240 573313
40560 573313 1000752 803757 165487 -269806 -162808 146525 171300 6679 190383 811452
40550 811452 1166572 613271 -491512 -1145692 -908051 -267555 227030 632356 1122814
40541 1122814 1361521 901571 -44020 -779077 -957576 -751019 -298242 411008 1069599
40532 1069599 1110325 482306 -118335 -84163 428935 904589 1096403 936120 284084 -740481
40522 -740481 -1514726 -1521600 -992525 -494623 -143067 254676 554978 475387 297500 605522
40512 605522 1302259 1661411 1498080 1464817 1858759 1961027 1152077 19747 -404430 -77053
40502 -77053 192943 48448 -88910 66746 246871 272814 416071 835298 1202650 1206966
40492 1206966 999197 848706 757452 713197 922560 1420291 1792908 1701957 1380838 1167832
40482 1167832 849952 57103 -874556 -1125014 -515251 225690 480642 431815 447926 373126
40472 373126 -61494 -513407 -355575 375258 906877 669200 -110428 -853812 -1313613 -1609515
40462 -1609515 -1816619 -1764573 -1221839 -191100 979741 1824604 2171111 2242448 2223375 1882651
40452 1882651 934423 -283998 -926803 -607996 70430 221876 -318730 -976348 -1234727
40443 -1234727 -1082609 -732308 -320456 -25082 -142159 -743382 -1371465 -1359786 -522065 602617
40433 602617 1242913 1051609 247675 -752351 -1677133 -2391173 -2739900 -2568617 -1885290
40424 -1885290 -918258 -1916 570875 647599 270127 -366495 -1055766 -1644916 -1935452 -1683704
40414 -1683704 -901137 -64788 261262 58533 -145488 16557 335392 480077 561305 898417
40404 898417 1393166 1563728 1241879 870246 916784 1218277 1153593 411952 -607980 -1217819
40394 -1217819 -1164491 -847448 -808539 -1099526 -1279220 -1014095 -467744 26194 459196 1023172
40384 1023172 1589056 1716042 1310294 923610 1090255 1565918 1612492 1010029 387442 400015
40374 400015 910823 1279097 1234524 1047758 888904 521396 -146595 -618570 -359957 379901
40364 379901 771597 445973 -102263 -274955 -114388 -14476 -33384 80792 332257 394033
40354 394033 112672 -259436 -439802 -436625 -352058 -121061 327997 809784 1032135 955845
40344 955845 779214 570742 163408 -483891 -1031099 -1084697 -701350 -330817 -248238 -278678
40334 -278678 -169758 7614 27468 -109740 -230636 -310033 -441269 -543360 -415013 -65999
40324 -65999 335288 828047 1546729 2184542 2096315 1182902 192027 -201189 -151403 -73820
40314 -73820 143966 701167 1097770 703142 -51141 -29082 961116 1828774 1797053 1395650
40304 1395650 1344133 1330129 709681 -222265 -632423 -464938 -386728 -575960 -534162 -136781
40294 -136781 81044 -86373 -127272 190954 250585 -390705 -1048422 -745452 379968 1247166
40284 1247166 1214995 607083 -12412 -370700 -304135 200348 589262 62798 -1304982 -2302546
40274 -2302546 -1915252 -548152 574985 928797 1003324 1233672 1299701 727179 -264050
40265 -264050 -907881 -770346 -198215 148513 53598 -96999 109138 570357 880277 930043
40255 930043 943557 913143 483887 -359237 -943230 -686275 88215 613001 692535 661387
40245 661387 518974 -127703 -1194059 -1934829 -1904151 -1512177 -1321362 -1313218 -1181617 -849961
40235 -849961 -325340 466955 1262827 1348751 423262 -790928 -1360473 -1270412 -1167146 -1258101
40225 -1258101 -1156750 -703276 -249562 -70661 -47982 -42751 -144282 -442673 -880716 -1360274
40215 -1360274 -1727670 -1742664 -1371292 -965023 -809957 -718793 -483593 -428928 -914198 -1523241
40205 -1523241 -1473347 -730445 -3762 297114 354187 267467 -44597 -247554 170356 914943
40195 914943 1091460 611747 382014 755803 904615 278331 -411829 -456342 -389144 -973002
40185 -973002 -1763439 -1812606 -1221135 -856139 -944293 -1051928 -1144364 -1545132 -2024959 -2005778
40175 -2005778 -1584403 -1359649 -1335930 -1016919 -520430 -502677 -921073 -977350 -444294 57327
40165 57327 331582 972510 2021139 2418170 1500249 105973 -585792 -546022 -437149 -382400
40155 -382400 -119584 133680 -41718 -375101 -188734 507399 976067 845087 593468 805978
40145 805978 1406548 1806991 1568049 837616 248724 302287 771226 949206 603783 308042
40135 308042 584751 1149355 1395455 1245998 1029620 830716 532899 298058 420138 807346
40125 807346 1114098 1262692 1335839 1142281 524082 -29984 164782 891860 1184729 776823
40115 776823 584818 1310480 2297841 2468986 1879540 1489046 1598755 1434218 449313 -717209
40105 -717209 -1038940 -395190 439794 844184 853038 705404 457088 193343 156216 362795
40095 362795 430578 118686 -228863 -158673 217778 480671 614299 865677 995255 405928
40085 405928 -828156 -1744304 -1626807 -825756 -125943 168884 153669 -128435 -565145 -855487
40075 -855487 -1001067 -1467541 -2339471 -2830650 -2320209 -1416844 -1165282 -1532914 -1595604 -1009848
40065 -1009848 -330152 40923 200661 22205 -830843 -1930650 -2166293 -1216524 -44062
40056 -44062 523653 818252 1397033 1967821 1972006 1528126 1030527 414178 -408223 -942286
40046 -942286 -776078 -353478 -231223 -62239 695435 1498009 1336866 440722 103369 759586
40036 759586 1445903 1407041 1038752 793053 313662 -606960 -1184626 -710670 198831 410743
40026 410743 -87439 -338686 20441 343474 156812 -150817 -109096 73255 -28860 -302837
40016 -302837 -309663 -20494 137955 -42379 -228887 -61537 272013 258947 -230643 -795261
40006 -795261 -1122724 -1373524 -1684085 -1664355 -906699 193182 744883 491008 7299 -300786
39996 -300786 -687000 -1287818 -1599772 -1244121 -657071 -409328 -332471 540 357264 205482
39986 205482 -290578 -468233 -224102 -69226 -194617 -298650 -364053 -775511 -1519865 -2028302
39976 -2028302 -1999947 -1691263 -1261389 -601301 38342 143461 -62387 331947 1440464
39967 1440464 2132152 1698307 1001402 1096812 1565309 1313089 405740 -131153 -21160 -31828
39957 -31828 -613116 -1308589 -1622103 -1575507 -1271094 -684176 -45318 238166 164480 89587
39947 89587 112975 67324 -25134 -135557 -619914 -1598476 -2216469 -1606680 -456451 -347060
39937 -347060 -1443348 -2198405 -1671693 -730488 -364438 -200971 399804 973403 776676
39928 776676 73597 -470368 -876622 -1295824 -1187735 -243677 604855 410696 -154914 206840
39918 206840 1274203 1679310 1160777 821734 1135856 1314807 953566 787884 1261193
39909 1261193 1638219 1240179 514678 187278 225798 271102 289533 232262 -129600 -463384
39899 -463384 132181 1680386 2742011 2167658 722807 -7427 240890 429314 -2590
39890 -2590 -499452 -462480 12725 581344 1060146 1217173 763358 -208723 -1151706 -1560118
39880 -1560118 -1309749 -569073 324755 984093 1262521 1343401 1335790 1035043 370797 -243058
39870 -243058 -419954 -340211 -301221 -84246 591289 1256114 1112609 204965 -559655 -599997
39860 -599997 -218962 69778 101001 -157917 -699848 -1166373 -1082182 -617114 -474847 -783074
39850 -783074 -821971 -248834 171027 -297357 -1119934 -1241584 -678129 -398853 -725447 -835543
39840 -835543 -107648 863285 1099172 553826 18210 6438 318635 622090 903247 1204083
39830 1204083 1339557 1164231 888543 836047 990779 1056025 934738 887593 1143199 1554165
39820 1554165 1770995 1645301 1331790 1034074 762131 393355 -33329 -175149 287994
39811 287994 1142930 1697979 1537169 1004642 673568 590452 485718 509674 1076223 1952683
39801 1952683 2239146 1516137 394980 -370066 -673743 -600240 65014 1220715 2010551
39792 2010551 1838245 1333585 1405372 1765911 1483901 732705 700845 1680840 2509494 2289219
39782 2289219 1550146 1147299 989728 581253 25766 -294599 -434645 -534389 -304769 366960
39772 366960 804412 380196 -434263 -731782 -540143 -561739 -775372 -408611 643760 1453061
39762 1453061 1422610 1119177 1309795 1922700 2460946 2793074 2944859 2630827 1675237 598865
39752 598865 155768 424279 849851 1041361 1034393 883689 530574 89919 -184542 -268075
39742 -268075 -311612 -236620 131024 471536 119028 -915469 -1603259 -1043805 425067 1759926
39732 1759926 2497571 2843508 2741583 1811038 365304 -447913 -63064 651982 646447 199754
39722 199754 277609 771743 552274 -693582 -1854498 -2026944 -1685855 -1531927 -1134112
39713 -1134112 178072 1664089 1763874 290347 -1202516 -1529649 -1265086 -1476688 -2021296
39704 -2021296 -1982341 -1228132 -542357 -398361 -489660 -478646 -393442 -131904 624056 1630438
39694 1630438 1940018 1154360 300322 661265 1957428 2540670 1480863 -318061 -1382716
39685 -1382716 -1364056 -952127 -642155 -354620 -97939 -207151 -722426 -1075663 -726058 160966
39675 160966 897822 962774 384030 -370449 -791968 -797732 -817305 -1184108 -1524154 -1209521
39665 -1209521 -447332 -272069 -1139851 -2144376 -2173142 -1350998 -650284 -456756 -388557 -348256
39655 -348256 -739376 -1493937 -1845398 -1470285 -1037359 -1080648 -1070692 -349807 608343 835929
39645 835929 456465 569941 1506843 2200320 1683750 441010 -302939 -132929 320001
39636 320001 395735 53601 -406247 -739956 -797796 -544196 -205779 -204579 -798560 -1808758
39626 -1808758 -2686174 -2852456 -2152517 -1079249 -351742 -127916 90777 562422 746895
39617 746895 164285 -542408 -235206 1044175 1911874 1435418 282449 -397246 -474610
39608 -474610 -494804 -439364 162412 1113505 1539088 1093869 398522 118740 293498 727267
39598 727267 1318377 1718552 1362534 250141 -863875 -1450653 -1798679 -2183488 -2103361
39589 -2103361 -1044622 473679 1436452 1633066 1613197 1536973 983777 -50223 -863033
39580 -863033 -1047411 -1054793 -1372684 -1746680 -1700022 -1348343 -1133357 -1043207 -678680 3801
39570 3801 515176 443323 -106287 -735067 -1143955 -1234209 -1051009 -763593 -602071 -717252
39560 -717252 -1098494 -1590031 -1939410 -1913552 -1502349 -994920 -742230 -833200 -1071939 -1232898
39550 -1232898 -1217384 -980321 -483066 196124 829767 1230242 1374907 1224982 574733 -620402
39540 -620402 -1786830 -2019947 -1087728 132375 588313 268624 72303 558086 1341054
39531 1341054 1800618 1834254 1653485 1328377 935601 778046 984014 1142513 794300 82190
39521 82190 -516556 -851605 -973551 -624825 402257 1485110 1596614 707000 3703
39512 3703 352140 1190172 1435918 935308 367113 73026 -272716 -874551 -1330572 -1140801
39502 -1140801 -368305 395523 590436 141460 -554034 -1055057 -1296340 -1524914 -1862827
39493 -1862827 -2129843 -2133631 -1909012 -1602723 -1367041 -1424682 -1896484 -2425067 -2363661 -1599478
39483 -1599478 -822638 -646625 -823669 -766502 -514483 -583100 -1008021 -1188685 -762210 -111465
39473 -111465 183753 39630 -171670 -105539 260854 665250 817420 694411 505872 291724
39463 291724 -160341 -730444 -687569 403578 1695115 1759669 397425 -978051 -1050480
39454 -1050480 -64422 825482 1076675 1016977 970717 868738 683336 647721 887704 1196581
39444 1196581 1329564 1317488 1394982 1721730 2169377 2318714 1803467 801870 14563 -69962
39434 -69962 272677 453278 395880 524226 1000976 1439944 1465543 1170411 860907 678700
39424 678700 661688 865484 1160691 1157136 645402 -33962 -357089 -240839 -4270 183431
39414 183431 424697 659228 552417 24185 -448385 -368222 141908 554152 651857 674248
39404 674248 811301 968802 1100554 1355799 1699800 1766150 1394366 993878 964142 1010987
39394 1010987 584355 -124022 -277644 399174 1160046 1308715 1165483 1431598 1994098
39385 1994098 2064328 1387902 623600 389000 497641 413406 16523 -465090 -997106 -1744441
39375 -1744441 -2585144 -3020752 -2723454 -1958982 -1271067 -833343 -349130 343919 831770
39366 831770 599984 -140485 -561840 -302870 35526 -143312 -416306 45375 1078076
39357 1078076 1584343 1088257 415513 455918 933828 956809 291454 -519961 -992379 -1061425
39347 -1061425 -841600 -577033 -670281 -1241334 -1791295 -1781102 -1372332 -1088078 -950775 -573027
39337 -573027 49688 512024 667599 634723 258889 -590000 -1237889 -759522 494440 996311
39327 996311 105151 -979744 -940151 -54749 608838 843465 1100279 1273376 866213 72036
39317 72036 -386316 -364166 -315172 -345888 -183991 16916 -170519 -496398 -245147 491433
39307 491433 764471 225587 -360872 -425450 -434057 -873337 -1279057 -1021375 -402533 -154628
39297 -154628 -273134 -172332 199678 175081 -631999 -1676008 -2046964 -1462294 -531067 -34204
39287 -34204 -13340 209034 975428 1635095 1399739 544484 44071 173800 349021 358974
39277 358974 718736 1499103 1847781 1250369 395095 110792 210920 125601 -33218 112763
39267 112763 316177 128254 -224554 -245849 -72880 -154493 -394116 -423902 -335384 -287316
39257 -287316 146247 1202020 1910023 1094680 -759157 -1888475 -1527596 -614079 -126966
39248 -126966 32158 212829 290207 265049 539623 1028983 931593 -14749 -916043 -1003755
39238 -1003755 -713422 -764593 -929331 -568843 210357 845951 1327517 2004948 2671298 2726314
39228 2726314 2154280 1572271 1334349 1261754 1241827 1396231 1542245 1135440 30766 -1158048
39218 -1158048 -1772412 -1860904 -1887838 -1912531 -1504048 -541713 289502 198735 -595224 -938384
39208 -938384 -155874 1049974 1563205 1344548 1266463 1642073 1802924 1287338 570172 173279
39198 173279 -204156 -1015707 -1855802 -1889278 -1067112 -223167 1469 -233485 -478739 -616384
39188 -616384 -768433 -894024 -768385 -351229 -8078 -177969 -754342 -1002661 -339612 932939
39178 932939 1953281 2217983 1844553 1151543 524934 537674 1454616 2553852 2669537
39169 2669537 1592019 275430 -467901 -703124 -645120 -173596 495158 614091 29419
39160 29419 -344587 96006 602877 274195 -466257 -640798 -366967 -536844 -1195219 -1459552
39150 -1459552 -983346 -410860 -297634 -496760 -728173 -954781 -1075671 -938698 -727489
39141 -727489 -725958 -762013 -552754 -446925 -974744 -1727743 -1659693 -630896 291370 342181
39131 342181 -400 51898 515897 956567 1226429 1344129 1109387 376439 -539040 -1102003
39121 -1102003 -1070589 -627342 -209891 -239978 -720338 -1104564 -903940 -355130 -79596 -208282
39111 -208282 -370151 -418496 -510221 -532946 -225345 71952 -398984 -1654005 -2721951 -2845625
39101 -2845625 -2292182 -1709420 -1314708 -1013995 -724521 -284534 414278 1006666 984479 609584
39091 609584 738717 1489127 1932349 1518124 922698 893787 1066840 684675 -156390 -788771
39081 -788771 -993726 -931379 -472022 532843 1540820 1708247 965278 81978 -316306
39072 -316306 -276855 -89292 175907 593756 1123790 1495436 1314488 442931 -697482 -1492068
39062 -1492068 -1833835 -2055295 -2154480 -1714670 -781964 -138661 -329244 -983334 -1451953 -1527995
39052 -1527995 -1219433 -523839 157766 163408 -362278 -382904 426580 928996 221475 -864237
39042 -864237 -1066527 -644770 -666690 -1031064 -811808 -194777 -312166 -1139602 -1306980 -373759
39032 -373759 334066 -169485 -1025098 -1056244 -611906 -728577 -1285190 -1255074 -391385 493489
39022 493489 831784 909734 1078413 1162435 929746 570601 356488 205618 -31982 -101794
39012 -101794 381232 1208535 1595331 1144870 435128 271802 634500 889689 863599 982088
39002 982088 1320539 1339676 833462 322359 69093 -453072 -1453842 -2005204 -1262550 106692
38992 106692 782692 659614 712013 1252413 1562420 1288667 1024565 1222786 1499783 1372985
38982 1372985 899322 272533 -489160 -1157205 -1272179 -813032 -306068 -64704 59220
38973 59220 14923 -590511 -1653475 -2302509 -1915474 -884150 19915 568088 994939 1408992
38963 1408992 1664596 1601917 1240691 916483 1121784 1827622 2159689 1363322 -46843
38954 -46843 -842809 -713493 -494118 -766132 -1181577 -1330384 -1305999 -1134916 -585152 117886
38944 117886 298146 -85398 -275209 3284 110726 -199270 -156910 645821 1294038 854784
38934 854784 -186660 -685392 -331544 429065 1249151 1802902 1566854 604806 -61574
38925 -61574 218113 675164 377222 -165348 158163 1150976 1584234 1121505 666897 825790
38915 825790 1195716 1309615 1271148 1248031 1156655 1044946 1127178 1324512 1341748 1219969
38905 1219969 1268741 1483020 1537574 1280875 795886 176460 -323951 -274016 298501 697866
38895 697866 558425 473437 913991 1221960 675578 -88135 59034 942527 1495926 1564177
38885 1564177 1799284 2003978 1259088 -225749 -1043344 -681508 -151362 -128473 -2351
38876 -2351 658407 1203779 1237887 1478621 2364597 3018626 2601825 1649892 1052389 672971
38866 672971 41888 -473376 -334810 67618 120244 143523 707634 1379712 1361946 916201
38856 916201 911070 1282641 1210296 636214 342146 545421 659960 566717 887058 1665137
38846 1665137 1929094 1129276 85004 -180092 171224 302694 76674 86440 560254 1024766
38836 1024766 1093379 944708 819916 581001 157559 54107 800367 1940914 2237078
38827 2237078 1200321 -83568 -205548 805843 1635691 1449509 738691 308799 210598
38818 210598 56185 -201774 -314963 -223180 -87773 -59820 -234796 -547167 -579215 80001
38808 80001 1094372 1527150 1015806 259904 -11753 26656 -127709 -370294 -260630 167503
38798 167503 485827 482516 190819 -377147 -1049229 -1394339 -1259819 -1008435 -816906 -344490
38788 -344490 359183 408819 -566409 -1359495 -665414 895781 1600568 1137819 743473 868766
38778 868766 482245 -806267 -1586499 -640454 1093873 1739123 903045 -223778 -651116
38769 -651116 -368733 333698 1243268 1958638 2138213 2101166 2485797 3245121 3649650 3405922
38759 3405922 3102569 3273545 3585038 3349279 2448106 1319906 314026 -459944 -790981
38750 -790981 -438396 343342 824397 646395 335412 584661 1241722 1524438 1200060 932737
38740 932737 1230642 1624474 1390053 703327 418301 804707 1165137 850698 124945 -288726
38730 -288726 -168963 80867 137513 203628 624380 1261319 1528567 1137459 571150 525173
38720 525173 989429 1315746 1222926 1181818 1549960 1890729 1646560 1033834 614967 303992
38710 303992 -391103 -1228001 -1226740 -80600 1119180 1054111 -266869 -1528490 -1536619 -352255
38700 -352255 932865 1356884 962049 535298 623075 1067124 1485975 1733896 1681542 1108314
38690 1108314 260341 -22657 620919 1337374 1171194 508581 450919 1041439 1270103 784394
38680 784394 345608 374256 281551 -294630 -732385 -539711 -212431 -239729 -184402 369223
38670 369223 780719 324188 -409151 -228233 840647 1529462 1054099 -31849 -746165
38661 -746165 -720692 -279878 -55547 -550135 -1625931 -2490200 -2574867 -2212280 -1991271 -1804211
38651 -1804211 -1214742 -485918 -369031 -902082 -1269754 -1028060 -736049 -1066969 -1844584
38642 -1844584 -2310873 -2008506 -1142813 -298645 58236 -29697 -94698 136748 342537 69870
38632 69870 -592473 -1149363 -1309882 -1068540 -409341 551162 1279132 1247117 598580 -75592
38622 -75592 -504750 -793429 -904798 -711307 -428364 -344679 -250860 149229 417973 -127316
38612 -127316 -1141479 -1485443 -891144 -356049 -552041 -881839 -641106 -142722 27469
38603 27469 46355 322130 589481 410805 87628 202013 599134 646285 249435 -145364
38593 -145364 -352882 -536205 -675711 -628481 -550020 -618593 -554116 -88000 341356 158142
38583 158142 -293041 -175499 444889 649031 193795 -74708 351296 832859 738098 467012
38573 467012 565449 582522 -209851 -1409694 -1847466 -1250477 -589160 -613273 -872717 -586538
38563 -586538 126005 448119 7229 -739340 -1220996 -1384360 -1448300 -1381539 -974438 -325780
38553 -325780 118856 133048 44328 293657 842553 1271653 1342605 1158393 824138 308148
38543 308148 -281808 -596465 -395650 181316 822797 1350346 1689590 1707529 1275198 457529
38533 457529 -455146 -1100575 -1268363 -1090323 -983468 -1238639 -1667765 -1826622 -1554452 -1077835
38523 -1077835 -645938 -394098 -538622 -1219703 -1987184 -1949970 -832574 453862 750995
38514 750995 -20076 -883506 -1014493 -478627 162361 494950 400824 -46836 -616597 -1052058
38504 -1052058 -1326434 -1630782 -2021374 -2231749 -1969376 -1327837 -777121 -707222 -1021346 -1271734
38494 -1271734 -1239119 -1206710 -1443370 -1598632 -1094721 -132721 327955 -98634 -529535 -22743
38484 -22743 993213 1273429 503904 -340291 -389115 137372 501710 358480 -151623 -713487
38474 -713487 -1022750 -1034653 -1084464 -1350147 -1328126 -527205 409598 242126 -1044750 -2013991
38464 -2013991 -1780754 -1157360 -1135451 -1317783 -888553 -265435 -483126 -1427155 -1990559 -1773148
38454 -1773148 -1401883 -1213785 -792303 45833 812090 1115389 1071469 844030 541268 537062
38444 537062 1009470 1216527 281946 -1272744 -1956493 -1404283 -747342 -616728 -274083
38435 -274083 639510 1025826 88563 -1088161 -1038652 -51657 546296 465721 362570 271609
38425 271609 -278791 -870434 -505877 636774 1175054 475518 -580836 -1049204 -1000962
38416 -1000962 -828071 -557834 -327314 -605705 -1408384 -2013662 -1900594 -1329977 -697775
38407 -697775 -50422 441284 350858 -204496 -389508 205214 905965 930864 373265 -253733
38397 -253733 -748032 -979102 -685832 -145122 -256337 -1181340 -1672198 -713832 857708
38388 857708 1507159 1164457 875035 712342 -265678 -1882455 -2403363 -935449 1087923
38379 1087923 1778990 1136019 452633 202592 -186363 -840825 -1079255 -634683 -138616
38370 -138616 -74179 -128227 29785 136375 32041 226593 1020027 1651665 1296185 553948
38360 553948 781252 1943069 2411112 1337975 22127 42178 1020480 1458322 1121099
38351 1121099 1086968 1646900 1798698 1147614 784682 1500570 2355084 2070077 947883
38342 947883 233537 187631 54250 -380501 -506655 -201590 -246483 -1097464 -2122725 -2463694
38332 -2463694 -1988885 -1044282 112415 1192173 1697291 1379082 626691 51049 -130831
38323 -130831 -96075 -80366 -272859 -770304 -1364598 -1586910 -1229862 -687268 -553223 -964518
38313 -964518 -1482421 -1565828 -1109761 -583435 -573275 -1050956 -1266841 -669228 278423 705856
38303 705856 617195 817921 1469542 1611514 617781 -633505 -847840 -124119 215043 -540439
38293 -540439 -1660977 -2077746 -1602835 -812552 -272260 -206825 -546628 -934785 -906725 -373436
38283 -373436 175353 170096 -387014 -911666 -849751 -227054 377529 382376 -219482 -826964
38273 -826964 -821581 -159399 659518 1078274 824060 -34727 -1069943 -1614573 -1265242 -340316
38263 -340316 421506 675574 725513 917571 1119276 993266 550107 194455 308871 878134
38253 878134 1404343 1218403 165164 -982611 -1183390 -360553 419031 227710 -694486
38244 -694486 -1504745 -1834127 -1774583 -1284852 -410636 172124 -237041 -1220268 -1600115 -1062625
38234 -1062625 -488851 -396249 -95386 972830 2000594 1878577 878730 198201 163200
38225 163200 -5808 -719938 -1395184 -1483083 -1214074 -1004571 -875770 -785673 -845549 -848444
38215 -848444 -256716 901294 1755338 1745529 1473249 1745394 2241346 1948556 723944 -387260
38205 -387260 -464121 271999 926506 983764 680469 580484 944624 1447839 1535256 1117283
38195 1117283 737750 889854 1383437 1650948 1482998 1139311 885144 768327 754135 744484
38185 744484 543716 119250 -200569 -107354 229147 429910 474571 548369 442132 -300091
38175 -300091 -1537051 -2369739 -2090684 -974532 76454 423813 100992 -398466 -579139
38166 -579139 -370814 -168744 -272950 -350760 182775 1224298 1878081 1519821 621091 201643
38156 201643 650225 1382605 1608691 1215690 827817 1036415 1649821 1877024 1327331 555049
38146 555049 332297 620846 717050 306791 -161177 -220078 -16172 -15230 -429679 -1087098
38136 -1087098 -1588248 -1544002 -979109 -502291 -673271 -1217205 -1380556 -1072548 -972868 -1339558
38126 -1339558 -1492890 -929697 -265793 -410992 -1256710 -1880433 -1811356 -1463152 -1413787 -1758519
38116 -1758519 -2122359 -1961483 -999915 300887 933917 394405 -690869 -1365808 -1459409
38107 -1459409 -1384247 -1163737 -441937 595823 1107553 632339 -309358 -902652 -901235 -579199
38097 -579199 -206541 133742 434498 712318 956028 1026690 748313 163978 -436455 -793190
38087 -793190 -887716 -902386 -1058247 -1393562 -1605426 -1312551 -629718 -162285 -134793 65823
38077 65823 925046 1734198 1342442 -82697 -1005797 -517267 509155 791189 381287
38068 381287 193014 327566 -1189 -917436 -1375674 -653275 464938 714786 94178
38059 94178 -261553 202170 756769 627553 143322 116076 638744 1205631 1670396 2250074
38049 2250074 2709633 2457864 1585768 935499 837296 640730 -28498 -431094 109512 940771
38039 940771 991181 447553 392015 994077 1255157 639893 -139268 -289070 38539 316682
38029 316682 438839 404737 -132480 -1349583 -2674244 -3307476 -3115413 -2577639 -2047158
38020 -2047158 -1455166 -646698 282716 969030 1046548 590521 243720 551417 1177653 1258331
38010 1258331 598270 -71165 -223624 -266214 -733776 -1358310 -1529403 -1250342 -986378 -834009
38000 -834009 -495717 39220 389421 360281 148949 -64339 -335297 -714468 -1093649 -1326766
37990 -1326766 -1287184 -874547 -215261 254895 235220 33251 255809 1010402 1708059 1722470
37980 1722470 1027337 131898 -432358 -504643 -309067 -153091 -111441 -36543 184482 564584
37970 564584 1169167 2015438 2741512 2745006 1872780 694631 -100345 -281186 86716 877605
37960 877605 1624157 1518474 315593 -1048082 -1373828 -606149 230246 356925 -87168
37951 -87168 -601220 -881303 -771508 -268925 284125 519968 642217 1151974 1880123 1959472
37941 1959472 1055748 15960 -157484 484204 1128470 1303820 1121058 679956 -96549
37932 -96549 -1018312 -1562012 -1447146 -974163 -632244 -591250 -726125 -956034 -1335594 -1831038
37922 -1831038 -2174329 -2049991 -1417875 -572397 155390 665487 957899 841690 51894
37913 51894 -1233542 -2212294 -2072083 -825501 601211 1169457 575598 -657344 -1746728
37904 -1746728 -2188181 -1888680 -1092544 -293543 21590 -203373 -519824 -540612 -467473 -751206
37894 -751206 -1304175 -1484980 -974562 -268465 -66748 -469929 -1023723 -1310673 -1240796 -966232
37884 -966232 -769506 -883162 -1214113 -1394988 -1234399 -883106 -450092 180931 957123 1493580
37874 1493580 1589792 1495141 1350002 866008 1665 -578413 -322798 382704 846890 1030311
37864 1030311 1115601 706142 -455623 -1376376 -756973 1012614 2129578 1776726 913369
37855 913369 412502 -112807 -998222 -1467633 -902443 -77677 67 -350891 -223131 308981
37845 308981 546884 504653 622999 591512 -197806 -1265534 -1483749 -851507 -475575 -663631
37835 -663631 -434859 671267 1626606 1462853 714288 440679 611256 410482 -368065
$$ [...]
##END NTUPLES=NMR SPECTRUM
##END=
