##TITLE=31Pdec_IBDPCO1202
 CDCl3, 24 sc
 13.2.2019
##JCAMPDX= 6.0         $$ Bruker NMR JCAMP-DX V2.0
##DATA TYPE= NMR SPECTRUM
##DATA CLASS= NTUPLES
##ORIGIN= UXNMR, Bruker Analytische Messtechnik GmbH
##OWNER= root
$$ XWIN-NMR		Version 3.5
$$ Wed Feb 13 13:57:44 2019 Russian Standard Time (UT+4h)  she@DPX200
##.OBSERVE FREQUENCY= 81.013821
##.OBSERVE NUCLEUS= ^31P
##.ACQUISITION MODE= SIMULTANEOUS
##.ACQUISITION SCHEME= undefined
##.AVERAGES= 24
##.DIGITISER RES= 17
##SPECTROMETER/DATA SYSTEM= spect
##.PULSE SEQUENCE= zgpg30
##.SOLVENT NAME= DMSO
##.SHIFT REFERENCE= (INTERNAL, DMSO, 0, 182.463)
##AUDIT TRAIL= $$ (NUMBER, WHEN, WHO, WHERE, WHAT)
$$ ##TITLE= Audit trail, XWIN-NMR		Version 3.5
$$ ##JCAMPDX= 5.01
$$ ##ORIGIN= Bruker BioSpin GmbH
$$ ##OWNER= she
$$ F:/spectra/data/she/nmr/P31/1/pdata/1/auditp.txt
$$ ##AUDIT TRAIL=  $$ (NUMBER, WHEN, WHO, WHERE, WHAT)
(   1,<2019-02-13 13:56:40.89 +0400>,<she>,<DPX200>,
      <created by zg, POWCHK disabled, PULCHK disabled
       configuration hash MD5:
       00 E9 B6 7A A2 85 ED C7 34 08 36 98 17 FE 4E 26
       data hash MD5: 32K
       2A 53 DA B8 C3 48 1A 8C 0C 4F 60 87 03 71 E1 77>)
(   2,<2019-02-13 13:56:53.70 +0400>,<she>,<DPX200>,
      <Start of raw data processing
       efp BC_mod = 2 LB = 1 FT_mod = 6 PKNL = 1 PHC0 = -1462.773 PHC1 = 22.79891 SI = 64K 
       data hash MD5: 64K
       60 3A 11 61 DF 84 E5 72 E1 99 BC 6C E6 FC 7B 8C>)
(   3,<2019-02-13 13:57:06.37 +0400>,<she>,<DPX200>,
      <pk PHC0 = 30.31338 PHC1 = 0 
       data hash MD5: 64K
       74 8D 04 C3 88 7B CD D7 4F DD 33 11 BA 54 0F 19>)
(   4,<2019-02-13 13:57:09.70 +0400>,<she>,<DPX200>,
      <abs ABSG = 5 
       data hash MD5: 64K
       9C CE 85 A6 00 A9 33 D7 18 CD 14 6B 42 37 BA 30>)
(   5,<2019-02-13 13:57:22.01 +0400>,<she>,<DPX200>,
      <abs ABSG = 5 
       data hash MD5: 64K
       DC AA 79 BC AB 36 C9 F2 6F AB F9 5C D3 3D E4 6C>)
$$ ##END=
$$ 
$$ hash MD5
$$ F6 0F C6 46 03 78 AE 41 06 83 2F B0 8C 82 3A A8
##$RELAX= 
##$RELAX= 
##$RELAX= 
##$RELAX= 
##$RELAX= 
##$RELAX= 
##$RELAX= 
##$RELAX= 
$$ Bruker specific parameters
$$ --------------------------
##$DU= <F:/spectra>
##$EXPNO= 1
##$NAME= <P31>
##$PROCNO= 1
##$TYPE= <nmr>
##$USER= <she>
##$AMP= (0..31)
100 100 100 100 100 100 100 100 100 100 100 100 100 100 100 100 100 100 
100 100 100 100 100 100 100 100 100 100 100 100 100 100 
##$AQSEQ= 0
##$AQ_mod= 1
##$AUNM= <au_zg>
##$AUTOPOS= <>
##$BF1= 81.014009
##$BF2= 200.13
##$BF3= 200.13
##$BF4= 200.13
##$BF5= 200.13
##$BF6= 200.13
##$BF7= 200.13
##$BF8= 200.13
##$BYTORDA= 1
##$CFDGTYP= 0
##$CFRGTYP= 5
##$CHEMSTR= <none>
##$CNST= (0..31)
1 1 145 1 1 1 1 1 1 1 1 1 1 1 1 1 1 1 1 1 1 1 1 1 1 1 1 1 1 1 1 1 
##$CPDPRG= <waltz16>
##$CPDPRG1= <>
##$CPDPRG2= <waltz16>
##$CPDPRG3= <>
##$CPDPRG4= <mlev>
##$CPDPRG5= <mlev>
##$CPDPRG6= <mlev>
##$CPDPRG7= <mlev>
##$CPDPRG8= <mlev>
##$CPDPRGB= <>
##$CPDPRGT= <>
##$D= (0..31)
0 1 0 0 0 0 0 0 0 0 0 0.03 2e-05 3e-06 0 0 0 0 0 0 0 0 0 0 0 0 0 0 0 0 
0 0 
##$DATE= 1550051800
$$ [...]
##$SUBNAM3= <"">
##$SUBNAM4= <"">
##$SUBNAM5= <"">
##$SUBNAM6= <"">
##$SUBNAM7= <"">
##$SUBNAM8= <"">
##$SUBNAM9= <"">
##$SW= 369.568048894756
##$SWIBOX= (0..15)
0 1 3 0 0 0 0 0 0 0 0 0 0 0 0 0 
##$SW_h= 29940.119760479
##$TD= 32768
##$TD0= 1
##$TE= 0
##$TE2= 300
##$TE3= 300
##$TEG= 300
##$TL= (0..7)
0 120 53 12 22 120 120 120 
##$TP= (0..7)
150 150 150 150 150 150 150 150 
##$TP07= 0
##$TPNAME0= <>
##$TPNAME1= <>
##$TPNAME2= <>
##$TPNAME3= <>
##$TPNAME4= <>
##$TPNAME5= <>
##$TPNAME6= <>
##$TPNAME7= <>
##$TPOAL= (0..7)
0.5 0.5 0.5 0.5 0.5 0.5 0.5 0.5 
##$TPOFFS= (0..7)
0 0 0 0 0 0 0 0 
##$TUNHIN= 0
##$TUNHOUT= 0
##$TUNXOUT= 0
##$USERA1= <user>
##$USERA2= <user>
##$USERA3= <user>
##$USERA4= <user>
##$USERA5= <user>
##$V9= 5
##$VALIST= <valist>
##$VCLIST= <CCCCCCCCCCCCCCC>
##$VD= 0
##$VDLIST= <DDDDDDDDDDDDDDD>
##$VPLIST= <PPPPPPPPPPPPPPP>
##$VTLIST= <TTTTTTTTTTTTTTT>
##$WBST= 1024
##$WBSW= 4
##$XGAIN= (0..3)
0 0 0 0 
##$XL= 0
##$YL= 0
##$YMAX_a= 34565
##$YMIN_a= -36286
##$ZGOPTNS= <>
##$ZL1= 120
##$ZL2= 120
##$ZL3= 120
##$ZL4= 120
##$ABSF1= 182.463
##$ABSF2= -187.1042
##$ABSG= 5
##$ABSL= 3
##$ALPHA= 0
##$AQORDER= 0
##$ASSFAC= 0
##$ASSFACI= 0
##$ASSFACX= 0
##$ASSWID= 0
##$AUNMP= <proc_1d>
##$AZFE= 0.1
##$AZFW= 0.5
##$BCFW= 0
##$BC_mod= 2
##$BYTORDP= 0
##$COROFFS= 0
##$CY= -3
##$DATMOD= 1
##$DC= 0
##$DFILT= <>
##$DTYPP= 0
##$F1P= 0
##$F2P= 0
##$FCOR= 1
##$FTSIZE= 65536
##$FT_mod= 6
##$GAMMA= 0
##$GB= 0
##$INTBC= 1
##$INTSCL= 5.30512e-09
##$ISEN= 30
##$LB= 1
##$LEV0= 0
##$LPBIN= 0
##$MAXI= 10000
##$MC2= 0
##$MEAN= 0
##$ME_mod= 0
##$MI= 50
##$NCOEF= 0
##$NC_proc= -3
##$NLEV= 6
##$NOISF1= 182.463
##$NOISF2= 159.3651
##$NSP= 0
##$NTH_PI= 0
##$NZP= 0
##$OFFSET= 182.463
##$PC= 4
##$PHC0= -1432.46
##$PHC1= 22.79891
##$PH_mod= 1
##$PKNL= yes
##$PPARMOD= 0
##$PSCAL= 0
##$PSIGN= 0
##$REVERSE= no
##$SF= 81.0140089999434
##$SI= 65536
##$SIGF1= 159.3651
##$SIGF2= -187.1042
##$SINO= 113.3802
##$SIOLD= 16384
##$SREGLST= <1H.CDCl3>
##$SSB= 0
##$STSI= 65536
##$STSR= 0
##$SW_p= 29940.119760479
##$SYMM= 0
##$S_DEV= 0
##$TDeff= 32768
##$TDoff= 0
##$TI= <>
##$TILT= no
##$TM1= 0
##$TM2= 0
##$TOPLEV= 0
##$USERP1= <user>
##$USERP2= <user>
##$USERP3= <user>
##$USERP4= <user>
##$USERP5= <user>
##$WDW= 1
##$XDIM= 65536
##$YMAX_p= 344238986
##$YMIN_p= -3128975
$$ End of Bruker specific parameters
$$ ---------------------------------
##NTUPLES= NMR SPECTRUM
##VAR_NAME=  FREQUENCY,     SPECTRUM/REAL,   SPECTRUM/IMAG
##SYMBOL=    X,             R,               I
##VAR_TYPE=  INDEPENDENT,   DEPENDENT,       DEPENDENT
##VAR_FORM=  AFFN,          ASDF,            ASDF
##VAR_DIM=   65536,         65536,           65536
##UNITS=     HZ,            ARBITRARY UNITS, ARBITRARY UNITS
##FACTOR=    0.456856943014862, 1,           1
##FIRST=     14782.0589164792, 0,            0
##LAST=      -15158.0608439998, 0,           0
##MIN=       -15158.0608439998, -3128975,    0
##MAX=       14782.0589164792, 344238986,    0
$$ Real data points
##PAGE= N=1
##DATA TABLE= (X++(R..R)), XYDATA
$$ [...]
42387c49218p6996j3309R5964J23462P9530J08369K31472K43845K2375k07829
42377B57665j51714J06698K11419N0309j33740j57350j09490q0362P623J57520
42367A58578J72065l1883k16105j50260M2461J02027K7163m773J7931l6652j52572
42356g2020j82661j28227j28277j69674q3517J32350K59123K01841J28110J51648
42346A08696J33853l5043j89299j39846Q650L8354k2047J0414J10353P4151j02592
42335d356j76692m5223Q7810M6743m6688k645J17694J08727n9665k13687k13685
42324d01667p3371J11068K15789J24982j33630l14793j80237J87054M35749L50567
42314C21511P9977r2060q4520l5725n2902p1144J1065J32925J06670j16267l05794
$$ plain form
42387 -349218 -426214 -439523 -343559 -220097 -140567 -32198 199274 443119 465494 257665
42377 257665 105951 212649 424068 474377 340637 183287 73797 -6565 1058 158578
42367 158578 330643 298760 82655 -67605 -25144 76883 104046 99273 117204 80552 -72020
42356 -72020 -254681 -382908 -511185 -680859 -764376 -632026 -372903 -171062 -42952 108696
42346 108696 242549 207506 18207 -121639 -112989 -74635 -96682 -86268 24085 98236 -4356
42335 -4356 -181048 -226271 -138461 -91718 -138406 -141051 -23357 85370 25705 -187982 -401667
42324 -401667 -475038 -363970 -148181 -23199 -156829 -471622 -651859 -464805 -29056 321511
42314 321511 401488 309428 224908 189183 136281 65137 76202 209127 315797 199530 -106264
42303a06264k11054P0132J70405m0664k46105j36282J27258J65213l4935j24232
42293c66528M4019K10479J52238R073N857J04812J32826O4769j6970r3681j54700
42282I2194j05953P8163K25249J66880k8072j77783k23703j81084r760K47188
42272H3319L40006J02058k27120k57089J9831K34024J60586n1162j84923k07509
42262A2021j57238m9649K3997n6718k11718k02780J4011K08640K31618J93220
42252E404J80228P6391j57147k87750j39640R3463J31428L7846P3276K30960K40239
42241D84698J3463k03537j85163j0993Q6016P686j46441k08080q7210J43041K94340
42230A87820K46775O5719j05569k00430k06573r6150R0243J82448P9740n0996
$$ plain form
42303 -106264 -317318 -247186 -76781 -117445 -363550 -499832 -372574 -207361 -242296 -366528
42293 -366528 -322509 -112030 40208 49281 55138 159950 292776 357545 340575 246894 92194
42282 92194 -13759 64404 289653 456533 428461 250678 26975 -154109 -163869 83319
42272 83319 423325 525383 298263 41174 61005 295029 455615 404453 219530 12021
42262 12021 -145217 -194866 -170869 -227587 -439305 -642085 -628074 -419434 -187816 5404
42252 5404 185632 262023 104876 -182874 -322514 -229051 -97623 -59777 13499 244459 484698
42241 484698 498161 294624 109461 98468 184484 192170 45729 -162351 -249561 -106520 187820
42230 187820 434595 500314 394745 194315 -12258 -108408 -18165 164283 244023 193027
42220A93027J8442J98419J50220k12148n20833m00781L4997L19535K02151q8135
42210a05106j72979J4348K01273J66001J4446j4668P9934P2654j03930k06774
42200e4801m2331K01212J91458p6726k78977k03117K6623J84523J99466J19794
42190B67124l921j14387j46440j01718l9530K7888J20389J68583O8906j04235
42180A42659j25112N8634K02466R6663j24311j70194M608J68766J42631o084j06598
42169B84128r8924n7155o2607r8507p3776M2811J40430Q7242p1957j42951l7686
42158h8952J08166J29491L2826p2507j32328j36254n4233Q7900J53229N5461q3833
42147a034q1296N1206J39856J02571J7006m2234p2428n1360N2888J54547J01023
$$ plain form
42220 193027 211469 409888 560108 347960 -172873 -573654 -538657 -219122 -16971 -105106
42210 -105106 -278085 -263737 -62464 103537 117983 103315 183249 255903 151973 -54801
42200 -54801 -97132 104080 295538 218812 -60165 -263282 -236659 -52136 147330 267124
42190 267124 263203 148816 2376 -99342 -138872 -110984 9405 177988 246894 142659
42180 142659 17547 76181 278647 375310 250999 80805 85413 254179 396810 390726 284128
42169 284128 185204 128049 65442 -33065 -106841 -64030 76400 163642 91685 -51266 -88952
42158 -88952 19214 148705 181531 109024 -23304 -159558 -213791 -125891 27338 82799 -1034
42147 -1034 -82330 -31124 108732 211303 228309 186075 113647 62287 115175 269722 370745
42136C70745r1392k08784j30709q703l7277j59632j53701L9727K29539K32027
42126H1840R9394K6177Q6569J55343J06034K026j1277K9797p2956l24871m01787
42115b23711p4656L65069M07842K5762k71427j56276R6787J04200n3489p5281
42105A44820K347q1943k75184k53801n936R8203o7742j39553J26963L99075K70853
42094B18102p5655j45967R5777J97214n8092l33244k61966N1010K39180J53095
42084G9454n9836k02748j86971l8361J18894J46226M4754l7944m235Q4378J40037
42073H3648J68437J87756J54003N6076k8278n9383j00678j66018j38796L2482
42063A89249J86560J49408j9543j34281j43773j27886j16512q3515n4672n5813
$$ plain form
42136 370745 279353 70569 -60140 -68843 -106120 -265752 -419453 -379726 -150187 81840
42126 81840 181234 207411 293980 449323 555357 557383 546106 575903 502947 178076 -223711
42115 -223711 -298367 66702 474544 500306 228879 72603 169390 273590 220101 144820
42105 144820 147167 65224 -209960 -463761 -469697 -371494 -439236 -578789 -451826 -52751 218102
42094 218102 142447 -3520 92257 289471 231379 -101865 -363831 -312821 -73641 79454
42084 79454 19618 -183130 -370101 -408462 -289568 -143342 -98588 -136532 -140767 -56389 83648
42073 83648 252085 439841 593844 649920 621642 562259 461581 295563 156767 189249
42063 189249 375809 525217 505674 371393 227620 99734 -16778 -100293 -154965 -210778
42053b10778j7285J05417J93125J31498L6924R0325K06971J34334j32911l06547
42043B31073k14003q148R6708P5937P227o1240p4196J2082J04790N2800r7324
42032A25706j30477l035Q1446J2167o8663n0036k7016n2036R658J91213K61937
42021C50864Q1311j31436j32056k1905j0359l7389M6894J29110J9830j60661j54695
42010b0492l996N9321M5991J30664K29327J00604j67152k32674p5963j9684j27057
41999h1111r0121J55245K32949k6849k46534j19774Q3207J5077j43237l8065K06256
41988e2957K01117m1435j64196p3520p043l9346J0174J51266J42444p1669k19270
41977a64435j24013M5411P9047P030n1870q0294p4277J6567J41086J40846J351
$$ plain form
42053 -210778 -228063 -122646 70479 201977 238901 329226 536197 670531 537620 231073
42043 231073 17070 8922 105630 181567 188794 127554 53358 65440 170230 223030 125706
42032 125706 -4771 -7806 73640 85807 17144 -32892 -59908 -111944 -102286 88927 350864
42021 350864 432175 300739 168683 146778 136419 99030 145924 275034 294864 134203 -20492
42010 -20492 -24488 34833 80824 211488 440815 541419 374267 141593 65630 45946 -81111
41999 -81111 -171232 -15987 216962 190113 -56421 -176195 -92988 -77911 -221148 -259213 -52957
41988 -52957 148160 106725 -57471 -130991 -138034 -177380 -167206 -15940 126504 54835 -164435
41977 -164435 -288448 -243037 -163990 -156960 -208830 -289124 -363401 -346834 -205748 -64902 -63551
41966f3551q9672l4404L8984L9881P4358J90021K06229J0832j82617j28579N8469
41955A19951Q2324p3972j59654q0488j4614p9395j46967p5714P8075J79668J91706
41944B0920J37408K0995j15035j58492n5402J00318J81898J68535J06308J1192
41934D18645j04243j69969j18319K3715J63337K25260J63833k9914k55929l23280
41924f864j58530O2168J19799M0738J8874Q6013P2861p0887j49799l2823J09526
41913I1076N6748j19795j81643r8922o2149j40510j65277p639K16326L10033K38633
41902A36881J20362O1610P0097P9694K7459n9166p6174m463J5481j05178k04219
41891F2384q3831J31874J28024j04425k16527l5139J72178J34962k0541m8994
$$ plain form
41966 -63551 -153223 -187627 -148643 -108762 -34404 155617 361846 372678 190061 61482 119951
41955 119951 202275 128303 -31351 -111839 -126453 -205848 -352815 -428529 -350454 -170786 20920
41944 20920 158328 179323 64288 -94204 -149606 -49288 132610 301145 407453 418645
41934 418645 314402 144433 26114 49829 213166 438426 602259 572345 316416 -6864
41924 -6864 -165394 -103226 16573 57311 76185 162198 235059 164172 14373 -18450 91076
41913 91076 147824 28029 -153614 -252536 -314685 -455195 -620472 -628111 -411785 -101752 136881
41902 136881 257243 318853 388950 468644 496103 436937 360763 356300 371781 266603 62384
41891 62384 -21447 110427 238451 134026 -82501 -117640 54538 189500 168959 119965
41881A19965M049l0638q3292Q458J40405Q5935r4150j41858m6518l7567j49064
41870b24275j61124j2661Q6717L9295J6193J16310J82801J02212j528k5008n9005
41859E9927j36736r0900J28521K59820J08009j10292q8858Q4390Q5960j18790
41849A81051k45114j51612k5163n4702j60127j44122K9677K01500K00344K5555
41839a42713j44234j45443k5197M2451K7670P0670J96754K15892K6774j78641
41829e6017j87118p1453l1024p4550p7270k8725K779M8737J55649K15342J13784
41818A0134l4261m0190M5321K7691q7675j18020k8975M0543O2295J44698K62744
41807B84305K39904M6210j31895j69241j28506p9536j9352J553r0779k07120j75361
$$ plain form
41881 119965 124014 93376 10084 18542 158947 244882 150732 8874 -37644 -75211 -224275
41870 -224275 -385399 -398060 -311343 -272048 -255855 -139545 43256 145468 143940 118932 59927
41859 59927 -76809 -167709 -39188 220632 328641 218349 129491 213881 299841 181051
41849 181051 -64063 -215675 -240838 -295540 -455667 -599789 -570112 -368612 -168268 -142713
41839 -142713 -286947 -432390 -457587 -415136 -387466 -316796 -120042 95850 122624 -56017
41829 -56017 -243135 -314588 -345612 -420162 -497432 -526157 -523378 -474641 -318992 -103650 10134
41818 10134 -24127 -64317 -18996 8695 -78980 -197000 -225975 -185432 -123137 21561 284305
41807 284305 524209 570419 438524 269283 140777 61241 41889 43442 -47337 -254457 -429818
41796d29818k9825L2657Q76N8954K07272K05192o977j58024p0469O7742L9833
41785h2587o7975p7919j7030J7095O6860J65650J76581J4021j43738r7163O0226
41774A4021R2279l4238j59432j82194j19411p711J00311J36992J28330J71387
41764A40334K19059Q7665k06436l61805k09971K8516J00452P1942R3488Q8702
41754E1946l1302r8012L5748J71082P0727j18319j28341n0720j24066k26633p2761
41743e20651K01101J77418j43590l06360j04478J61394K13181J31451N3890l7320
41733a73964r8616J0516K13167K30419K5007j33437j33326j48139k07569j02197
41723e18139J39791J70736p2637j80386M3568K07002l549k61343j50222J41098
$$ plain form
41796 -429818 -459643 -426986 -426110 -367156 -159884 45308 38331 -119693 -190162 -122420 -82587
41785 -82587 -150562 -228481 -245511 -228416 -161556 4094 180675 194696 50958 -46205 14021
41774 14021 106300 72062 -87370 -269564 -388975 -396686 -296375 -159383 -31053 140334
41764 140334 359393 447058 240622 -121183 -331154 -302638 -202186 -130244 -36756 51946
41754 51946 20644 -77368 -41620 129462 200189 81870 -46471 -97191 -221257 -447890 -520651
41743 -520651 -319550 -142132 -285722 -592082 -696560 -535166 -321985 -190534 -136644 -173964
41733 -173964 -272580 -262064 -48897 181522 206529 73092 -60234 -208373 -415942 -518139
41723 -518139 -378348 -207612 -280249 -460635 -417067 -210065 -213614 -474957 -625179 -484081
41713d84081J86014M0444M1692J44289M3559j90005j81243R4073K54734J32697
41703H2173k2643j0936O4164Q0730P9292Q1670L5950j0554L3894P3700m8409k10991
41691B28040j46491Q5505J44592k7783j06660M6826J37216m5428k41340j38581
41681f4104J21007J73893j9902j75321j24276J3177P1710M8951M8734J25761K07957
41670D27587J60349l1289j72660q1389J25248J48557o3698k23415j14430J09847
41660B84707J66257R910j74358k17778q7294J23176K25418Q4028j85381k99407
41650g0722j60779L1238R9050J12136J72723J90590N7414j25334j93867j59937
41640d7488j10287j1408J68302K72495J46124p5201j22721R812Q3843L024q2778
$$ plain form
41713 -484081 -298067 -257623 -215931 -71642 -28083 -218088 -399331 -305258 -50524 82173
41703 82173 59530 48594 112758 193488 272780 354450 390400 379846 413740 487440 439031 228040
41691 228040 81549 167054 311646 283863 177203 224029 361245 315817 74477 -64104
41681 -64104 56903 230796 210894 35573 -88703 -75526 -3816 45135 93869 219630 427587
41670 427587 587936 556647 383987 302598 427846 576403 512705 289290 174860 284707
41660 284707 450964 460874 286516 68738 -18556 104620 330038 414066 228685 -70722
41650 -70722 -231501 -200263 -101213 10923 183646 374236 431650 306316 112449 -47488
41640 -47488 -157775 -169183 -881 271614 417738 342537 219816 229628 313471 316495 233717
41629B33717p5233o4836j02513p3787Q1818K13765J61223k0395j57913j81364
41619A4482j31410m0090O6645J10321L8106o5072o3613K9814N8718m3225j33774
41608a59098n6680J23328J97365R6571l3968o5661m6415n3827l1663Q1241J66042
41597B17235O5632j38706k08344r9574q163l1948l7245N1839Q7173k2738r5839
41586b20678M1287K32448K06292o407j30486n3620P7288J34306J35011Q6995n4570
41575D47866k22706k34985l7180J89529K30988N1962k12843l75412l08107o2425
41565e33313J36241J34194N1190Q8288K00501J80735L0483l3445L3126J5227j59893
41554A43334k43165o7381J41577J03990p6856j03904L8107J06966K1825n7198
$$ plain form
41629 233717 158484 93648 -8865 -82652 -834 212931 374154 353759 195846 14482
41619 14482 -116928 -157018 -90373 19948 58054 -7018 -70631 -40817 17901 -25324 -159098
41608 -159098 -215778 -92450 104915 201486 167518 101857 55442 1615 -30048 51193 217235
41597 217235 282867 144161 -64183 -163757 -171920 -203868 -241113 -189274 -102101 -124839 -220678
41586 -220678 -179391 53057 259349 252942 122456 68836 146124 280430 415441 502436 447866
41575 447866 225160 -9825 -47005 142524 373512 425474 212631 -162781 -470888 -533313
41565 -533313 -397072 -262878 -211688 -123400 77101 257836 288319 254874 288000 303227 143334
41554 143334 -99831 -167212 -25635 78355 1499 -102405 -64298 42668 64493 7295
41544G295n4619q2717j69207j56108K0674J73567J27536k4236p7759m358P3020
41533a66912R2202P8704K3827r2897j79575j00574J02553K09985J07853n5547
41523A9619r1904l6805m8426j16946p0339J17128K20972P5531j61937k13950o0944
41512c68001O6388M1061j4890K1415P0815J3703q0764m7454J10506K06841J25636
41501A45256l4940j09656o5729%M450m4713r0448q8218k8324N8857J09020P3561
41489g0884j3738n2521N732Q5196Q5524K7640J5634O0348N6918k8314q1323l2550
41477E7662J0344m2968o6823Q0741K49098J57251j40345k50638j670K73323J96295
41466E22270j33146l18865k21033n1271J5378L9041J00179J25577K5839j39198
$$ plain form
41544 7295 -47324 -130041 -299248 -455356 -434682 -261115 -133579 -157815 -235574 -239932 -166912
41533 -166912 -74710 3994 27821 -65076 -244651 -345225 -242672 -32687 75166 19619
41523 19619 -72285 -109090 -157516 -274462 -344801 -227673 -6701 68830 -93107 -307057 -368001
41512 -368001 -301613 -260552 -275442 -254027 -183212 -169509 -250273 -297727 -187221 19620 145256
41501 145256 110316 660 -65069 -65069 -60619 -105332 -195780 -283998 -312322 -253465 -144445 -70884
41489 -70884 -84622 -137143 -131411 -46215 39309 66949 82583 142931 199849 171535 90212 57662
41477 57662 68006 25038 -41785 38956 288054 445305 304960 54322 52652 325975 522270
41466 522270 389124 70259 -150774 -202045 -186667 -147626 -47447 78130 103969 -35229
41456c5229k25074j58968Q017J43645J30461p405r5402j5444J21030J28256K5154
41445A9041r707O1276Q4815o370p9092l6889K5630J1941j2162K7199N4962p620
41433A33024q2009p2600l5529m1880r513J29226K18139P8558j66743k36277j07794
41422a93398j2917k9203J3489J71707K48793J37664J8735M4299P5529n2215k12430
41411B10053j86160k1727O6395M6027M5182N9942k6337j54766j17063Q4060J69776
41400A75382j5177k55902k58116k6849J87106K10588Q8967k6790l0723N6881R7442
41389B02809k4450k31385l04625j48858Q4460J92674J47040N5595m611k7517k0432
41378g9300j389j4770p7216j37620j36277o5721M9482J68471K12272J23049k0641
$$ plain form
41456 -35229 -260303 -419271 -411254 -267609 -137148 -144553 -239955 -255399 -134369 -6113 19041
41445 19041 9334 70610 155425 149055 69963 33074 58704 70645 58483 85682 140644 133024
41433 133024 51015 -21585 -57114 -98994 -108507 20719 238858 317416 150673 -85604 -193398
41422 -193398 -206315 -235518 -222029 -50322 198471 336135 354870 399169 474698 422483 210053
41411 210053 23893 2166 68561 114588 159770 219712 193375 38609 -78454 5606 175382
41400 175382 160205 -95697 -353813 -380662 -193556 17032 105999 79209 48486 105367 202809
41389 202809 178359 -53026 -357651 -506509 -422049 -229375 -82335 -26740 -31351 -58868 -79300
41378 -79300 -80689 -95459 -172675 -310295 -446572 -512293 -462811 -294340 -82068 40981 20340
41367B0340o0918J6879M8041n2049j38224o1151R3704J45221Q4746L4761K5639
41356A56989j824k8035K4438J29680J85760J75060J38776M2781j37741k48196
41346D37688j13302J35944J63485q6914k80241j79115K0456K8628r0269o7456
41336c1096J16043K12383R8583p7238j61193j76723j75336j00312P8980K29471
41326A3562J97231K7069r2123q1786m9998r3421j41422p8342N4733J01126J8015
41315a25356o0019k5175N1229N4682K1747O9649J78938J95838O2878q6927j18006
41304B19478o8638o2443j14396j19252j5788J15603J46493N7001m3668o2224m3025
41293I141q7597j77139j78345n0692P0524P1639K9008O7341J46440J36992M2738
$$ plain form
41367 20340 -40578 -23699 24342 -27707 -165931 -227082 -133378 11843 96589 131350 156989
41356 156989 155165 127130 151568 281248 467008 642068 780844 823625 685884 437688
41346 437688 324386 460330 623815 536901 256660 77545 98001 126629 36360 -31096
41336 -31096 84947 297330 395913 318675 157482 -19241 -194577 -294889 -215909 13562
41326 13562 210793 237862 145739 63953 13955 -79466 -220888 -299230 -244497 -143371 -125356
41315 -125356 -185375 -210550 -159321 -104639 -82892 -13243 165695 361533 424411 337484 219478
41304 219478 150840 88397 -25999 -145251 -161039 -45436 101057 158058 114390 52166 9141
41293 9141 -78456 -255595 -433940 -484632 -414108 -342469 -313461 -246120 -99680 37312 80050
41282H0050j8650k1251m7583j08251j10890k5521O3934R0910O2266j1950j06816
41271a53752j20164J3221J62426J45867K4518K4742J58268J83218O662j49363
41261B95643j03227K1537M0315k0113o8236j39898k39013j99285N2524K72770
41251h6983K03153m1892j52391o7347L0837O5154J11212J54340R8911M197K4600
41240C43791J05497K3142k28297l69975k51878q0893r5026k10350j70180P1866
41230h62303K88658K68564O0314q5738J576K02855K31301K685k19084j55226J06653
41219a59745K34119R2965j27794k12901j40094Q264J52157J93183P3605q7595
41209B6164q7928P0441J55769M0775j10015q8797O6927J54981P1911j12673k65031
$$ plain form
41282 80050 61400 40149 -7434 -115685 -226575 -252096 -188162 -97252 -34986 -46936 -153752
41271 -153752 -273916 -260695 -98269 47598 72116 96858 255126 438344 445006 295643
41261 295643 192416 213953 254268 234155 165919 26021 -212992 -412277 -359753 -86983
41251 -86983 116170 74278 -78113 -145460 -114623 -49469 61743 216083 314994 319191 343791
41240 343791 449288 472430 244133 -125842 -377720 -458613 -553639 -763989 -934169 -862303
41230 -862303 -573645 -305081 -244767 -330505 -328929 -126074 105227 107912 -111172 -266398 -159745
41219 -159745 74374 167339 39545 -173356 -313450 -305186 -153029 40154 113759 26164
41209 26164 -61764 8677 164446 205221 95206 6409 73336 228317 300228 187555 -77476
41198g7476k84204j59776K919Q1465Q8561J26246J72850P9045j51060k57535n8474
41187d37439K45730L00509O5791j49662j20670L2299Q7532N1800Q4468J83194
41177C43552J56453o1184k57138k24532n7479J2421k4749M874J03511P1522j18101
41166e0850k12526p9771O0607Q90j15444o2109Q7945J32812R7456J06296P8976
41155D4282r4631k30577r6604J37030J21947p6627q1243J40522K26292N5508q7288
41144E8611p4591j22061k57860j62118K15474M13630J67507j30957p0429J33119
41134A70325P9485j25411j36763r604k5912j22827m4968J05042K1286k10621k18470
41123e18438J0349J19267J5314j0547J48108K21735O1396j14906j24806q5880
$$ plain form
41198 -77476 -361680 -521456 -518537 -437072 -348511 -222265 -49415 29630 -121430 -378965 -437439
41187 -437439 -191709 108800 174591 24929 -95741 -63442 24090 75890 160358 343552
41177 343552 500005 438821 181683 -42849 -100328 -87907 -112656 -107782 -4271 67251 -50850
41166 -50850 -263376 -343147 -282540 -281650 -397094 -459203 -371258 -238446 -140990 -34694 44282
41155 44282 -50349 -280926 -377530 -240500 -118553 -195180 -276423 -135901 90391 145899 58611
41144 58611 -15980 -138041 -395901 -558019 -342545 71085 238592 107635 37206 170325
41134 170325 249810 124399 -12364 -21968 -47880 -170707 -215675 -110633 -89347 -299968 -518438
41123 -518438 -508089 -388822 -373508 -384055 -235947 -14212 47184 -67722 -192528 -278408
41113b78408j17525j21936k8395M5982L6247N7832J56604J93437J06414K8294
41103G8546K0741l8111j69054j77788P035J49908O3060q9633o1297J01738J78802
41092F3947J18394M3374J7396k600m6497j01838j46059j28281j0716J19435J13826
41081D0381p837n5878M2420J44716J51896J37681J20998k6873k85450l65809j26519
41070b30274J25876M7049k15337k38514L8826K55448J82607j446n5716l970J1901
41059h3550n230M4156J53495J95500Q5796j05975k10247j26117M8145R9928l4746
41048F1155j64360r1124J01214J52223o007j48710o9702J44580K43871J35730
41038C58870l1846r2090o1423o9487j45776j74634p8832N0975Q4829L5492N042
$$ plain form
41113 -278408 -395933 -517869 -546264 -500282 -464035 -406203 -249599 -56162 50252 78546
41103 78546 99287 61176 -107878 -285666 -278631 -128723 -65663 -155296 -216593 -114855 63947
41092 63947 182341 225715 243111 240511 194014 92176 -53883 -182164 -192880 -73445 40381
41081 40381 32544 -23334 19086 163802 315698 453379 574377 547504 262054 -103755 -230274
41070 -230274 -104398 -57349 -272686 -511200 -472374 -216926 -34319 -35765 -91481 -95451 -83550
41059 -83550 -88780 -44624 108871 304371 390167 284192 73945 -52172 -4027 95901 61155
41048 61155 -103205 -194329 -93115 59108 53101 -95609 -165311 -20731 223140 358870
41038 358870 327024 234934 173511 104024 -41752 -216386 -295218 -244243 -159414 -123922 -118880
41027a18880J0114l95K617Q0348J42702K6221k07512k81566j02677Q2128P1427
41016b95473J9142J41805L15507K56470j1127j82527j35805o5202j17692j76875
41006b51777j07484J5460N9815M8422P2120J12573R5529L9476J8526K7253K76
40995A30189o0626q2976m0805J0572K5133K3404L8987N6342L1116m7630j34260
40984e0554j61124r7296J4870Q5480N9866j9659n4984m374P1213R3686O9123N9586
40972F5833P5409O4295J1195k8787k4393j6852l1110j9690M3252R3601P9663M7612
40960C60028L2701l3041j71749k20499l2388K40692K83987L5925k35373k89050
40950b8767j47651M6239J93689K07383L6335j86362k17578k6988J33837P7218
$$ plain form
41027 -118880 -108766 -109161 -106544 -26196 116506 142727 -64785 -346351 -449028 -366900 -295473
41016 -295473 -276331 -134526 180981 437451 426324 243797 107992 42790 -74902 -251777
41006 -251777 -359261 -343801 -283986 -235564 -163444 -50871 44658 84134 102660 129913 130189
40995 130189 69563 -13413 -54218 -43646 -18513 4891 43878 100220 131336 83706 -50554
40984 -50554 -211678 -308974 -294104 -208624 -148758 -168417 -223401 -227775 -156562 -62876 6247 65833
40972 65833 141242 205537 216732 187945 163552 146700 115590 95900 139152 232753 312416 360028
40960 360028 392729 359688 187939 -32560 -64948 175744 459731 495656 260283 -28767
40950 -28767 -176418 -130179 63510 270893 307228 120866 -96712 -123700 10137 87355
40940H7355r3679j94435j84013p3122J49439L48936K62280j04058l37875j49188
40930b88360J81949K01262n4177j58532L6159K34991K00533M8424l3055n0370
40920C18824p4289p9300l6553K073L570M260J5550J0752J7140P4449J13009M6677
40908D16162l5520J7878J31354P9718j26951k21259j11103l2878j35545k05074
40898b23218k1173K49845K91100J06827k6273M855M2123k5825r3560n0447L0607
40887B84861K4016m4708m3942N7528J30275N2036j22528k17727j52218k7821K4742
40876c5486Q654r81m434m4613p5819j2947R5201R1754o1803k17422k35898j31142
40864f24936J3547J44073K04108J37652o209q1896l0133M7652N6446L5985M9058
$$ plain form
40940 87355 -6324 -200759 -384772 -457894 -308455 40481 302761 198703 -139172 -288360
40930 -288360 -106411 94851 40674 -117858 -81699 153292 353825 402249 369194 318824
40920 318824 244535 165235 128682 130755 134325 138585 154135 164887 182027 256476 369485 416162
40908 416162 380642 398520 529874 609592 482641 261382 150279 117401 -18144 -223218
40898 -223218 -244391 5454 296554 403381 377108 381963 424086 398261 304701 254254 284861
40887 284861 308877 264169 220227 277755 408030 460066 337538 119811 -32407 -60228 -35486
40876 -35486 -26832 -27813 -32247 -76860 -152679 -165626 -70425 21329 -40474 -257896 -493794 -624936
40864 -624936 -611389 -467316 -263208 -125556 -131765 -213661 -243794 -196142 -139696 -103711 -54653
40853e4653N7000N785n6041n2292m475J9093K9193R1757K00327K51973J57796
40842F45463n0576k22998k17253o2629M1538l0618j40067o8505J40011K14148
40832B48514N3035j24387j13065l81L2415J2940Q3748K13327K18395N0251j25102
40821E49690j62666j22421j56296k77439l15078j23441J87296L15550J32469j08624
40811h0960q0932J53009K12724m5928l05914k34633P3859K82340K59992J34461
40801C68018J3537j12701k27747k36513q0495J81052L87681L53441M0681k94504
40791C92450l08505k1193J55577K611j48807P4309M46300M25200k4002l55157
40781F38783k37526K2581L1992j11352q6203Q6946J19680l2420j01172L7111J48125
$$ plain form
40853 -54653 2347 8132 -47909 -100201 -104676 -85583 -56390 35367 235694 487667 645463
40842 645463 594887 371889 154636 92007 133545 102927 -37140 -105645 34366 248514
40832 248514 301549 177162 64097 63716 96131 109071 192819 406146 624541 674792 549690
40821 549690 387024 264603 108307 -169132 -484210 -607651 -420355 -104805 27664 -80960
40811 -80960 -161892 -8883 203841 157913 -148001 -382634 -308775 -26435 233557 368018
40801 368018 381555 268854 41107 -195406 -275901 -94849 292832 646273 686954 392450
40791 392450 83945 62752 218329 220940 72133 146442 592742 1017942 993940 638783
40781 638783 401257 423838 455830 344478 258275 345221 464901 432481 331309 368420 516545
40770E16545N361k47549k85855n1476J81718J81344K1934q6094q7551p0245n4622
40759B3510K2481J31424J43744M2943k5169K4032J01392J30689J68331K23715
40749I87092J53195r2198k84150k05993M197M7243r3558j74975j11830p9851j77537
40738b8365k54723j62539K8218J45788J08643m6871j90864j43374J39724M19862
40728A5499M05151J38121n6151l0173K1916p7034k18609k18363p8635Q8136K11747
40717B01605K25422P1072j36302j57459K2547J16382l5721k00888j31579L3914
40707H993L2375o8696k1389J34477J32779m5737j40638o4675k4427j15546j43441
40696c15925J5004J75959J60533Q6935J32621K13111J49415N561j7255N5091n721
$$ plain form
40770 516545 521906 274357 -11498 -62974 118744 300088 322022 235928 148377 78132 23510
40759 23510 45991 177415 321159 364102 338933 362965 464357 595046 763377 987092
40749 987092 1140287 1048089 763939 557946 562143 609386 515828 340853 229023 149172 -28365
40738 -28365 -283088 -445627 -417409 -271621 -162978 -209849 -400713 -544087 -404363 15499
40728 15499 420650 558771 502620 472447 494363 417329 198720 -19643 -98278 -10142 201605
40717 201605 427027 498099 361797 204338 226885 343267 307546 106658 -24921 8993
40707 8993 41368 -27328 -48717 85760 218539 172802 32164 -32511 -56938 -172484 -315925
40696 -315925 -300921 -124962 35571 122506 255127 468238 617653 623214 605959 661050 655329
40685F55329k37456l78556k37000L0176J38216M6865m1195O292R8575R9278K4497
40674B05021j9596k2986p4787j81181k03754n2918J39700J58783r039j46716q3314
40663b90787J06519K25283J83966M6636q0692j26934p5860J0936L0747l2814p1011
40652g4011j2850M8166L200p5475n4933K048o5242j68222k1884L48529M76002
40641D05328Q2266m14797l92215J14508M55433K57589j55488l30834k55707j47925
40631c81842m1522J04736J54782J0651j01849O4920L18213K62874o0276k04092
40621A26595j2550J52617K3018j54594o9637J12476K3307k85951l83602q8853
40611e57174K62208K65027m9360k80005j34581K52844M82378L40204L9707n8292
$$ plain form
40685 655329 417873 39317 -197683 -167507 -29291 17574 -23621 -17329 81246 180524 205021
40674 205021 185425 162439 87652 -93529 -297283 -350201 -210501 -51718 -60757 -207473 -290787
40663 -290787 -184268 41015 224981 271617 190925 63991 -11869 -933 29814 -3000 -74011
40652 -74011 -86861 -38695 -35495 -110970 -165903 -163855 -229097 -397319 -419203 -70674 405328
40641 405328 487594 72797 -319418 -204910 250523 508112 352624 21790 -233917 -381842
40631 -381842 -423364 -318628 -163846 -153195 -255044 -190124 128089 390963 330687 126595
40621 126595 114045 266662 289680 135086 65449 177925 201232 -84719 -468321 -557174
40611 -557174 -294966 -29939 -79299 -359304 -493885 -241041 241337 581541 621248 562956
40601E62956P9588J34497q3147l46631l51658j52753l3321o0645m5652Q4796J57793
40590e4177O0730n7622j9848J11007J45383N2164k0970K3755J13265J24721L8821
40579E17229o9314j43447j89176k05396j43181N843J22423O8925j04865j84475
40569c25434p0560Q3962J02856L2731K9616J00588J28925R4321P9479Q3427K2806
40558C62717p5984q2785M634K9671o2849j28732p3866r974l8025n8183L7269J34084
40546C7977O5519q7731q7785J06011K69195K03861m9601k92094l36793j30179
40536c01620J67508K67731P1616j53054j01496J21493J46185q4004k09458k5321
40526a00420J85795J11999q4809m5779J90738K48831J0421k16557j76397J500
$$ plain form
40601 562956 642544 777041 693894 347263 -4395 -157148 -190469 -251114 -296766 -211970 -54177
40590 -54177 6553 -51069 -70917 40090 185473 237637 216667 240422 353687 478408 517229
40579 517229 447915 304468 115292 -90104 -233285 -227442 -105019 -36094 -140959 -325434
40569 -325434 -395994 -312032 -209176 -176445 -146829 -46241 82684 177005 256484 339911 362717
40558 362717 286733 203948 208582 238253 175404 46672 -27194 -37168 -75193 -133376 -96107 37977
40546 37977 103496 15765 -72020 33991 303186 507047 457446 165352 -171441 -301620
40536 -301620 -134112 133619 205235 52181 -49315 72178 218363 134359 -75099 -100420
40526 -100420 85375 197374 112565 66786 257524 506355 516776 300219 123822 125322
40516A25322O9214J2233k9413j8973k4386n7390o2176k2028K3391L6521n22p9310
40504b7517j34319q6041L8318J01667L1527p0931o0043O8911J81192J55598L454
40493B01816j36732j26788N896P2264k7082j27176k8368J67707J85765J9430m9315
40482A57417P4236J35859q556j12217L6300K09534J00175j48686j64296N1503
40472C31269J49769k37j73789k10963j92685j62861l9834J22069J23951k7886
40462h1197q2498M1042J20626L9369m356J25884K29839J04973j05644j54948p2480
40451A60610m6659r2384q6131r968O1104J13936J52942J08697m0105j69201j85798
40440c2957j63035j48272k3998K39064L83762J90316j43068k32483l1654J58270
$$ plain form
40516 125322 194536 206769 177356 158383 133997 76607 14431 -7597 15794 52315 51793 -27517
40504 -27517 -161836 -247877 -209559 -107892 -76365 -147296 -207339 -138428 42764 198362 201816
40493 201816 65084 -61704 -55808 16456 -10626 -137802 -166170 1537 187302 206732 157417
40482 157417 231653 367512 358956 246739 283039 492573 592748 444062 279766 331269
40472 331269 481038 480801 307012 96049 -96636 -259497 -299331 -177262 -53311 -81197
40462 -81197 -163695 -122653 -2027 37342 32986 158870 388709 493682 388038 233090 160610
40451 160610 113951 21567 -64564 -74532 -13428 100508 253450 362147 322042 152841 -32957
40440 -32957 -195992 -344264 -368262 -129198 254564 444880 301812 69329 37675 195945
40430A95945J44285K9546l7309m6361l6929k0607j6137k5403k34N4640L4658p8172
40418A97922j22462k4275K0725j28093k39301m3847K66633K72742k3877k09760
40408c3593r9155P2284J29476J81867K56883J55635j36095k93163j43639L5769
40398A26269k6509j74777j46722j6450J3271O349J16870K17895R5692j18963j08563
40387a5638J07204J86023k121k04108j92267l4966J13756K20983K74802K12303
40377F65971N8829m9133p2742j24947k32577k37269n2896J51258J72890M9850
40367C29234l7832l0446K221L0039P5162R9941L8270p2480j22756r3268o9129
40356A48956q8906r5065m9445J1212N5481Q4989O1912o2665k05180j81630K8596
$$ plain form
40430 195945 340230 369776 332467 286106 249177 228570 212433 187030 186796 241436 276094 197922
40418 197922 75460 51185 71910 -56183 -295484 -339331 -72698 200044 176167 -33593
40408 -33593 -132748 -60464 69012 250879 507762 663397 527302 234139 90500 126269
40398 126269 99760 -75017 -221739 -238189 -224918 -218569 -101699 116196 211888 92925 -15638
40387 -15638 91566 277589 275468 71360 -120907 -155873 -42117 178866 453668 665971
40377 665971 724800 675667 602925 477978 245401 8132 -44764 106494 279384 329234
40367 329234 291402 260956 263177 293216 368378 468319 506589 434109 311353 218085 148956
40356 148956 60050 -35015 -84460 -73248 -17767 67222 129134 66469 -138711 -320341 -291745
40345b91745J93498J35374j177L0871J89359K02072j2610k28824k51767j44487
40335a79436m2798L6638Q9548L1086j33134k13609r1027P8791R7462K6469M6808
40324b53202J33332J16200q89l9677N4012J45468J47209J01759K3960j12819k11190
40313A04163j09767J29596K20822L4735k14569k70509j47392k9484r705m8754
40303c40864p3397j4336J43479K73358K01678l1354j57581l1972J54773J50105
40293B73889j1108r8711l0534O0337O0241J0233j398M0045R3471J26761J26289
40282F49515O9269p3021k64477l46271j61079J87039L29034O5475k92348k70606
40272a07470J15208L66444K03022q2268j21454L749k231j35694j50717k605R6285
$$ plain form
40345 -291745 -98247 37127 35950 66821 256180 458252 445642 216818 -34949 -179436
40335 -179436 -222234 -185596 -96048 -64962 -198096 -411705 -502732 -423941 -326479 -300010 -253202
40324 -253202 -119870 -3670 -4559 -44236 9776 155244 302453 404212 428172 315353 104163
40313 104163 -5604 123992 344814 379549 164980 -105529 -252921 -282405 -292110 -340864
40303 -340864 -414261 -428597 -285118 -11760 189918 158564 983 -30989 123784 273889
40293 273889 262781 164070 133536 193873 254114 264347 262949 302994 396465 523226 649515
40282 649515 718784 645763 381286 35015 -126064 60975 390009 455484 163136 -107470
40272 -107470 7738 374182 577204 494936 373482 377231 375000 239306 88589 85984 182269
40261A82269L9410l2542J3800J19285J53129O6917j11855l14788m23116l26363
40251f33854m3145K62602M08771L28123J04974r3827j58475j23976q4579n1349
40241h4735J4108O4478K3952l0538N0853K01554J68311q6662k67496j69870K3214
40230i2831O0847K738L3921J06540O2044l4839Q13J22266J11299m5251j28848
40219A98699m3021O6669P4280K3393k8292j06602j96127j85480k3022J71200K13817
40208A65514M7741j75347k03447M3018L05021K52022n2489j89140J8121K37173
40198D48187J52154o7059j16510p3252j56414k29911m2133K04611Q3602l14358
40188a11083m42826j44688J32729R4371Q675J29650K24878K5001k61422k73430
$$ plain form
40261 182269 221679 189137 202937 322222 475351 542268 430413 115625 -307491 -633854
40251 -633854 -676999 -414397 -5626 322497 427471 333644 175169 51193 -33386 -84735
40241 -84735 -70627 -6149 17803 -12735 38118 239672 407983 321321 53825 -116045 -92831
40230 -92831 -31984 -29246 4675 111215 173259 138420 139233 261499 372798 327547 198699
40219 198699 155678 222347 296627 320020 291728 185126 -11001 -196481 -219503 -48303 165514
40208 165514 213255 37908 -165539 -122521 182500 434522 382033 192893 211014 448187
40198 448187 600341 533282 416772 343520 187106 -42805 -84938 119673 203275 -111083
40188 -111083 -553909 -698597 -565868 -471497 -462822 -333172 -108294 -83293 -344715 -618145
40178f18145n3348R3453Q3539N4455L7419l8135j07881l2223J49849K53537K06876
40167B9396J03697L0922j5896o7334j23474j44216q1392J5188k4431k46142l70536
40156h94218j06918L44273M52014R3587k43490j59036J37245K43461J51162Q8900
40146A06980P2946r677p8176N368J21156O3018r2752j17098j4722M1455M8044
40135A46542J05087J20009n3589k59585k12205J6769Q9107k8901k0945J96356
40125I8645K92985P8268j78775k05236j39060k03373k63764o0105L04423M61631
40115A85639K91396L1796j01936j34918j42189r1641K3938Q1004j1273j45096
40105a3280j42962J367J32198J56484J30172J12113P6599L1779P3448J92405J68062
$$ plain form
40178 -618145 -671493 -578040 -494501 -440046 -402627 -440762 -548643 -580866 -431017 -177480 29396
40167 29396 133093 164015 148119 80785 -42689 -186905 -268297 -253109 -277540 -523682 -894218
40156 -894218 -1001136 -656863 -204849 -111262 -354752 -513788 -376543 -133082 18080 106980
40146 106980 179926 170249 92073 97441 218597 281615 188863 71765 57043 98498 146542
40135 146542 251629 371638 318049 58464 -153741 -136972 -47865 -76766 -97711 98645
40125 98645 391630 469898 291123 85887 -53173 -256546 -520310 -580415 -275992 185639
40115 185639 477035 508831 406895 271977 129788 38147 62085 143089 131816 -13280
40105 -13280 -156242 -154875 -22677 133807 263979 376092 452691 484470 557918 750323 918385
40094I18385j38272m75002m56423j10534J33730O1863n7652L1570J53447M8928
40084A10040j34158p1796J79785K53338L8631j86885k06903j17009p2151p0323
40074b77431o8557p5238m8865Q5316K53450K66665R1743j00100j85684j87297
40064b45998j06497Q6312K58177J92995n3534j65779m2868M7239n6723j13130
40054a99806R3324L26046K38081p3148k24049j28437m3410q6399q5975M8587J46023
40043A0837O7133q0594j43105j28433r9582l6097P7449J69893J99239K18610K30344
40032D85694J23428j16584k80268j92272N437K9929j33108k12022n5464J52547
40022a92683J69274J9567q8006o4459k929J6031K2662M8936N9433M4162O8954
$$ plain form
40094 918385 780113 305111 -151312 -261846 -128116 -66253 -123905 -92335 61112 110040
40084 110040 -24118 -95914 83871 337209 375840 188955 -17948 -134957 -207108 -277431
40074 -277431 -345988 -421226 -470091 -384775 -131325 135340 227083 126983 -58701 -245998
40064 -245998 -352495 -266183 -8006 184989 131455 -34324 -77192 -29953 -86676 -199806
40054 -199806 -106482 219564 457645 384497 160448 32011 -11399 -97798 -183773 -135186 10837
40043 10837 77970 -2624 -145729 -274162 -373744 -409841 -332392 -162499 36740 255350 485694
40032 485694 609122 492538 212270 19998 25435 55364 -77744 -289766 -345230 -192683
40022 -192683 -23409 -3842 -91848 -156307 -159236 -143205 -120543 -71607 -12174 31988 100942
40011A00942J53511J88208Q0038p6914j07816j3772K6276n9963j08453K5110K06069
40000D13236J83852m1884k08879j62768n1191o2199j37741j05890J4606M8089
39990a10769l4771o0886O1406J92944J83794Q4644K5385J3327j4019m0495k5009
39979B75551k4073j02762j78365j15701N1360J49886J06472J3406l0076n414P4259
39968B14543J57043J28447m4249j84470j13568N7718P8926l2251k7197J14870
39958C49812J16348j08547k57157j29934J9469r1839k86880k16111O5795J94999
39948c44045O4702p5461n1057M7335J18450J85575K27502J43866l6445j35043
39938A45379q3142o445O534K5256R3872J14334J6528r9342j01171r291N1496K4756
$$ plain form
40011 100942 254453 442661 522699 445785 337969 324197 350473 290510 182057 207167 413236
40000 413236 597088 555204 346325 183557 132366 70167 -67574 -173464 -158858 -110769
39990 -110769 -145540 -206426 -145020 47924 231718 316362 341747 355074 341055 300560 275551
39979 275551 251478 148716 -29649 -145350 -93990 55896 162368 175774 145698 140284 214543
39968 214543 371586 500033 455784 271314 157746 215464 294390 262139 234942 349812
39958 349812 466160 357613 100456 -29478 -10009 -101848 -388728 -604839 -539044 -344045
39948 -344045 -279343 -354804 -405861 -358526 -240076 -54501 173001 316867 280422 145379
39938 145379 62237 55792 62326 87582 181454 295788 312316 212974 111803 102512 154008 178764
39926A78764k3912m918P3588R2603l0861j91046j94997m4712M1378l2084p4059
39915b10256O6516K18175J57067k0030o8186P738L3441J4764O2810P6814j03902
39904B34951k96055j61522K00854L20498P9403j14543k2343N6117j39019l39880
39894a81539k05343R7769J80452M3228j3361P9645J17156J7344r2652j41504j62116
39883b60921j13928O3647K45646K33753O9604n550Q5715J56818N1382j55180k94646
39872G6340k96137j94767o3466L2938Q6331J40511J92565J68922O7197J1693N7550
39861B79677O3420q4685k40013j89729j361O0843o1666j44297l6652J23983J45674
39850h4806N6428J9159P4969J06532L0721q1985j15289o9595l7921l2606M3272
$$ plain form
39926 178764 154852 149934 223522 316125 285264 94218 -100779 -145491 -104113 -136197 -210256
39915 -210256 -143740 74435 231502 211472 143286 151024 184465 199229 262039 338853 234951
39904 234951 -61104 -222626 -21772 298726 378129 263586 241243 297360 158341 -181539
39894 -181539 -386882 -289113 -108661 -65433 -78794 851 118007 135351 42699 -98805 -260921
39883 -260921 -374849 -311202 -65556 168197 237801 232251 317966 474784 526166 370986 76340
39872 76340 -219797 -414564 -478030 -445092 -358761 -218250 -25685 143237 210434 222127 279677
39861 279677 343097 258412 18399 -171330 -172691 -111848 -173514 -317811 -354463 -230480 -84806
39850 -84806 -28378 -9219 65750 172282 203003 121018 5729 -63866 -101787 -134393 -91121
39839i1121J89343K15444J5352j87767j17170J10150J35438n1984q0338J47915
39829B85262K19512j08878m20499k40010K05385L34927J11570J8543K13193K98460
39819I17465K9315k86934l07616j44944p6209r4485l2640J02348J85501J93439
39809D85240J50994K0601j56470j79995K9091K26579J64408k5769m3544Q7025
39799G58160N8667j96243l54977j80273J19490J85433p707j67479j02707P3083
39789A85447J57902J14124L9468m595l3445n1578k6225L8846P7724M8096p599
39778E38165l3558n3258j22894k07410j89215l3708J25701J40802M9251K4231
39768B38107J19029J78792P5070p9071q4287L7881P6955l0068j07097n1822j7102
$$ plain form
39839 -91121 98222 313666 329018 141251 24081 134231 269669 217685 137347 285262
39829 285262 504774 395896 -24603 -264613 -59228 275699 387269 405812 619005 917465
39819 917465 946780 659846 352230 207286 131077 36592 3952 106300 291801 485240
39809 485240 636234 656835 500365 320370 349461 576040 740448 714679 671135 758160
39799 758160 816827 620584 265607 85334 204824 390257 382550 215071 112364 185447
39789 185447 343349 457473 496941 492346 458901 407323 381098 419944 497668 545764 538165
39778 538165 504607 451349 328455 121045 -68170 -101878 23823 164625 213876 238107
39768 238107 357136 535928 610998 531927 447640 485521 562476 532408 425311 373489 356387
39757C56387j29370k27468j11720R0015Q3579j31776k51138j08818J28131K42732
39747e9446K03203P1191r2348j71263o6920J08142J21265l9663j39723o3929L8284
39736i1207M6323L9750P7801P3821L263k5222j0362p9044j65166k3207K85231
39725A31981L25478m5092l55261j97116J54764K08781M949p8104l82k3800j66420
39714d0222k01933j05464l9715J0476J44004J94989m0153l19989k23773J48662
39704d73118K87277P9896n9251P0442J73256O3703q713J22043J97197M658k25924
39693B31466k07713l5241M7883K6113Q93k8012m5117N2682K12684J92281m0282
39682D07637j76389m4674J05098L3645j01051o9258L0483J5896j4512R3874K03412
$$ plain form
39757 356387 227017 -451 -112171 -22156 61423 -70353 -321491 -430309 -302178 -59446
39747 -59446 143757 214948 122600 -48663 -115583 -7441 113824 74161 -65562 -129491 -91207
39736 -91207 -44884 -5134 72667 146488 149751 124529 114167 35123 -130043 -153250 131981
39725 131981 457459 412367 57106 -140010 14754 223535 228484 150380 149998 126198 -40222
39714 -40222 -242155 -347619 -387334 -376858 -232854 -37865 -78018 -398007 -621780 -473118
39704 -473118 -185841 -105945 -165196 -94754 78502 142205 133492 255535 452732 457390 231466
39693 231466 23753 -11488 36395 62508 63401 35389 -9728 42954 255638 447919 407637
39682 407637 231248 186574 291672 325317 224266 155008 185491 201387 186875 280749 484161
39671D84161J17322m1175l8706N5216K2731q9150p9654K400n4735k10784k17873
39660e0247n0692O0517L5416N1271J94780K98043K09512J931j73385k60325k59525
39649E7296j67331j4741J34745K43799K77820J71487n8098k26957j78577k3360
39639B16083k791j34571j93331o4739Q7792R0377J6602M0853J42324J25204p8934
39628B44869k79987k69355r0799M9298R0202J58113K77621K62043K5348j97802
39618B69551j65660r101k1195j77555j94239j3578J24115J03836O9219Q1360J4891
39607H1644j12323q4243J01374J46407m2948j49093K9296K22719J54884M098M9610
39596D01425J68821Q7416j13733j57554n3831j7993n2115o570N4868m6336k15450
$$ plain form
39671 484161 601483 560308 521602 576818 599549 510399 430745 433145 378410 167626 -50247
39660 -50247 -100939 -40422 -5006 46265 241045 539088 748600 750531 577146 316821 57296
39649 57296 -110035 -124776 9969 253768 531588 703075 644977 418020 239443 216083
39639 216083 213292 78721 -114610 -179349 -91557 -1180 15422 56275 198599 323803 244869
39628 244869 -35118 -304473 -395272 -345974 -255772 -97659 179962 442005 467353 269551
39618 269551 103891 94790 73595 -103960 -298199 -311777 -187662 -83826 -14607 66753 81644
39607 81644 -30679 -114922 -13548 132859 89911 -59182 -29886 192833 347717 351815 401425
39596 401425 570246 657662 543929 386375 332544 314551 262436 255866 310734 264398 48948
39585D8948j89359P827R1477q685o4084L4400J18201P4331L6448J31388K59148
39574E40040K38563L3864k21589l34903k03510M9477J58295L9671q2243j0235
39564B07430J29186J16894r81l8141o363m2083j03787m2843R5414J31929O2439
39553E09094L0910M6984L291p2713n7729J5015N443p0745q2683l6438l2257l4521
39541B23651M9474J32727P0741n4225o3197j0522o6398j56661p6984R8278J07200
39530B54084l2299m7054R7833J39955k684r5470q271J00380J12711J13863J30660
39519G63708M9128j09935j61123q7605p6153j48077j10898M4020Q4571j5645J0262
39508B42253K11629K52864k3333k76923j94441L4608Q0553r662m740P0084M9587
$$ plain form
39585 48948 -140411 -132584 -41107 -49792 -113876 -79476 38725 113056 149504 280892 540040
39574 540040 778603 812467 590878 255975 52465 101942 260237 299908 217665 207430
39564 207430 336616 453510 452529 414388 408025 365942 262155 219312 314726 446655 509094
39553 509094 540004 586988 590279 517566 459837 474852 480295 409550 326867 290429 258172 223651
39541 223651 273125 405852 476593 422368 359171 348649 282251 125590 48606 146884 254084
39530 254084 221785 174731 272564 412519 409835 314365 306094 406474 519185 633048 763708
39519 763708 812836 702901 541778 454173 378020 229943 119045 163065 247636 231991 242253
39508 242253 453882 706746 683413 406490 212049 246657 327210 317548 312808 382892 432479
39497D32479j6542J8006P4607j2714j49337r9524J08648K02607P4541r0433j11845
39486D30493k4385M7659O1942M9521L3350N40p3246j67554j90181p0702J14045
39475B11482J98780J28973M608p7640j04614o7438M6796J58411J40873Q1j27913
39464E12399j72799j71169j14495M5004K10231J82718l4875j82001q5115J14165
39454C04063J79314P5631n8603j13664q3223k5557j1793m4888k7005R7820K00044
39443D92139J07669j24275k49598j42967O8619J88875J39269k0080j39722r2937
39433B26992N9710J07578p021q2881K483P0677k8871j20319k5263P4321k7941
39422B49465j13594J10319M16337L47137l0714k26992j08173P99l5509j5294P3141
$$ plain form
39497 432479 415937 433943 508550 495836 346499 246975 355623 558230 632771 542338 430493
39486 430493 406108 453767 515709 565230 598580 599120 525874 358320 168139 97437 211482
39475 211482 410262 539235 543843 466203 361589 294151 340947 499358 640231 640312 512399
39464 512399 339600 168431 53936 98940 309171 491889 457014 275013 189898 304063
39454 304063 483377 559008 500405 386741 303518 277961 266168 221280 194275 292095 492139
39443 492139 599808 475533 225935 82968 151587 340462 479731 459651 319929 226992
39433 226992 286702 394280 387259 304378 306861 377538 348667 228348 203085 277406 249465
39422 249465 135871 246190 662527 1009664 978950 751958 643785 644584 609075 593781 666922
39411F66922j4271k27055j95876J09322K60577O6174j54646j50804o5666k2013
39401B72664R2654K53789K28527M1656Q93J21158P4253j58366j92469M0303J32685
39390I07747l8162p5121J63725K63574L6474j11801L6083Q5112j84056l23695
39380G59880j8160L12537K61943J35333K98694M52154K15082j13907o7786J91335
39370B427105K50812J87288K72515L47221J48560r3231k2472J85887J21692j92102
39360C633275m34565m90037l87396j08732J54534K6242l84635m17468J04345M59574
39350B155137J84387j27330J31488N09496L19719j61214k64631j02445j75559
39341B469048l28164j14649K23145J59008j13955o6653J43605J6979k77060k27374
$$ plain form
39411 666922 652651 425596 229720 339042 599619 665793 511147 360343 294677 272664
39401 272664 365318 619107 847634 889290 890183 1011341 1085594 927228 734759 775062 907747
39390 907747 869585 794464 958189 1221763 1258237 1146436 1182519 1267631 1083575 759880
39380 759880 741720 1054257 1316200 1451533 1750227 2202381 2417463 2303556 2235770 2427105
39370 2427105 2677917 2865205 3137720 3484941 3633501 3540270 3517798 3703685 3825377 3633275
39360 3633275 3198710 2708673 2321277 2212545 2367079 2393321 2008686 1591218 1695563 2155137
39350 2155137 2339524 2212194 2343682 2853178 3172897 3011683 2747052 2644607 2469048
39341 2469048 2140884 2026235 2249380 2408388 2294433 2227780 2371385 2388364 2111304 1883930
39331A883930J4170m3375k27524m1675L03044K31482j02874j04165J58769J67435
39321B239217K102J23333L69917K36222j02808r6512J22529L7936j99043r7739
39311B635154J30598k3635k93165j22685J77654j129k86286O5110P02087P21073
39301C704776K60345J27382K74169J26081o1009K55902N54965J19451l60729J09625
39291E110958Q21104N03615k43138K6508Q51773P20643M4977M24591J464645J443470
39281A1169146P41818J224523K526409K661040K100622L108600N053143N012073
39273C3597374L274931L139775M814823N396781N687752J0072375J8168013K5040552
39265A09192376L2290037M7590834O6047318O3918642K5199779l1295015o6922016
$$ plain form
39331 1883930 1898100 1854725 1627201 1585526 1888570 2120052 2017178 1913013 2071782 2239217
39321 2239217 2241319 2364652 2734569 2970791 2867983 2771471 2894000 2931936 2732893 2635154
39311 2635154 2765752 2742117 2448952 2326267 2503921 2502792 2216506 2281616 2983703 3704776
39301 3704776 3965121 4092503 4366672 4492753 4431744 4687646 5242611 5362062 5001333 5110958
39291 5110958 5932062 6435677 6192539 6219047 7070820 7791463 7836440 8261031 9725676 11169146
39281 11169146 11910964 13135487 15661896 18322936 20423558 23532158 28585301 33597374
39273 33597374 36872305 40012080 44826903 50223684 55911436 65983811 84151824 109192376
39265 109192376 141482413 189073247 255120565 319039207 344238986 312943971 246021955
39258B46021955o4823127m3260084k7013759k0679034j5695726r595632o699907
39251E8254686p163820o755085m959358m848431o245022n871296l524004k258966
39243A6628704k779217k697625j301913n54777j137158j419160p54484m04998
39235E579372p70221p01350L683J19783n74170q17691k21602J23112k28936l96243
39225B115737l081J88859j30474l00356r8821j09388m05176l40045J15793K27601
39215A260649j31425k89502q5502o2352k56935j02668L50945L97864k5931k29174
39205H25969m8708l9024k89045k53504J18227K48935M2933O813J82959Q6741k30440
39194F51856j99443J23731R7159k56465k37499J91776K88728r1067k44038L1637
$$ plain form
39258 246021955 181198828 137938744 110924985 90245951 74550225 64954593 58254686
39251 58254686 51090866 44335781 39376423 34527992 28282970 22411674 18887670 16628704
39243 16628704 13849487 11151862 9849949 9295172 8158014 6738854 5984370 5579372
39235 5579372 4809151 4107801 4111484 4231267 3657097 2839406 2617804 2740916 2511980 2115737
39225 2115737 2112656 2301515 2171041 1870685 1771864 1662476 1257300 917255 1033048 1260649
39215 1260649 1129224 839722 754220 691868 434933 332265 683210 1081074 1055143 825969
39205 825969 777261 738237 449192 195688 313915 562850 605783 612596 795555 882296 651856
39194 651856 452413 576144 673303 416838 179339 371115 659843 568776 324738 356375
39184C56375R1330k52777l28009J14322M11727K36132J65641M98006O12278J17168
39174B022193l88927l51485j26667j69503k27061j3728J14934j30944l08066J2107
39164D32853M50780M68364K52039K73079M26778K94119q1504k88355j83006L7529
39154B082676J89541J77240n2351l53150m28889k36996o2132o6952j22323j63808
39144I62856k82849l81206k23035P7595J42558j8662j9039J70047J50154j20569
39134D57850j95426K6491Q7589j60706k56357q684J11029j43010k99729m2971
39124d23924J89250K9006j27735J17112L78311J66104k28433k61209n6551n6756
39114b74825j68106j2101K94812L43012J65265R6884J16933k5574k13766j23752
$$ plain form
39184 356375 447705 194928 -133081 -18759 392968 629100 794741 1292747 1905025 2022193
39174 2022193 1633266 1281781 1155114 985611 758550 744822 859756 728812 420746 432853
39164 432853 883633 1351997 1604036 1877115 2303893 2598012 2516508 2228153 2045147 2082676
39154 2082676 2272217 2449457 2397106 2043956 1615067 1378071 1315939 1248987 1126664 962856
39144 962856 680007 298801 75766 153361 295919 277257 258218 428265 578419 457850
39134 457850 262424 288915 376504 215798 -40559 -49243 61786 -81224 -380953 -423924
39124 -423924 -234674 -205668 -333403 -216291 162020 328124 99691 -161518 -218069 -274825
39114 -274825 -442931 -455032 -160220 182792 348057 444941 561874 536300 322534 198782
39104A98782J47616K01414j1818j81887j83151j46032r2920L2904Q6430q0018
39094b8680k50763j24609J52428J81217n2020j73693r719K28526L15740K24116
39084D62543Q349k14687k46692n2613Q6080n7549k79638k43905L461J50890J11734
39073b72027N6044O7460R2201J29328J81710J33361n6155j81203q0358P5507O0651
39062B06519l4612m977J01263J24817J00155J02863J7275k08108l13636j07371
39052a5812J45478J07309r0896j13842N637J8656k9884N8608J64275L4315j97522
39041H6322j93938j299O1260j1784K5500J20026P609k04037j42036J40141J85718
39030G3482r2918k68193j34894J147n5746n6683J60939L28397K25447N7821M9459
$$ plain form
39104 198782 346398 547812 535994 354107 170956 24924 -67996 -35092 51338 -28680
39094 -28680 -279443 -404052 -251624 -70407 -122427 -296120 -305839 -77313 238427 462543
39084 462543 470892 256205 9513 -43100 42980 -14569 -294207 -538112 -534651 -383761 -272027
39073 -272027 -215983 -148523 -56322 73006 254716 388077 331922 150719 70361 145868 206519
39062 206519 171907 166930 268193 393010 493165 596028 613303 405195 91559 -15812
39052 -15812 129666 236975 146079 32237 37874 56530 26646 85254 249529 283844 86322
39041 86322 -107616 -108915 -47655 -59439 -33939 86087 93696 -110341 -252377 -112236 73482
39030 73482 -19436 -287629 -422523 -421376 -477122 -533805 -372866 -44469 180978 238799 288258
39019B88258N5101r9107k36646j33195P9000J38058O2963L0609K7677o8101j81897
39008c7280j08300J52781L44868K56592l8742k55616j77861J09598K97420K16554
38998G60014L9653R80M6022k5365j80233k10065j12473r2458j80126j72527n892
38987a32470J23310Q8034P86k8931m2009n4486L786R4104P1602l8516l5499J00351
38975A50062J29397n2694k18649j56176L3723J39787J26140O6715j0211p2750
38965A35344n5015R265p439j00761j06118K0372J02696K6587q5140q5349K564
38954a42994R7728J75015J80771M4645j36386j45286K7985J31229K5209j18074
38944A39842j12575k3069R325l650P146K2812J8866L2983N4253J4804m0191K7610
$$ plain form
39019 288258 343359 244252 7606 -125589 -46589 91469 154432 185041 212718 144617 -37280
39008 -37280 -145580 7201 352069 608661 569919 314303 136442 246040 543460 760014
38998 760014 799667 800647 846669 821304 641071 431006 318533 226075 45949 -126578 -132470
38987 -132470 -9160 78874 79660 50729 8720 -45766 -41980 52124 123726 85210 49711 150062
38975 150062 279459 226765 8116 -148060 -114337 25450 151590 218305 208094 135344
38965 135344 80329 89594 82155 -18606 -124724 -104352 -1656 24931 -60209 -145558 -142994
38954 -142994 -45266 129749 310520 355165 218779 73493 101478 232707 257916 139842
38944 139842 27267 4198 13523 9873 17019 39831 58697 91680 145933 160737 120546 148156
38932A48156J99629K88727K27624J26399J2947j81584l35905k05804J22807K44196
38922F47192M6605j00101K8912J43763j5838k00378r1577J52406K16832J73777
38912A001593K54339L57091K65594J27494K16924M00715L52345J58057J88988
38903C323140M69333O98344Q31293J100303J514543J926204K544554L634320M554452
38894B0596486L926039J276679k022635m040636m189548l367581k548738j909274
38886G720792j279305p56097n57281o17686o62382n75638m87596n19114n87189
38877A678504n14550k73138l7160L1952j8493l7267j5851q1571k41029l07100
38867A84297j62503M8941J12242J8730p0439o1600o13M6705O6401O4503M9834
$$ plain form
38932 148156 347785 636512 864136 990535 1003482 821898 485993 280189 402996 647192
38922 647192 693797 593696 622608 766371 750533 550155 458578 610984 827816 1001593
38912 1001593 1255932 1613023 1878617 2006111 2223035 2623750 2976095 3134152 3323140
38903 3323140 3792473 4490817 5322110 6422413 7936956 9863160 12407714 16042034 20596486
38894 20596486 24522525 25799204 23776569 19735933 15546385 12178804 9630066 7720792
38886 7720792 6441487 5685390 5128109 4510423 3848041 3272403 2784807 2265693 1678504
38877 1678504 1163954 890816 853656 885608 867115 829848 813997 732426 491397 184297
38867 184297 21794 70735 182977 201707 131268 69668 69055 115760 182161 246664 296498
38856B96498L2192j5804j39361k80181k66094l8922J89712J75042j5241q7399
38846a49558M9175J62433P3950o9234m7970Q3863J14389J7656n0718m4043o3329
38835G6614j05867k9736J63079K44200Q5755j25016j55080m9500p562o5575j05961
38824g4649r3509r0025q0370J0175J37284J62783O3954m5402j03413j47446j73491
38813d34109j20635j3556M5566M9580Q5632J40205Q7096q2879j98963j46575q620
38802e97258R4266J46636J55650R5541K0225O0965K02638K26297J3181k34428
38792A83713k38220j0176J90249K03824J16136O7864N9032p440j47304k30412
38782A87266j38610L2585M6012j41253k59862r8873J47551J49578m2971q0246
$$ plain form
38856 296498 328690 312886 173525 -106656 -372750 -411672 -221960 -46918 -62159 -149558
38846 -149558 -100383 62050 136000 66766 18796 102659 217048 234704 183986 139943 76614
38835 76614 -29253 -58989 104090 348290 434045 309029 153949 104449 96887 31312 -74649
38824 -74649 -168158 -258183 -338553 -328378 -191094 -28311 35643 -9759 -113172 -260618 -434109
38813 -434109 -554744 -568300 -522734 -473154 -387522 -247317 -160221 -243100 -442063 -588638 -597258
38802 -597258 -502992 -356356 -200706 -105165 -84940 -23975 178663 404960 418141 183713
38792 183713 -54507 -64683 125566 329390 445526 513390 572422 564982 417678 187266
38782 187266 48656 81241 127253 -14000 -273862 -372735 -225184 -75606 -118577 -198823
38772a98823J12820K09019P134k63550l18578j87279k5808J45464L01768K83216
38762F5383N9204j04244m481J69530J32267o5624j81530j84269k04702k19275
38752e37741j05259P3187J36472Q9333P4834Q9522K0223q6228p2012M0774Q0770
38741a96125L3819M8455J31915J12040n5802j87955j48088k6233K9810J0463J2275
38730b35426J12056K88886L99802K87363L384j77996j03661K8668l8068k32874
38720C32134k91119j66050m0872L34L8835Q7759N4244n7975j24302q4317J3183
38709b38146J10227J39515K7438j41977j29999Q9057J86868j7070j85226J2288
38699a47025K76111J21338k59822k44431J78995L47684J713l09128j51884J30419
$$ plain form
38772 -198823 -86003 123016 130150 -133400 -451978 -639257 -665065 -519601 -217833 65383
38762 65383 124587 20343 15862 185392 317659 252035 70505 -113764 -318466 -537741
38752 -537741 -643000 -569813 -433341 -344008 -269174 -179652 -159429 -245657 -317669 -276895 -196125
38741 -196125 -162306 -113851 18064 130104 74302 -113653 -261741 -287974 -258164 -247701 -235426
38730 -235426 -123370 165516 565318 852681 856065 678069 574408 603076 565008 332134
38720 332134 41015 -125035 -165907 -165573 -126738 -38979 15265 -42710 -167012 -251329 -238146
38709 -238146 -127919 11596 39034 -102943 -232942 -143885 42983 25913 -159313 -147025
38699 -147025 129086 250424 -9398 -253829 -74834 272850 274563 -34565 -186449 -56030
38689e6030P4152j57750j53983N3029J53162R7623L5681k5685j11925q1736J02670
38678g0792J70033l2767j94097k3159K06468P9592k34737k31634R5045K42774
38668F726O736k45196j86965L8581J47438J00867J4052l7578k662J21510J84163
38657A47672L3480j98566k26026m5965N3963k7753n6773J00629K27871J32068
38647A40600k2718M006J40494J57413M8137j6882j0521m9877j23370q7056M6639
38636B26865O7127j00098k28392j05345J41498K23593J04110R427M9349P1711
38626D59845l4789j28258n7218P6248R9361N5647O6178M2036j59927l85186l42295
38615c08358q9243K7108n3740j6111K41324L80083J96702j9936r502ok41236m44210
$$ plain form
38689 -56030 18122 -139628 -293611 -240582 -87420 10203 45884 20199 -91726 -173462 -70792
38678 -70792 99241 66474 -127623 -150782 55686 135278 -99459 -331093 -236048 6726
38668 6726 13462 -231734 -418699 -380118 -232680 -131813 -117761 -155339 -158001 -36491 147672
38657 147672 181152 -17414 -243440 -289405 -235442 -263195 -319968 -219339 8532 140600
38647 140600 117882 121888 262382 419795 467932 451050 440529 390652 267282 180226 226865
38636 226865 293992 193894 -34498 -139843 1655 225248 329358 338785 388134 459845
38626 459845 425056 296798 239580 315828 415189 470836 537014 579050 419123 33937 -308358
38615 -308358 -397601 -370493 -424233 -440344 -199020 181063 377765 357829 348327 348321 107085 -337125
38603c37125k04618K57067L48526l429k68882j32132J17623J18988p1824j94222
38593c70028j59211m0089P6292J01659j80r8472j5429K05721L38858K81315J21325
38582D41761o5650k44534k87741j06064J09254Q8822q3913r0932P5230R4693r4928
38571a64002j49115R1568K92615J49370j49774k58743j59198l0230Q4646J87429
38561a05434J53193n0213j84270p3051Q6318L6180j18428j10448M3747J26535
38551a95871R7525O2389l146j62065k66106j46181M4933M3411n5887N7229L33183
38540a90586L71751O1086k14913j44627J00725K01194J19805Lj00394j53061n9046
38529h063J63379K64891P1859k22665k97884j35205J1854Q206l3106q50M8171
$$ plain form
38603 -337125 -541743 -284676 63850 60421 -208461 -340593 -222970 -103982 -175806 -370028
38593 -370028 -529239 -569328 -493036 -391377 -391557 -490029 -505458 -299737 39121 320436 441761
38582 441761 376111 131577 -156164 -262228 -152974 -64152 -148065 -238997 -163767 -69074 -164002
38571 -164002 -313117 -221549 71066 220436 70662 -188081 -347279 -377509 -292863 -105434
38561 -105434 47759 -2454 -186724 -259775 -173457 -137277 -255705 -366153 -322406 -195871
38551 -195871 -98346 -35957 -39103 -201168 -467274 -613455 -568522 -525111 -580998 -523769 -190586
38540 -190586 181165 242251 27338 -117289 -16564 184630 304435 304438 204044 50983 -8063
38529 -8063 155316 420207 492066 269401 -28483 -163688 -151834 -143628 -176734 -177584 -129413
38518a29413K6325l3544m1383K2473J03917J46102J22745M2798m1052n9917n072
38507A53979L6495l3351j90162k73073j46516J32805L56171L73992K19227J9300
38497F48867j36155k07346j75193p8103j7557m5953r5901r2635p1716r1440r7586
38486d60718k749J45767K15940J81368J20991N3162o6826j85860j71128k8506
38476a98559O7319K3759m7840l8221o613l0021l3125P9246K18790K06380K4887
38465B66002j56101j90967r1108L4162Q3404K9630m6912k2072J10468J89578Q3108
38454B89192j14825j91768r5530J6369J3056m2068j2685J03042J68548R7126k2331
38443B08126l0389Q6370J53744L7079j51233j85861m8549M2619l7809j36267p0582
$$ plain form
38518 -129413 -103088 -136632 -178015 -155542 -51625 94477 217222 260020 218968 159051 153979
38507 153979 190474 157123 -33039 -306112 -452628 -319823 36348 410340 629567 648867
38497 648867 512712 305366 130173 52070 34513 -11440 -107341 -199976 -271692 -363132 -460718
38486 -460718 -463467 -317700 -101760 79608 200599 253761 186935 1075 -170053 -198559
38476 -198559 -131240 -107481 -155321 -193542 -200155 -230176 -263301 -184055 34735 241115 266002
38465 266002 109901 -81066 -172174 -138012 -54608 -24978 -71890 -93962 16506 206084 289192
38454 289192 174367 -17401 -112931 -96562 -83506 -125574 -138259 -35217 133331 230457 208126
38443 208126 177737 264107 417851 454930 303697 117836 69287 111906 74097 -62170 -132752
38432a32752Q1876J07893k5553j51512j44048j9160J58928L09075L07919J07439
38422F00105j37978k26306j66653j09715o5255P1477K19350J34351j82167l82695
38412b45486k36212N2528J73745J36965J28333J35968J5117j77917k18676n8543
38402b94178J15447J64171J21350L8745p3030j34511m6481J10682J27449l2006
38392I7638j63602j19211J0326P7075O8911L8516k625l0427J0889R0623Q7745
38381A65858k0274j02097p5388j5634Q606L9939Q5942N6349m0233l6179J08486
38370A75375J61089m4970l09528l40591j76213o3044l6256O8897K46526K89039
38360b9676J47340K7549N8249J12627N6096m4046o6744k2486J5245K4386m604
$$ plain form
38432 -132752 -50876 57017 31464 -120048 -264096 -283256 -124328 184747 492666 600105
38422 600105 462127 235821 69168 -40547 -105802 -34325 185025 319376 137209 -245486
38412 -245486 -481698 -429170 -255425 -118460 9873 145841 160958 -16959 -235635 -294178
38402 -294178 -178731 -14560 106790 145535 72505 -62006 -108487 2195 129644 97638
38392 97638 -65964 -185175 -174849 -97774 -28863 9653 7028 -23399 -12510 78113 165858
38381 165858 145584 43487 -31901 -47535 -38929 1010 86952 143301 103068 66889 175375
38370 175375 336464 291494 -18034 -358625 -534838 -597882 -634138 -565241 -318715 -29676
38360 -29676 117664 145213 203462 316089 372185 328139 261395 238909 254154 278540 273936
38349B73936q9699j65005j01971R6377K46610K12164O9269k7548l7962k1515l0303
38338D24353q3745j65634k03196j39518m1131j1199N050J48904L52495L41017
38328F27396L4239k69271k67568l6869J38420J54609R9705J1708j26175k20505
38318A45689j44777K9111Q5101l9311j82898j98235r8942L8845J60130J94170
38308a1117R1072o3661j07181j2011Q4248R0592O0454L3789n1525j91479k12127
38297b88946K160K64020K60325k6053k47533j21048K00336L16588Q5960k19135
38287B26674k87895j42162j7235L968M1174J39348J69184O5398l4468q428N0335
38276B05893p37j13159j38191o3298J5743Q2856J73368K12326R2270r7819j32615
$$ plain form
38349 273936 184237 19232 -82739 13638 260248 472412 541681 514133 476171 454656 424353
38338 424353 340608 174974 -28222 -167740 -208871 -220070 -215020 -66116 286379 627396
38328 627396 661635 392364 124796 87927 226347 380956 480661 492369 366194 145689
38318 145689 912 30023 115124 75813 -107085 -305320 -404262 -365417 -205287 -11117
38308 -11117 79955 16294 -90887 -102898 -18650 71942 132396 166185 114660 -76819 -288946
38297 -288946 -286786 -22766 237559 211506 -36027 -157075 43261 359849 445809 226674
38287 226674 -61221 -203383 -220618 -216650 -175476 -36128 133056 198454 163986 155558 205893
38276 205893 205156 91997 -46194 -109492 -93749 -10893 162475 374801 467071 369252 236637
38265B36637K6105J54200P4281j19934k20494j52015Q531J38814J31118m0451
38255B36792k43510k81482j26793M1848Q7615P4366J01014J14442J6722j33618
38245a12604j70745l6975J54628K50030J79766j305j40206j12974J4746L7126
38235F1487j07356k10468p8138J60817K09957J9035j60662j42464k1397M2169
38225b27020O8060J50239K35029J80730n894j52218j50432p8540n2377o5535m9028
38214a46986q786J510N992Q0220J85867J62780l4847k00146j10987J41078K30091
38203C05786K9848k01244j69448N7924J68139M0543j28844j46348o7963m0715
38193a52322n4186j028J01013J21743L8933j6878K3297M9905m4392j74986j71128
$$ plain form
38265 236637 262742 416942 491223 371289 150795 -1220 7311 146125 277243 236792
38255 236792 -6718 -288200 -414993 -373145 -285530 -211164 -110150 4292 21014 -112604
38245 -112604 -283349 -320324 -165696 84334 264100 262795 122589 9615 24361 61487
38235 61487 -45869 -256337 -334475 -173658 36299 55334 -105328 -247792 -269189 -227020
38225 -227020 -158960 -8721 226308 407038 401144 248926 98494 19954 -32423 -97958 -146986
38214 -146986 -155772 -154262 -148270 -68050 117817 280597 245750 45604 -65383 75695 305786
38203 305786 335634 134390 -35058 22866 191005 231548 102704 -43644 -111607 -152322
38193 -152322 -206508 -207536 -106523 15220 54153 37275 60572 110477 66085 -108901 -280029
38182b80029j0897J63111K28668J76335M6463j00125j57448o2967O7678M4872
38172A15661j07806j39838N2873K17689Q9913j85624k28815K4378K19250Q7109
38162A44790j93389k75762j00464J12208K04215K06814J69888P0668p0186j39011
38152A29771p3431M1461R3128Q1450O4807L8246l1528r2274n4810M0583L8298
38141B75701j01492k10874j49894k5427k9133j33855j44675k9025L1384l3360
38131e50650m1085J23908K62702J42004j21765k05532l5978J42948J41148K7863
38121a14437n6493q0509o1288o556K5525k8768r2203k0089J38883J61549K194
38110a32192r8840K0812J90352J79126K9543p7009j09016j15608l2272J72964
$$ plain form
38182 -280029 -290926 -127815 100853 277188 323651 223526 66078 3111 70789 115661
38172 115661 7855 -131983 -79110 138579 228492 42868 -185947 -161569 57681 144790
38162 144790 -48599 -324361 -424825 -312617 -108402 98412 268300 338968 268782 129771
38152 129771 56340 97801 190929 272379 337186 375432 343904 251630 196820 237403 275701
38141 275701 174209 -36665 -186559 -211986 -241119 -374974 -519649 -548674 -517290 -550650
38131 -550650 -591735 -467827 -205125 -63121 -184886 -390418 -426396 -283448 -142300 -114437
38121 -114437 -170930 -251439 -312727 -319283 -293758 -322526 -414729 -434818 -295935 -134386 -132192
38110 -132192 -231032 -210220 -19868 159258 188801 111792 2776 -112832 -145104 27860
38100B7860K85218Q9511k32556k86783m1923J24871J4829j21632m8895O7525l515
38089a25490j19305q442K17934J98464q1280k25948m2470J53771L8446k14852
38079b09172k20257J6199J28891k3886j59573l0842K08923K66340J26968J0413
38069A14004L1592J06549J30131P6029l7502j38688j13204L5505J13674p969j57423
38058A52698r5820R6545J46425M4125K7132J02850L141k70204l03137O9718L75595
38047C49068J62993k79407l47132l9220J05562r2578k10417L6412L43684L31267
38037C60232Q2730r9457j49458j60536j10353L8629J50246R9944K266J0148L8975
38026B63366n1697j47438m8835J47510J58016l6999j66637j04590k5197o3807
$$ plain form
38100 27860 313078 402589 170033 -116750 -158673 -33802 -18973 -140605 -189500 -121975 -125490
38089 -125490 -244795 -253237 -35303 163161 81881 -144067 -186537 -32766 5680 -209172
38079 -209172 -429429 -413230 -284339 -308225 -467798 -498640 -289717 -23377 103591 114004
38069 114004 145596 252145 382276 458305 420803 282115 168911 204416 318090 310121 152698
38058 152698 56878 153423 299848 343973 371105 473955 477096 206892 -96245 -26527 349068
38047 349068 512061 232654 -114478 -153698 -48136 -140714 -351131 -314719 28965 360232
38037 360232 442962 343505 194047 33511 -76842 -38213 112033 211977 214243 224391 263366
38026 263366 211669 64231 15396 162906 320922 283923 117286 12696 -12501 -76308
38016g6308j11791o8568m2645j31210j96000o0279J92869L12068K04588J3631
38006C6355r0423n9289O2442J84034J94936O2371r0302j05573l435L2887q6860
37995A37143k21180j81868J3900J63340J20364o0293k15147k35489j23348N0496
37985e52082J96661K45221J84528P0906j5164k6227K7980Q5651O4467o2575k02728
37974A6638k09297n2236J28182J86900J31080M4301n8439j68939j52877J08909
37964b5778M35776M43153L6148l94054m41712j95809n4743j44524k08305o6332
37954f16180J11143J01546k7154m8484Q0449J92610J69723O8130o525k6446k1037
37943b2225j3332j0826j6301k4142k2965q142J2373J7000j6006o6372o0999L6629
$$ plain form
38016 -76308 -188099 -256667 -299312 -430522 -626522 -686801 -493932 -181864 22724 36355
38006 36355 -54068 -113357 -50915 133119 328055 390426 300124 194551 191116 224003 137143
37995 137143 -84037 -265905 -252005 -88665 31699 -28594 -243741 -479230 -602578 -552082
37985 -552082 -355421 -110200 74328 145234 130070 103843 131823 217474 281941 219366 16638
37974 16638 -192659 -244895 -116713 70187 201267 245568 187129 18190 -134687 -25778
37964 -25778 409998 853151 889299 495245 53533 -142276 -197019 -341543 -549848 -616180
37954 -616180 -505037 -403491 -430645 -479129 -398680 -206070 -36347 31783 25258 -1188 -22225
37943 -22225 -35557 -46383 -62684 -86826 -109791 -117933 -105560 -88560 -104566 -170938 -231937 -195308
37931a95308J38226J22392K5827K5600J76851K92517J90219m1816j65355j11423
37921D57730k1607n324k6830l9434o3309q7172m4478M9545P5787J319m5569J2958
37909B63616N4494m7116j94106k05555j02418n2297p2034j3899J28096J37031
37899a04188q6093k92509j83334J66155L81129K63150P909r1713o594O2615j0850
37888A05677j37465j65243p6938J3035J6539k9790l2028L0324Q1277O3173L3321
37877i8118R2038K17322K46583P9924j49984k11847p5965L7431l9538j88763j83989
37866b74906j3598J31398J49623J21374R5352r573k00650k94774j55761Q2132
37856c69383J90642J47767R3605P5681L3452k2561k5639j5511p3359j16922l550
$$ plain form
37931 -195308 -57082 65310 91137 116737 293588 586105 776324 734508 569153 457730
37921 457730 436123 430799 403969 364535 301226 214054 169576 219121 294908 296227 250658 263616
37909 263616 318110 270994 76888 -128667 -231085 -283382 -355416 -369315 -241219 -104188
37899 -104188 -190281 -482790 -666124 -499969 -118840 144310 152219 60506 53912 116527 105677
37888 105677 -31788 -197031 -273969 -260934 -244395 -274185 -306213 -275889 -194612 -131439 -98118
37877 -98118 -6080 211242 457825 537749 387765 175918 99953 137384 97846 -90917 -274906
37866 -274906 -288504 -157106 -7483 113891 209243 199670 -980 -295754 -451515 -369383
37856 -369383 -178741 -30974 62631 138312 171764 149203 123564 108053 34694 -82228 -85778
37845h5778J57928Q5121k13769l51158r5821K64368L17236P4295j36064j65883
37835a49525j43028j51183j13811q62R4200J18552J11397P6002j6747q9894k2255
37824b87154J28760J67581O2291m075N3831Q3883k0959j17985n9347M1262m98
37813D7590j12196p5257R6750J51714k765j35649l6646J61118J77554K004r8576
37802A75641J2585J35416M2086j63354j88202P782J45915M5494j13948p9854R8945
37791A18506J77687Q3321m1023j01272j34443j35260l1541J23551J45311j2607
37781A92230j56318j15974L5613J25338J05570L6050l5629o7215n322J14728J50092
37770C79163L6050j03136j30084q0439n9508n4052J0313R3360P1800p5764k27364
$$ plain form
37845 -85778 72150 157271 -56498 -407656 -503477 -239109 78127 152422 16358 -149525
37835 -149525 -292553 -443736 -557547 -558409 -464209 -345657 -234260 -158258 -175005 -264899 -287154
37824 -287154 -158394 9187 71478 67403 121234 205117 184158 66173 6826 48088 47590
37813 47590 -64606 -139863 -43113 108601 105836 -29813 -66459 94659 272213 274217 175641
37802 175641 188226 323642 365728 202374 14172 21954 167869 213363 99415 19561 118506
37791 118506 296193 379514 338491 237219 102776 -32484 -64025 59526 204837 192230
37781 192230 35912 -80062 -44449 80889 186459 222509 186880 119665 114343 229071 379163
37770 379163 415213 312077 181993 101554 42046 -12006 -1693 91667 163467 87703 -139661
37759a39661k51677j17548R2552K25357J73081r71j20836j08418k6554R9318L06230
37748A30873M70814L18224j59337n21457l85547M9057K78388J67888J4868J5599
37738C79370M7583j091m7243m4712q9671j84476j75982m4270K1638l6823k0719
37727a96396J46395K05582l0238l08849k74556J0012J89230J38070M0832J1139
37717f8779m5165j72929k49073j83361l3675J25825K69285L16305J57291j47347
37707c1623l52921k98847p8410J09651J63455R4806k3899p5187J7324J60207J65498
37696a49946Q358j20894q8966j97m471o1451l7487O2350J15387P4854k283p5973
37684b80719j29884r6578O5620K33066K18795L4026j07851q5594q747Q85l461
$$ plain form
37759 -139661 -391338 -508886 -416334 -190977 -17896 -18867 -139703 -248121 -274675 -175357 130873
37748 130873 601687 919911 760574 239117 -146430 -97373 181015 348903 363771 379370
37738 379370 426953 425862 378619 333907 244236 59760 -116222 -160492 -138854 -175677 -196396
37727 -196396 -50001 155581 125343 -183506 -458062 -448050 -258820 -120750 -79918 -68779
37717 -68779 -113944 -286873 -535946 -719307 -752982 -627157 -357872 -41567 115724 -31623
37707 -31623 -384544 -683391 -761801 -652150 -488695 -393889 -417788 -492975 -475651 -315444 -149946
37696 -149946 -141588 -262482 -351448 -351645 -356116 -417567 -455054 -392704 -277317 -202463 -204746 -280719
37684 -280719 -410603 -507181 -441561 -208495 10300 44326 -63525 -149119 -157866 -156981 -160442
37673a60442N6964R7829M595j38601j45825j8003N7550K557m5915K3351J20023
37662a45917J10569J3057p8289j46633k00121j63395J7970K17562K39521Q2799
37652e2877n1776k9099P9661J44396J28949N5414n5525j43612j19674L800Q3952
37641D3609L0532o3967o3528J8081O4721L9217M120m805j2678k2015K27L9832
37629G3346K7931n6028j39077j42811p1483J3352P3179J20683J76330K10325J47134
37618D32881l9026k38912k83753j37809M4994J02043L9278k8254m3743l2982j7455
37607b02738k209j4027n6264o2135P129O2705J0403o9745k3334J16153J49717
37596h4345K5017o4788K7325J79605J82494J3910j76680k51084j52927Q4535K93296
$$ plain form
37673 -160442 -103478 -5649 -1054 -139655 -285480 -303483 -245933 -243376 -289291 -265940 -145917
37662 -145917 -35348 -22291 -100580 -247213 -447334 -610729 -592759 -375197 -135676 -52877
37652 -52877 -104653 -133752 -54091 90305 219254 274668 219143 75531 -44143 -40343 43609
37641 43609 74141 10174 -53354 -35273 29448 68665 72785 67980 55302 33287 33514 73346
37629 73346 101277 45249 -93828 -236639 -308122 -294770 -221591 -100908 75422 285747 432881
37618 432881 393855 154943 -128810 -266619 -221625 -119582 -80304 -108558 -152301 -185283 -202738
37607 -202738 -204947 -218974 -275238 -337373 -330244 -267539 -257136 -326881 -350215 -234062 -84345
37596 -84345 -59328 -124116 -96791 82814 265308 279218 102538 -148546 -301473 -216938 76358
37585G6358K62574P552j79962r9637P5474P6302m4198l9931P2357K3603k27084
37574C408l66941k03844L4241O5047k6230K2675K07790K84308J58699p626p8998
37563I2529r9692j27049j06071J646R8969O8457o0885j44270r1482M3359J33163
37552a91326J13113L5636j6740n0372j27641k10624j49192R9766L40696L51699
37542A95015J68937K0413Q928J3970q4405k31350k91351k06930k0933J68646K45375
37531a3685J57340l157q4009n6610k7519o0115r9002r3647o8700k9298O8419J88005
37519a21978J91220M0314r9925p7364L0583M3271n7008j23796p1790K3520M8108
37508a74845j4615p3936k3148J29651K15692P8739j83292k82418j07894J23263
$$ plain form
37585 76358 338932 346484 166522 66885 142359 218661 174463 134532 206889 230492 3408
37574 3408 -363533 -567377 -533136 -468089 -494319 -471644 -263854 20454 179153 171527 92529
37563 92529 -7163 -134212 -240283 -238637 -139668 -71211 -132096 -276366 -367848 -324489 -191326
37552 -191326 -78213 -42577 -59317 -109689 -237330 -447954 -597146 -497380 -156684 195015
37542 195015 363952 384365 393293 407263 322858 91508 -199843 -406773 -427706 -259060 -13685
37531 -13685 143655 140498 56489 -121 -27640 -87755 -186757 -280404 -349104 -378402 -309983 -121978
37519 -121978 69242 109556 9631 -67733 -37150 6121 -50887 -174683 -246473 -222953 -174845
37508 -174845 -189460 -263396 -286544 -156893 58799 137538 -45754 -328172 -436066 -312803
37498c12803J81620J18258Q9227O6958m0297j18391Q566K24362K20921l6917k44273
37487A57231k11796r8205p8938o3704P3120K07245J42804o3569j81090j28290
37477b45192k5185K5237L3053K7619J9536M1945J04795J28906M4337p1309p7729
37466F013K3310R7758Q5231N6870N5723K4461o0486j14193p9755l4445o5174j18083
37454a22770q2725K2451O8073N365p3906q5918n6909l3146J2517J06834J84820
37443e5314J71482J06095P7551P1400O498r4197j17365n4749k2989m8595j1367
37432B8450J19808J84795R1107j3844j14M598j35110k46478r5420J65101J64197
37421B67090r8796k29217n7344J11415J1722j82777j95146o2922M3747J44886
$$ plain form
37498 -312803 -131183 -12925 76302 143260 102963 -15428 -6862 217500 438421 401504 157231
37487 157231 -54565 -152770 -231708 -295412 -222292 -15047 127757 64188 -116902 -245192
37477 -245192 -270377 -245140 -212087 -184468 -164932 -122987 -18192 110714 155051 83742 6013
37466 6013 29323 127081 212312 269182 324905 349366 288880 174687 94932 60487 -4687 -122770
37454 -122770 -205495 -183044 -114971 -109606 -183512 -269430 -326339 -359485 -346968 -240134 -55314
37443 -55314 116168 222263 299814 371214 377712 283515 166150 111401 88412 39817 28450
37432 28450 148258 333053 424160 410316 410202 414800 279690 33212 -62208 102893 267090
37421 267090 168294 -60923 -118267 -6852 4870 -177907 -373053 -435975 -392228 -247342
37411b47342K83229K70907l0983l42423k71071Q9365K64469R5338o9762M0410
37401H2137K22772J71752m8262j53076p6823k195l7758r3800p4927k5108l8867
37390g4155j27335k15465k21044j11579P7772K50409K92453J59573n6035j81200
37380b06606j36808l5357k8257p4765R911K49044M04870K85629J6847j39145j28679
37369B16684r6196j05429q1712j3864q77n7390n4431P2588J98281J72484Q637
37358B58775j60266k26363j55330J4741J59501J41942k0222j25597j3342K19077
37348I2916L05146J17147j77332k99526j73561O71J2591r1867j08497N4M9703
37337b72555n3820j41891m7037J26111J73230J02160N8979M5555l7117j21528
$$ plain form
37411 -247342 35887 306794 275811 -66612 -337683 -248318 16151 111489 41727 82137
37401 82137 304909 476661 428399 275323 198500 196305 158547 64747 -10180 -35288 -74155
37390 -74155 -201490 -416955 -637999 -749578 -671806 -421397 -128944 30629 -25406 -206606
37380 -206606 -343414 -378771 -407028 -481793 -471882 -222838 182032 467661 484508 345363 216684
37369 216684 120488 15059 -66653 -80517 -81394 -138784 -193215 -120627 77654 250138 258775
37358 258775 98509 -127854 -283184 -268443 -108942 33000 12778 -112819 -126161 92916
37348 92916 398062 515209 337877 38351 -135210 -134539 -121948 -213815 -322312 -322258 -272555
37337 -272555 -326375 -468266 -515303 -389192 -215962 -113802 -54823 -9268 -46385 -167913
37327a67913l0251J91840K72484R8047j33449k18523j80993j09906O664J56563
37317a15437K12488J19564J5596J8645L8955m9589j84737k23525j66739j15922
37307d50701q9544l3203M8687J05628J37319J67676J71482J15856J8406j00363
37297I1243k34907l05822j88677O9710K15800J16860j8811O1813K61204K70095
37287C38508L7848j54585j04422O4742J32679O9553j1482n1606p2567p6989l4151
37276A37528M5523Q9584L6120q8513j81402j70896j03455p7885r3967m4674J08379
37265c43658K40211K13382N5884r1566j50996j44998j03914k9508O4593J48476
37255a42094K02943K07160J31731o446j16975j14693l878J37193K12579J46339
$$ plain form
37327 -167913 -198164 -6324 266160 364207 230758 12235 -168758 -278664 -272000 -115437
37317 -115437 97051 216615 232211 250856 289811 240222 55485 -168040 -334779 -450701
37307 -450701 -540245 -573448 -524761 -419133 -281814 -114138 57344 173200 191606 91243
37297 91243 -143664 -449486 -638163 -568453 -352653 -235793 -254604 -192791 68413 338508
37287 338508 376356 221771 117349 182091 314770 384323 372841 321235 248668 171679 137528
37276 137528 183051 272635 308755 220242 38840 -132056 -235511 -313396 -407363 -452037 -343658
37265 -343658 -103447 109935 165819 74253 -76743 -221741 -325655 -355163 -290570 -142094
37255 -142094 60849 268009 399740 393294 276319 161626 157748 294941 507520 653859
37245F53859n0824k31005k29981p8567K0071k9842r8697o5050o147l2943q3869
37234b32995m6321L1839L0825k6278k7103K4383L2079q563j9977J221J825J4521
37222b24544J14969K49599K64665J12705r5184k33673k51619j56096k6811Q061
37212b37928o0969n7059J28413L04794K15048o4194k02545q3538O1316K6025r8296
37201f8933j11565K2555J91472K86077K56364J14868o0813j95491k81276l04782
37191a51524j86143P1828K62564K02823J5043m3251K8402K0364q9688j07357k415
37180B0646K4594p3261q6273M8706Q7887r5290k47991j32078R8706J72106J01233
37169h1015M0753l3510j88448k62217p6512J93815K08621l2159j92644r9410O6534
$$ plain form
37245 653859 603035 372030 142049 63482 83553 53711 -44986 -110036 -116183 -149126 -232995
37234 -232995 -279316 -247477 -216652 -242930 -270033 -245650 -213571 -222134 -242111 -240890 -239065 -224544
37222 -224544 -109575 140024 404689 517394 422210 188537 -63082 -219178 -245989 -237928
37212 -237928 -298897 -355956 -227543 77251 292299 228105 25560 -57978 3338 29363 -68933
37201 -68933 -180498 -157943 33529 319606 575970 690838 630025 434534 153258 -151524
37191 -151524 -337667 -265839 -3275 199548 214591 171340 199742 220106 130418 23061 20646
37180 20646 45240 -28021 -114294 -65588 22299 -72991 -320982 -453060 -354354 -182248 -81015
37169 -81015 -40262 -73772 -262220 -524437 -600949 -407134 -198513 -230672 -423316 -522726 -456192
37158d56192J06850N6920K0612j5953q8986j31635o0343R4462K15805K13756R1907
37147D7203n4451j11828o2567k412j3425p4863j31824j61577j24092L2813K41648
37136d15375L20547K11640P6537L9403l76j39368k28498q8771J59883K40996J12403
37125B89021l5193j05058j55954j77668q5592N6795Q0023K372J9616J52093J71609
37114B12064k2583k05015j47013N8902J60682R0881r806k2199L4841P3751L6340
37103B60845n4925j16482j08378r3362j19176j04045K7463J57869J17342k7351
37093f0200n6442L8969N1240m7012j7371K08320L26722J23065j39085r3625J50898
37082D85479J64964j48940m12854l18553j7190J46271O7490r2383j70375j34127
$$ plain form
37158 -456192 -349342 -292422 -271810 -287763 -376749 -508384 -568727 -474265 -258460 -44704 47203
37147 47203 -7248 -119076 -181643 -184055 -197480 -272343 -404167 -565744 -689836 -657023 -415375
37136 -415375 -94828 116812 193349 232752 232376 93008 -135490 -224261 -64378 176618 289021
37125 289021 253828 148770 -7184 -184852 -270444 -213649 -133626 -131254 -111638 40455 212064
37114 212064 189481 -15534 -162547 -103645 57037 147918 138112 115913 150754 224505 260845
37103 260845 205920 89438 -18940 -112302 -231478 -335523 -308060 -150191 -32849 -60200
37093 -60200 -116642 -77673 -26433 -73445 -90816 117504 444226 567291 428206 334581 485479
37082 485479 650443 501503 88649 -229904 -247094 -100823 -33333 -125716 -296091 -430218
37072d30218k1744J07755J68355R6306n5550j30320l1740J41898J96137Q5971
37062A26850j9602K5146J31855J21609Q605l5299J8648K657j46955k49156j62295
37051a77937k5607l9674j41989j15816N1834J48036O4857n2417l6720Q2770J69301
37040g3362J64681R8965j741j18644j89383j46214j6327P4512L5343p4411j05681
37029c52262j225J32786J70595J29745J18069J55667J57145Q9473K7614J6659
37019F44266q683j01523j91463j76576o7149L0379L1506o1867j62380j47819P048
37008b04261J42066P8888j03555j31899N9242J93077N8541j47739j08005J34142
36998b9503K48309J05089q7831j35676q5395n3913m8172l9131m2701m4407J5381
$$ plain form
37072 -430218 -451962 -344207 -175852 -79546 -135096 -265416 -297156 -155258 40879 126850
37062 126850 107248 132394 264249 385858 394463 359164 377812 380469 233514 -15642 -177937
37051 -177937 -203544 -243218 -385207 -501023 -449189 -301153 -236296 -288713 -325433 -242663 -73362
37040 -73362 91319 190284 188543 69899 -119484 -265698 -282025 -207513 -172170 -246581 -352262
37029 -352262 -353487 -220701 -50106 79639 197708 353375 510520 599993 627607 644266
37019 644266 635583 534060 342597 166021 98872 129251 160757 98890 -63490 -211309 -204261
37008 -204261 -62195 16693 -86862 -218761 -159519 33558 92099 -55640 -163645 -29503
36998 -29503 218806 323895 236064 100388 14993 -38920 -87092 -126223 -168924 -213331 -197950
36987a97950J12837J30473L9395l7523r710N7795P1178L6790n854o1172j11746
36976B4513q7354J8338R8285P4026l554n2696n5576o115J03471J82661R1275j17540
36964B69734j83249q624J38578k424k70098l00710o3076J26498R5533J0304K9672
36953a57862N9166k0094j13621p5992N2083J29430J11894K8428j06999k13006
36943c06573j15627J96707M10142K22878k07352m10807k07749R0600J42997p345
36933a92129j07298p0805P449P1759J26838J14836k3348j85533j89771k9254J11594
36922c65662J19011P7286Q8653J07227L5352j10103k09456j65898J6613K16396
36912a90581K46284L1802k36415k64266k4526J86249J50222J4280K1572J26100
$$ plain form
36987 -197950 -85113 45360 84755 47232 37522 95317 166495 203285 197431 136259 24513
36976 24513 -62841 -44503 53782 127808 124254 71558 15982 9867 113338 295999 387274 269734
36964 269734 86485 77861 216439 214015 -56083 -356793 -419869 -293371 -197838 -187534 -157862
36953 -157862 -98696 -118790 -232411 -308403 -256320 -126890 -14996 13432 -93567 -306573
36943 -306573 -422200 -225493 184649 407527 200175 -210632 -418381 -327781 -184784 -192129
36933 -192129 -299427 -370232 -362783 -291024 -164186 -49350 -72698 -258231 -448002 -477256 -365662
36922 -365662 -246651 -169365 -80712 26515 61867 -48236 -257692 -423590 -406977 -190581
36912 -190581 55703 87505 -148910 -413176 -437702 -251453 -101231 -86951 -65379 60721
36902F0721J09952k4307o4686L3045P4411j9696p2165K4752J05143K2892p9588
36891A70474k4568O3537m0517k38974k18998L1882J57680k4561k20956r5943K16720
36880b24224L11216J01693q5444j6683J35449J06401n1745q6618M2687J20016
36870C52748L7675l6882L7700J16564O785j67596j06139J83386L24293Q9534k62263
36859E75805l45469j58896q997l8407r9485o7917j4059j1683p211K5610n149j26765
36847b82623j94114j03012L0712N9377M4624J28144K58029K54562J03138k7978
36837B70859n1595l7905j5863P8644J95200J37895j23188l00994j47822J61061
36827A66292K27070l2765k74226j92268R1433K15041L6630k21942k60781l4311
$$ plain form
36902 60721 170673 146366 81680 114725 189136 169440 97275 122027 227170 250062 170474
36891 170474 145906 209443 168926 -70048 -289046 -257164 -99484 -124045 -345001 -440944 -224224
36880 -224224 86992 188685 103241 86558 222007 328408 276663 190045 232732 352748
36870 352748 390423 353541 391241 507805 514590 346994 240855 424241 748534 838068 575805
36859 575805 230336 71440 62443 24036 -75449 -143366 -157425 -169108 -176319 -150709 -155858 -282623
36847 -282623 -476737 -579749 -549037 -489660 -445036 -316892 -58863 195699 298837 270859
36837 270859 219264 181359 165496 244140 439340 577235 454047 153053 5231 166292
36827 166292 393362 360597 86371 -105897 -14464 200577 237207 15265 -245516 -279827
36817b79827K20809K47442L5350j73751j51947O0217K04462J11192j07530k14328
36807d7911j40746l6827l8799r9383j04049n9601n2697p0761j5775R3439J00493
36796d72617k9605r2587O4901K64654K17682m2149j94640j03492K1860R124j4899
36785c71768Q4397J53723J7479j45161l1458K55863K87127m4513l13850j63957
36775b72118J83072K65173K6497j76605j25237J5810K9527m1368l8582L2054L6112
36764f5665m8436r0133j4105P0483K0166j27891j80924l5928J73306K27937R0759
36753A9569m9490j2251J58167K58436J79190K4163m4024k0546m5573j74167k56081
36742C7393j31229J09564J98838M4776j37343j25397J2997O2296o498l5960K4803
$$ plain form
36817 -279827 -59018 188424 223774 50023 -101924 -41707 162755 273947 166417 -47911
36807 -47911 -188657 -225484 -264283 -363666 -467715 -527316 -580013 -650774 -666549 -573110 -472617
36796 -472617 -502222 -594809 -529908 -265254 -47572 -89721 -284361 -387853 -365993 -356869 -371768
36785 -371768 -287371 -133648 -116169 -261330 -292788 -36925 250202 205689 -108161 -272118
36775 -272118 -89046 176127 202624 26019 -99218 -83408 -53881 -95249 -133831 -101777 -65665
36764 -65665 -114101 -204234 -218339 -147856 -127690 -255581 -436505 -472433 -299127 -71190 19569
36753 19569 -29921 -42172 115995 374431 553621 577784 533760 513214 467641 293474 37393
36742 37393 -93836 15728 214566 259342 121999 -3398 9599 71895 65397 29437 54240
36731E4240M6768k3155l9604J00723K52290K01227l5861k34327k39401j01031
36721a8131M6920J27247J24874M3402q9458j97771j82563p718K22038L10468J65133
36710E44441o9366j56795n3093N1866K437j22982j48653m9524L3752j2253j45513
36699a25683k22745j41631N6444K13782K16340J16445M3283K4853J292j4525N2833
36688B20688J58853J48343L004j03575q0207n2019j06566j21466j9177J8826j59382
36677i2678l42209k14537J42238L31983K01369K653l0661K9603L2362m895r943
36666D5285j3918n0089m6371M6883J36641J08943j8088j44007j99970j54035o576
36655b95302J58555K19254J64500R8054O1681j5168j48533k34909k17949j67428
$$ plain form
36731 54240 101008 77853 38249 138972 391262 592489 556628 322301 82900 -18131
36721 -18131 28789 156036 280910 324312 234854 37083 -145480 -153198 68840 379308 544441
36710 544441 475075 318280 265187 317053 319490 196508 47855 -1669 32083 19830 -125683
36699 -125683 -348428 -490059 -433615 -219833 -3493 112952 156235 181088 182380 167855 220688
36688 220688 379541 527884 530888 427313 347106 295087 188521 67055 47878 66704 -92678
36677 -92678 -434887 -649424 -507186 -175203 26166 28819 -1842 27761 60123 55228 45285
36666 45285 31367 -18722 -65093 -18210 118431 227374 209286 65279 -134691 -288726 -295302
36655 -295302 -136747 82507 247007 345061 406742 391574 243041 8132 -209817 -377245
36645c77245j16730R158J96555K47626M0831k43653l29580j83526Q097J13857
36635f34610J42109J19197O1072L5464R0216J32418K8444j75754k77739j83731
36625f62914k4038L8085R321J5790J12509K11692J95088O0831p1336j08301q9033
36614c12306q4748m9924R6293K57920K21381j1851j52349k2185J52008N8581k12137
36603e9317k74532j4558K30822J41539j62142l12842j72876N6108J47566J05736
36593c14496O9147P7173M2942o4169j31184o3905M9543N8967q267J0971J26974
36582a46304J38130o1101k85312l01781j33809K8854J08414J55954J77338J33968
36572a85649P4685Q6339J29803Q8495k8959r1309n0890Q35o432m0975n9161n4397
$$ plain form
36645 -377245 -493975 -484817 -288262 -40636 195 -243458 -573038 -756564 -748467 -634610
36635 -634610 -492501 -373304 -312232 -276768 -186552 -54134 -25690 -201444 -479183 -662914
36625 -662914 -686952 -648867 -639546 -623756 -511247 -299555 -104467 -43636 -114972 -223273 -312306
36614 -312306 -397054 -446978 -350685 -92765 128616 116765 -35584 -57769 94239 152820 -59317
36603 -59317 -333849 -348407 -117585 23954 -138188 -451030 -623906 -567798 -420232 -314496
36593 -314496 -245349 -168176 -125234 -189403 -320587 -384492 -334949 -275982 -284249 -273278 -146304
36582 -146304 -8174 -69275 -354587 -656368 -790177 -761323 -652909 -496955 -319617 -185649
36572 -185649 -110964 -24625 105178 193673 164714 73405 22515 23350 16918 -24057 -83218 -137615
36560a37615j3695O0385R9310N8682K0032N7949O1743j08865l22325k83884J9690
36549d88593K47084J74551m229p270J18266J21819m6053j86922j57439k2165Q6870
36538a64081J09793N0543m8470j03911n4464N3334J05884N9985j2314k4316K6101
36527a916P7948J00602J27797J78632J75738K3641k06850k81553q8323J69118
36517B74834K06954K9024j19607j28825j27249j88236j81093k2668J34731J22848
36507G13P524m3051j5533j1229m5221n0060j4569K4281O9813J19475R8426l0018
36495A10551j56144j63029j06296j08430j39816p5683O9143J42538Q8026J2926
36485c26214Q296M0893M7128J6668l5785q2825o9543J4962P0427L753j09580j14384
$$ plain form
36560 -137615 -151310 -90925 8385 67067 87099 145048 206791 97926 -224399 -508283 -488593
36549 -488593 -241509 -66958 -71187 -78457 39809 161628 115575 -71347 -228786 -250951 -164081
36538 -164081 -54288 -3745 -52215 -156126 -210590 -157256 -51372 8613 -3701 -28017 -1916
36527 -1916 76032 176634 304431 483063 658801 682442 475592 194039 105716 274834
36517 274834 481788 510812 391205 262380 135131 -53105 -234198 -256866 -122135 713
36507 713 8237 -34814 -50347 -61576 -106797 -156857 -171426 -147145 -77332 42143 140569 110551
36495 110551 -45593 -208622 -314918 -423348 -563164 -638847 -569704 -427166 -339140 -326214
36485 -326214 -317918 -277025 -229897 -213229 -249014 -331839 -401382 -386420 -315993 -312240 -421820 -536204
36473e36204n938Q0490J02934J59661K72197K99040J45615p5098j81107j26743
36463A34847o499N9038l210j62974k65644j72782L9444J42568N9644l3131K5991
36452a82708J66486K35535K20824J89338J27137J540j05192r2842j7726j1396
36442E30996o9872q4862m9850n8644j06646p6097N2320J40566R4865k1901j27166
36431B23709k12013k37130j14163R9883J63927k6328k21111j29256J50207K55601
36421d6674Q3380q9447m3893Q6108Q0587k7194o2392m489L2485J8705P888j9582
36409A5482j16178k08478j76423o9802l8889n6685N1333K66137L28826J40843
36399A36166m5299p050J04801L5825j43277j67379k5550L9063m9925r5058J3921
$$ plain form
36473 -536204 -542142 -461652 -358718 -199057 73140 372180 517795 442697 261590 134847
36463 134847 128348 187386 184176 21202 -244442 -417224 -377780 -235212 -175568 -208699 -182708
36452 -182708 -16222 219313 440137 629475 756612 758152 652960 560118 542392 530996
36442 530996 461124 376262 326412 267768 161122 85025 137345 277911 372776 350875 223709
36431 223709 11696 -225434 -339597 -239714 -75787 -102115 -323226 -452482 -302275 -46674
36421 -46674 36706 -52741 -96634 -10526 70061 42867 -19525 -24014 8471 27176 35064 15482
36409 15482 -100696 -309174 -485597 -555399 -594288 -650973 -599640 -333503 -4677 136166
36399 136166 90867 83817 188618 224443 81166 -86213 -111763 -72700 -122625 -217683 -203762
36388b03762J17724P2720k3554l4523j2519n8116j09914n7183N2244R7917R3689
36377f5277J25924J51852N9987r5171j25938J8R9109N9860O093O3233J25744L2124
36365D37558j28696j04665J28208K73664J08601j85864k45457l621K29389J82885
36355F92002m4542j63011q2244K0450j4421j25728j56497p7067j238j9606r1458
36344f3360j09028k7661R0144J50071J23596N6593l737m9773p4264m8620J4399
36333E8360K6316p1929j93407j84613l0923J04039Q0897m3961j02584k3241J05889
36322b75157J58765J04471J8156r632L2355O5912J4125j01233j76641j44300m3721
36311c56900L4780M9598L1462K7030M3408N1687L7264K8032M5530L9532o0730
$$ plain form
36388 -203762 -86038 -13318 -36872 -71395 -83914 -142030 -251944 -309127 -256883 -158966 -65277
36377 -65277 60647 212499 272486 177315 51377 51395 150504 210364 216457 279690 405434 437558
36365 437558 308862 204197 332405 606069 714670 528806 283349 279728 509117 692002
36355 692002 647460 484449 402205 422655 408234 282506 126009 48942 47704 28098 -63360
36344 -63360 -172388 -200049 -109905 40166 163762 220355 216618 166845 92581 43961 58360
36333 58360 84676 12747 -180660 -365273 -396196 -292157 -211260 -255221 -357805 -381046 -275157
36322 -275157 -116392 -11921 6235 -3397 28958 94870 108995 7762 -168879 -313179 -356900
36311 -356900 -322120 -272522 -241060 -214030 -170622 -118935 -81671 -53639 -8109 31423 -29307
36300b9307k01246j96428L7669K99314K86635k8016l38096l58142j25019J19317
36290e33319K34644K58307K41137J56992K073j21547j04120J6308P3555k1219
36280B02811j49583j36303k254N5846l3724r2817J8939J40883L8481j97744k43461
36269c98926k4992J64961J09521l9022m8756M2127O0171j381l7321n2083r6295
36258c21996q3978Q3245K70488K34016k3345k40452k41226q9398R1895K36367
36248h4384K57304Q6409j53477k24194r1601K7382P869p418J14665K55600K40730
36237D28885J10466J9885o076m2342q8033r0809p0656o5516k7625P4649J31997
36226C74825M1756q9289q1321K5167K2494j26227k19567j29471J7801N2571j0670
$$ plain form
36300 -29307 -230553 -426981 -389312 -89998 196637 168621 -169475 -527617 -652636 -533319
36290 -533319 -298675 -40368 200769 357761 359834 238287 134167 150475 224030 202811
36280 202811 53228 -83075 -85329 -29483 -63207 -156024 -137085 3798 42279 -155465 -398926
36269 -398926 -423918 -258957 -149436 -188458 -237214 -195087 -134916 -136297 -173618 -225701 -321996
36258 -321996 -405974 -322729 -52241 181775 158430 -82022 -323248 -412646 -320751 -84384
36248 -84384 172920 259329 105852 -118342 -209943 -182561 -174692 -182110 -67445 188155 428885
36237 428885 539351 559236 553160 510818 422785 331976 261320 195804 168179 242828 374825
36226 374825 416581 327292 245971 271138 293632 167405 -52162 -181633 -163832 -111261 -121931
36215a21931n7492n4792l6451l267N2746Q7083N9795P851j4233k0110m8588p9939
36203b29328o5971o807O6462J45511K12492J97026N5942j21328j79312p9479N4511
36192D9719Q9783J9375p5853j37945j61604j51996j05394l1811K9964L3982k8318
36181d70098r9994r4076J4440J42387J83777J40909J18987J70256K00154Q5057
36171C91799j43332l00276k47248m2010J32911J58508O8004k9242p2159q7350
36161a70395j23631j68630j49081k3631J40909K16348J40655k2656j52431j69073
36151d81616o8881R1843K25049K63281K12702J27617K8444r4283j82119j23252
36141a215O1368J55288P982k12416k07050L4112K03003J03226r3372j22168J5436
$$ plain form
36215 -121931 -179423 -234215 -270666 -273933 -221187 -134104 -74309 -66458 -80691 -100801 -149389 -229328
36203 -229328 -295299 -302106 -235644 -90133 122359 319385 375327 253999 74687 -4792 49719
36192 49719 139502 158877 83024 -54921 -216525 -368521 -473915 -505726 -475762 -441780 -470098
36181 -470098 -570092 -664168 -649728 -507341 -323564 -182655 -63668 106588 306742 391799
36171 391799 248467 -51809 -299057 -341067 -208156 -49648 18356 -10886 -83045 -170395
36161 -170395 -294026 -462656 -611737 -635368 -494459 -278111 -137456 -160112 -312543 -481616
36151 -481616 -550497 -458654 -233605 29676 242378 369995 398439 304156 122037 -1215
36141 -1215 60153 215441 223423 11007 -196043 -161931 41072 144298 50926 -71242 -55806
36130e5806J16987P7781l7390j37373j64395p5724Q2564J39561p136k08641k34586
$$ plain form
36130 -55806 61181 138962 101572 -35801 -200196 -275920 -193356 -53795 -60931 -269572 -504158
$$ [...]
##END NTUPLES=NMR SPECTRUM
##END=
