##TITLE=31Pdec_IBDPCO0102
 CDCl3, 24 sc
 5.2.2019
##JCAMPDX= 6.0         $$ Bruker NMR JCAMP-DX V2.0
##DATA TYPE= NMR SPECTRUM
##DATA CLASS= NTUPLES
##ORIGIN= UXNMR, Bruker Analytische Messtechnik GmbH
##OWNER= root
$$ XWIN-NMR		Version 3.5
$$ Tue Feb  5 16:11:59 2019 Russian Standard Time (UT+4h)  she@DPX200
##.OBSERVE FREQUENCY= 81.013821
##.OBSERVE NUCLEUS= ^31P
##.ACQUISITION MODE= SIMULTANEOUS
##.ACQUISITION SCHEME= undefined
##.AVERAGES= 24
##.DIGITISER RES= 17
##SPECTROMETER/DATA SYSTEM= spect
##.PULSE SEQUENCE= zgpg30
##.SOLVENT NAME= DMSO
##.SHIFT REFERENCE= (INTERNAL, DMSO, 0, 182.463)
##AUDIT TRAIL= $$ (NUMBER, WHEN, WHO, WHERE, WHAT)
$$ ##TITLE= Audit trail, XWIN-NMR		Version 3.5
$$ ##JCAMPDX= 5.01
$$ ##ORIGIN= Bruker BioSpin GmbH
$$ ##OWNER= she
$$ F:/spectra/data/she/nmr/P31/1/pdata/1/auditp.txt
$$ ##AUDIT TRAIL=  $$ (NUMBER, WHEN, WHO, WHERE, WHAT)
(   1,<2019-02-05 16:10:52.57 +0400>,<she>,<DPX200>,
      <created by zg, POWCHK disabled, PULCHK disabled
       configuration hash MD5:
       00 E9 B6 7A A2 85 ED C7 34 08 36 98 17 FE 4E 26
       data hash MD5: 32K
       DA B0 AE 9F DE 4D EA 81 01 D9 5B 3E 3C D3 02 19>)
(   2,<2019-02-05 16:10:54.98 +0400>,<she>,<DPX200>,
      <Start of raw data processing
       efp BC_mod = 2 LB = 1 FT_mod = 6 PKNL = 1 PHC0 = -1469.205 PHC1 = 113.399 SI = 64K 
       data hash MD5: 64K
       87 63 DA AA 90 BE 88 B9 77 DD 07 4E 1D 6C 24 4B>)
(   3,<2019-02-05 16:11:14.42 +0400>,<she>,<DPX200>,
      <pk PHC0 = 2.494028 PHC1 = 0 
       data hash MD5: 64K
       D3 FA 2D 15 96 53 29 28 89 02 F1 46 ED 19 1E 24>)
(   4,<2019-02-05 16:11:18.34 +0400>,<she>,<DPX200>,
      <abs ABSG = 5 
       data hash MD5: 64K
       0E 12 0E DF 1C 6E DF 36 DA 24 C9 A5 93 91 4D 54>)
$$ ##END=
$$ 
$$ hash MD5
$$ 58 32 58 63 E9 76 A3 19 09 35 5A 01 21 7B 9A F6
##$RELAX= 
##$RELAX= 
##$RELAX= 
##$RELAX= 
##$RELAX= 
##$RELAX= 
##$RELAX= 
##$RELAX= 
$$ Bruker specific parameters
$$ --------------------------
##$DU= <F:/spectra>
##$EXPNO= 1
##$NAME= <P31>
##$PROCNO= 1
##$TYPE= <nmr>
##$USER= <she>
##$AMP= (0..31)
100 100 100 100 100 100 100 100 100 100 100 100 100 100 100 100 100 100 
100 100 100 100 100 100 100 100 100 100 100 100 100 100 
##$AQSEQ= 0
##$AQ_mod= 1
##$AUNM= <au_zg>
##$AUTOPOS= <>
##$BF1= 81.014009
##$BF2= 200.13
##$BF3= 200.13
##$BF4= 200.13
##$BF5= 200.13
##$BF6= 200.13
##$BF7= 200.13
##$BF8= 200.13
##$BYTORDA= 1
##$CFDGTYP= 0
##$CFRGTYP= 5
##$CHEMSTR= <none>
##$CNST= (0..31)
1 1 145 1 1 1 1 1 1 1 1 1 1 1 1 1 1 1 1 1 1 1 1 1 1 1 1 1 1 1 1 1 
##$CPDPRG= <waltz16>
##$CPDPRG1= <>
##$CPDPRG2= <waltz16>
##$CPDPRG3= <>
##$CPDPRG4= <mlev>
##$CPDPRG5= <mlev>
##$CPDPRG6= <mlev>
##$CPDPRG7= <mlev>
##$CPDPRG8= <mlev>
##$CPDPRGB= <>
##$CPDPRGT= <>
##$D= (0..31)
0 1 0 0 0 0 0 0 0 0 0 0.03 2e-05 3e-06 0 0 0 0 0 0 0 0 0 0 0 0 0 0 0 0 
0 0 
##$DATE= 1549368652
##$DBL= (0..7)
120 120 120 11 120 120 24 19 
##$DBP= (0..7)
150 150 150 150 150 150 150 150 
##$DBP07= 0
##$DBPNAM0= <>
##$DBPNAM1= <>
##$DBPNAM2= <>
$$ [...]
##$SUBNAM3= <"">
##$SUBNAM4= <"">
##$SUBNAM5= <"">
##$SUBNAM6= <"">
##$SUBNAM7= <"">
##$SUBNAM8= <"">
##$SUBNAM9= <"">
##$SW= 369.568048894756
##$SWIBOX= (0..15)
0 1 3 0 0 0 0 0 0 0 0 0 0 0 0 0 
##$SW_h= 29940.119760479
##$TD= 32768
##$TD0= 1
##$TE= 0
##$TE2= 300
##$TE3= 300
##$TEG= 300
##$TL= (0..7)
0 120 53 12 22 120 120 120 
##$TP= (0..7)
150 150 150 150 150 150 150 150 
##$TP07= 0
##$TPNAME0= <>
##$TPNAME1= <>
##$TPNAME2= <>
##$TPNAME3= <>
##$TPNAME4= <>
##$TPNAME5= <>
##$TPNAME6= <>
##$TPNAME7= <>
##$TPOAL= (0..7)
0.5 0.5 0.5 0.5 0.5 0.5 0.5 0.5 
##$TPOFFS= (0..7)
0 0 0 0 0 0 0 0 
##$TUNHIN= 0
##$TUNHOUT= 0
##$TUNXOUT= 0
##$USERA1= <user>
##$USERA2= <user>
##$USERA3= <user>
##$USERA4= <user>
##$USERA5= <user>
##$V9= 5
##$VALIST= <valist>
##$VCLIST= <CCCCCCCCCCCCCCC>
##$VD= 0
##$VDLIST= <DDDDDDDDDDDDDDD>
##$VPLIST= <PPPPPPPPPPPPPPP>
##$VTLIST= <TTTTTTTTTTTTTTT>
##$WBST= 1024
##$WBSW= 4
##$XGAIN= (0..3)
0 0 0 0 
##$XL= 0
##$YL= 0
##$YMAX_a= 61219
##$YMIN_a= -66473
##$ZGOPTNS= <>
##$ZL1= 120
##$ZL2= 120
##$ZL3= 120
##$ZL4= 120
##$ABSF1= 182.463
##$ABSF2= -187.1042
##$ABSG= 5
##$ABSL= 3
##$ALPHA= 0
##$AQORDER= 0
##$ASSFAC= 0
##$ASSFACI= 0
##$ASSFACX= 0
##$ASSWID= 0
##$AUNMP= <proc_1d>
##$AZFE= 0.1
##$AZFW= 0.5
##$BCFW= 0
##$BC_mod= 2
##$BYTORDP= 0
##$COROFFS= 0
##$CY= -3
##$DATMOD= 1
##$DC= 0
##$DFILT= <>
##$DTYPP= 0
##$F1P= 0
##$F2P= 0
##$FCOR= 1
##$FTSIZE= 65536
##$FT_mod= 6
##$GAMMA= 0
##$GB= 0
##$INTBC= 1
##$INTSCL= 5.30512e-09
##$ISEN= 30
##$LB= 1
##$LEV0= 0
##$LPBIN= 0
##$MAXI= 10000
##$MC2= 0
##$MEAN= 0
##$ME_mod= 0
##$MI= 50
##$NCOEF= 0
##$NC_proc= -3
##$NLEV= 6
##$NOISF1= 182.463
##$NOISF2= 159.3651
##$NSP= 0
##$NTH_PI= 0
##$NZP= 0
##$OFFSET= 182.463
##$PC= 4
##$PHC0= -1466.711
##$PHC1= 113.399
##$PH_mod= 1
##$PKNL= yes
##$PPARMOD= 0
##$PSCAL= 0
##$PSIGN= 0
##$REVERSE= no
##$SF= 81.0140089999434
##$SI= 65536
##$SIGF1= 159.3651
##$SIGF2= -187.1042
##$SINO= 113.3802
##$SIOLD= 16384
##$SREGLST= <1H.CDCl3>
##$SSB= 0
##$STSI= 65536
##$STSR= 0
##$SW_p= 29940.119760479
##$SYMM= 0
##$S_DEV= 0
##$TDeff= 32768
##$TDoff= 0
##$TI= <>
##$TILT= no
##$TM1= 0
##$TM2= 0
##$TOPLEV= 0
##$USERP1= <user>
##$USERP2= <user>
##$USERP3= <user>
##$USERP4= <user>
##$USERP5= <user>
##$WDW= 1
##$XDIM= 65536
##$YMAX_p= 497926649
##$YMIN_p= -3030015
$$ End of Bruker specific parameters
$$ ---------------------------------
##NTUPLES= NMR SPECTRUM
##VAR_NAME=  FREQUENCY,     SPECTRUM/REAL,   SPECTRUM/IMAG
##SYMBOL=    X,             R,               I
##VAR_TYPE=  INDEPENDENT,   DEPENDENT,       DEPENDENT
##VAR_FORM=  AFFN,          ASDF,            ASDF
##VAR_DIM=   65536,         65536,           65536
##UNITS=     HZ,            ARBITRARY UNITS, ARBITRARY UNITS
##FACTOR=    0.456856943014862, 1,           1
##FIRST=     14782.0589164792, 0,            0
##LAST=      -15158.0608439998, 0,           0
##MIN=       -15158.0608439998, -3030015,    0
##MAX=       14782.0589164792, 497926649,    0
$$ Real data points
##PAGE= N=1
##DATA TABLE= (X++(R..R)), XYDATA
$$ [...]
42476C1373k20121k21044K702K94810L60930J55513m0470k7741L5916q2104l12278
42465b2514l83665j99777O6376K13183K10717J63453J54040J48468O3573o9816
42455C44038r9426J1295N7716j21142l36057k76805Q952J69135Q1807J57R1693
42444f8637J79715R5175l0769k6943L7607M7176O0757J16015O2285j58591l04731
42433I059j88319q230j7268q2350N3084K61369K19252j8188r7526K5938M0393
42422A97214j31904j79446L5125K02226O5242j83564k56301j98491j85758j63801
42412g99458j1369J37042P4314q5341k9081K63186M42608K54441j38239l69564
42402b61461k69744J8881K36665K57979J72489J32056J41268P5477q8983j96277
$$ plain form
42476 31373 -188748 -409792 -407090 -112280 248650 404163 363693 335952 371868 289764 -22514
42465 -22514 -406179 -605956 -539580 -326397 -115680 47773 201813 350281 413854 344038
42455 344038 244612 255907 313623 192481 -143576 -420381 -411429 -242294 -160487 -160330 -68637
42444 -68637 111078 206253 175484 148541 186148 233324 294081 410096 472381 313790 9059
42433 9059 -179260 -187490 -204758 -287108 -234024 27345 246597 228409 130883 156821 197214
42422 197214 65310 -114136 -79011 123215 188457 4893 -251408 -449899 -635657 -799458
42412 -799458 -810827 -673785 -599471 -684812 -713893 -450707 -8099 246342 108103 -261461
42402 -261461 -531205 -512324 -275659 -17680 154809 286865 428133 503610 414627 218350
42392B18350j33409k229M0485K263j5898q164k9567n4344l0946j2357o1025q3351
42380a70192M6619K34311K49762O8795q5751q0429l7349r1097j77535j76451j03087
42369c22404l2994L3947J11268J38445P5609q324m6858p4087j10151p2792O4712
42358b43629J53388P5403l7887O009J40298J37770j6973j09311n3979r663o9400
42347b7974q7570N5080K18259J99265J8627j53123k43085k90185k94623k13055
42337h18384o2317R5590K31213L11963K59719O9269r2072m9058J42405K49179
42327C37507J39894r7605k91155l24617j75441O0223J95452J29340j4242m0838
42317h1482M6461P3642k3191j08509o5355M9532J17009R3386p406j43011k06327
$$ plain form
42392 218350 84941 82712 123197 125460 109562 101398 71831 17487 -13459 -25816 -86841 -170192
42380 -170192 -123573 110738 360500 429295 343544 263115 225766 134669 -42866 -219317 -322404
42369 -322404 -355398 -321451 -210183 -71738 3871 -4453 -51311 -125398 -235549 -308341 -243629
42358 -243629 -90241 -14838 -52725 -46716 93582 231352 214379 105068 51089 41426 -27974
42347 -27974 -115544 -60464 157795 357060 375687 222564 -20521 -310706 -605329 -818384
42337 -818384 -880701 -785111 -553898 -241935 17784 87053 -5019 -54077 88328 337507
42327 337507 477401 379796 88641 -235976 -411417 -351194 -155742 -26402 -40644 -81482
42317 -81482 -35021 38621 15430 -93079 -158434 -108902 8107 101493 94087 -48924 -255251
42306b55251r0093J45690K84891K04029J2835j10020j15870n9699J2108O3406
42296I2026M6128m0765j30321j69680j50814m8338J50137L25983L01675R3483
42286D69514p3116q1310p1272j57543k06107p6376R7805J04598k505j3827P9069
42275F8930J06072M2895L0032P5340J7871j67954k83391j93967K661J60988K39269
42264I8746K14017O3587r1727o5762Q3693O9322j73337l18958j37824J15202Q6069
42253e6972j13066r2160J72622K93679Q9558j44951j21498J9572o111j60547j81549
42242c01423j7487J22512J22637J04023J66281K04166R7427o6945j08105p095
42232C15991R0220Q8025K6065m1296j17866j85800j71694n7885N8826Q9668O3608
$$ plain form
42306 -255251 -345344 -199654 85237 289266 302101 192081 76211 16512 28620 92026
42296 92026 138154 97389 -32932 -202612 -353426 -401764 -251627 74356 376031 469514
42286 469514 396398 315088 243816 86273 -119834 -196210 -98405 6193 3688 -10139 68930
42275 68930 175002 217897 247929 323269 341140 173186 -110205 -304172 -301511 -140523 98746
42264 98746 312763 376350 284623 218861 302554 371876 198539 -120419 -258243 -143041 -56972
42253 -56972 -170038 -262198 -89576 204103 293661 148710 27212 46784 40673 -119874 -301423
42242 -301423 -318910 -196398 -73761 30262 196543 400709 498136 431191 323086 315991
42232 315991 406211 494236 520301 479005 361139 175339 3645 -54240 4586 94254 157862
42221A57862M4890J7238n7229j28888j24747q0734q9246j35679j10105J7963J49870
42210c38805J91530J38368L2168o0245m2383J05555K28083J57677l0633j16449
42200B64866q9244j58294l45466l61544n9979K54278K30978r521p3016J23765
42190b23177K90986K30578M6113j05275j74389j14402R7461K89589K28384k1423
42180E44445j52618r1629r1612k46248k89164q7846L7655j81969m53953l32976
42170a345915P0891K59659J10787j7365O3914J13861l2598j52611m5666J13021
42160h62022J00461L5945J39991L20854L23083J49907K6282K1284M67q0724j11828
42149F3700o3129m2303q1980q3670j6622K1705o730j5953K3868K1295n0161p6800
$$ plain form
42221 157862 202752 219990 162761 33873 -90874 -171608 -260854 -396533 -506638 -488675 -338805
42210 -338805 -147275 -8907 23261 -36984 -79367 26188 254271 411948 381315 264866
42200 264866 175622 17328 -328138 -689682 -749661 -495383 -264405 -273926 -346942 -223177
42190 -223177 67809 298387 344500 239225 64836 -49566 47895 337484 565868 544445
42180 544445 391827 300198 208586 -37662 -326826 -414672 -377017 -558986 -1012939 -1345915
42170 -1345915 -1275024 -1015365 -904578 -921943 -858029 -744168 -776766 -929377 -975043 -862022
42160 -862022 -761561 -725616 -585625 -264771 58312 208219 234501 255785 256252 175528 63700
42149 63700 571 -41732 -123712 -207382 -224004 -202299 -209029 -224982 -201114 -179819 -229980 -306780
42137c06780q094L1295n1147j45021j08865J2740Q9542J14142J48347J49862L8530
42126c5449j10175j27278m313Q7893O0325K2994Q1731J62139J35673K0942n9959
42115B34523p6421j17993k20708k68565j37471J03800K28202J17708p4207j07908
42105c19040L3277J38847Q1544j7305n837N9809L5193n7830p5630j007M0927M084
42093h2968k6873k1420n2754j21531j17665k2948L8740L9042J21784L07290L41465
42082D02162N6098k99884l62196j62295l0014n7760k0300J50265J94011k0766
42072a50679k05605p0267K06740K31598k1293k00352j07106P0444R7190L367m8468
42061a94431j7029K8355M5927K7155m8353j55650j89731r0437M7426Q6136L1899
$$ plain form
42137 -306780 -314874 -283579 -334726 -479747 -588612 -575872 -486330 -372188 -223841 -73979 -35449
42126 -35449 -145624 -272902 -277215 -189322 -128997 -106003 -24272 137867 273540 294482 234523
42115 234523 158102 40109 -180599 -449164 -586635 -482835 -254633 -136925 -211132 -319040
42105 -319040 -285763 -146916 -65372 -82677 -88514 -28705 6488 -51342 -126972 -127979 -87052 -82968
42093 -82968 -109841 -131261 -184015 -305546 -423211 -446159 -407419 -368377 -246593 60697 402162
42082 402162 458260 158376 -203820 -366115 -396129 -453889 -474189 -323924 -129913 -150679
42072 -150679 -356284 -426551 -219811 11787 -9506 -209858 -316964 -246520 -149330 -145963 -194431
42061 -194431 -211460 -183105 -137178 -110023 -158376 -314026 -503757 -594194 -546768 -460632 -428733
42050d28733J3310R0849J82659J87438J01516q100q2306r0012k3910P4540J14331
42039A31582L7233r2816j31684k2068J11502R6889n5982j43318l5276J29722J29151
42028A54935k0421r1593n174M4302p2601j54032L8803L36425L10823j05180m41280
42017d993k83901J73072L97519K05013r2882j85700j20135q1544p2790M683J02540
42006D0882P9019n3715j34428j01783n8173n7511r824J25904K17921J55144L6600
41995B40036J4858M6485j7394j44949j39318M4110J95896J40616l4369j34699
41985B11272j10770m2107J9757O3838N3313k3332q6168o5930k4081n1910r8060
41974a54178l9280R9307J50233N0120n9724l2120R1115J46088M2822j50030k69695
$$ plain form
42050 -428733 -415423 -324574 -141915 45523 147039 138939 56633 -33379 -57289 17251 131582
42039 131582 168815 75999 -55685 -77753 33749 130638 74656 -68662 -103938 25784 154935
42028 154935 134514 42921 37747 82049 9448 -144584 -105781 230644 541467 436287 -4993
42017 -4993 -288894 -115822 281697 486710 393828 208128 87993 6449 -66341 -61658 40882
42006 40882 119901 66186 -68242 -170025 -228198 -285709 -295533 -169629 48292 203436 240036
41995 240036 254894 301379 283985 139036 -282 43828 239724 380340 345971 211272
41985 211272 100502 58395 78152 141990 195303 171971 85803 19873 -4208 -56118 -154178
41974 -154178 -193458 -94151 56082 106202 46478 14358 105473 251561 294383 144353 -125342
41963a25342j93863L2358K01924J51143l8847j33781m5679P1371O1636j6130k464
41952c7674J14000J79970R7271l7927n9800M2198R1387m6145k49782k68692o3513
41941b38707J21911J04243J3447M9138J37712P2545j03982j59431q2096r5933
41931a81153k19270j70880J38046L65239K31055m0785p9942O2300N7435j34540
41921B7505k27192r1063P9788J12567O5700L4222K214l5211k0892J7997l4930
41910f9295j72542k24722j05635N7747J13555O2622m413j7446N6747J75234J91150
41899F3002K2879j59809j17741R3473J83437P1571j5814L6263L9306j17632k12258
41888a13323n7417J40198Q9878j11973j47692J7066J31018Q7982K6312J2208n4761
$$ plain form
41963 -125342 -319205 -286847 -84923 66220 27373 -106408 -152087 -80716 -19080 -35210 -37674
41952 -37674 76326 256296 353567 315640 255840 298038 389425 343280 93498 -175194 -238707
41941 -238707 -116796 -12553 894 50032 187744 260289 156307 -3124 -85220 -181153
41931 -181153 -400423 -571303 -433257 -68018 163037 122252 42310 104610 162045 27505
41921 27505 -199687 -290750 -210962 -98395 -32695 1527 3741 -31470 -52362 -34365 -69295
41910 -69295 -241837 -466559 -572194 -514447 -400892 -338270 -342683 -360129 -303382 -128148 63002
41899 63002 85881 -73928 -191669 -98196 85241 156812 140998 177261 216567 98935 -113323
41888 -113323 -170740 -30542 59336 -52637 -200329 -183263 -52245 35737 62049 74257 19496
41877A9496j75973j83564k5264J22204J28652Q6988R6672O8388r4396k63727k22475
41866d42999L1297K65229K81620J06870p6421j15669j3777Q7805O1495n8142j19096
41855H212n5664K6434J2387n2703m3561M4152Q5650K5365k7643L5329J40766J22803
41843C21527k9310j40823j05264l8634p5936j24446k26K35142L00505J02030j08011
41832C36554r8419J5151q25j03794p0353R0301J14893q3774k35444r6529J80595
41821D8356K52305N3587j38836r8537P5815J42522M7739m6889k1531N2461N2085
41810D19077k1949r1800j39325j80436j63974m4054P8765O1985l8261k9624R1963
41799e7633J17453n018m6657J07930K19858P8982j24579j12497J3298k1003j50155
$$ plain form
41877 19496 -156477 -340041 -365305 -243101 -114449 -27461 69211 137599 43203 -220524 -442999
41866 -442999 -411702 -146473 135147 242017 165596 49927 36150 123955 185450 127308 8212
41855 8212 -47452 -21018 -8631 -61334 -104895 -60743 24907 50272 22629 57958 198724 321527
41843 321527 292217 151394 46130 7496 -68440 -192886 -193112 42030 342535 444565 336554
41832 336554 238135 253286 252461 148667 78314 168615 283508 199734 -35710 -132239 48356
41821 48356 300661 354248 215412 116875 192690 335212 382951 336062 314531 366992 419077
41810 419077 397128 305328 166003 -14433 -178407 -222461 -143696 -81711 -119972 -149596 -57633
41799 -57633 59820 54802 8145 116075 335933 414915 290336 177839 191137 170134 19979
41788A9979r4534R7775J05775p6237j03182Q6445J14395j67206l46660j04600
41778d68050K37067K21737k8123p0877J18514J78205R562j00000m219R4471L9418
41767B27705n2299o7468q4440j51416j48183j6331R6138O7963l211J8931R7906
41756a4705J27373J05408P5540J4645r1906j60354j12843Q99P8501R2006O7281
41745A81845J4639m9179q1496p2913n5695k6023L9744P2583l4716k11933k32268
41734d55412m8124Q4696k3004j75544o9868K28734L59415J82080m6494o2181P0046
41723D4344J22317M1336l3826j4809K4556q935p2159m3882P9238J33258L100j73904
41711A00634j60450L2924J40763M5303l4270Q6149K09094N3100k46200k84348
$$ plain form
41788 19979 -74555 23220 128995 52758 -50424 36021 150416 -16790 -363450 -468050
41778 -468050 -230983 -9246 -37369 -108246 10268 188473 198035 98035 93816 188287 227705
41767 227705 175406 107938 23498 -127918 -276101 -292432 -196294 -128331 -131542 -112611 -14705
41756 -14705 112668 218076 293616 308261 216355 56001 -56842 -55943 22558 114564 181845
41745 181845 196484 147305 65809 -7104 -62799 -88822 -49078 23505 -11211 -223144 -455412
41734 -455412 -503536 -418840 -441844 -617388 -687256 -458522 -99107 82973 36479 -25702 44344
41723 44344 166661 207997 174171 159362 183918 174983 102824 58942 138180 271438 274538 100634
41711 100634 -59816 -26892 113871 159174 124904 211053 420147 473247 227047 -57301
41701e7301q794J78868K5263k12397j83179N8219K05660J53349L6155n0124j16144
41690B9575j41227r4453m6862o3550l6653J59153L82254L40552J4875k66091k48350
41679B9223n5715L0733o0933j71535j51983q972J39687J78191R3404o152j5072
41668H76L0155J8641m1498k7355Q0543J36110N1830n5331m5947K7403J2580j11122
41656G6885k18639k12509j06528K9996J19223R5709k9099j37367j15148J3676
41646d83801J17583J08794K0236n3666n8892l4474o4118j42799j25563R0526L48609
41635b77565L56565Q0263j58319q8576J54582K41893R2798r0868j61749j73486
41625b4462j87377j36789L9470K54083L45370K45047L7326j19949j34485o2043
$$ plain form
41701 -57301 -66095 112773 138036 -74361 -257540 -199321 6339 159688 195843 145719 29575
41690 29575 -111652 -206105 -252967 -316517 -353170 -194017 188237 528789 543664 277573 29223
41679 29223 -26492 4241 -56692 -228227 -380210 -389182 -249495 -71304 22100 15948 876
41668 876 31031 49672 8174 -19181 61362 197472 249302 193971 148024 175427 188007 76885
41656 76885 -141754 -354263 -460791 -430795 -311572 -215863 -244962 -382329 -497477 -483801
41646 -483801 -366218 -257424 -237188 -290854 -349746 -384220 -448338 -591137 -716700 -626174 -277565
41635 -277565 79000 159263 944 -87632 66950 308843 401641 310773 149024 -24462
41625 -24462 -211839 -348628 -309158 -55075 290295 535342 572668 452719 318234 256191
41615B56191k1686k5715J5461R4612O6576r8785j88992m4221J59234J40887o6923
41604B86639j83330j04425J967J6748J5463N6486P1884L6000K5710M7949J3436
41593B84527o3138n7334J3152k2050j60460j62250N0945K01308N8687j90562k18287
41582b65462k4388J18932P3676n1024j15371p2247O6786K16255K29996P7379p4000
41571A80532q4190l1748k9364l001J35400K36588R8887j83829l27567k56734j33255
41560c98281l3622J10034K47368J95032m4741k15291j59249k2363O572l4562l354
41549c52457J01346J49841N8651j21979k39538j45800J36204L64986L26521J06915
41539C84690l3365k3513j5215o8971p0550n607l6170j89565k36993m9896J56291
$$ plain form
41615 256191 234505 208790 224251 318863 385439 286654 97662 53441 212675 353562 286639
41604 286639 103309 -1116 851 17599 33062 89548 161432 197432 223142 271091 284527
41593 284527 221389 164055 177207 155157 -5303 -167553 -116608 84700 143387 -47175 -265462
41582 -265462 -289850 -170918 -97242 -148266 -263637 -335884 -269098 -52843 177153 254532 180532
41571 180532 96342 64594 35230 32229 167629 404217 503104 319275 -8292 -265026 -398281
41560 -398281 -431903 -321869 -74501 120531 75790 -139501 -298750 -321113 -314541 -349103 -352457
41549 -352457 -251111 -101270 -42619 -164598 -404136 -549936 -413732 -48746 277775 384690
41539 384690 351325 327812 312597 243626 173076 167469 131299 -58266 -295259 -345155 -188864
41528a88864J38060j5722o8809j6032j5999o3618j4303J10703J16100m8989j90881
41517b58354j48196L772R2529O2229j6546n8064k9907L1497N1778Q348k6942Q954
41505b78902O3692M8030k1047n8519n5970o6684p2567q277Q4950Q5054m491l2828
41493c17559N5504J15719M1185m1615K8271J57912J12605j10050k27033n3047
41483b38108K28334K96138R4565j34463j76896o3187M7730P1446K9453l0113o7524
41472E7375n6986j6803K867k366J2295K8446m8796k04552k32532n632K50977J87945
41460b7762j62337l56725j15848K92185M13058J84726o8045j20903p3596q3731
41450a18978j19907q0433Q774N2889N4190Q4828J32429R8956l6414j54465j41077
$$ plain form
41528 -188864 -50804 -66526 -135335 -151367 -167366 -230984 -245287 -134584 -18484 -67473 -258354
41517 -258354 -406550 -402778 -310249 -248020 -264566 -322630 -352537 -321040 -269262 -260914 -287856 -278902
41505 -278902 -215210 -167180 -188227 -246746 -302716 -369400 -441967 -450244 -365294 -280240 -284731 -317559
41493 -317559 -262055 -146336 -105151 -146766 -118495 39417 152022 41972 -185061 -238108
41483 -238108 -9774 286364 380929 246466 69570 6383 54113 125559 155012 124899 57375
41472 57375 389 -16414 -13547 -15913 -3618 24828 -23968 -228520 -461052 -466684 -215707 -27762
41460 -27762 -190099 -546824 -662672 -370487 42571 227297 159252 38349 -35247 -118978
41450 -118978 -238885 -319318 -310544 -257655 -203465 -118637 13792 112748 76334 -78131 -219208
41439b19208k9771N7600P0516N9491O4016N6921K3077J3575O2863J07440O2311
41428C28831n1233j29294j22019p6244n1694o3805j00259j22013o2045Q9496K09594
41417a50685J59480j6116j27161r9472n7949q9079p5132J02325L06710K80736
41407B33657J2476k08132j47317Q6444K04321J08104k2458r141Q6526R1774M925
41396D41179j1977P7513R5737n2482j78527q8326Q1784O0689j10854j35730M4942
41385B23948J48934K5108j08100o2079j423j19821k57129j54825R5610K04444
41375e333J60828J93330L08361K49011m5916k90901k73732j37348r7563j24055
41365f3318p9759J2608M1959K5124O4491J51907J67265M9783j30321k51241k29870
$$ plain form
41439 -219208 -248979 -191379 -120863 -61372 2644 59565 82642 96217 159080 266520 328831
41428 328831 277598 148304 26285 -49959 -101653 -165458 -265717 -387730 -449775 -360279 -150685
41417 -150685 8795 -7321 -134482 -233954 -291903 -380982 -456114 -353789 -47079 233657
41407 233657 246133 38001 -109316 -22872 181449 289553 267095 257954 344480 436254 441179
41396 441179 429202 506715 602452 549970 371443 283117 364901 425590 314736 179006 223948
41385 223948 372882 397990 289890 227811 226388 106567 -150562 -305387 -209777 -5333
41375 -5333 155495 348825 657186 906197 860281 569380 295648 158300 60737 -63318
41365 -63318 -143077 -130469 -88510 -63386 1105 153012 320277 370060 239739 -11502 -241372
41354b41372p4329J00236J58530R7283N3569J10371J61208M6207k14876m06756
41344b09929l44330p6902J52982J63098L1485j2552R0113J30151n1777k70547
41334c98208k18592P1306K36602R9203q3006j0040K24543K93346J01611j29819
41324A86946k01006j44210p8410k3663O1571J56161J81101J07498N363l0852P626
41313B28125L4251j5042q6325q2228j0328K4055k2339o9672m4458J7388M6922
41302B0349M5420M9593N4225L4239k82k7656n5949r3430j14067r4288n0704j0836
41290b43386J5865J9965j55L686Q6637J92978J70711l0353k45483k60711n4566
41279c44812J85557K58201J18752j02519k12875j27803L8459R1474k1936j66316
$$ plain form
41354 -241372 -315701 -215465 -56935 40348 93917 204288 365496 411703 196827 -209929
41344 -209929 -554259 -631161 -478179 -315081 -283596 -296148 -206035 -75884 -127661 -398208
41334 -398208 -616800 -545494 -308892 -209689 -292695 -302735 -78192 215154 316765 186946
41324 186946 -14060 -158270 -236680 -260343 -198772 -42611 138490 245988 251351 220499 228125
41313 228125 262376 247334 161009 78781 68453 92508 70169 497 -43961 -26573 20349
41302 20349 65769 115362 169587 203826 203544 175888 119939 26509 -87558 -181846 -232550 -243386
41290 -243386 -227521 -207556 -207711 -204025 -117388 75590 246301 215948 -29535 -290246 -344812
41279 -344812 -159255 98946 217698 115179 -97696 -225499 -187040 -95566 -117502 -283818
41269b83818j91774p4154J17160K77252K77709O4614k05267k69977p5442J53429
41259b10268K18835J58302O3078r3951k87879l15124p8962J64572J30339m8437
41249b99495j8726K16528K86385L7003k32221k27526m2171Q1051J01329R7535
41239c08N2164o1977j36761q1254K720j1402n3599n665N0515k5403j31630m5273
41227d47873J82794K49197O2152r8135o474J63132J11034j41350l04437k32654
41217d62614o1924M3458P9726J05729J21008J09762Q9630N2336m1850j47495j25514
41206b37748N1632J89253J02969j05794j69940k5821J17629J01297K1178K7533
41196G2188Q5452P7479K7316M5612J10306Q2540n9875j71181j60349j20949j59112
$$ plain form
41269 -283818 -475592 -549746 -432586 -155334 122375 186989 -18278 -288255 -363697 -210268
41259 -210268 8567 166869 229947 135996 -151883 -467007 -545969 -381397 -251058 -299495
41249 -299495 -318221 -101693 184692 221695 -10526 -238052 -280223 -199172 -97843 -308
41239 -308 51856 -10121 -146882 -228136 -225416 -236818 -290417 -296082 -245567 -270970 -402600 -447873
41227 -447873 -265079 -15882 46270 -51865 -58339 104793 215827 74477 -229960 -462614
41217 -462614 -524538 -481080 -401354 -295625 -174617 -64855 24775 77111 35261 -112234 -237748
41206 -237748 -186116 3137 106106 312 -169628 -195449 -77820 23477 44655 72188
41196 72188 157640 235119 262435 308047 418353 500893 441018 269837 109488 -11461 -170573
41185a70573k00784q6608J80991L91101L46956Q6727j49878j71540l2724M3170
41175B36838o3180k22505k26895n5589J14347J51871J21804J45122J92720J18045
41165E12578j13758l22756l02587p8551J06744Q9677j7739r199J09104J44086
41155A17599L6145l9634L2899J05780J0387j44655j33964J5940O7026m0575r4338
41144f7390L9613J96630J57099n3539k29219k33919r1492P5018J16328k6450k09247
41133c26568k04472N07J62683J22746J9860M1361J29285J23071N4933O8621J27910
41122C19937O2187j15880j87747o5950O0920L148j73517k58497j48266Q3751K72061
41111a47853K64485M4762k03049k53243j01340M0205M1060M331N3461J27570J14700
$$ plain form
41185 -170573 -371357 -457965 -276974 114127 461083 547810 397932 226392 193668 236838
41175 236838 173658 -48847 -275742 -331331 -216984 -65113 56691 201813 394533 512578
41165 512578 398820 76064 -226523 -305074 -198330 -108653 -126392 -135591 -26487 117599
41155 117599 153744 114110 147009 252789 263176 118521 -15443 497 67523 26948 -67390
41144 -67390 -27777 168853 325952 272413 43194 -190725 -282217 -207199 -90871 -117321 -326568
41133 -326568 -531040 -530533 -367850 -245104 -225244 -183883 -54598 68473 123406 192027 319937
41122 319937 382124 266244 78497 12547 73467 76615 -96902 -355399 -503665 -419914 -147853
41111 -147853 116632 161394 -41655 -294898 -396238 -356033 -314973 -310642 -257181 -129611 -14911
41100a4911N9295P0866J05576K1891j65611k58207j33416Q9579J96259J08860
41090H0181o9087j80447j51359m0486K9587J7839K4644J46206K91096K53377J452
41079D03003k22771j88638J8357J11882j83r9578M339J70101J13220j65558l40296
41068a96122j92764R1000J84921O0143l0871M0269J12386L0918r1889o1114Q3729
41057C0606J26747P674r5914m9336M3256J7302r3557j11714J5791J39981J24692
41046A55528K9802O653P1060Q2410m6682k10223k34408r5257N9734R5100K8436
41035e7847k0363L0853J51596K24483J43875o0319k00812j14502J14676K10397
41025D22037L4602k32293l26480k23552r8658l4868M9094J82055K41093J46202
$$ plain form
41100 -14911 44384 115250 220826 242717 77106 -181101 -314517 -224938 -28679 80181
41090 80181 11094 -169353 -320712 -361198 -331611 -313772 -289128 -142922 148174 401551 403003
41079 403003 180232 -8406 9951 121833 121650 22072 26411 196512 309732 144174 -196122
41068 -196122 -388886 -297886 -112965 -52822 -83693 -43424 68962 99880 7991 -53123 30606
41057 30606 157353 165027 69113 19777 63033 80335 -13222 -124936 -109145 30836 155528
41046 155528 185330 191983 263043 345453 298771 88548 -145860 -241117 -181383 -86283 -57847
41035 -57847 -78210 -47357 104239 328722 472597 412278 211466 96964 211640 422037
41025 422037 456639 224346 -102134 -325686 -424344 -459212 -410118 -228063 13030 159232
41015A59232J0394j7447L6301L8549l2450p0637k6208K0006p942o8230p4926k3570
41003e6928J3509j1337p1211j05478p5137J7040J24978J71861J05147k9960j02576
40992b0092l5022Q2654Q8872k6907r0276J2409J46980J01526j13544k76387k49723
40981c79510j15115Q608J19375K31507K65145J56804p888q8379o2476j6348j9136
40970I2587q6109j94321k51607j41035R9184K44629J70448N5800J15068K30714
40960C35358J20442j69878k61754o260K52944J52775j86135l55042k03190M8963
40950b71777J58905R8272l3725j35972j30020r173J14987J26049O1634N1380J12739
40939A43299J36846P5664N312j7374k6249l4331J7946J36563K06394J32481l1205
$$ plain form
41015 159232 169626 152179 188480 227029 194579 123942 97734 117740 109798 41568 -33358 -56928
41003 -56928 -43419 -54756 -125967 -231445 -306582 -289542 -164564 7297 112444 82484 -20092
40992 -20092 -55114 27540 116412 89505 -771 11638 158618 260144 146600 -129787 -379510
40981 -379510 -494625 -486017 -366642 -135135 130010 286814 278926 190547 128071 111723 92587
40970 92587 6478 -187843 -439450 -580485 -481301 -236672 -66224 -10424 104644 335358
40960 335358 455800 285922 24168 17908 270852 423627 237492 -117550 -320740 -271777
40950 -271777 -112872 -14600 -48325 -184297 -314317 -323490 -208503 -82454 -20820 30560 143299
40939 143299 280145 355809 361121 343747 317498 283167 301113 437676 644070 776551 745346
40928G45346j67577k36145k52142k03629q8981J5732L3412J269O797K9471l1805
40917a48252j60282j82866m409K15259K33491M0846j10288j5944K28235L45889
40907D41679K05809m2882j63527r8297N256J2761k7032J5398J22520J19098p0988
40896E19795k70125k65285j10803m6093j23461j22565Q8720L06015K65219L0777
40886B72194j00045j2666J17678J18010J2938r6029j63114j62592p9337J4116
40876g8847J4347m2485k2903O1575M8833p9301j20676J8850J46088Q9101k9001
40865E581k8766J3064n3232j22630n470J77938J21287j67422l32016j90570K0986
40854e61250M3005m1161r48J77381L07364K67460J04459n3907r9290k9627J8177
$$ plain form
40928 745346 577769 341624 89482 -114147 -203128 -187396 -153984 -152715 -145918 -116447 -148252
40917 -148252 -308534 -491400 -495809 -280550 -47059 -6213 -116501 -132445 95790 441679
40907 441679 647488 604606 441079 342782 348038 360799 333767 349165 471685 590783 519795
40896 519795 249670 -15615 -126418 -172511 -295972 -418537 -329817 -23802 241417 272194
40886 272194 172149 159483 277161 395171 408109 312080 148966 -13626 -92963 -78847
40876 -78847 -64500 -106985 -129888 -68313 -19480 -98781 -219457 -200607 -54519 34582 5581
40865 5581 -23185 -10121 -63353 -185983 -191453 -13515 107772 -59650 -391666 -582236 -561250
40854 -561250 -518245 -559406 -560354 -382973 -75609 191851 296310 242403 143113 113486 131663
40843A31663p5509k05380j48803Q1190K00183O6887r3047m7621O8848n216j97528
40832b24333j93385N5551K30040J12493j08939j38891J9035J28655P5973k7819
40822g1620n9073l2642j6015j2403J1508M9141O6204N6371L8993K6847L5685R0572
40810A83568J64525J49017j7950k05743j98954J1809J75305R6226j09883j94796
40800E3124j13002k6790l5991p2942n5884O723Q0440J47285J70567J26642O9611
40789C49783N6201L2417p1240j67707j12228M1661Q7224j9198j01820o6330k9414
40778f51p2521r7152l5261J9071J9341Q1100K24148K32025j4366k69705k51213
40767a65184o4208j1154j06855j08740L9794J36128R0458N1773J04968J27629
$$ plain form
40843 131663 56154 -149226 -298029 -216839 -16656 50231 -42816 -90437 -21589 -26805 -224333
40832 -224333 -417718 -362167 -132127 -19634 -128573 -267464 -248429 -119774 -43801 -71620
40822 -71620 -130693 -163335 -179350 -191753 -180245 -131104 -64900 -8529 30464 57311 92996 183568
40810 183568 348093 497110 479160 273417 74463 86272 261577 357803 247920 53124
40800 53124 -59878 -86668 -122659 -195601 -251485 -244762 -164322 -17037 153530 280172 349783
40789 349783 405984 438401 367161 199454 87226 128887 216111 196913 95093 28763 -651
40778 -651 -73172 -170324 -205585 -186514 -167173 -86073 138075 370100 355734 86029 -165184
40767 -165184 -229392 -240546 -347401 -456141 -416347 -280219 -189761 -137988 -33020 94609
40757I4609M4991j9889K7974Q5362L5391p0607j40676j91531k36282j74701L8532
40746e06827K31254K06321L5162k5661R9491J94227N2204k36872l90004k59701
40736f00406K2391K16661K21155J22980N3249M9723O3461M7870N419l5183n8551
40725A08769p5156r3791q3083K396J23948J42719p765j68976j14120J30433K72263
40714B37637J23224j57417k84326j88262k0457Q2907J04793P9793M7005L6087
40704F0984K1761n0875j42580j30878j7108K6356p0832j30256j9169R1794O582
40693c54221j22705j9863K14983K04990j00155l03696j49832J12510J38573k2460
40683d01876q8698N078R2067J01682J35995K25776K28588M3483j98189k58022
$$ plain form
40757 94609 139600 119711 147685 233047 268438 197831 57155 -134376 -370658 -545359 -506827
40746 -506827 -275573 -69252 -34090 -59751 39740 233967 286171 49299 -340705 -600406
40736 -600406 -578015 -361354 -140199 -17219 36030 85753 149214 197084 202503 167320 108769
40725 108769 33613 -60178 -143261 -140865 -16917 125802 118037 -50939 -165059 -34626 237637
40714 237637 360861 203444 -80882 -269144 -289601 -206694 -101901 -22108 24897 60984
40704 60984 82745 31870 -110710 -241588 -258696 -232340 -303172 -433428 -452597 -360803 -354221
40693 -354221 -476926 -496789 -281806 -76816 -176971 -480667 -630499 -517989 -379416 -401876
40683 -401876 -490574 -485496 -393429 -291747 -155752 70024 298612 342095 143906 -114116
40673a14116q0555J19080J02225r3112j94533n7630J42359J71267N8157K50M7530
40662A00922Q3895O0990K8186l8902j98020l28683k21237P6414K54806J64861
40652a6768J699l0921O219j4933n3774l7042l0518q4002p8105P0766K02595J31040
40640F6256m7163q7469L6295J27134Q6812K4606L5506N7336L511q6691r8660N069
40628A22542J16544P2582j52965l57562l00755k360K64437L10084K14741J17759
40618D05047O59j83762l17113k45139l0923J01672N9239k8089r238R7369J42386
40607g892L2388j35517j53395L1307J85655O2861k31906l47139j64589O9385J51996
40596e06846J84597K85101L17169J35577j11696j85144j02865m1751k9133J1997
$$ plain form
40673 -114116 -194671 -75591 26634 -66478 -261011 -318641 -176282 -5015 53142 53392 100922
40662 100922 184817 245807 273993 235091 37071 -291612 -512849 -436435 -181629 -16768
40652 -16768 -15069 -45990 -39771 -54704 -108478 -145520 -176038 -260040 -338145 -267379 -64784 66256
40640 66256 19093 -68376 -32081 95053 181865 206471 241977 299313 302824 216133 117473 122542
40628 122542 239086 311668 158703 -198859 -499614 -501974 -237537 72547 287288 405047
40618 405047 405706 221944 -95169 -340308 -371231 -269559 -210320 -238409 -247647 -150278 -7892
40607 -7892 24496 -111021 -264416 -233109 -47454 15407 -216499 -563638 -728227 -658842 -506846
40596 -506846 -322249 -37148 280021 415598 303902 118758 15893 -25858 -54991 -42994
40586d2994L1067o6620j90973j81693q0362l6761j9027J09598K79161K69724P0237
40575A41357r2011r2207k6486K1533P5181R4162l4114k63723l70462k40644l245
40564g90659J73596K43687K12230R4624j4339q881N8689M8027k8683l7554J0751
40553c8512k8738j35854j11052P0507J70674O7044n3978l7617k8894j85520l46732
40542f58672k56405K8194K24178K38894K31043K77472K42629N0512j21495o8278
40532A88072J25246J58196q6841l53972l18809j1196K13491J25220j25783k66271
40522c52647k31385j07604Q1201L17897M40055K97557K0816j00324O459J46078
40512E18103J63573R0205j842p4241o3519L8386P2411q5220k56700j84048K4623
$$ plain form
40586 -42994 -11927 -78547 -269520 -451213 -531575 -568336 -587363 -477765 -198604 71120 141357
40575 141357 49346 -42861 -69347 -47814 27367 121529 87415 -176308 -546770 -787414 -790659
40564 -790659 -617063 -373376 -161146 -66522 -80861 -89742 -31053 16974 -11709 -49263 -38512
40553 -38512 -67250 -203104 -314156 -243649 -72975 -5931 -59909 -97526 -126420 -311940 -658672
40542 -658672 -915077 -886883 -662705 -423811 -192768 84704 327333 377845 256350 188072
40532 188072 313318 471514 384673 30701 -288108 -299304 -85813 39407 -86376 -352647
40522 -352647 -584032 -691636 -610435 -292538 147517 445074 465890 365566 372025 518103
40512 518103 681676 771881 770039 695798 632279 670665 743076 657856 401156 217108 241731
40501B41731K2304j96522k48103J4967K44680J47912q1560j28419l0874o299n9710
40490g9893n6559R512P7415J69363K58258J81433q5513k74936j89031q202J4647
40479A6494n4573l3971N398q0750j51545P401K44873K21845m2211j96153j02591
40468a65783K7426N3522Q1243J56982J36918k8013j60887j29206j6896O3685J19073
40457A38064J58069J30716N5552K4990L4651j0025q9944p9476J4712M2934k1785
40446C98458m2394M934l4108j89593k53859j08391N8904L5722q8788o8913J32268
40435a55760K90303J97747r3111k89162j30127K83160N05027K54593j70389k53223
40425D39058J2686J22446j52106m02264k33376J17587J80654j6312o5673J19443
$$ plain form
40501 241731 264035 67513 -180590 -165623 79057 226969 145409 16990 -13884 -20183 -79893
40490 -79893 -136452 -126940 -49525 119838 378096 559529 474016 199080 10049 1847 16494
40479 16494 -38079 -72050 -66652 -147402 -298947 -291546 -46673 175172 132961 -63192 -165783
40468 -165783 -138357 -84835 -3592 153390 290308 262295 101408 -27798 -44694 18991 138064
40457 138064 296133 426849 482401 507391 542042 532017 442073 362597 377309 420243 398458
40446 398458 356064 360998 326890 137297 -116562 -224953 -166049 -130327 -219115 -288028 -155760
40435 -155760 134543 332290 239179 -49983 -180110 103050 608077 862670 692281 439058
40425 439058 451744 574190 422084 19820 -213556 -95969 84685 68373 2700 122143
40415A22143K03987L2538j16984j6579J37135N6948j72814k32107l8800J60928
40405A36395J49325j1969j19470p7540N0447J53153J62945Q1131k4095o2750j8592
40394D18980J2770o1746j86742k02708n6806J09687J31615J0482j19026j44818
40384h8312l9365J50581K89305K15908n5541k75032k37282n2030L3910P004M4995
40373e859J41873P7058j72337k90194o7138K49652K84037M6426j32424r0529N899
40362D6464j7816j01976r7134P382R0930O0401n9407j57692j36010j99J43033
40351b22024J92975J33873L691j48840k46037k06278n1509Q4778J25225J41140
40341a93006J98733K20717J28350K1486L7516R2563j8532k64729l54777j48883
$$ plain form
40415 122143 326130 358668 241684 225105 362240 419188 246374 14267 -24533 136395
40405 136395 285720 273751 154281 76741 127188 280341 443286 524417 500322 437572 418980
40394 418980 431750 370004 183262 -19446 -76252 33435 165050 175532 56506 -88312
40384 -88312 -127677 22904 312209 528117 472576 197544 -39738 -91768 -57858 -50854 -5859
40373 -5859 136014 213072 40735 -249459 -316597 -66945 217092 263518 131094 40565 46464
40362 46464 28648 -73328 -170462 -163080 -72150 -11749 -71156 -228848 -364858 -365057 -222024
40351 -222024 -29049 104824 108515 -40325 -286362 -492640 -544149 -459371 -334146 -193006
40341 -193006 5727 226444 354794 376280 413796 506359 487827 223098 -131679 -280562
40331b80562J10598J19650q7149k28565j71496m1142K9407O4776J24355J71214
40321a88914J48244Q4304L7256R02m7723o5770j400J05197J68070J69559J33552
40310E43277K8293j68576l29272k75451n0585R0226L7120j9600Q3824K02372J28541
40299B70169m8206r9106n8959j43759l03655k28765J25305L77474K60230Q804
40289A59532k8826R0491Q5961l9086l8644J05477J31615n1450k01499j43641m5388
40278B4542j09732k16570j12322J64695L06744J72016k4776k8968J05459J16215
40268C97303q4011k72548k04271O2603K28454J20877j06298j88158p4682N6047
40258f4684O6757J4166R590M3247L1097k8393m8657M425N9067N0457J3175R113
$$ plain form
40331 -280562 -169964 -50314 -137463 -366028 -537524 -578666 -549259 -484483 -360128 -188914
40321 -188914 -40670 43634 80890 81792 34069 -31701 -33101 72096 240166 409725 543277
40310 543277 571570 402994 73722 -201729 -252314 -162088 -124968 -144568 -60744 141628 270169
40299 270169 221963 122857 63898 -79861 -383516 -612281 -486976 -109502 150728 159532
40289 159532 130706 221197 307158 268072 229428 334905 466520 415070 213571 69930 24542
40278 24542 -85190 -301760 -414082 -249387 57357 229373 204597 175629 281088 397303
40268 397303 313292 40744 -163527 -100924 127530 248407 142109 -46049 -120731 -64684
40258 -64684 2073 16239 25829 69076 100173 71780 23123 27548 86615 137072 150247 159360
40246A59360J6638l0612j14227j31935m9328L7816N1622O3555J71123K86034J96889
40235F56935j17153l73716l02229M907J98262J11300n9246o3085N9603Q0358n1745
40224A44191j36755l8108J10393J17857K1633k75P7014J09364M1734j7443j3487
40213D16118l9247j28687j45784j5468R5521P583j79493k24601r9522J0378K5401
40202b77801O3281J82744K43004J10731j30677k76670k30388p0737N8085Q5400
40192b43028O5384Q6242J22972O1287q6876j30969J0490J21882j04j78035q7850
40181b58605K02871K81981J2410k52674k01417J5012Q9327J1511l3728j5392k9081
40170a77785n2343J5255J39590J92515J49007O8845m4087j83973k22001m8145
$$ plain form
40246 159360 175998 145386 31159 -100776 -150104 -112288 -60666 2889 174012 460046 656935
40235 656935 539782 166066 -136163 -131256 67006 178306 119060 55975 115578 195936 144191
40224 144191 7436 -30672 79721 197578 219211 218936 295950 405314 447048 429605 416118
40213 416118 376871 248184 102400 86932 182453 190036 10543 -214058 -313580 -303202 -277801
40202 -277801 -214520 -31776 211228 321959 191282 -85388 -315776 -386513 -328428 -243028
40192 -243028 -177644 -91402 31570 92857 5981 -124988 -114498 7384 7280 -170755 -258605
40181 -258605 -55734 226247 238657 -14017 -215434 -200422 -111095 -99584 -133312 -148704 -177785
40170 -177785 -230128 -214873 -75283 117232 266239 335084 290997 107024 -114977 -163122
40160a63122K06664K86660J38903m2382q8432j5592P8291J18452M7635j32943
40150D34134k91167k63570o3723J15925J43317Q8385Q1915J20769Q8308o3213
40140C91080k18404k13581k7984J81956K54824J76799K3949j58478l16124l17113
40130b23076j03440J32928J36852n0522j45604n1915K8284k4358m3165J07317
40120b36699K74057K57376R3983p2447j92202k20786p0115J66671J97827m7107
40110A50558k48821j83061o3731j06693r8276J85669M44184K62374j60565k75415
40100i3777m7178N7275r4904j22853J29298K95676J28190j11759j53875j31617
40090a45524k05985k05403K6759K75165K81151J47882J03577J10158J6246j17559
$$ plain form
40160 -163122 43542 330202 469105 426723 338291 322699 400990 519442 567077 434134
40150 434134 142967 -120603 -184326 -68401 74916 163301 245216 365985 454293 391080
40140 391080 172676 -40905 -68889 113067 367891 544690 568639 410161 94037 -223076
40130 -223076 -326516 -193588 -56736 -107258 -252862 -304777 -276493 -300851 -344016 -236699
40120 -236699 37358 294734 388717 316270 124068 -96718 -166833 -162 197665 150558
40110 150558 -98263 -281324 -345055 -451748 -550024 -364355 79829 342203 181638 -93777
40100 -93777 -140955 -83680 -178584 -301437 -172139 123537 251727 139968 -13907 -145524
40090 -145524 -351509 -556912 -530153 -254988 26163 174045 277622 387780 404026 286467
40080B86467j51719j46263k16868k64390j27100J10802K13760J17247m1359j28459
40070c47882r1430O5385K39149K73159J55575M3355J2229k8602r5332n4139R4534
40059B66001J33926j0113j19232p2918o5048k00201k28050M560J82543P205k47588
40048c48915j38467K16677L32578J35532K620P7625R4300p3431j89689j04921
40038C909M584q607l8623L42J5372o866R0615L04797L58250J10134j76333j82623
40026D74951M7919K23562J74989l2656k17688k08368P183J98838J31288r3987
40016G06031j64080m3523k4387k03749k79850o6604J42871K9606k17882j92949
40006c14516R3946K61313J46113l2182q3976p5407q5309m2209P8889J33759K8898
$$ plain form
40080 286467 134748 -11515 -228383 -492773 -619873 -509071 -295311 -178064 -219423 -347882
40070 -347882 -439312 -373927 -134778 138381 293956 337311 349540 320938 225606 171467 266001
40059 266001 399927 389814 270582 197664 132616 -67585 -295635 -291075 -108532 -101327 -348915
40048 -348915 -487382 -270705 61873 197405 200025 277650 371950 298519 108830 3909
40038 3909 8493 -114 -38737 -38395 -23023 -29889 60726 365523 723773 833907 657574 474951
40026 474951 522870 746432 921421 888765 671077 462709 469892 668730 800018 706031
40016 706031 541951 498428 474041 270292 -9558 -76162 66709 96315 -121567 -314516
40006 -314516 -220570 40743 186856 154674 70698 -4709 -90018 -132227 -53338 80421 109319
39995A09319j00816q0732M6098Q9545j6984j40026j32786q384J01962J15096O9215
39984E1507L3716Q811k9564l3838N5096J54882R0985j40668k95187j75610R3336
39973a86534K25095J31456l0574j21027j44657j19611j1691J36570J74023M5306
39963I8356q9584o1959O4286R4009j1402j03268r3314o7388j02835j20990k5176
39952d19265J22228J92649J92160K19080K53966J63205o4364k45697k36674j06142
39942G1146L467O5683J16154J23086N0358k6139j1405M5950K6917n2658o1388
39931C51171K3128N8351n1109j97541j91293J4783K60758L24557J44847q6366
39921F51286j13663O6047J81202N4598j42680j56606l8736l6861j68059j82888
$$ plain form
39995 109319 8503 -72229 -26131 63414 46430 -93596 -226382 -234766 -132804 -17708 51507
39984 51507 85223 94034 64470 30632 85728 240610 331595 190927 -104260 -279870 -186534
39973 -186534 38561 170017 139443 18416 -126241 -245852 -257543 -120973 53050 98356
39963 98356 8772 -53187 11099 105108 93706 -9562 -102876 -170264 -273099 -394089 -419265
39952 -419265 -297037 -104388 87772 306852 560818 724023 659659 413962 177288 71146
39942 71146 74613 140296 256450 379536 429894 403755 392350 438300 465217 412559 351171
39931 351171 374299 432650 381541 184000 -7293 7490 268248 592805 737652 651286
39921 651286 537623 603670 784872 839470 696790 540184 501448 464587 296528 113640
39911A13640K1606K22395J98580K1071j06081j18635p8929l0491R980K1779L4340
39900C09255J05627J80222J10997r3563k05314q2886J05627J15521m3292j71313
39890C30881j75938j28478q9294m6167l281M870j6847k9733j5505K8465Q8407
39879e2620Q7933m6963k17397k01192K0573J64828M3340j16874O894L20760M19292
39868D28574J60597j59122k34410r2150O4719J27911R6191p083j17613j45993
39858A21621q2857j87O6482J19112R3820p0048k46526k11795L1877K20954J90380
39847B32833O2995j0276p0881j66933j66904K8300K48049K59197J02044p038k3637
39836D87749q5480k18625k79389k04582j06978p4447m5773N7867K10266L28101
$$ plain form
39911 113640 135246 357641 556221 577292 471211 352576 273647 243156 253136 274915 309255
39900 309255 414882 595104 706101 612538 407224 324338 429965 545486 502194 330881
39890 330881 154943 26465 -62829 -108996 -112277 -107407 -124254 -153987 -169492 -141027 -52620
39879 -52620 35313 -11650 -229047 -430239 -409666 -244838 -201498 -318372 -311478 9282 428574
39868 428574 589171 430049 195639 103489 168208 296119 392310 385227 267614 121621
39858 121621 38764 38577 105059 224171 317991 247943 1417 -210378 -178501 42453 232833
39847 232833 295828 285552 214671 47738 -119166 -90866 157183 416380 518424 511386 487749
39836 487749 402269 183644 -95745 -300327 -407305 -481752 -527525 -469658 -259392 68709
39826F8709L31976J61806j28896l02674j47501K09231L87643K24468l6321j20451
39816F47990q5121j32149k31942j81241L5357J90831J40329O64n1574l129N5721
39805C85736R3081J35221J72875J62867R9041K0083l7167n3704k4336K3169L5358
39794A012224P795K1812J36199K56508K13031N331j36186l4879J59382J44142
39784A785359r7146k31189l6311K66240L24266J50774M9400J15281J23701m9496
39774B400879k16128k17167j87234k69745l16461j47937P4898O7770j01698j09367
39764I77810R1431J90983K0132k12004k78510k24752j55161j9481J87048K57176
39754H34672N9048j82623j58839P6611J88928L7749j67160j81649k20K06091K66307
$$ plain form
39826 68709 400685 562491 433595 130921 -16580 192651 580294 804762 768441 647990
39816 647990 562869 430720 198778 17537 52894 243725 384054 384718 333144 330015 385736
39805 385736 478817 614038 786913 949780 1048821 1068904 1031737 978033 953697 976866 1012224
39794 1012224 1020019 1041831 1178030 1434538 1647569 1652900 1516714 1481835 1641217 1785359
39784 1785359 1688213 1457024 1420713 1686953 2011219 2161993 2211393 2326674 2450375 2400879
39774 2400879 2184751 1967584 1780350 1510605 1194144 1046207 1121105 1188875 1087177 977810
39764 977810 1069241 1260224 1280356 1068352 789842 565090 409929 390448 577496 834672
39754 834672 893720 711097 552258 628869 817797 855546 688386 506737 506517 712608 978915
39743I78915J04600k00527m24302l82165j40462N3211O8113J9011O4906J78573
39733C19873J96283N7875r1131p7565O0009J02943m2471j83156j02697J03297
39723C43260J52563J431j05317m4854N403p7910j14395N6952K41086J64196p0965
39712E51450j27718M7839J73603Q2343p3744j14232o9634m9075o8216q9923q6314
39701A76379j2685J38852K40081J43352p9851j92208j17927l1076n8008q4971
39691A21938K7133J93448K15371N3143j36500j95424j10909J2395P2646O3835
39681C17076N8004R3604J19505Q0229P82o3935r9814r7574l2687M8041K9312q9702
39669C62841j42527m2844O3931M6621J3142Q4925J26762k1823j98214j36907O1699
$$ plain form
39743 978915 1083515 882988 458686 76521 -63941 -10730 57383 76394 141300 319873
39733 319873 516156 574031 482900 405335 465344 568287 525816 342660 239963 343260
39723 343260 495823 497254 391937 347083 352486 274576 160181 217133 458219 622415 551450
39712 551450 423732 471571 645174 727517 653773 539541 469907 420832 352616 262693 176379
39701 176379 163694 302546 542627 685979 606128 413920 295993 264917 206909 121938
39691 121938 149071 342519 557890 611033 474533 279109 168200 180595 253241 317076
39681 317076 375080 468684 588189 668418 669200 605265 505451 407877 375190 423231 452543 362841
39669 362841 220314 177470 241401 288022 301164 386089 512851 491028 292814 155907 217606
39658B17606N8796j59982k38619q197K72284L22274J72323p939j32140j53681
39648C42725n8026K8188l1738j13896J6425K64854K72346j4401k20173j15105
39638C71199O5373M7339q8392j45143j25269r2771m052J28425J69371J14407J20725
39627E61212J61359J3606k58767k50984J21180L64798J38808k00051j77646P5008
39617E48523J41943J9312j5437L7706j2084j03417n4984K9520n0091j67763r1931
39606B81297N3381K1047n9739O5805K17604N7345k21878j37231K17598K48015
39596G43244j51714l89306j26853K17966K01645L927j4047P5667Q037j63226j97747
39585B07593q8171m169K6960R6851J79598J51262o777j67923j89568m1879J22279
$$ plain form
39658 217606 276402 116420 -122199 -130396 141888 464162 636485 628546 496406 342725
39648 342725 284699 312887 281149 167253 183678 448532 720878 706477 486304 371199
39638 371199 436572 483911 395519 250376 125107 32336 28284 156709 326080 440487 561212
39627 561212 722571 736177 477410 226426 347606 712404 851212 651161 473515 548523
39617 548523 690466 709778 694341 732047 719963 616546 561562 591082 540991 373228 281297
39606 281297 334678 355725 295986 361791 579395 636740 414862 277631 495229 743244
39596 743244 591530 202224 75371 293337 494982 498909 484862 560529 568566 405340 207593
39585 207593 119422 115253 142213 239064 418662 569924 563147 395224 205656 163777 286056
39574B86056O6406k19444l90940j60042K50206L68073J37863m7699J8446J06782
39564D15707K0412r6271q0931k3401k0995J8119J33103J67570O3692J5502J27249
39553G39756J96861O0412j11596j04437q322j9653r6332p7548J4256N1021N2674
39542F97092J15259J77461R4317j00879k08533j32788J621J7984j00902j85535
39532C75097o8554J79628K78113R1120j47815j39632N2293J21268m378r9339m3043
39521E94758L2057K9924K5678N0593K7075k3259J1210P0322k2122j91956j47879
39510D56401J34810L19271K15999L7997N509M0696K2436J2727M5274P79j25555
39499A166344j39719p029K8664j24622j92128K1689K85176K93145R8610n3342
$$ plain form
39574 286056 352462 133018 -257922 -417964 -167758 200315 338178 290479 308925 415707
39564 415707 436119 339848 258917 235516 214521 232640 365743 533313 597005 612507 739756
39553 739756 936617 997029 885433 780996 772674 753021 656689 579141 593397 644418 697092
39542 697092 812351 989812 1084129 983250 774717 641929 643550 661534 560632 375097
39532 375097 306543 486171 764284 855404 707589 567957 620250 741518 737140 637801 594758
39521 594758 626815 656739 682417 733010 760085 736826 748036 818358 796236 604280 456401
39510 456401 591211 910482 1126481 1164478 1169987 1210683 1233119 1245846 1291120 1291899 1166344
39499 1166344 1026625 1019596 1048260 923638 731510 753199 1038375 1331520 1430130 1376788
39489A376788q0304l1812O0590J09634j0037k05372j95149M8770J97819P3475
39479A344402p7319j3581J34060J59312J16446J19461J08554M3104L3287Q9036
39469B056762N9999j2129J32381M66201N81643L22697N0269L0848N6935l6944
39459C708662j6635K34294L75742K06716P8717K60729M14730K10927m8891J2942
39449E437933J56152j0612l17916m13666m19321n62222n87207k34467J08973j1118
39439C146529k62879n9577L84192L88552l4871k32694K0080L16275L88643L26937
39429D381187J23707k63946n15195l31295p0564k50096n98838m40752J29720L62244
39419B526172P4008j62183o4437L0023m0538p317J68841J87683P1071J63190L93287
$$ plain form
39489 1376788 1296484 1264672 1325262 1434896 1424859 1219487 1024338 1073108 1270927 1344402
39479 1344402 1267083 1253502 1387562 1546874 1663320 1782781 1891335 1934439 1967726 2056762
39469 2056762 2116761 2104632 2237013 2703214 3284857 3607554 3657823 3688671 3745606 3708662
39459 3708662 3692027 3926321 4302063 4508779 4587496 4848225 5262955 5473882 5424991 5437933
39449 5437933 5594085 5583473 5265557 4851891 4432570 3870348 3283141 3048674 3157647 3146529
39439 3146529 2883650 2824073 3208265 3596817 3561946 3329252 3349332 3665607 4054250 4381187
39429 4381187 4504894 4240948 3725753 3394458 3323894 3073798 2474960 2034208 2163928 2526172
39419 2526172 2600180 2437997 2373560 2403583 2363045 2355728 2524569 2712252 2783323 2946513 3339800
39408C339800L23989K884m8497K18402K72242m3981k70409j70295j5857P4786
39398C683064K83724M84425L09946q1971j41860J17232J63535l5766J3632L14005
39388E109966L44208J07224J44632M28788L68064J7030P7771N49135O46923K72533
39378H066274K28581P05560R35339O80643O51429J060048J215501R65264J045863
39369A5554502J589338J853930J829542K399065L528022M210152M585830N876693
39361D1427074P730122Q236408P326002P266994Q890954J0701869J2916847J8284558
39353A22780828K7102705L6419380M6796420O2762669Q0031466P9003477M3029704
39346D97926649j7090587o7636253q4358473p2850770n4323756m0748295l0613672
$$ plain form
39408 3339800 3663789 3666673 3618176 3836578 4108820 4064839 3794430 3624135 3608278 3683064
39398 3683064 3966788 4451213 4761159 4679188 4537328 4654560 4818095 4782329 4795961 5109966
39388 5109966 5454174 5561398 5706030 6134818 6502882 6519912 6597683 7146818 7793741 8066274
39378 8066274 8294855 9000415 9935754 10616397 11267826 12327874 13543375 14508639 15554502
39369 15554502 17143840 18997770 20827312 23226377 26754399 30964551 35550381 41427074
39361 41427074 49157196 57393604 64719606 71986600 80877554 91579423 104496270 122780828
39353 122780828 149883533 186302913 233099333 295862002 375893468 454896945 497926649
39346 497926649 480836062 413199809 328841336 255990566 201666810 160918515 130304843
39339A30304843k1304374j4708138j1796471j0106975q163984p279662p838809
39332D9106430p865223o374490m840345m310812l847913k748943j860053j750286
39324A5508365j673031j185302r59147j244855j224179n88157j93734m91317p57703
39315G190940n19362l42152n67678n98497j27309J54805k02639n70438l58211
39306D059459K1594J0242j70510j28935m5254j62102k39241r0367r284j59114
39296C086488j86916Q8539K60566N8849j60293r2096j804j19372j71862R934O8155
39285B840188j95502l41850m7376K59120R6081k70374l27321j40984p5682j04544
39275A691756o035J04256J6840j01884j6184J01908J4380p5110J09809L40283
$$ plain form
39339 130304843 109000469 94292331 82495860 72388885 64224901 56945239 49106430
39332 49106430 41241207 34866717 30026372 25715560 21867647 19118704 17258651 15508365
39324 15508365 13835334 12650032 11690885 10446030 9221851 8633694 8439960 7948643 7190940
39315 7190940 6671578 6329426 5761748 5163251 5035942 5190747 4988108 4417670 4059459
39306 4059459 4081053 4091295 3920785 3791850 3746596 3584494 3345253 3254886 3245602 3086488
39296 3086488 2899572 2988111 3248677 3307526 3147233 3055137 3053333 2933961 2762099 2772033 2840188
39285 2840188 2644686 2302836 2255460 2514580 2610661 2340287 2012966 1871982 1796300 1691756
39275 1691756 1685721 1789977 1806817 1704933 1688749 1790657 1805037 1729927 1839736 2180019
39265B180019K48180J9973J16804M66088N36820J55592k95217m82352m52535l50853
39255B142519k25064j36993j27526p3672J24692K82761J77042l0130K4874L48929
39245B507432N88572N63772M36476L37667J98410J1525q8059j07585k51671n61314
39235C635225p64619o45544l51136j70445j69985k06096j78565j13238n3606k247
39225I79744L7690L9674j6376j13416j95334k02172j25031j4037Q0551J43735
39215F15028J57440Q4205o3087j77233j44365K6830J90304J85865n10j86277j61119
39204E27081M7461J69472N0681j03827k5748J80892J73822q6929k53070j10582
39194E69253J21892J57632K9997o7634r0621p8529J4821J92008K73092J21851
$$ plain form
39265 2180019 2428199 2448172 2564976 3031064 3567884 3723476 3428259 2945907 2493372 2142519
39255 2142519 1917455 1780462 1652936 1579264 1703956 1986717 2163759 2133629 2158503 2507432
39245 2507432 3096004 3659776 4096252 4433919 4632329 4643854 4555795 4448210 4196539 3635225
39235 3635225 2870606 2225062 1873926 1703481 1533496 1327400 1148835 1035597 981991 979744
39225 979744 1017434 1057108 1040732 927316 731982 529810 404779 390742 471293 615028
39215 615028 772468 856673 793586 616353 471988 498818 689122 874987 874477 688200 527081
39204 527081 574542 744014 794695 690868 665120 846012 1019834 932905 679835 569253
39194 569253 691145 848777 878774 811140 720519 641990 656811 848819 1121911 1243762
39184A243762j11786j90569j14635m2443j4689J7680J0192q2078j26857P857J75454
39173G71888J24889r7947k10428j33485o9554j16660j14539L2567J59405J12538
39163D58674k433j3342N1023N9037J0096q889j2163p8894j67009j34163L7253
39152A99190J70711J11320o9191j59526p1589O3027Q1930Q619R74J08270J91728
39141F35463J24376l2273j28157j20327p1354j7637L9822N2451l0415j34361j13063
39130B04525L7610J37621N6701j04176j48497l8306Q5787J16512J07060J51966
39120F06803K21591K01563P2787m9472q2217p7853r2730o0952O7574J47206m952
39109I49348k86561l72840j57388R1133J21427L1964M2148J26697J14279J3558
$$ plain form
39184 1243762 1131976 941407 826772 784329 769640 787320 797512 715434 588577 596434 771888
39173 771888 896777 798830 588402 454917 385363 268703 154164 186731 346136 458674
39163 458674 456241 442899 493922 552959 563055 554166 542003 463109 296100 161937 199190
39152 199190 369901 481221 412030 252504 180915 243942 325872 334491 335465 443735 635463
39141 635463 759839 727566 599409 479082 407728 390091 429913 482364 451949 317588 204525
39130 204525 242135 379756 436457 332281 183784 145478 231265 347777 454837 606803
39120 606803 828394 1029957 1102744 1053272 971055 893202 800472 739520 807094 954300 949348
39109 949348 662787 289947 132559 223692 345119 377083 419231 545928 660207 673765
39099F73765l1415l7088j44369l00801k72077k6463J65774J30545M2566J10315
39089C10752K13217R2922k02178l25864r8932K41378L41069J51989n7608o3933
39079F02812O0639R3368k2461j15505m8112P7868P0135p0893j53717o9322P2900
39068D97712J16451M9606l0714n5276j9944M2196P3247M0944J1119P9450J94026
39057I98817J76661j155j18934l0750N9058j23633m51045m98925j47051K24613
39047H7656K62358R3035M4906J31612J09526o0732j39010o012J47866J24284j6440
39036G79049j06041j01575l9231Q2494K22398K34603N7765j33941j40773j7595
39026H37153L1660l3078p9793o1776o2771r1894n9003J4853j3188j41773j69069
$$ plain form
39099 673765 642350 605262 460893 160092 -111985 -138448 27326 157871 200437 310752
39089 310752 523969 616891 414713 88849 -10083 231295 572364 724353 666745 602812
39079 602812 663451 756819 734358 618853 570741 648609 718744 647851 494134 424812 497712
39068 497712 614163 663769 633055 577779 557835 600031 673278 714222 725341 804791 998817
39057 998817 1175478 1174323 1055389 1024639 1083697 960064 509019 10094 -136957 87656
39047 87656 350014 443049 487955 619567 729093 668361 529351 523339 671205 795489 779049
39036 779049 673008 571433 532202 614696 837094 1071697 1129462 995521 854748 837153
39026 837153 868813 835735 755942 694166 631395 539501 480498 495351 482163 340390 171321
39015A71321p326J55049J47720P7958J07266J41229o250k42148k70018k5530K19798
39004D69069K36498R8386r662m2419l5983K8652J46011J89659O5191j13534j64374
38993H67494j00612q1042j26165q5956Q1711K04405J55888M6359K2802L3858l3787
38982I84955j07515l5470J26967J80015J20513J67089L84963N27381L84817J07490
38972B841205J2079J84330M31289N56200N47939N36486O43119Q40997R56674R11042
38962H461360R33722J336619K078192K854734L660971M768073N847909N637663
38954C5579243L159515q48351m332115n819355n485222m384817l267021k354281
38946A2247596j702102j294897j014554q26404q28803r44739q42658m01156K5635
$$ plain form
39015 171321 163995 319044 466764 544722 651988 793217 786967 544819 274801 249271 469069
39004 469069 705567 803953 794291 751872 715889 744541 890552 1080211 1145402 1031868 867494
38993 867494 766882 685840 559675 473719 555430 759835 915723 962082 984884 1018742 984955
38982 984955 877440 841970 968937 1148952 1269465 1436554 1821517 2348898 2733715 2841205
38972 2841205 2853284 3037614 3468903 4025103 4573042 5109528 5752647 6593644 7550318 8461360
38962 8461360 9395082 10731701 12809893 15664627 19325598 24093671 29941580 35579243
38954 35579243 38738758 37890407 33558292 27738937 22253715 17868898 14601877 12247596
38946 12247596 10545494 9250597 8236043 7409639 6580836 5636097 4793439 4392283 4417918
38937D417918J02136K9521K21498O24734P35238K54434n57140j177959j276822
38928C373558r00288l91319j05310r8619j51277j26580j16326j52780o6427J71002
38918A435634K52162k1916l47369l18585l1654R8234k3047j26260q9425o2269
38908G65505j01116q6956k6487n3236j02760K4644K33134J78948j50681l24892
38898C56103j06984J82815J72469l3861j11262k5444J7950m8099j12263j14261
38888A77163q4255l5462J0989r689p5785l9777J35751K49417J40949m0131m5186
38877C83984J07553J91299J17124Q001l5607m7086p2439r5777r6172o4733K1681
38866D17828J39710J67459J8106j95459k61564j40842j5253l8356j41727j44972
$$ plain form
38937 4417918 4520054 4549575 4771073 5395807 6131045 6385479 5828339 4650380 3373558
38928 3373558 2473270 2081951 1976641 1878022 1726745 1600165 1483839 1331059 1264632 1435634
38918 1435634 1687796 1665880 1318511 999926 968272 1066506 1043459 917199 827774 765505
38908 765505 664389 577433 550946 497710 394950 419594 652728 831676 680995 356103
38898 356103 249119 431934 604403 570542 459280 433836 451786 403687 291424 177163
38888 177163 92908 57446 68435 58746 -17039 -56816 78935 328352 469301 429170 383984
38877 383984 491537 682836 799960 807961 772354 725268 652829 557052 460880 396147 417828
38866 417828 557538 724997 743103 547644 286080 145238 129985 91629 -50098 -195070
38856a95070J3498K26777L69627M20964M20053L77484L11167L22174M82517O23534
38846C372725M31537j17212n98453o31381l86373l17484m82681n00646k00647
38837E69385R0065O4040j14898j28547j233K2390q3607j26471m5704K3979J4956
38826B84355Q869M7163N7912N58o6936r2394q8596p7118o1614n1521m1675M429
38814g6568Q8445J44871J38914J26442J43733J25113K1546q9266j15477q6161
38804D21592o8859n1244k0518m5533j34229j27317P8813K97137K55697j0703j94488
38793D00348j29000M1071J19089Q8582L5393O4k4620n7119j24100k04139j84756
38782c9187R91K06728J98741k5646j98394j13892J24530K52810J41062j09024
$$ plain form
38856 -195070 -181572 45205 414832 835796 1255849 1633333 1944500 2266674 2749191 3372725
38846 3372725 3804262 3687050 3088597 2457216 2070843 1753359 1270678 770032 569385
38837 569385 659450 723490 608592 480045 478812 501202 417595 291124 245420 269399 284355
38826 284355 293224 340387 398299 398857 331921 239527 150931 73813 12199 -39322 -80997 -76568
38814 -76568 11877 156748 295662 422104 565837 690950 712496 623230 507753 421592
38804 421592 352733 301489 280971 235438 101209 -26108 52705 349842 605539 594836 400348
38793 400348 271348 312419 431508 520090 555483 555547 530927 473808 349708 145569 -39187
38782 -39187 -38196 168532 367273 341627 143233 29341 153871 406681 547743 438719
38772D38719k70372j56316K20515O04414O94065M31322L3172k67069m06508m12242
38762I09700k94879j16292l4358j29026k41083j39920J47239L19698J76887j04514
38752D93452j76077N6842L43738M13970K52600J7992j57314j88360k1181K42228
38742A277890L46206K33787K61347P26275J240025J016454r0057j243643j567774
38733B200510j093786m84111j37317J9893P9820J317j27217j08435K9132N7069
38723D36875n3714q8505P953K5793j13998j87631m8020J12034P3484o2918o2613
38712C8740P4653J46622N1479j14917k06331j49446K5759J92848K21954J19003
38702D00364O646n0247r4738j39069j15258o888R9890J39381J20049M2645q6194
$$ plain form
38772 438719 168347 12031 232546 836960 1531025 1962347 1995519 1728450 1321942 909700
38762 909700 614821 498529 464171 335145 94062 -45858 101381 421079 597966 493452
38752 493452 317375 374217 717955 1131925 1384525 1402517 1245203 1056843 1035662 1277890
38742 1277890 1624096 1857883 2119230 2845505 4085530 5101984 5011927 3768284 2200510
38733 2200510 1106724 622613 485296 505189 585009 586326 459109 350674 379806 436875
38723 436875 383161 294656 302609 328402 214404 26773 -21247 90787 164271 101353 38740
38712 38740 113393 260015 311494 196577 -9754 -159200 -133441 59407 281361 400364
38702 400364 407010 356763 262025 122956 7698 810 100700 240081 360130 402775 316581
38691C16581j55301n3968J05365R1112p7590j17937P4222K40861J63437j6341
38681E70441p2726n2335j10468j87281j23005L6925J17976J01637Q8322O4338
38671D33824m3338j54520j40238q5138j66774k96879j88517J72728M20125K90971
38661B42244j7972j44515l2497Q2340M9340l8604m5687J6747N2426L1686M785
38650B00293M388P996m837k3112m6905q4458p4673P8703L07388L38307K7486l55646
38638C74930m14242j55914M3222J9442K3587K22445L56001J51216j98771k97399
38628A24517j09402O7300P5284J2616n3561j57021k32858j53987J6208P8434J7912
38617c14558L671N7970K2378r9130p4998J64639L55852K76414O2665k1860N0097
$$ plain form
38691 316581 161280 107312 212677 303789 226199 108262 182484 423345 586782 570441
38681 570441 497715 445380 334912 147631 24626 61551 179527 281164 369486 433824
38671 433824 390486 235966 95728 10590 -156184 -453063 -641580 -468852 -48727 242244
38661 242244 224272 79757 47260 129600 178940 140336 94649 111396 163822 195508 200293
38650 200293 204681 212677 207840 184728 137823 53365 -21308 57395 364783 703090 730576 374930
38638 374930 -39312 -195226 -152004 -132562 -108975 113470 469471 620687 421916 124517
38628 124517 15115 82415 157699 170315 116754 -40267 -273125 -427112 -410904 -332470 -314558
38617 -314558 -310887 -252917 -230539 -329669 -404667 -240028 115824 392238 454903 433043 483140
38606D83140J08512M4797j18441k93724l44833j69233J22378K53168J24900m0597
38596A70067l2877N6767N2974J7515J00170K04228J10445j13524j54249N0821
38586D62337J67767m2287l45549l70275j36372L0030K0134M8429J97149K03528
38576B34891r0891l56822j92245K22665L13057m1079l04999j08705J85581Q3417
38566e5130k42128k52046O8911K04103m5060k75792j69501O0295J29027J31870
38556d45451K28433K62394O5345j54605j19961M1530K4710j23791j17573M5415
38546b93554J00783J2774K3918J87336K57492J30926J7823M3316L1596j25982
38536C86428k06246r783K62893K81691Q3529J1058K17463M82165N21228K89191
$$ plain form
38606 483140 591652 636449 518008 224284 -120549 -289782 -167404 85764 210664 170067
38596 170067 137190 193957 246931 264446 364616 568844 679289 565765 411516 462337
38586 462337 630104 587817 242268 -128007 -264379 -234349 -214215 -165786 31363 234891
38576 234891 144000 -212822 -405067 -182402 130655 89576 -215423 -324128 -138547 -55130
38566 -55130 -297258 -549304 -480393 -276290 -321350 -597142 -766643 -706348 -577321 -445451
38556 -445451 -217018 45376 110721 -43884 -163845 -122315 -97605 -221396 -338969 -293554
38546 -293554 -192771 -179997 -156079 31257 288749 419675 437498 480814 512410 386428
38536 386428 180182 170399 433292 714983 798512 809570 1027033 1509198 2030426 2319617
38526B319617n5132l34312m53110m12202k86979j70425j14179j13012j15830n7018
38516B07418O5045J40561O2241j03078j67005p9579n916o6601j38593m9672J32325
38505b854J81122M0050j10078j19865m6221r121j1320J1403N2056M8377n37k0866
38493A2146L2191J09804J20028K5478j06525j51817n7285P4490Q1710m8724j37480
38482d5984m2020J32892J62718R799j36248j35151n4272Q974Q9400K09138K29316
38471D28562M8954j57814j52236j9829n8573k74050l16051k2381K96958L14551
38461H8091J42647P2830R3680k015j82065k08856n0004Q1255Q9979R6694J51192
38450C73428J42429M3639k0643j3388m2736j22447j19536l099R4493J18313J43977
$$ plain form
38526 2319617 2264485 1930173 1477063 1064861 777882 607457 493278 380266 264436 207418
38516 207418 272463 413024 475265 372187 205182 125603 119687 53086 -85507 -135179 -2854
38505 -2854 178268 218318 108240 -11625 -57846 -66967 -78287 -66884 -14828 33549 33012 12146
38493 12146 44337 154141 274169 299647 193122 41305 -15980 58510 140220 91496 -45984
38482 -45984 -88004 44888 207606 217405 81157 -53994 -108266 -99292 -9892 199246 428562
38471 428562 477516 319702 167466 147637 89064 -184986 -501037 -523418 -226460 88091
38461 88091 230738 303568 397248 395233 213168 4312 -45692 35563 125542 222236 373428
38450 373428 515857 559496 538853 525465 482729 360282 240746 237647 332140 450453 594430
38439E94430J50282K5767j44552j23235O5738J18518l9021j06579O8733K39074
38429H49155K33642K47890L83046L70616J15401K0044L15793N99400O29758R98098
38419D762843K099667K881262J842679p18879k682741k656077j487878p37446
38411C303430o63503n51820k29789j59121l73311l58162K0581K77220J03168k18817
38401A149876l38313k73713j73680n2921P4868J14365O6017M5406O8137M4218
38391G24260q496L102J9789q2653j97503r3998J73480K92959J65138J4044k2030
38380I88092n9673j43111j06728R1389K28113J78090J12503J52436J33583n3164
38370A521530j78524k2815K23533K26439J5279r1789L3271K24049L36757L89630
$$ plain form
38439 594430 744712 770479 625927 502692 568430 686948 647927 541348 610081 849155
38429 849155 1082797 1330687 1713733 2084349 2199750 2219794 2535587 3134987 3764745 4762843
38419 4762843 6862510 9743772 11586451 10867572 8184831 5528754 4040876 3303430
38411 3303430 2639927 2088107 1858318 1699197 1325886 967724 988305 1265525 1368693 1149876
38401 1149876 811563 537850 364170 311249 386117 500482 566499 611905 680042 724260
38391 724260 715764 718866 738655 656002 458499 364501 537981 830940 996078 1010122 988092
38380 988092 928419 785308 678580 769969 998082 1176172 1288675 1441111 1574694 1521530
38370 1521530 1343006 1320191 1543724 1770163 1785442 1693653 1726924 1950973 2287730 2677360
38360B677360L97809L21087K04959J75010K55602L47996L99414M39254M36649
38351E655140K90898J6628k02644k29677j52103j60974l00831m26726m09829l09685
38341C770197k78156l22915k85690j08875J0565j14825l39240l48777j26729P715
38331A863270j20426k92778k61851j19136r7964j97444k37421j63435o7060J3669
38321C19424R9840J40714P7902j0338j5135R528m9547j31788r3957R590j6695
38310C39538j74625k41267j11696O0636J32075J52787J83817J43677j2800j29778
38300C42364m6554J40703J88272L0583j53225j86422q1891L2561P1353K9058o5365
38289C01437j60320j72896m9196J38412K18863J13230m3456o1411M8785J02044
$$ plain form
38360 2677360 3075169 3396256 3601215 3776225 4031827 4379823 4779237 5218491 5655140
38351 5655140 5946038 5962666 5760022 5530345 5378242 5217268 4916437 4489711 4079882 3770197
38341 3770197 3492041 3169126 2883436 2774561 2785126 2670301 2331061 1982284 1855555 1863270
38331 1863270 1742844 1450066 1188215 1069079 971115 773671 536250 372815 305755 319424
38321 319424 419264 559978 637880 627542 612407 621935 572388 440600 346643 356233 339538
38310 339538 164913 -76354 -188050 -127414 4661 157448 341265 484942 472142 342364
38300 342364 295810 436513 624785 655368 502143 315721 233830 266391 337744 366802 301437
38289 301437 141117 -31779 -80975 57437 276300 389530 346074 284663 333448 435492
38279D35492J9303p3722p6656p3364j52713k22400j55817j2754N4307L2292J7331
38268b08701J9544k4952r0111q0745N427Q7797J44683J98476K02604J05137j2634
38257C46525k7166L3528M9915J3284q782m0601j22264j39078J7986J80737R3161
38246C97245j54100k16354l8178O7369m2967j23381j4182N9870q4263k15385o7203
38235d31529J86045J97575m338j08347k9241M3881L7377P0972J53794J31899j5455
38224B32633j05229m3962M1447L9545J7387O2209J25693J15842K6768q5872j64633
38213B61828j54286m0834R4354J45966J09946N3977n320q6076j40175j04040k6171
38202A09169m665k1948P689N4135J4995o7281l8331Q9257J05019p3302k38847
$$ plain form
38279 435492 454795 381073 304417 231053 78340 -144060 -299877 -312631 -258324 -226032 -208701
38268 -208701 -189157 -214109 -304220 -384965 -379538 -291741 -147058 51418 254022 359159 346525
38257 346525 319359 352887 402802 416086 407304 366703 244439 105361 123347 304084 397245
38246 397245 243145 26791 -11387 55982 13015 -110366 -124548 -64678 -148941 -364326 -431529
38235 -431529 -245484 -47909 -52247 -160594 -189835 -145954 -108577 -37605 116189 248088 232633
38224 232633 127404 83442 124889 164434 181821 244030 369723 485565 512333 426461 261828
38213 261828 107542 66708 161062 307028 416974 470951 465631 379555 239380 135340 109169
38202 109169 104504 82556 90245 144380 159375 92094 53763 143020 248039 174737 -64110
38191f4110j78753L7544J82783J61840M6615p7953j63591j60349n9981N2381Q8576
38180a34998P3773R5222J67909K26893K23948J59196M1490j09061k29042k46152
38170B69178j52444r112J15760J87654J98534J51322N4800o8574j64662j66607
38160D15849p9968k6421j20401k95843l48650j86569N0021J67165J33543N2838
38150b38436M312N023O6477J72587K28779J44968l1687j57689j63595r6333o707
38139g2301Q8178J25872K7786j37977j65406J5942J96072J50141m4354j25536
38129E8417k4514P3953L9938m5229q6833j18584j47895o2351J53109K79433J48497
38118B67941o7105q9204L0794n406k42956l61366j48403J74980K63351R7584n5532
$$ plain form
38191 -64110 -242863 -205319 -22536 139304 185919 107966 -55625 -215974 -275955 -223574 -134998
38180 -134998 -61225 33997 201906 428799 652747 811943 853433 744372 515330 269178
38170 269178 116734 107622 223382 411036 609570 760892 815692 747118 582456 415849
38160 415849 335881 309460 189059 -106784 -455434 -642003 -591982 -424817 -291274 -238436
38150 -238436 -234124 -229101 -162624 9963 238742 383710 352023 194334 30739 -65594 -72301
38139 -72301 15877 141749 169535 31558 -133848 -117906 78166 228307 183953 58417
38129 58417 33903 107856 147794 102565 15732 -102852 -250747 -313098 -159989 119444 267941
38118 267941 200836 111632 142426 137020 -105936 -467302 -615705 -440725 -177374 -79790 -135322
38107a35322k3315J12125J89176J54963O7921k064m5377r4992j40771j06380L0921
38096F885J50404J22837l059p3653m8762L830P9301J96598K27761L1317k36482
38085D56977k46833L965J48412J4389j15387m886J29673R131k15508k18314k3674
38074f2055R8392R5906J17445J54994P9211n3930q8079q0177j75783k57988j10223
38063b82287J36761J47489n2274j02125P5137J52038j4176j37641j8121J28554
38053C3355P7428l8157j2278R3129J33484J31532J22584J7524j67877k17368o3372
38042A09984M4566n0977j24575M8165K90661L12272J57291N1447Q503q4974j69290
38031E93073j21006k1050j7047n7729l8113m0492j43486j83933l2216R8260j2801
$$ plain form
38107 -135322 -158637 -46512 142664 297627 365548 363484 318107 223115 82344 -24036 6885
38096 6885 157289 280126 277067 203414 154652 158482 237783 434381 662142 693459 456977
38085 456977 210144 214109 362521 376910 261523 256637 386310 395441 179933 -38381 -62055
38074 -62055 36337 132243 249688 404682 483893 429963 341884 261707 85924 -172064 -282287
38063 -282287 -145526 1963 -50311 -152436 -77299 74739 60563 -77078 -95199 33355
38053 33355 110783 72626 60348 153477 286961 418493 541077 558601 390724 173356 109984
38042 109984 154550 103573 -21002 27163 317824 630096 787387 838834 847337 762363 593073
38031 593073 472067 451017 433970 376241 338128 297636 154150 -29783 -61999 36261 23460
38020B3460j51418k860K49068J70855j75159k98094q1726O5602m6121q6158J44058
38009a88493L01027P2369k77903l21463r4959P0130R2081J18149J40090K7716
37999f1256j45097j66503m5675M239o6099p9266L7360J23436O3080l2077k4561
37988c92419L6604L4142o879K8149J34656J72713P2249n1521m9923M9925P9472
37977A07168l1088j47088j17152J4403P6483Q636p7447o7399J9729Q1449N2777
37966g9529l6809r2628n8032r036p4374k14634k02138O3041L41366L42205J30478
37955A09910J2887P1418Q9885l6205j14623O457J68727J42247m4305j86110j89351
37944C0937j17419m2469Q109J7689k761j3333j4544l7878l8574P0286K29944K45039
$$ plain form
38020 23460 -127958 -130818 118250 289105 113946 -184148 -265874 -200272 -246393 -332551 -188493
38009 -188493 112534 184903 -93000 -414463 -509422 -439292 -347211 -229062 -88972 -61256
37999 -61256 -206353 -372856 -418531 -414292 -480391 -559657 -522297 -398861 -335781 -367858 -392419
37988 -392419 -355815 -321673 -328552 -300403 -165747 6966 79215 27694 -22229 27696 107168
37977 107168 76080 -71008 -188160 -173757 -97274 -88638 -166085 -233484 -213755 -132306 -79529
37966 -79529 -116338 -208966 -266998 -276034 -350408 -565042 -767180 -704139 -362773 -20568 109910
37955 109910 122797 194215 284100 247895 133272 139729 308456 450703 406398 220288 30937
37944 30937 -86482 -128951 -120842 -103153 -105914 -119247 -133791 -171669 -210243 -139957 89987 335026
37932C35026O0299j39080k00021j91772k01398j43618M2875J96088J59341O1828
37922b0432J12752K30572J69901m3962j22410L2332J81113J32424M498k8959l2466
37911F15363j60790l53258l76965j44050J57135K68781J33009o6755j13240J0535
37901c0235J19302O7232p1334j23710n6721J4729J7131j7419o8549j60068k40758
37890e50400j77941M8160K52963K55010J08717K3339P8738J28303J1281k08033
37880b9863k84586q8333J96908K50109J764k48554j81180J49148L89911L28019
37870D83343R9368n6952r2194j04451j25552r7762k0506K0442q024k1401N3178
37859A29489J45184J14364n4843k03545j77614j3780J10581R5225O720o3262j30275
$$ plain form
37932 335026 395325 256245 56224 -135548 -336946 -480564 -437689 -241601 -82260 -20432
37922 -20432 92320 322892 492793 448831 326421 358753 539866 672290 676788 647829 615363
37911 615363 454573 101315 -275650 -419700 -262565 6216 139225 72470 -40770 -30235
37901 -30235 89067 156299 84965 -38745 -95466 -80737 -63606 -81025 -149574 -309642 -550400
37890 -550400 -728341 -680181 -427218 -172208 -63491 -40152 38586 166889 178170 -29863
37880 -29863 -314449 -402782 -205874 44235 45999 -202555 -383735 -234587 155324 483343
37870 483343 582711 525759 433565 329114 203562 105800 85294 105736 97712 76311 129489
37859 129489 274673 389037 334194 130649 -46965 -60745 49836 145061 151781 88519 -41756
37848d1756k29701k72620j26643J58552L42333K73950Q2797o874K1713j769j28775
37837G1207j75297L866K52709K86155P8593j02289p9431J528o5304k05991j74625
37826a08879P3210L13619L51040K05525n051j90600k62685j68041j9732k4400
37816A64006j88963k67901j15740P9507P2502p8944j26755n323J17262J10216
37806b40133J2253q3537j13214l3104J20272J90792P8798p6283n9479R9871J62843
37795E9079L5687j08827j01218J5145J02665J02615K9113p4431j20086m2849P5847
37784b7260P9449l9350j26720j06830p0019q1087p9612l8929m0492r4563o4885
37773f90298J06201K57772K31235R0896j0718m6944m8762L2858K09811L14256
$$ plain form
37848 -41756 -271457 -544077 -670720 -512168 -169835 104115 186912 180038 201751 199982 71207
37837 71207 -104090 -100224 152485 438640 517233 414944 335513 337041 271737 65746 -108879
37826 -108879 -35669 277950 628990 834515 829464 638864 376179 208138 188406 164006
37816 164006 -24957 -292858 -408598 -329091 -256589 -335533 -462288 -467611 -350349 -240133
37806 -240133 -227880 -311417 -424631 -457735 -337463 -146671 -67873 -144156 -203635 -103764 59079
37795 59079 94766 -14061 -115279 -100134 2531 105146 134259 59828 -60258 -103107 -27260
37784 -27260 52189 12839 -113881 -220711 -290730 -371817 -451429 -490358 -530850 -625413 -690298
37773 -690298 -584097 -326325 -95090 -4194 -14912 -61856 -110618 -77760 132051 446307
37763D46307J80513r1007k39397j75057m2166J1669l3523j36010k26376j96677
37753e01724j3802J70393J77662O1358M1217J74969K69978J67330m0653j50279
37743C56449r0187M6584J30012R2695l0976j17265o0524R4666J78105Q2636j09149
37732E73046k10544j21250P3840J84858J08169o5524j75119j97580k24741k37546
37722b92391r2465J87581L25199J67300m1335r034J43006R2556j23944j59893
37712A96580M4452J43266k8597j64188l37K26286J46827j65879l29972k11171
37702a42733k3901M2963Q413n9131j26505j26224j4170J08192J11366M9240O4565
37691a07925J24478P2900o9361j02266K3704J12678L3785q3606o9425M6305J28375
$$ plain form
37763 446307 626820 535813 296416 121359 79193 90862 57339 -78671 -305047 -501724
37753 -501724 -515526 -345133 -167471 -106113 -64896 110073 380051 547381 506728 356449
37743 356449 266262 312846 442858 535553 504577 387312 326788 421454 599559 682195 573046
37732 573046 362502 241252 315092 499950 608119 542595 367476 169896 -54845 -292391
37722 -292391 -384856 -197275 127924 295224 253889 244855 387861 480417 356473 196580
37712 196580 241032 384298 355701 191513 191176 417462 564289 398410 68438 -142733
37702 -142733 -166634 -123671 -115258 -174389 -300894 -427118 -441288 -333096 -221730 -172490 -107925
37691 -107925 16553 89453 20092 -82174 -58470 54208 87993 4387 -65038 -18733 109642
37680A09642J32361R1178K0899n0899n9539p367o261j16596k23755j83542l0684
37669c24563P0965N6787L1703R9824K01629J74964k6340k22515j87707M9872J95903
37658A20522O0387j69605j79041L7666J99416J62470O8261L6655j6536j45352
37648A74843k07823j06256J2401m650n2361L2393J57140J21669k1923m2201P9580
37637A42812J17481j7897j32951o1636J00296J74791J36399N7989k9434j06343
37627C81507j13737m8634j6227p8016j31981n9887P4052J02458r84r1526p6142
37616e9117l8098p8555j35094p5475O6001R5788m8912j61990m8606J65216J99042
37605a19800L9582n4170J7086M7311p9773j52182O71J70473R9294p3004n2759
$$ plain form
37680 109642 242003 333181 354080 303181 243642 236275 230014 113418 -110337 -293879 -324563
37669 -324563 -253598 -196811 -165108 -65284 136345 311309 284969 62454 -125253 -75381 120522
37658 120522 180909 11304 -167737 -130071 69345 231815 300076 336731 320195 174843
37648 174843 -32980 -139236 -126835 -131485 -183846 -151453 5687 127356 105433 63232 142812
37637 142812 260293 242396 109445 47809 148105 322896 459295 517284 487850 381507
37627 381507 267770 219136 202909 124893 -7088 -66975 7077 109535 108551 17025 -59117
37616 -59117 -97215 -175770 -310864 -386339 -320338 -224550 -273462 -435452 -484058 -318842 -119800
37605 -119800 -80218 -134388 -117302 -69991 -149764 -301946 -301275 -130802 -31508 -104512 -157271
37594a57271Q0268J6889j96033j93006O5805J79620l1191k14799o8519J83099
37584c35138J93303L3827j6896M3245L7629r500L9128J10710M2962p9266m7547
37573A2457R9234J61639J52198K26532L11868K01884L928N7890L38983L74269
37563A940882o8428n77251o27641k44880J17993J63908l0255k33702k73306j15801
37553E1519Q6251J07195o9799j95487r9767N4084K5532j32894j74291l7246R7524
37542b87379R7564K1864l0623m2764k4172K6821P5600P2318L6465K6741L0017
37531B452j2432o8781l0410J12388K25320K07160J09983K6194m5314j36061j92697
37520A97802j43718m9012n4927j76925k37146q8825J67926K87696J70417l8937
$$ plain form
37594 -157271 -77003 -60114 -256147 -449153 -383348 -203728 -234919 -449718 -518237 -335138
37584 -335138 -141835 -108008 -124904 -81659 -44030 -53530 -14402 96308 139270 60004 12457
37573 12457 111691 273330 425528 652060 963928 1165812 1169740 1227630 1566613 1940882
37563 1940882 1872454 1295203 667562 422682 540675 704583 674328 440626 167320 51519
37553 51519 137770 244965 175166 -20321 -120088 -66004 -40472 -173366 -347657 -384903 -287379
37542 -287379 -189815 -167951 -198574 -241338 -265510 -238689 -163089 -90771 -54306 -27565 2452
37531 2452 -9980 -78761 -109171 3217 228537 435697 545680 571874 526560 390499 197802
37520 197802 54084 5072 -49855 -226780 -463926 -552751 -384825 -97129 73288 34351
37510C4351j39168p6200N5802J32035Q6101m1559j12352k5593J27134J44601j1382
37499A73770j55410j48018o2054J8851J64777L77253M04535P1329l37554l73718
37489A33761n7743J55228N7936o2681L1627J51084O7600o9158k1129R0533j7335
37478D59723k99984m35329k86972j9408J94857L05546K62564M6641j76717j92813
37468a41892m9322N799p8264p4957J29941L11224K08238j09042l28845k63646
37458c90766j0885K02800K50555J83194J11671M4296q5668k19323j56393J38552
37448F8033L68113K49289p7562k38119j49934o2030r4628q8263K1979L7862j30633
37437i5893k35232o2419K06877K68533J32892J8456l2476j26524k12048j30078
$$ plain form
37510 34351 -104817 -181017 -125215 6820 92921 51362 -60990 -86583 40551 185152 173770
37499 173770 18360 -129658 -191712 -172861 -8084 369169 773704 845033 507479 133761
37489 133761 76018 231246 289182 226501 258128 409212 476812 407654 386525 477058 459723
37478 459723 159739 -275590 -562562 -581970 -387113 -81567 180997 227638 50921 -141892
37468 -141892 -191214 -185415 -263679 -338636 -208695 102529 310767 201725 -127120 -390766
37458 -390766 -401651 -198851 51704 234898 346569 390865 305197 85874 -70519 68033
37448 68033 436146 685435 607873 369754 219820 157790 63162 -25101 -3122 34740 -95893
37437 -95893 -331125 -393544 -186667 81866 214758 233214 200738 74214 -137834 -267912
37427b67912N2260P7134r2958j86915m0086J57502J68491N2437J9460R1093J18246
37416A48752O0798L7291R6104J18585J1171j32956j57582o3197m684p7365j84362
37405a47445j56362K8682J96787J65899m3832k25692k14934n8945P2935J08907
37395b74000J26736J85648K07747J00333o9427j33974m9290M7076K5181q0172
37385H5858j39307p9939O7078K01697K03347L3441j70725k06683o4638M5538j345
37374b5678o4369J1718J18332O0150r9737j22364K4191J24287O4944k8244n2415
37363A0815p2335j13994n6330J31044K51958J57401j3944m9589K6343M9730J867
37352C22966j6057j0217p0614j55638j17441M5204J46342O6515j00667k02018
$$ plain form
37427 -267912 -215652 -138518 -231476 -418391 -458477 -300975 -132484 -80047 -60587 30506 148752
37416 148752 209550 246841 342945 461530 472701 339745 182163 118966 114282 36917 -147445
37405 -147445 -303807 -275125 -78338 87561 43729 -181963 -396897 -455842 -382907 -274000
37395 -274000 -147264 38384 246131 346464 277037 143063 93773 140849 166030 85858
37385 85858 -53449 -133388 -66310 135387 338734 372175 201450 -5233 -69871 -24333 -25678
37374 -25678 -90047 -78329 40003 100153 416 -121948 -97757 26530 91474 63230 10815
37363 10815 -61520 -175514 -231844 -100800 151158 308559 294615 245026 271369 321099 322966
37352 322966 306909 296692 226078 70440 -47001 -1797 144545 211060 110393 -91625
37342i1625k01276j47730o8084M0630J56251K16701J60536J870j26354p6757J10208
37331b5630J97882M9885j47681j10928J40789K87954J27239j82859l49501k81831
37321b94681j17680j1818Q241J6977Q4298J82199J93779N7653j10742j24225M0059
37310g5940J98664J86019L8985q2679q6335q036N4929K4569r3017j81501j09201
37299a33543J01069K53377J95149R454q5867r290J00040P9777n5538j63536j68954
37288A22138j25131q7638k5372Q7798J72250J36423L3252l70M3922L3450p6296
37277C14426j53838j07180l4234m2972o6590j4048K9658l9610r4040N9086L04477
37266A55135L08091J7307k18350j42519N1117M1848j41028k05743n4121R8983
$$ plain form
37342 -91625 -292901 -440631 -508715 -468085 -311834 -95133 65403 67273 -59081 -135838 -25630
37331 -25630 172252 222137 74456 -36472 104317 392271 519510 336651 -12850 -294681
37321 -294681 -412361 -424179 -415938 -398961 -314663 -132464 61315 118968 8226 -115999 -75940
37310 -75940 122724 308743 347728 265049 178714 170678 225607 250176 157159 -24342 -133543
37299 -133543 -32474 220903 416052 425506 339639 330349 430389 510166 454628 291092 122138
37288 122138 -2993 -90631 -116003 -28205 144045 280468 313720 313350 357272 390722 314426
37277 314426 160588 53408 19174 -23798 -90388 -104436 -74778 -114388 -208428 -149342 155135
37266 155135 463226 480533 262183 119664 170781 212629 71601 -134142 -188263 -89280
37256h9280N5265j13087j92465r5348O3880J15902K3068q3116n8267Q2942K02717
37245h7789K23743J80505R5391n5081k08762k03877M919K29625K56763R0600r8809
37234D27228j81446j36461j8148N0964m0402k17156k41410k7990J99270K12251
37224B6700R2080N0392Q4892N6997o384K0586P0127k3274j63899q3895J77317
37213C01639K53958K1145j86007j03149O2126K5105q5074J9294K52590K81782
37203H43409Q5124j5498J16492K40769J68888P1729J92784M74246O62062O61285
37193C501290O14239O72329Q12142Q70428P00994L07373j53866n13889p25051
37184F085989q26035q26233p15217n58498m65980m54190m38284l67934k69995
$$ plain form
37256 -89280 -34015 -147102 -339567 -434915 -371035 -255133 -232065 -315181 -373448 -290506 -87789
37245 -87789 135954 316459 411850 356769 148007 -55870 -50951 178674 435437 526037 427228
37234 427228 245782 109321 91173 142137 101735 -115421 -356831 -384821 -185551 26700
37224 26700 118780 169172 254064 311061 304677 325263 395390 372116 208217 124322 301639
37213 301639 555597 576742 390735 287586 349712 374817 289743 309037 561627 843409
37203 843409 928533 913035 1029527 1270296 1439184 1510913 1703697 2177943 2840005 3501290
37193 3501290 4115529 4787858 5600000 6470428 7171422 7478795 7324929 6811040 6085989
37184 6085989 5259954 4433721 3718504 3160006 2694026 2239836 1801552 1433618 1163623
37175A163623j56123j3829R1829M8743j17927k24713j68141o5328o7345j41516
37165C49273j50276o1418M0893R6632J05495O4391j7662o8897k7799M4847K7881
37154D03360q6708j76796j57989q0280l0435j5192J2491O2159R4937Q5470N1484
37143A62501J7690j9534o7330q9731l3503P7095J23692L3586j00062j24691l8437
37132e8724J2029n0301j36569j46907r4396j4657J14651K65277K94087J29120
37122C13610o6472p4348Q3257J82843J11605j4056m9274k48L2230j4086j18211
37111C86850j91428j35827L4214J47965O1446j27603j76260j9243J43266J25144
37101B48524j0361p6968k6500K3910j9810j10907j39096p0936J8555N3117O1831
$$ plain form
37175 1163623 1007500 993671 1085500 1134243 1016316 791603 623462 558134 490789 349273
37165 349273 198997 137579 178472 275104 380599 444990 427328 358431 330632 375479 403360
37154 403360 316652 139856 -18133 -98413 -128848 -144040 -131549 -69390 25547 111017 162501
37143 162501 180191 160657 93327 3596 -29907 47188 170880 204466 104404 -20287 -58724
37132 -58724 -46695 -96996 -233565 -380472 -474868 -489525 -374874 -109597 184490 313610
37122 313610 247138 172790 256047 438890 550495 536439 487165 486917 519147 505061 386850
37111 386850 195422 59595 93809 241774 303220 175617 -643 -19886 123380 248524
37101 248524 238163 161195 134695 158605 138795 27888 -111208 -182144 -163589 -110472 -48641
37090d8641J23796K11326J88334J4187j61458j99615j55220j29873o4466J22830
37080i8800K86593K04493m7598j51879j5856J01035J9806q3132k30J52649J34914
37069E01995l2251j20533m4639N7263N2392m3319j26218r7009N9568K03461J40256
37058E50966j12205k80805j83051K0560P6109l148l0107J8675M857r0273j29716
37047a58138n5207N1959J37675K06162J98738N1943j21835j29752L135M9576o3828
37036A70428j41080l7129J18067J36273M0331k1797q959K308l6907r6471j16766
37025H298n6967N5771J14563N0611m7419m6330K1955K6182o551P3554K12660J38534
37013E44861k00851m48059k97148O4521K29929J30653L1332O3554Q6873Q231o6251
$$ plain form
37090 -48641 75155 286481 474815 489002 327544 127929 -27291 -157164 -221630 -98800
37080 -98800 187793 392286 344688 192809 176953 277988 297794 214662 214432 367081 501995
37069 501995 469744 349211 304572 361835 414227 370908 244690 147681 207249 410710 550966
37058 550966 438761 157956 -25095 -4535 71574 68426 38319 56994 61851 -28422 -158138
37047 -158138 -213345 -161386 -23711 182451 381189 433132 311297 181545 184680 234256 170428
37036 170428 29348 -7781 110286 246559 286890 265093 256134 258442 221535 125064 8298
37025 8298 -48669 7102 121665 172276 124857 78527 100482 126664 120113 193667 406327 544861
37013 544861 344010 -104049 -401197 -336676 -106747 23906 55238 118792 205665 213896 147645
37002A47645o8862r7865j90095j84568K6399K69085K92613J06649n7893p2584
36992A70524k7828l5343p2660o6993j7340L1340N9610N7780k214j10832j75673
36981a89629j07095N9676J88346J91198J08610L3315o23l3103j02773j74079j53227
36970a79384m164J62147J89635R2793O2650J78978K43324O0441k13060k39544
36960C53816N291J78818O4201j55855k36719k17581k36280k26673n9772J63340
36950c67414K28465J32876N3113N5384O4289O1381R0679J13466O9188K3707M5066
36939E70200J7349j68640l30876k18397L6529N3893j94764l07680o2477K65260
36929c39603L47268K35173J47025J03927J3584r5640j47691j69109j89325j41543
$$ plain form
37002 147645 78783 -19082 -209177 -393745 -367346 -98261 194352 301001 243108 170524
36992 170524 142696 107353 34693 -32300 -49640 -18300 41310 99090 96876 -13956 -189629
36981 -189629 -296724 -237048 -48702 142496 251106 284421 283798 250695 147922 -26157 -179384
36970 -179384 -183548 -21401 168234 261027 323677 502655 745979 806420 593360 353816
36960 353816 359107 537925 602126 446271 209552 -8029 -244309 -470982 -530754 -367414
36950 -367414 -138949 -6073 47040 102424 166713 228094 318773 432239 501427 525134 570200
36939 570200 587549 418909 88033 -130364 -93835 -39942 -234706 -542386 -604863 -339603
36929 -339603 7665 242838 389863 493790 507374 411734 264043 94934 -94391 -235934
36919b35934j1397P6016N2651J7451K5969k4583j56695j87241k7345J10359K4180
36908c36569j48367j51311L569J12195J04523O2281K5397l863K7898J14804J15839
36897g3604k0564j01984K8868K14576K16796Q0845R508R230n4032j51477j39371
36886A8791m7029l9673j28540j60243o5243Q5889K18930K69693J62821l7570j00116
36875A77710M0318J08400r0151k89497j52889J57532K22776L3487n5906M5195
36865A96975Q2955p938j030J31587J14737j24306k91117k09504o3803j2514L8708
36854a45250J25013Q8360o5430p2386J27984K28726P0736p8855k0514J3038j86571
36843H4851l58354j85804J37163J87098l9596j77561p5191N6778L3871p8430j27316
$$ plain form
36919 -235934 -247331 -171315 -118664 -101213 -75244 -99827 -256522 -443763 -471108 -360749 -336569
36908 -336569 -484936 -636247 -632678 -520483 -415960 -353679 -328282 -332145 -304247 -189443 -73604
36897 -73604 -94168 -196152 -167284 47292 264088 344933 354441 363671 309639 158162 18791
36886 18791 -28238 -67911 -196451 -356694 -421937 -336048 -117118 152575 315396 277826 177710
36875 177710 218028 326428 236277 -53220 -206109 -48577 174199 207686 151780 196975
36865 196975 279930 271992 270962 402549 517286 392980 101863 -107641 -171444 -183958 -145250
36854 -145250 -20237 68123 2693 -69693 58291 287017 357753 278898 258384 271422 84851
36843 84851 -273503 -459307 -322144 -135046 -174642 -352203 -427394 -370616 -336745 -415175 -542491
36832e42491m4877J22935K29756J55562P606K5819J95651K10041l3743k07829
36822A18430o1403J53579Q3277j68018k46745j04819M1292J29600K27686K30889
36812D03768P700k47784k31248l5551j7863j91977k02586N9873K66222J84260
36802e186P527j8895L9088J7453m4910l7003r693o9024j59668j28532N6923K61208
36790i0712L17010J74721l9438j31072o3563j1376r8608j97389j37108J0967O7789
36779a98779N2421R8804J57614P5848q1714j07801k3783l8059j31921o0934J69926
36768h8378K28863K097j58680L4034L36908L30031K1412k08894j49957L5129J10392
36757D92957M8526k2286k3819k0857j17894k71318k81509o4701J58543J28757
$$ plain form
36832 -542491 -587368 -464433 -234677 -79115 -71509 -45690 149961 360002 326259 118430
36822 118430 57027 210606 293883 125865 -120880 -225699 -184407 -54807 172879 403768
36812 403768 411468 163684 -67564 -103115 -120978 -312955 -515541 -455668 -189446 -5186
36802 -5186 2341 -16554 22534 39987 -4923 -41926 -51619 -120643 -280311 -408843 -351920 -90712
36790 -90712 226298 401019 361581 230509 166946 155570 56962 -140427 -277535 -266568 -198779
36779 -198779 -146358 -47554 110060 185908 104194 -3607 -27390 -65449 -197370 -258304 -88378
36768 -88378 140485 142582 -16098 17936 354844 684875 706287 497393 347436 382565 492957
36757 492957 541483 519197 495378 474521 356627 85309 -196200 -260901 -102358 26399
36747B6399o1822r0066J04325K37654J42987N004J6055Q4072N3672k8379o0403
36736D29498q5240j45295j31984J4305J28649N8030q3018j05539m4550m0181o3055
36725f8380q138N1871k3134j49468j11996P8363J79621Q8167k0197K7083J65042
36714B08834K13523J00715r4752k28594j88533K209J64214J34071l3208j23117
36704A55362l3603J01666R0211q6767k54400k26932K310K40465K77016R8480j02006
36693B61802j34548O046J67800J94612N0014j49205k25173j29382j3635k2703
36683E628p4937j676J46310J54414O528o8800K1068P7821l5144j46810p2369P2169
36671H4202P2657m4964j10068r3612o8331j1081J20359K17900J58775K3546k8000
$$ plain form
36747 26399 -35423 -125489 -21164 216490 359477 364481 380536 464608 518280 489901 429498
36736 429498 344258 198963 66979 81284 209933 267963 184945 79406 34856 -5325 -68380
36725 -68380 -76518 -24647 -47781 -197249 -309245 -230882 -51261 36906 16709 43792 208834
36714 208834 422357 523072 428320 199726 11193 13402 177616 311687 278479 155362
36704 155362 121759 223425 313636 226869 -27531 -254463 -252153 -11688 265328 363808 261802
36693 261802 127254 133300 301100 495712 545726 396521 171348 41966 28331 5628
36683 5628 -69309 -70985 75325 229739 236267 167467 188535 266356 231212 84402 12033 84202
36671 84202 156859 111895 1827 -91785 -160116 -171197 -50838 167062 325837 349383 321383
36660C21383j154J3355L7171R6739O0494j43337k79116r8245K13981K46318k6432
36649D41157k15999j17539M6676N4111r934l252K8483J6800J8175M6231m575j27649
36637A72685j37646J5155J05506j7998j73634j33266L7296J34794J29464R7898
36627B30254J6174j35889k06214o7813J18407J01684o6159j00193Q5831K70252
36617B46334K53333P0082j48095l10981l30757j53600R8684J95044Q3618l9803
36607c6141k6430K6372k4286j24568j34006o0612r164L1346J51010K90296K56711
36596C40528K2782j75151j43746M997M3104l0440k8621Q6780J29356m473j49377
36585I5739j10010N3149J22704K5715j09332j53385j00832j0927N6179M7036m1310
$$ plain form
36660 321383 320229 333584 370755 467494 527988 384651 105535 7290 221271 467589 441157
36649 441157 225158 107619 154295 208406 198472 195220 223703 240503 258678 304909 300334 172685
36637 172685 35039 50194 155700 137702 -35932 -169198 -131902 2892 132356 230254
36627 230254 246428 110539 -95675 -163488 -45081 56603 -9556 -109749 -23918 246334
36617 246334 499667 569749 421654 110673 -220084 -373684 -275000 -79956 3662 -36141
36607 -36141 -62571 -36199 -60485 -185053 -319059 -379671 -388835 -357489 -206479 83817 340528
36596 340528 363310 188159 44413 49410 92514 62074 33453 120233 249589 245116 95739
36585 95739 -14271 38878 161582 187297 77965 -75420 -176252 -187179 -131000 -83964 -125274
36574a25274j22776j09890l3362L563k6007n1629j5906P5558J88745K59810J98848
36563B41680L975j63913j48481j7601K2317q1844j76684j46427m6280M2006J26231
36552c45021K10118K23100J28052k033q4729j21598j41475j34784q6741l474J08514
36541b50071K08586J91264J5501j60984j45165M093N5535k1434j5913J34265J97286
36530B12963L1586j56753j46705n4903r6662j85513p8987J85236L10292J66302
36520A86856o9229j92926j68505m1986J15548J73994O3805o1462M141J74831J43906
36509C28973j47270l68710k55501K4308J37861N0832n514O5314J12194L6228k4072
36498d5357P5757K14326J45910j17546k60295q3571J83199J72820r9105k51722
$$ plain form
36574 -125274 -248050 -357940 -391302 -387739 -413746 -465375 -481281 -405723 -216978 42832 241680
36563 241680 245655 81742 -66739 -84340 -62023 -143867 -320551 -466978 -513258 -471252 -345021
36552 -345021 -134903 88197 216249 214216 129487 7889 -133586 -268370 -355111 -358585 -250071
36541 -250071 -41485 149779 165280 4296 -140869 -136776 -81241 -102675 -118588 15677 212963
36530 212963 244549 87796 -58909 -113812 -210474 -395987 -474974 -289738 20554 186856
36520 186856 117627 -75299 -243804 -285790 -170242 3752 67557 6095 10236 185067 328973
36509 328973 181703 -187007 -442508 -418200 -280339 -229507 -235021 -169707 -57513 -21285 -45357
36498 -45357 30400 244726 390636 273090 12795 -70776 112423 285243 186138 -65584
36488f5584r8733Q5054Q58k13616k12236K6751K01292J63855Q6807J12740J27845
36477B15033N526j46924j51984k9863O1986P2616Q9043J57291J99273J27790k2540
36466E77247j16441p2771J5388l0216k29096l67073k60696k3167Q3908J8961j7858
36455d21814O1676R2576l4505j39957j7271K10708K27254k5450k45925j74762
36445d67470O9976J70335K9335j34342j15607k42l344j17363j11163R6973K68083
36434c14829J71943p0226j61077m2456Q2754R0268O0331O4085N2574L164k0055
36423h3524m383j3598m0813j7128J4423n3807j52169r2851Q6157J30858N090k2560
36411b44305J33469J74620n7784k28175k0159L10507L14354L6246j34371j18081
$$ plain form
36488 -65584 -164317 -79263 -78405 -292021 -504257 -477506 -276214 -112359 -25552 87188 215033
36477 215033 220559 73635 -78349 -108212 -46226 26390 115433 272724 471997 599787 577247
36466 577247 460806 388035 403423 373207 144111 -222962 -483658 -506825 -422917 -403956 -421814
36455 -421814 -360138 -267562 -302067 -442024 -459295 -248587 -21333 -46783 -292708 -467470
36445 -467470 -397494 -227159 -197824 -332166 -447773 -448015 -451359 -568722 -679885 -582912 -314829
36434 -314829 -142886 -213112 -374189 -416645 -333891 -243623 -183292 -119207 -66633 -63469 -83524
36423 -83524 -87907 -101505 -142318 -159446 -145023 -198830 -350999 -443850 -357693 -226835 -221745 -244305
36411 -244305 -110836 63784 6000 -222175 -242334 68173 382527 418773 284402 166321
36401A66321j47393k25175j19780J13115J37855o7838j38270M4481J45227j4281
36391a05738j34617J4537J82391R4552p5710n7025M2795j571q9159j8853R4069
36380e4329M8712j9935J03049K34125O0991k55135k77490j9836P7330j00790j79341
36369c82649K0123J79060O4826p6941J9068J99959K14128J22940Q5824L2044j34899
36358C43483k54818j52474L9005R2149L8910K8793K1867p5012j36568o749J76361
36347A14947J63320q009j07390j01895j27672j58328m1220J77690K82189K11083
36337D04715P3011r4594k74132k75119K5500L21881J99684k01260l31655q0979
36327b32948O3177j45819k86166R469M05612L77858J0963j97936r6345L8886M0135
$$ plain form
36401 166321 18928 -206247 -326027 -212912 -75057 -142895 -281165 -236684 -91457 -105738
36391 -105738 -240355 -225818 -43427 51125 -24585 -81610 -38815 -40386 -129545 -148398 -54329
36380 -54329 -5617 -25552 77497 311622 372613 117478 -160012 -179848 -102518 -203308 -382649
36369 -382649 -362526 -183466 -118640 -195581 -176513 23446 237574 360514 446338 478382 343483
36358 343483 88665 -63809 -24804 67345 106255 135048 156915 81903 -54665 -61414 114947
36347 114947 278267 270258 162868 60973 -66699 -225027 -266247 -88557 193632 404715
36337 404715 477726 383132 109000 -166119 -140619 181262 380946 179686 -151969 -232948
36327 -232948 -169771 -315590 -601756 -592287 -186675 191183 202146 4210 -92135 -53249 -13114
36316a3114K4552O7587P7715J7959k8994k9688j9560J4699P9634P6652l9251j08246
36304A19945j985J13052K1425j52305j25299N8594Q9118r4810k24500j61895p2031
36293d30691o3011r403J43727K25660J43810N7138Q0168P6016p2626k21493j91090
36282b61795l9104P7104J28202J29566K0327j80499k73415j43614K7240K4881
36272d91107p0312m5684R1814J77254J89311K18147K10099L7787k00292k45043
36262a28026p1837N4906p018p3539L2505J75120J23611p6110j67124n3379R6673
36251i4218J18843M7890j3524p1607j66013k08596p1231J64834K29384K4275j90705
36240b30668j35979P8137J12081q0082j77761l318J93218J35450m0346j4800K01691
$$ plain form
36316 -13114 11438 79025 156740 174699 145705 116017 96457 111156 190790 267442 228191 119945
36304 119945 117960 231012 252437 100132 -25167 33427 122545 27735 -196765 -358660 -430691
36293 -430691 -493702 -503105 -359378 -133718 10092 67230 147398 223414 150788 -70705 -261795
36282 -261795 -300899 -223795 -95593 33973 54300 -126199 -399614 -543228 -515988 -491107
36272 -491107 -561419 -607103 -515289 -338035 -148724 69423 279522 317309 117017 -128026
36262 -128026 -199863 -144957 -151975 -225514 -193009 -17889 105722 29612 -137512 -190891 -94218
36251 -94218 24625 72515 58991 -12616 -178629 -387225 -458456 -293622 -64238 -39963 -230668
36240 -230668 -366647 -288510 -176429 -256511 -434272 -437590 -244372 -108922 -149268 -164068 37623
$$ [...]
##END NTUPLES=NMR SPECTRUM
##END=
