##TITLE=31Pdec_IBDPBF1202
 CDCl3, 24 sc
 13.2.2019
##JCAMPDX= 6.0         $$ Bruker NMR JCAMP-DX V2.0
##DATA TYPE= NMR SPECTRUM
##DATA CLASS= NTUPLES
##ORIGIN= UXNMR, Bruker Analytische Messtechnik GmbH
##OWNER= root
$$ XWIN-NMR		Version 3.5
$$ Wed Feb 13 14:07:58 2019 Russian Standard Time (UT+4h)  she@DPX200
##.OBSERVE FREQUENCY= 81.013821
##.OBSERVE NUCLEUS= ^31P
##.ACQUISITION MODE= SIMULTANEOUS
##.ACQUISITION SCHEME= undefined
##.AVERAGES= 24
##.DIGITISER RES= 17
##SPECTROMETER/DATA SYSTEM= spect
##.PULSE SEQUENCE= zgpg30
##.SOLVENT NAME= DMSO
##.SHIFT REFERENCE= (INTERNAL, DMSO, 0, 182.463)
##AUDIT TRAIL= $$ (NUMBER, WHEN, WHO, WHERE, WHAT)
$$ ##TITLE= Audit trail, XWIN-NMR		Version 3.5
$$ ##JCAMPDX= 5.01
$$ ##ORIGIN= Bruker BioSpin GmbH
$$ ##OWNER= she
$$ F:/spectra/data/she/nmr/P31/1/pdata/1/auditp.txt
$$ ##AUDIT TRAIL=  $$ (NUMBER, WHEN, WHO, WHERE, WHAT)
(   1,<2019-02-13 14:07:05.92 +0400>,<she>,<DPX200>,
      <created by zg, POWCHK disabled, PULCHK disabled
       configuration hash MD5:
       00 E9 B6 7A A2 85 ED C7 34 08 36 98 17 FE 4E 26
       data hash MD5: 32K
       E4 FB 96 A4 0D 89 E5 47 F5 72 24 06 38 18 FD 3E>)
(   2,<2019-02-13 14:07:08.39 +0400>,<she>,<DPX200>,
      <Start of raw data processing
       efp BC_mod = 2 LB = 1 FT_mod = 6 PKNL = 1 PHC0 = -1432.46 PHC1 = 22.79891 SI = 64K 
       data hash MD5: 64K
       53 45 A6 74 7B CB 8D 4B 37 FF BC 6D 8F CE C8 D9>)
(   3,<2019-02-13 14:07:26.18 +0400>,<she>,<DPX200>,
      <pk PHC0 = 0.75023 PHC1 = 0 
       data hash MD5: 64K
       61 6F 57 F2 59 0D EF 97 1E BA 41 B0 AA 3C B0 32>)
$$ ##END=
$$ 
$$ hash MD5
$$ 47 F1 3B 24 21 AF 76 F2 9E F6 8E 0D 42 08 2E 93
##$RELAX= 
##$RELAX= 
##$RELAX= 
##$RELAX= 
##$RELAX= 
##$RELAX= 
##$RELAX= 
##$RELAX= 
$$ Bruker specific parameters
$$ --------------------------
##$DU= <F:/spectra>
##$EXPNO= 1
##$NAME= <P31>
##$PROCNO= 1
##$TYPE= <nmr>
##$USER= <she>
##$AMP= (0..31)
100 100 100 100 100 100 100 100 100 100 100 100 100 100 100 100 100 100 
100 100 100 100 100 100 100 100 100 100 100 100 100 100 
##$AQSEQ= 0
##$AQ_mod= 1
##$AUNM= <au_zg>
##$AUTOPOS= <>
##$BF1= 81.014009
##$BF2= 200.13
##$BF3= 200.13
##$BF4= 200.13
##$BF5= 200.13
##$BF6= 200.13
##$BF7= 200.13
##$BF8= 200.13
##$BYTORDA= 1
##$CFDGTYP= 0
##$CFRGTYP= 5
##$CHEMSTR= <none>
##$CNST= (0..31)
1 1 145 1 1 1 1 1 1 1 1 1 1 1 1 1 1 1 1 1 1 1 1 1 1 1 1 1 1 1 1 1 
##$CPDPRG= <waltz16>
##$CPDPRG1= <>
##$CPDPRG2= <waltz16>
##$CPDPRG3= <>
##$CPDPRG4= <mlev>
##$CPDPRG5= <mlev>
##$CPDPRG6= <mlev>
##$CPDPRG7= <mlev>
##$CPDPRG8= <mlev>
##$CPDPRGB= <>
##$CPDPRGT= <>
##$D= (0..31)
0 1 0 0 0 0 0 0 0 0 0 0.03 2e-05 3e-06 0 0 0 0 0 0 0 0 0 0 0 0 0 0 0 0 
0 0 
##$DATE= 1550052425
##$DBL= (0..7)
120 120 120 11 120 120 24 19 
##$DBP= (0..7)
150 150 150 150 150 150 150 150 
##$DBP07= 0
##$DBPNAM0= <>
##$DBPNAM1= <>
##$DBPNAM2= <>
##$DBPNAM3= <>
##$DBPNAM4= <>
##$DBPNAM5= <>
##$DBPNAM6= <>
##$DBPNAM7= <>
##$DBPOAL= (0..7)
0.5 0.5 0.5 0.5 0.5 0.5 0.5 0.5 
##$DBPOFFS= (0..7)
0 0 0 0 0 0 0 0 
$$ [...]
##$SUBNAM2= <"">
##$SUBNAM3= <"">
##$SUBNAM4= <"">
##$SUBNAM5= <"">
##$SUBNAM6= <"">
##$SUBNAM7= <"">
##$SUBNAM8= <"">
##$SUBNAM9= <"">
##$SW= 369.568048894756
##$SWIBOX= (0..15)
0 1 3 0 0 0 0 0 0 0 0 0 0 0 0 0 
##$SW_h= 29940.119760479
##$TD= 32768
##$TD0= 1
##$TE= 0
##$TE2= 300
##$TE3= 300
##$TEG= 300
##$TL= (0..7)
0 120 53 12 22 120 120 120 
##$TP= (0..7)
150 150 150 150 150 150 150 150 
##$TP07= 0
##$TPNAME0= <>
##$TPNAME1= <>
##$TPNAME2= <>
##$TPNAME3= <>
##$TPNAME4= <>
##$TPNAME5= <>
##$TPNAME6= <>
##$TPNAME7= <>
##$TPOAL= (0..7)
0.5 0.5 0.5 0.5 0.5 0.5 0.5 0.5 
##$TPOFFS= (0..7)
0 0 0 0 0 0 0 0 
##$TUNHIN= 0
##$TUNHOUT= 0
##$TUNXOUT= 0
##$USERA1= <user>
##$USERA2= <user>
##$USERA3= <user>
##$USERA4= <user>
##$USERA5= <user>
##$V9= 5
##$VALIST= <valist>
##$VCLIST= <CCCCCCCCCCCCCCC>
##$VD= 0
##$VDLIST= <DDDDDDDDDDDDDDD>
##$VPLIST= <PPPPPPPPPPPPPPP>
##$VTLIST= <TTTTTTTTTTTTTTT>
##$WBST= 1024
##$WBSW= 4
##$XGAIN= (0..3)
0 0 0 0 
##$XL= 0
##$YL= 0
##$YMAX_a= 19491
##$YMIN_a= -20377
##$ZGOPTNS= <>
##$ZL1= 120
##$ZL2= 120
##$ZL3= 120
##$ZL4= 120
##$ABSF1= 0
##$ABSF2= 0
##$ABSG= 0
##$ABSL= 0
##$ALPHA= 0
##$AQORDER= 0
##$ASSFAC= 0
##$ASSFACI= 0
##$ASSFACX= 0
##$ASSWID= 0
##$AUNMP= <proc_1d>
##$AZFE= 0.1
##$AZFW= 0.5
##$BCFW= 0
##$BC_mod= 2
##$BYTORDP= 0
##$COROFFS= 0
##$CY= -3
##$DATMOD= 1
##$DC= 0
##$DFILT= <>
##$DTYPP= 0
##$F1P= 0
##$F2P= 0
##$FCOR= 1
##$FTSIZE= 65536
##$FT_mod= 6
##$GAMMA= 0
##$GB= 0
##$INTBC= 1
##$INTSCL= 5.30512e-09
##$ISEN= 30
##$LB= 1
##$LEV0= 0
##$LPBIN= 0
##$MAXI= 10000
##$MC2= 0
##$MEAN= 0
##$ME_mod= 0
##$MI= 50
##$NCOEF= 0
##$NC_proc= -4
##$NLEV= 6
##$NOISF1= 182.463
##$NOISF2= 159.3651
##$NSP= 0
##$NTH_PI= 0
##$NZP= 0
##$OFFSET= 182.463
##$PC= 4
##$PHC0= -1431.71
##$PHC1= 22.79891
##$PH_mod= 1
##$PKNL= yes
##$PPARMOD= 0
##$PSCAL= 0
##$PSIGN= 0
##$REVERSE= no
##$SF= 81.0140089999434
##$SI= 65536
##$SIGF1= 159.3651
##$SIGF2= -187.1042
##$SINO= 113.3802
##$SIOLD= 16384
##$SREGLST= <1H.CDCl3>
##$SSB= 0
##$STSI= 65536
##$STSR= 0
##$SW_p= 29940.119760479
##$SYMM= 0
##$S_DEV= 0
##$TDeff= 32768
##$TDoff= 0
##$TI= <>
##$TILT= no
##$TM1= 0
##$TM2= 0
##$TOPLEV= 0
##$USERP1= <user>
##$USERP2= <user>
##$USERP3= <user>
##$USERP4= <user>
##$USERP5= <user>
##$WDW= 1
##$XDIM= 65536
##$YMAX_p= 280853384
##$YMIN_p= -14539584
$$ End of Bruker specific parameters
$$ ---------------------------------
##NTUPLES= NMR SPECTRUM
##VAR_NAME=  FREQUENCY,     SPECTRUM/REAL,   SPECTRUM/IMAG
##SYMBOL=    X,             R,               I
##VAR_TYPE=  INDEPENDENT,   DEPENDENT,       DEPENDENT
##VAR_FORM=  AFFN,          ASDF,            ASDF
##VAR_DIM=   65536,         65536,           65536
##UNITS=     HZ,            ARBITRARY UNITS, ARBITRARY UNITS
##FACTOR=    0.456856943014862, 1,           1
##FIRST=     14782.0589164792, 0,            0
##LAST=      -15158.0608439998, 0,           0
##MIN=       -15158.0608439998, -14539584,   0
##MAX=       14782.0589164792, 280853384,    0
$$ Real data points
##PAGE= N=1
##DATA TABLE= (X++(R..R)), XYDATA
$$ [...]
$$ plain form
42276 1008473 834880 734799 537653 139581 -225746 -284797 -112608 -18453 -140723 -340495
42266 -340495 -453927 -478409 -486326 -475269 -364458 -94156 305060 713746 969347 943420
42256 943420 640801 251691 47849 141029 349241 387968 203297 18085 32387 214708
42246 214708 444017 683890 873362 798168 307099 -378563 -781566 -630403 -83871 489652
42236 489652 817261 827800 635519 468482 490247 642611 730764 648570 438447 190862
42226 190862 18587 61642 327597 562948 494671 187538 -63364 -184823 -382967 -691361
42216 -691361 -779555 -393812 241246 668345 693531 469315 228980 108457 115203 130459
42206 130459 52998 23964 301767 780141 913245 400009 -284756 -415753 53824 493647
$$ packed form
42276A008473j73593j00081j97146l98072l65327n9051J72189R4155j22270j99772
42266c40495j13432k4482p917J1057J10811K70302L99216M08686K55601k5927
42256I43420l02619l89110k03842R3180K08212L8727j84671j85212J4302J82321
42246B14708K29309K39873J89472p5194m91069o85662m03003J51163N46532N73523
42236D89652L27609J0539j92281j67037K1765J52364Q8153q2194k10123k47585
42226A90862j72275M3055K65955K35351o8277l07133k50902j21459j98144l08394
42216f91361q8194L85743O35058M27099K5186k24216k40335j20523O746J5256
42206A30459p7461k9034K77803M78374J33104n13236o84765j30997M69577M39823
$$ plain form
42196 493647 490365 316175 418460 817937 1197539 1318587 1153424 804770 478792 392017
42186 392017 552287 751121 865695 990303 1155368 1149400 833042 436697 268464 249939
42176 249939 49344 -374405 -677971 -618627 -352406 -159027 -107382 -116917 -148274 -172889 -95586
42165 -95586 134256 431099 716923 1041487 1406101 1574558 1279223 615350 53511 -4405
42155 -4405 393684 823710 875106 485673 -25958 -257018 -100112 193273 351926 389935
42145 389935 486180 670968 790500 723325 480883 152898 -94780 -68607 186047 264281
42135 264281 -151035 -770806 -989728 -704160 -418486 -439723 -447738 -111351 337182 530355
42125 530355 570434 720005 807204 523706 113137 117919 511223 737733 646008 689330 1034589
$$ packed form
42196D93647l282j74190J02285L99477L79602J21048j65163l48654l25978q6775
42186C92017J60270J98834J14574J24608J65065n968l16358l96345j68233j8525
42176B49939k00595m23749l03566N9344K66221J93379N1645r535l1357k4615P7303
42165i5586K29842K96843K85824L24564L64614J68457k95335o63873n61839n7916
42155d405L98089M30026N1396l89433n11631k31060J56906K93385J58653L8009
42145C89935R6245J84788J19532o7175k42442l27985k47678K6173K54654P8234
42135B64281m15316o19771k18922K85568K85674k1237q015L36387M48533J93173
42125E30355M0079J49571Q7199k83498m10569M782L93304K26510r1725M3322L45259
$$ plain form
42114 1034589 1170030 741974 168307 -42406 -64101 -288830 -506610 -217460 458943 845791
42104 845791 617983 76475 -456896 -940477 -1257772 -1148270 -685827 -336878 -298499 -204146
42094 -204146 232362 678764 663179 298276 110324 308993 622460 788163 844791 916358
42084 916358 989638 971339 791558 440169 51200 -95380 145502 534234 698153 615141
42074 615141 593238 754196 841874 659715 411753 397704 581531 712812 723037 715993 652468
42063 652468 366969 -82027 -372706 -323924 -91498 160302 520780 1033582 1343168 1013055
42053 1013055 197314 -349871 -101423 623922 1087325 1037324 903991 1086246 1363404 1232075
42043 1232075 656507 172654 229593 699026 1157703 1418291 1556598 1581642 1399051 1077890
$$ packed form
42114A034589J35441m28056n73667k10713k1695k24729k17780K89150O76403L86848
42104H45791k27808n41508n33371m83581l17295J09502M62443L48949L8379R4353
42094b04146M36508M46402j5585l64903j87952J98669L13467J65703N6628P1567
42084I16358P3280j8299j79781l51389l88969j46580K40882L88732J63919q3012
42074F15141k1903J60958Q7678j82159k47962j4049J83827J31281J0225p044o3525
42063F52468k85499m48996k90679M8782K32426K51800L60478N12802L09586l30113
42053A013055q15741n47185K48448P25345M63403n0001j33333J82255K77158j31329
42043A232075n75568m83853N6939M69433M58677K60588J38307K5044j82591l21161
$$ plain form
42033 1077890 852183 795777 750535 653351 660538 813029 854251 592486 211464 -22880
42023 -22880 -145199 -289702 -317712 -25546 413056 637968 674196 860393 1196394 1245815
42013 1245815 810984 255096 -35168 -89781 -38035 207901 620938 801570 481411 7088
42003 7088 -113075 77043 169907 105250 181050 447425 612348 560441 483191 434799 225298
41992 225298 -126975 -275017 -52264 266438 382263 304327 119140 -168031 -355127 -52182
41982 -52182 688901 1140843 745825 -82135 -487155 -311025 -158053 -387616 -625799 -421893
41972 -421893 88205 444723 475185 355276 248587 155940 42723 -89297 -231861 -345034
41962 -345034 -338826 -181017 15685 100932 44456 -78329 -194744 -243902 -151357 69787 224087
$$ packed form
42033A077890k25707n6406m5242r7184P187J52491M1222k61765l81022k34344
42023b2880j22319j44503k8010K92166M38602K24912L6228J86197L36001M9421
42013A245815m34831n55888k90264n4613N1746K45936M13037J80632l20159m74323
42003G088j20163J90118R2864o4657P5800K66375J64923n1907p7250m8392k09501
41992B25298l52273j48042K22753L18702J15825p7936j85187k87171j87096L02945
41982e2182P41083M51942l95018q27960m05020J76130J52972k29563k38183K03906
41972d21893N10098L56518L0462j19909j06689r2647j13217j32020j42564j13173
41962c45034O208J57809J96702Q5247n6476j22785j16415m9158R2545K21144J54300
$$ plain form
41951 224087 100441 -236434 -474360 -453672 -390560 -547725 -802477 -799565 -523481 -405342
41941 -405342 -710207 -1097448 -1081384 -742814 -587900 -752133 -800795 -446288 -31361 -2633
41931 -2633 -223905 -211459 125647 411741 424863 365268 412893 381775 30767 -502751 -815680
41920 -815680 -700646 -330302 -20888 68497 6290 -62441 -89803 -116233 -105444 74192 396137
41909 396137 547847 291010 -106481 -86948 489252 1100589 1139264 534426 -291918 -873405
41899 -873405 -971004 -615244 -78420 322118 528439 704051 821228 595553 45988 -242111
41889 -242111 156058 763695 749804 126870 -235515 110106 564282 468913 123173 231051
41879 231051 717155 823040 301597 -194832 -88350 352195 546026 457152 453273 574539
$$ packed form
41951B24087j23646l36875k37926K0688O3112j57165k54752K912K76084J18139
41941d05342l04865l87241J6064L38570J54914j64233m8662L54507M14927K8728
41931b633k21272J2446L37106K86094J3122n9595M7625l1118l51008n33518l12929
41920h15680J15034L70344L09414Q9385o2207o8731k7362k6430J0789J79636L21945
41909C96137J51710k56837l97491J9533N76200O11337L8675o04838q26344n81487
41899h73405r7599L55760N36824M00538K06321J75612J17177k25675n49565k88099
41889b42111L98169O07637j3891o22934l62385L45621M54176r5369l45740J07878
41879B31051M86104J05885n21443m96429J06482M40545J93831q8874l879J21266
$$ plain form
41869 574539 476136 64218 -286384 -278262 -100129 -91388 -254097 -333139 -216531 -20825 120997
41858 120997 141932 -9277 -282018 -446555 -336498 -133802 -160878 -406440 -556274 -524081
41848 -524081 -592496 -887036 -1074552 -849719 -419197 -157542 -17227 301532 733033 858481
41838 858481 521097 6811 -427007 -788620 -1032362 -942829 -543788 -244463 -298491 -409063
41828 -409063 -174879 299870 562290 427092 139806 20910 195019 582739 935339 966802
41818 966802 655410 309902 157187 43529 -210476 -376163 -120078 380305 558764 205211
41808 205211 -295180 -519667 -452070 -288829 -140899 -62987 -98410 -154031 -60775 138369
41798 138369 197538 51771 -73995 -44094 -11658 -95000 -151053 -74190 -50801 -263265 -551751
$$ packed form
41869E74539r8403m11918l50602Q122J78133Q741j62709p9042J16608J95706J41822
41858A20997K0935j51209k72741j64537J10057K02696k7076k45562j49834L2193
41848e24081o8415k94540j87516K24833M30522K61655J40315L18759M31501J25448
41838H58481l37384n14286m33818l61613k43742Q9533L99041K99325n4028j10572
41828d09063K34184M74749K62420j35198k87286j18896J74109L87720L52600L1463
41818I66802l11392l45508j52715j13658k54005j65687K56085N00383J78459l53553
41808B05211n00391k24487O7597J63241J47930P7912l5423n5621R3256J99144
41798A38369N9169j45767j25766K9901L2436q3342n6053P6863K3389k12464k88486
$$ plain form
41787 -551751 -631994 -484312 -277316 -57577 215508 435216 422430 194873 -51158 -191409
41777 -191409 -235698 -206887 -141445 -153388 -309682 -469714 -411568 -107041 248570 453035
41767 453035 447554 298088 114404 -49041 -236862 -452295 -504267 -204388 265558 465009
41757 465009 260829 -25621 -154340 -266097 -443780 -427821 -133226 -16586 -414363 -872815
41747 -872815 -760789 -278197 -120389 -293066 -114753 547761 942800 641395 274395 540700
41737 540700 1114276 1202758 779022 535604 785207 1078349 957883 569378 350564 448737
41727 448737 643010 683267 559174 463745 535908 679529 717706 686608 786058 1019814 1134211
41716 1134211 1007439 844641 849985 963162 1082192 1254924 1418511 1245090 570841 -243350
$$ packed form
41787e51751q0243J47682K06996K19739K73085K19708j2786k27557k46031j40251
41777a91409m4289K8811O5442j1943j56294j60032N8146L04527L55611K04465
41767D53035n481j49466j83684j63445j87821k15433n1972K99879M69946J99451
41757D65009k04180k86450j28719j11757j77683J5959K94595J16640l97777m58452
41747h72815J12026M82592J57808j72677J78313O62514L95039l01405l67000K66305
41737E40700N73576Q8482m23736k43418K49603K93142j20466l88505k18814R8173
41727D48737J94273M0257j24093r5429P2163J43621L8177l1098R9450K33756J14397
41716A134211j26772j62798N344J13177J19030J72732J63587j73421o74249q14191
$$ plain form
41706 -243350 -708984 -766937 -616134 -237164 442660 1075563 1157374 775705 561372 790138
41696 790138 1040151 929208 687317 663125 684313 382601 -95991 -238167 30418 187254
41686 187254 -108613 -485020 -377528 165983 545226 397850 -3239 -204924 -127340 29271
41676 29271 207344 511247 872433 1017330 836914 541454 348290 230038 86288 -51339
41666 -51339 -142299 -267724 -445531 -480623 -209884 242342 662799 1047074 1433744 1581572
41656 1581572 1178182 374366 -218446 -164574 378364 939317 1210632 1160912 893547 562235
41646 562235 319534 204366 106777 -92554 -378111 -623338 -721884 -673036 -547781 -368246
41636 -368246 -56134 409145 802685 807803 423581 21471 -122774 -135565 -209554 -215999 41222
$$ packed form
41706b43350m65634n7953J50803L78970O79824O32903Q1811l81669k14333K28766
41696G90138K50013j10943k41891k4192K1188l01712m78592j42176K68585J56836
41686A87254k95867l76407J07492N43511L79243j47376m01089k01685P7584J56611
41676B9271J78073L03903L61186J44897j80416k95460j93164j18252j43750j37627
41666e1339r0960j25425j77807l5092K70739M52226M20457L84275L86670J47828
41656A581572m03390q03816n92812N3872N42938N60953K71315m9720k67365l31312
41646E62235k42701j15168r7589j99331k85557k45227r8546M8848J25255J79535
41636c68246L12112M65279L93540N118l84222m02110j44245j2791p3989o445K57221
$$ plain form
41625 41222 368403 362961 -12306 -393258 -535169 -528405 -487577 -376676 -207342 -95687 -40734
41614 -40734 69253 165499 14918 -388235 -743951 -853443 -810377 -700805 -449808 -99758
41604 -99758 104595 91981 101918 252597 313642 149884 34329 191575 350370 158483
41594 158483 -198297 -244068 63463 306726 246220 61931 -44204 -91994 -107727 -12595
41584 -12595 169952 280202 303997 437982 753010 1009092 942397 573687 120356 -240024
41574 -240024 -399019 -265307 139081 590505 821615 776074 626720 536695 475607 319405
41564 319405 91828 -3973 138796 319278 252048 -34019 -226274 -173894 -46032 45735
41554 45735 276955 735388 1085139 951245 484026 167584 145193 125565 -49924 -163362
$$ packed form
41625D1222L27181n442l75267l80952j41911O764M0828J10901J69334J11655N4953
41614d0734J09987R6246j50581m03153l55716j09492M3066J09572K50997L50050
41604i9758K04353j2614R937J50679O1045j63758j15555J57246J58795j91887
41594A58483l56780m5771L07531K43263o0506j84289j06135m7790j5733R5132
41584a2595J82547J10250K3795J33985L15028K56082o6695l68710m53331l60380
41574b40024j58995J33712M04388M51424K31110m5541j49354r0025o1088j56202
41564C19405k27577r5801J42769J80482o7230k86067j92255N2380J27862R1767
41554D5735K31220M58433L49751j33894m67219l16442k2391j9628j75489j13438
$$ plain form
41544 -163362 -43801 137606 170747 103477 45771 -47226 -176798 -146880 109478 266058
41534 266058 17380 -367052 -296532 321231 874520 784039 170214 -381894 -507381 -299850
41524 -299850 -22744 143392 96330 -185510 -549754 -742733 -678781 -530235 -463715 -405675
41514 -405675 -201133 88231 226128 123731 -46562 -83994 29840 179967 240874 112876
41504 112876 -214537 -559788 -639626 -359293 78953 418219 574906 558671 344187 -14200
41494 -14200 -266636 -173680 203253 560096 664270 500960 180961 -151805 -373810 -480165
41484 -480165 -576776 -661842 -536408 -121401 257679 183336 -296135 -714649 -801794 -727856
41474 -727856 -662479 -448490 55563 575348 679248 319320 -164206 -516700 -771398 -976181
$$ packed form
41544a63362J19561J81407L3141o7270n7706r2997j29572K9918K56358J56580
41534B66058k48678l84432P0520O17763N53289r0481o13825n52108j25487K07531
41524b99850K77106J66136m7062k81840l64244j92979O3952J48546O6520N8040
41514d05675K04542K89364J37897j02397j70293l7432J13834J50127O0907j27998
41504A12876l27413l45251p9838K80333M38246L39266J56687j6235k14484l58387
41494a4200k52436R2956L76933L56843J04174j63310l19999l32766k22005j06355
41484d80165r6611q5066J25434M15007L79080p4343m79471m18514q7145P3938
41474g27856O5377K13989N04053N19785J03900l59928m83526l52494k54698k04783
$$ plain form
41464 -976181 -1001559 -749419 -373256 -122325 -38819 54730 292971 604587 816183 830927
41454 830927 682672 487215 377913 428330 581484 682274 611143 352227 -68981 -601590
41444 -601590 -1059210 -1141700 -747960 -201682 34695 -137970 -414525 -516944 -441644 -282769
41434 -282769 -96058 -10224 -176832 -472141 -537103 -297361 -152398 -407229 -808609 -961397
41424 -961397 -922978 -962530 -954257 -549927 113188 435760 176388 -232688 -343730 -234164
41414 -234164 -177777 -171717 -93957 -46330 -209669 -512904 -709121 -675086 -449044 -104557 229971
41403 229971 361762 236338 42464 -45100 -95579 -222732 -306057 -144471 198402 428706
41393 428706 365088 75781 -259652 -439179 -265463 270942 835123 1000899 717184 352633
$$ packed form
41464i76181k5378K52140L76163K50931Q3506R3549K38241L11616K11596J4744
41454H30927j48255j95457j09302N0417J53154J00790p1131k58916m21208n32609
41444f01590m57620q2490L93740N46278K36377j72665k76555j02419P5300J58875
41434b82769J86711Q5834j66608k95309o4962K39742J44963k54831m01380j52788
41424i61397L8419l9552Q273M04330O63115L22572k59372m09076j11042J09566
41414b34164N6387O060P7760M7627j63339l03235j96217L4035K26042L44487L34528
41403B29971J31791j25424j93874q7564n0479j27153q3325J61586L42873K30304
41393D28706o3618k89307l35433j79527J73716N36405N64181J65776k83715l64551
$$ plain form
41383 352633 226962 270066 230412 58741 -72983 -63664 -34860 -171075 -499414 -857026
41373 -857026 -1016385 -827526 -336903 145822 181636 -415907 -1298820 -1842666 -1771576 -1397459
41363 -1397459 -1154332 -1079389 -935499 -672408 -460219 -314648 -14594 530152 1075242 1316349
41353 1316349 1197246 871898 531813 338204 342498 388734 267450 45570 43517 367417
41343 367417 672383 580372 184201 -85822 -23857 146269 146624 45444 156994 581012
41333 581012 981821 950670 548210 276929 423134 647717 440830 -193950 -790679 -1032583
41323 -1032583 -995435 -859436 -719610 -650961 -636914 -473830 -73875 242860 180561 56579
41313 56579 367722 825603 582135 -438005 -1235544 -1116370 -607789 -490903 -639975 -515349
$$ packed form
41383C52633j25671M3104l9654j71671j31724R319K8804j36215l28339l57612
41373h57026j59359J88859M90623M82725L5814n97543q82913n43846P1090L74117
41363a397459K43127P4943J43890K63091K12189J45571L00054N44746N45090K41107
41353A316349j19103l25348l40085j93609M294M6236j21284k21880k053L23900
41343C67417L04966r2011l96171k70023O1965J70126L55j01180J11550M24018
41333E81012M00809l1151m02460k71281J46205K24583k06887o34780n96729k41904
41323a032583L7148J35999J39826O8649J4047J63084L99955L16735o2299j23982
41313E6579L11143M57881k43468j020140p97539J19174N08581J16886j49072J24626
$$ plain form
41303 -515349 -210390 -163444 -230027 63544 556710 621665 229227 20939 260186 474997
41293 474997 306804 32927 -2094 98212 123915 149082 270627 304557 48062 -353173
41283 -353173 -512339 -195217 418359 769310 354552 -652978 -1409181 -1335148 -827578 -638810
41273 -638810 -824016 -870558 -641036 -453384 -313981 105569 644707 638610 -26243 -601719
41263 -601719 -565090 -323469 -426331 -719193 -773559 -612814 -482452 -345963 -122788 -36711
41253 -36711 -229716 -383532 -205930 52613 54337 -5333 223244 542841 475647 32023
41243 32023 -349767 -493729 -578073 -621124 -389577 168984 787512 1167622 1139783 679059
41233 679059 70783 -136427 278947 843087 981768 763624 620780 582571 352227 -15457
$$ packed form
41303e15349L04959M6946o6583K93571M93166O4955l92438k08288K39247K14811
41293D74997j68193k73877l5021J00306K5703K5167J21545L3930k56495m01235
41283c53173j59166L17122O13576L50951m14758j007530p56203P4033N07570J88768
41273f38810j85206m6542K29522J87652J39403M19550N39138o097o64853n75476
41263f01719L6629K41621j02862k92862n4366J60745J30362J36489K23175Q6077
41253c6711j93005j53816J77602K58543J724n9670K28577L19597o7194m43624
41243C2023l81790j43962q4344m3051K31547N58561O18528L80110k7839m60724
41233F79059o08276k07210M15374N64140J38681k18144j42844l8209k30344l67684
$$ plain form
41223 -15457 -142560 601 53698 -67356 -37652 245259 439621 325065 106762 -13804
41213 -13804 -110785 -184906 -3530 436327 676998 366466 -211211 -479945 -268256 83527
41203 83527 169503 -129922 -623000 -966850 -941949 -676044 -506012 -563817 -628556 -440442
41193 -440442 -22226 363749 455314 172314 -293443 -558788 -374381 118208 578371 850344
41183 850344 968060 874874 452563 -153234 -545267 -521232 -291969 -161090 -164724 -110206
41173 -110206 160163 585694 879025 763391 351051 153343 489167 1014785 1130360 736022
41163 736022 246508 -30340 -112868 -18019 288098 575018 481436 95983 -39341 332350
41153 332350 852223 1120034 1178483 1211737 1168502 961466 709295 514343 292488 54097
$$ packed form
41223a5457j27103J43161N3097j21054K9704K82911J94362j14556k18303j20566
41213a3804r6981p4121J81376M39857K40671l10532n77677k68734K11689L51783
41203H3527Q5976k99425m93078l43850K4901K65905J70032n7805o4739J88114
41193d40442M18216L85975R1565k83000m65757k65345J84407M92589M60163K71973
41183H50344J17716r3186m22311o05797l92033K4035K29263J30879l634N4518
41173a10206K70369M25531K93331j15634m12340j97708L35824N25618J15575l94338
41163G36022m89514k76848q2528R4849L06117K86920r3582l85453j35324L71691
41153C32350N19873K67811N8449L3254m3235k07036k52171j94952k21855k38391
$$ plain form
41143 54097 39990 326722 601534 595110 448098 382081 308605 72346 -190620 -269609 -229172
41132 -229172 -222731 -156378 147762 615518 1019832 1249979 1249018 903657 275141 -260164 -386589
41121 -386589 -198792 49894 310124 582873 675304 459143 165784 82892 141818 125806
41111 125806 77201 150351 268100 292543 333662 506344 601148 428393 272350 496081
41101 496081 855738 769436 201179 -282220 -342172 -213770 -145257 -9509 345933 758004
41091 758004 954117 843633 512171 153811 16464 166016 344661 318546 239630 331753
41081 331753 403103 141640 -246521 -258291 114195 416983 530803 746367 989927 760947
41071 760947 86542 -233738 243205 898777 989660 707060 689890 946916 962053 597852
$$ packed form
41143E4097j4107K86732K74812o424j47012o6017p3476k36259k62966p8989M0437
41132b29172O441O6353L04140M67756M04314K30147r61l45361o28516n35305j26425
41121c86589J87797K48686K60230K72749R2431k16161k93359q2892N8926j6012
41111A25806m8605P3150J17749K4443M1119J72682R4804j72755j56043K23731
41101D96081L59657q6302n68257m83399n9952J28402O8513J35748L55442M12071
41091G58004J96113j10484l31462l58360j37347J49552J78645k6115p8916R2123
41081C31753P1350k61463l88161j1770L72486L02788J13820K15564K43560k28980
41071G60947o74405l20280M76943O55572R0883k82600j7170K57026J5137l64201
$$ plain form
41061 597852 219386 41750 -56275 -115673 -19830 144918 96018 -205069 -455655 -419928
41051 -419928 -179959 49135 142999 105673 56330 148436 372565 535031 555086 611368 823288
41040 823288 997304 921943 707058 557902 421147 179525 5775 136003 415441 464700
41030 464700 227200 -20880 -140725 -224232 -263581 -142701 30538 -8334 -228684 -314775
41020 -314775 -203803 -202366 -421449 -497594 -118601 492209 894085 985080 943953 801690
41010 801690 425533 -99369 -387874 -186740 256810 417853 85978 -379977 -471639 -117355
41000 -117355 324106 604711 816969 999764 898519 413500 -30673 1161 279046 252437
40990 252437 -47043 -36447 456553 877638 788095 467448 360978 400283 278143 29631
$$ packed form
41061E97852l78466j77636r8025n9398R5843J64748m8900l01087k50586L5727
41051d19928K39969K29094R3864l7326m9343R2106K24129J62466K0055N6282K11920
41040H23288J74016p5361k14885j49156j36755k41622j73750J30228K79438M9259
41030D64700k37500k48080j19845q3507l9349J20880J73239l8872k20350q6091
41020c14775J10972J437k19083p6145L78993O10810M01876R0995m1127j42263
41010H01690l76157n24902k88505K01134M43550J61043l31875m65955r1662L54284
41000a17355M41461K80605K12258J82795j01245m85019m44173L1834K77885k6609
40990B52437k99480J0596M93000M21085q9543l20647j06470L9305j22140k48512
$$ plain form
40980 29631 -117071 -213092 -448554 -696924 -645058 -312514 -54181 -73903 -274270 -551160
40970 -551160 -872467 -1055473 -849679 -347775 13071 18051 -28817 225718 633332 720020
40960 720020 315195 -239722 -517745 -457111 -323572 -353149 -547444 -766926 -878447 -774699
40950 -774699 -397859 113179 390641 172800 -312483 -516700 -218104 182698 151034 -346851
40940 -346851 -856679 -964063 -636043 -133753 219146 233690 8406 -133893 -7533 184959
40930 184959 120202 -194663 -445549 -446847 -306909 -145617 78693 354822 476460 307726
40920 307726 39956 -29884 90043 101396 -151731 -442794 -442944 -139287 151044 165250 -35331
40909 -35331 -234010 -371060 -530838 -679431 -649273 -439551 -298925 -368002 -450367 -348676
$$ packed form
40980B9631j46702r6021k35462k48370N1866L32544K58333j9722k00367k76890
40970e51160l21307j83006K05794N01904L60846M980m6868K54535M07614Q6688
40960G20020m04825n54917k78023O0634J33539k9577j94295k19482j11521J03748
40950g74699L76840N11038K77462k17841m85283k04217K98596M00802l1664m97885
40940c46851n09828j07384L28020N02290L52899J4544k25284j42299J26360J92492
40930A84959o4757l14865k50886j298J39938J61292K24310K76129J21638j68734
40920C07726k67770o9840J19927J1353k53127k91063j50L03657K90331J4206k00581
40909c5331j98679j37050j59778j48593L0158K09722J40626o9077q2365J01691
$$ plain form
40899 -348676 -238648 -411462 -764013 -901225 -722589 -541903 -566010 -615011 -499886 -347692
40889 -347692 -342140 -416011 -443244 -497362 -638064 -640523 -270962 278438 551175 367823 -79200
40878 -79200 -599691 -1126495 -1466902 -1325788 -721485 -81558 258471 422214 675352 963094
40868 963094 1021748 823810 638366 669617 852060 1022347 1109597 1095227 930605 610611
40858 610611 281373 173562 383537 731520 884298 666233 228473 -148052 -376626 -570579
40848 -570579 -747604 -737003 -472504 -174135 -53386 9782 253095 592208 685816 425861
40838 425861 62778 -209978 -483211 -807271 -948703 -727228 -372454 -226446 -221769 -8751
40828 -8751 426217 629935 266100 -450122 -1039782 -1260917 -1171285 -898987 -567846 -329160
$$ packed form
40899c48676J10028j72814l52551j37212J78636J80686k4107m9001J15125J52194
40889c47692N552p3871k7233n4118j40702k459L69561N49400K72737j83352m47023
40878g9200n20491n26804l40407J41114O04303O39927L40029J63743K53138K87742
40868I63094N8654j97938j85444L1251J82443J70287Q7250j4370j64622l19994
40858F10611l29238j07811K09975L47983J52778k18065m37760l76525k28574j93953
40848e70579j77025J0601K64499K98369J20749O3168K43313L39113R3608k59955
40838D25861l63083k72756k73233l24060j41432K21475L54774J46008M677K13018
40828h751M34968K03718l63835p16222n89660k21135Q9632K72298L31141K38686
$$ plain form
40818 -329160 -247148 -195876 -33522 165983 210633 79648 -42204 5580 241226 609244
40808 609244 982146 1116433 837858 323946 -6447 29292 204152 279725 339881 534652
40798 534652 704572 565392 172725 -123365 -190145 -258145 -466236 -566670 -285489 244145
40788 244145 664479 873251 1039721 1195016 1112454 674223 127913 -158608 -64557 265010
40778 265010 638265 929906 1078710 1115726 1143341 1182168 1113699 891976 710464 771733
40768 771733 951652 920401 598203 253472 97943 35397 -67562 -103689 78779 379775
40758 379775 577185 622342 569419 339582 -137132 -613527 -724016 -531689 -512524 -855154
40748 -855154 -1119250 -839950 -202059 224786 274510 342639 766160 1363475 1690412 1545683
$$ packed form
40818c29160Q2012N1272J62354J99505M4650j30985j21852M7784K35646L68018
40808F09244L72902J34287k78575n13912l30393L5739J74860P5573O0156J94771
40798E34652J69920j39180l92667k96090o6780o8000k08091j00434K81181N29634
40788B44145M20334K08772J66470J55295q2562m38231n46310k86521R4051L29567
40778B65010L73255K91641J48804L7016K7615L8827o8469k21723j81512O1269
40768G71733J79919l1251l22198l44731j55529o2546j02959l6127J82468L00996
40758C79775J97410M5157n2923k29837m76714m76395j10489J92327J9165l42630
40748h55154k64096K79300O37891M26845M9724O8129M23521N97315L26937j44729
$$ plain form
40738 1545683 1106005 685080 458043 362062 216303 -31535 -203674 -113496 151223 291437
40728 291437 137541 -194432 -481015 -586488 -480403 -238827 -81063 -222713 -576302 -743339
40718 -743339 -460677 34156 250025 19562 -331254 -408603 -199763 -7640 -19302 -82350
40708 -82350 48018 344090 520792 402945 120976 -118938 -283743 -378466 -225703 340130
40698 340130 1097100 1548065 1470080 1112995 791259 553262 376746 393356 674151 994451
40688 994451 1076562 936561 760106 574659 309425 64774 19970 123361 153009 50388
40678 50388 -74971 -220822 -450447 -592361 -355668 175722 517139 390380 39916 -215479
40668 -215479 -409056 -658785 -783392 -543825 -92584 181386 185776 184020 347087 550412
$$ packed form
40738A545683m39678m20925k27037r5981j45759k47838j72139R0178K64719J40214
40728B91437j53896l31973k86583j05473J06085K41576J57764j41650l53589j67037
40718g43339K82662M94833K15869k30463l50816p7349K08840J92123j1662o3048
40708h2350J30368K96072J76702j17847k81969k39914j64805r4723J52763N65833
40698C40130P56970M50965p7985l57085l21736k37997j76516J6610K80795L20300
40688I94451Q2111j40001j76455j85447k65234k44651m4804J03391K9648j02621
40678E0388j25359j45851k29625j41914K36693N31390L41417j26759l50464k55395
40668b15479j93577k49729j24607K39567M51241K73970M390j756J63067K03325
$$ plain form
40658 550412 653333 702248 744126 648173 282681 -223582 -552488 -543365 -390002 -428966 -734557
40647 -734557 -1011645 -970267 -713391 -571019 -604936 -570145 -417573 -463541 -828147 -1047837
40637 -1047837 -659209 26722 226375 -260630 -772089 -673209 -108114 350539 455918 389382
40627 389382 340452 327353 349109 423439 474634 396917 240688 162733 184590 178169 125886
40616 125886 205542 504517 791260 743883 354926 -61813 -265800 -304389 -281215 -148116
40606 -148116 71813 55901 -455695 -1108696 -1174130 -482395 266733 379845 3632 -276859
40596 -276859 -353098 -577409 -994503 -1199131 -1007543 -719362 -559898 -370078 -80427 -3725
40586 -3725 -305379 -584415 -408902 22541 197125 45177 -87993 -84546 -167354 -393947
$$ packed form
40658E50412J02921M8915M1878r5953l65492n06263l28906R123J53363l8964l05591
40647g34557k77088M1378K56876J42372l3917L4791J52572m5968l64606k19690
40637a047837L88628O85931J99653m87005n11459R8880N65095M58653J05379o6536
40627C89382m8930j3099K1756P4330N1195p7717j56229p7955K1857o421n2283
40616A25886P9656K98975K86743m7377l88957m16739k03987l8589K3174J33099
40606a48116K19929j5912n11596o53001o5434O91735P49128J13112l76213k80491
40596b76859p6239k24311m17094k04628J91588K88181J59464J89820K89651P6702
40586c725l01654k79036J75513M31443J74584j51948j33170L447q2808k26593
$$ plain form
40576 -393947 -510016 -388720 -219890 -143506 -47757 113792 130720 -115152 -361603 -295783
40566 -295783 -22006 67488 -167958 -445391 -448166 -199847 40667 138048 190051 296654
40556 296654 382460 355292 330371 499737 798154 928940 785991 618488 647067 740731
40546 740731 663359 436745 225751 49835 -118355 -148939 16148 91935 -174556 -459547
40536 -459547 -194310 533579 930049 505308 -323992 -861398 -924905 -726547 -376774 70794
40526 70794 368205 327444 175042 246087 438957 387775 119953 108436 607868 1296754
40516 1296754 1692348 1643111 1303653 882212 561147 464457 531230 531170 322260 8465 -223271
40505 -223271 -313206 -310925 -268486 -244082 -320050 -516890 -734464 -838785 -768241 -536933 -216048
$$ packed form
40576c93947j16069J21296J68830P6384R5749J61549J6928k45872k46451O5820
40566b95783K73777Q9494k35446k77433k775K48319K40514R7381N2003J06603
40556B96654Q5806k7168k4921J69366K98417J30786j42949j67503K8579R3664
40546G40731p7372k26614k10994j75916j68190l0584J65087P5787k66491k84991
40536d59547K65237P27889L96470m24741q29300n37406o3507J98358L49773M47568
40526G0794K97411m0761j52402P1045J92870n1182k67822j1517M99432O88886
40516A296754L95594m9237l39458m21441l21065r6690O6773o0k08910l13795k31736
40505b23271q9935K281M2439K4404p5968j96840k17574j04321P0544K31308L20885
$$ plain form
40494 -216048 54551 140726 77434 82658 320724 700304 992628 1116100 1208191 1411000
40484 1411000 1665021 1752493 1512675 1000078 467340 201716 303706 550768 529369 39143
40474 39143 -609052 -844921 -480166 38884 167752 -81522 -257262 -147754 -7034 -67069
40464 -67069 -186397 -156599 -48932 -4887 57119 204241 163586 -358786 -1112250 -1474591
40454 -1474591 -1235053 -834644 -711549 -745293 -558755 -117009 252475 324621 209813 122844
40444 122844 99096 19057 -157005 -287947 -245263 -144537 -218025 -422842 -404645 -18353
40434 -18353 341397 233670 -155795 -232119 154123 500449 378956 -48126 -406494 -612467
40424 -612467 -746567 -759267 -613480 -468226 -419299 -292110 -2993 134202 -135088 -464611
$$ packed form
40494b16048K70599Q6175o3292N224K38066L79580K92324J23472R2091K02809
40484A411000K54021Q7472k39818n12597n32738k65624J01990K47062k1399m90226
40474C9143o48195k35869L64755N19050J28868k49274j75740J09508J40720o0035
40464f7069j19328K9798J07667M4045O2006J47122m0655n22372p53464l62341
40454a474591K39538M00409J23095l3744J86538M41746L69484P2146j14808q6969
40444A22844k3748q0039j76062j30942M2684J00726p3488k04817J8197L86292
40434a8353L59750j07727l89465p6324L86242L46326j21493m27082l58368k05973
40424f12467j34100j2700J45787J45254M8927J27189K89117J37195k69290l29523
$$ plain form
40414 -464611 -328870 122217 192194 -344496 -918993 -1040480 -960382 -1125361 -1394801 -1288249
40404 -1288249 -787759 -383898 -355775 -451122 -373576 -213409 -194616 -264739 -208010 -24611
40394 -24611 85744 76911 111124 210514 136265 -207124 -472921 -270423 245903 533935 427680
40383 427680 375793 756495 1277729 1345833 819822 75467 -542517 -968835 -1175646 -1086541
40373 -1086541 -824096 -714496 -881562 -1066799 -999211 -731566 -451282 -166344 204186 569626
40363 569626 728312 628007 393509 150664 -32126 -101231 -74674 -72361 -125030 -34604 356411
40352 356411 798568 809233 280757 -313390 -457185 -181063 42796 -106197 -478801 -702399
40342 -702399 -595124 -296173 -68659 -25120 -31921 118251 430246 650055 553170 255887
$$ packed form
40414d64611J35741M51087O9977n36690n74497j21487Q0098j64979k69440J06552
40404a288249N00490M03861K8123r5347P7546J60167J8793p0123N6729J83399
40394b4611J10355q833L4213R9390p4249l43389k65797K02498N16326K88032j06255
40383D27680n1887L80702N21234O8104n26011p44355o17984m26318k06811Q9105
40373a086541K62445J09600j67066j85237O7588K67645K80284K84938L70530L65440
40363E69626J58686j00305k34498k42845j82790o9105K6557K313n2669R0426L91015
40352C56411M42157J0665n28476n94147j43795K76122K23859j48993l72604k23598
40342g02399J07275K98951K27514M3539o801J50172L11995K19809r6885k97283
$$ plain form
40332 255887 108989 237746 332844 54246 -434320 -570421 -91812 587057 861534 640047
40322 640047 327259 202000 125947 -91053 -350165 -462330 -466434 -524862 -634370 -661496
40312 -661496 -582486 -477411 -345919 -144664 30956 37116 -46165 23926 272153 423783
40302 423783 301635 86972 40570 143496 190693 107938 -14153 -114930 -203683 -244232
40292 -244232 -161144 48499 321402 612283 870439 994541 935431 786078 649058 505329
40282 505329 365545 414896 745470 1038144 871322 367142 139818 461037 853718 766859
40272 766859 321544 30335 30436 44996 -23878 38539 278543 425402 361847 337946 501039
40261 501039 567596 268514 -137756 -156001 273072 724988 866715 783445 723189 766256
$$ packed form
40332B55887j46898J28757R5098k78598m88566j36101M78609O78869K74477k21487
40322F40047l12788j25259p6053k17000k59112j12165m104n8428j09508k7126
40312f61496P9010J05075J31492K01255J75620O160q3281P0091K48227J51630
40302D23783j22148k14663m6402J02926M7197q2755j22091j00777q8753m0549
40292b44232Q3088K09643K72903K90881K58156J24102n9110j49353j37020j43729
40282E05329j39784M9351L30574K92674j66822n04180k27324L21219L92681q6859
40272G66859m45315k91209J01J4560o8874O2417K40004J46859o3555k3901J63093
40261E01039O6557k99082m06270j8245M29073M51916J41727q3270o0256M3067
$$ plain form
40251 766256 802891 671991 304184 -131559 -267236 72261 535581 553466 29672 -511957
40241 -511957 -556055 -146950 304744 539710 586099 548977 494493 471062 461823 362488 147207
40230 147207 -18844 5008 78816 -59787 -405486 -649641 -553152 -193560 175304 355359
40220 355359 292638 118097 121335 463182 842594 698874 -81327 -862251 -909258 -227322
40210 -227322 494403 692575 400433 -58403 -487443 -795389 -862326 -695787 -566671 -719757
40200 -719757 -1007160 -1047842 -730590 -320013 -42168 176497 449609 643568 552400 230907
40190 230907 -51756 -124719 3080 311095 776552 1189858 1203418 714691 79618 -199210
40180 -199210 44821 543403 900841 910201 640682 345795 268206 421806 561249 457925
$$ packed form
40251G66256L6635j30900l67807m35743j35677L39497M63320J7885n23794n41629
40241e11957m4098M09105M51694K34966M6389l7122n4484k3431r239r9335k15281
40230A47207j66051K3852P3808j38603l45699k44155R6489L59592L68864J80055
40220C55359o2721j74541L238L41847L79412j43720p80201p80924m7007O81936
40210b27322P21725J98172k92142m58836m29040l07946o6937J66539J29116j53086
40200g19757k87403m0682L17252M10577K77845K18665K73112J93959r1168l21493
40190B30907k82663p2963J27799L08015M65457M13306J3560m88727o35073k78828
40180a99210K44031M98582L57438R360k69519k94887p7589J53600J39443j03324
$$ plain form
40170 457925 201329 112874 337878 653200 758699 642854 514442 438797 257748 -68706
40160 -68706 -245646 29372 598656 943851 800953 462304 327318 331948 78700 -517438
40150 -517438 -1001454 -905882 -315479 253600 424714 237326 -81303 -398982 -667193 -791807
40140 -791807 -682237 -411402 -191243 -124988 -63152 189276 550464 684153 392401 -135200
40130 -135200 -554671 -736228 -765445 -686408 -461982 -160419 52261 142489 220451 274514
40120 274514 133294 -212082 -502158 -585844 -660180 -916983 -1179186 -1174924 -979977 -834008
40110 -834008 -659487 -199791 394332 590890 212762 -256013 -298827 30128 351302 492852
40100 492852 487675 297770 -97094 -475725 -577440 -451096 -309248 -122367 298289 838316
$$ packed form
40170D57925k56596q8455K25004L15322J05499j15845j28412p5645j81049l26454
40160f8706j76940K75018N69284L45195j42898l38649j34986M630k53248n96138
40150e17438m84016R5572N90403N69079J71114j87388l18629l17679k68211j24614
40140g91807J09570K70835K20159O6255O1836K52428L61188J33689k91752n27601
40130a35200m19471j81557k9217P9037K24426L01563K12680R0228P7962N4063
40120B74514j41220l45376k90076q3686p4336k56803k62203M262J94947J45969
40110h34008J74521M59696N94123J96558l78128m68775m2814L28955L21174J41550
40100D92852n177j89905l94864l78631j01715J26344J41848J86881M20656N40027
$$ plain form
40090 838316 1071752 804186 327345 18854 -49731 17118 185604 409808 522194 449955
40080 449955 391129 525317 655263 411844 -214818 -809625 -1024594 -908824 -695238 -490537
40070 -490537 -301900 -184751 -179133 -189228 -88188 94564 204276 136356 -109513 -469568
40060 -469568 -783421 -815020 -502860 -143621 -94433 -289435 -319346 -58169 98894 -185938
40050 -185938 -653218 -786505 -502090 -138633 125492 413291 702223 699005 330589 -27269
40040 -27269 -65972 24322 -68281 -249887 -240098 -105394 -130575 -261574 -151858 216870 421754
40029 421754 231064 -65555 -155418 -146279 -220280 -168310 323704 1081117 1537955 1420787
40019 1420787 1032474 822415 909762 1074988 1035800 690534 231061 20054 219191 563354
$$ packed form
40090H38316K33436k67566m76841l08491o8585O6849J68486K24204J12386p2239
40080D49955n8826J34188J29946k43419o26662n94807k14969J15770K13586K04701
40070d90537J88637J17149N618j0095J01040J82752J09712o7920k45869l60055
40060d69568l13853l1599L12160L59239M9188j95002k9911K61177J57063k84832
40050a85938m67280j33287K84415L63457K64125K87799K88932l218l68416l57858
40040b7269l8703R0294r2603j81606R789J34704k5181j30999J09716L68728K04884
40029D21754j90690k96619q9863R139p4001N1970M92014P57413M56838j17168
40019A420787l88313k10059Q7347J65226l9188l45266m59473k11007J99137L44163
$$ plain form
40009 563354 653051 412793 62372 -286242 -693380 -1047796 -1030388 -590443 -173181 -239616
39999 -239616 -736350 -1232930 -1414158 -1246860 -847701 -432928 -259449 -363986 -472315 -394940
39989 -394940 -346199 -565737 -801880 -617431 -138177 30579 -284539 -533265 -290624 105672
39979 105672 146443 -36685 36892 357878 460923 206067 -44856 -79064 -119322 -290288
39969 -290288 -298052 39938 330517 98226 -465276 -690060 -325610 143115 170057 -154259
39959 -154259 -260953 189129 938986 1454090 1482158 1238606 1076496 1076817 1052326 896178
39949 896178 739599 699981 655303 437398 137979 12072 112223 227200 203678 133400
39939 133400 156520 252717 328761 371233 390791 335679 209141 178906 383609 663873 681909
$$ packed form
40009E63354Q9697k40258l50421l48614m07138l54416J7408M39945M17262o6435
39999b39616m96734m96580j81228J67298L99159M14773J73479j04537j08329P7375
39989c94940M8741k19538k36143J84449M79254J68756l15118k48726K42641L96296
39979A05672M0771j83128P3577L20986J03045k54856k50923l4208m0258j70966
39969b90288p764L37990K90579k32291n63502k24784L64450M68725K6942l24316
39959a54259j06694M50082P49857N15104K8068k43552j62110L21k4491j56148
39949H96178j56579l9618m4678k17905k99419j25907J00151J14977k3522p0278
39939A33400K3120R6197P6044M2472J9558n5112j26538l0235K04703K80264J8036
$$ plain form
39928 681909 346742 -43094 -160705 -29440 62144 -68107 -334624 -547003 -598843 -481627
39918 -481627 -218909 152130 565546 921593 1100047 1025038 777026 602413 702393 990314
39908 990314 1147171 957813 526717 134966 -36123 -6903 69330 5082 -290673 -663859
39898 -663859 -758653 -350190 358847 873173 867045 471146 108740 95136 388006 685058
39888 685058 755088 653636 566269 495422 276664 -67903 -235119 -61057 176490 132358
39878 132358 -82437 -72945 230326 514588 646392 869559 1288544 1536178 1247344 612436
39868 612436 132483 -33793 -152211 -399375 -595685 -530713 -317558 -256223 -429194 -579027
39858 -579027 -413342 49869 520297 781828 858552 807400 568163 194278 16998 259435
$$ packed form
39928F81909l35167l89836j17611J31265R1584j30251k66517k12379n1840J17216
39918d81627K62718L71039M13416L56047J78454p5009k48012j74613R9980K87921
39908I90314J56857j89358m31096l91751j71089K9220P6233o4248k95755l73186
39898f63859r4794M08463P09037N14326o128l95899l62406j3604K92870K97052
39888F85058P0030j01452q7367p0847k18758l44567j67216J74062K37547m4132
39878A32358k14795R492L03271K84262J31804K23167M18985K47634k88834o34908
39868F12436m79953j66276j18418k47164j96310O4972K13155O1335j72971j49833
39858e79027J65685M63211M70428K61531P6724n1152k39237l73885j77280K42437
$$ plain form
39848 259435 609086 553828 88924 -327865 -491993 -592367 -578881 -53725 912867 1502711
39838 1502711 1194568 584077 557009 1044665 1290383 1065634 842460 862442 809882 483887
39828 483887 129528 -42979 -112013 -100915 82832 261239 101717 -245658 -211905 303376
39818 303376 707698 630933 457019 596849 818446 764394 641726 856829 1308812 1553447
39808 1553447 1423562 1068895 627469 234926 92989 161886 66325 -343914 -673444 -586084
39798 -586084 -326011 -193218 42517 616065 1085775 911258 397152 264444 508404 545262
39788 545262 355110 509983 1018544 1139525 614296 181957 451344 1039386 1323926 1360524
39778 1360524 1463523 1452215 996901 345347 61177 256130 605979 923972 1217073 1347564
$$ packed form
39848B59435L49651n5258m64904m16789j64128j00374J3486N25156R66592N89844
39838A502711l08143o10491k7068M87656K45718k24749k23174J9982n2560l25995
39828D83887l54359j72507o9034J1098J83747J78407j59522l47375L3753N15281
39818C03376M04322p6765j73914J39830K21597n4052j22668K15103M51983K44635
39808A553447j29885l54667m41426l92543j41937O8897r5561m10239l29530Q7360
39798e86084K60073J32793K35735N73548M69710j74517n14106j32708K43960L6858
39788E45262j90152J54873N08561J20981n25229m32339K69387N88042K84540L6598
39778A360524J02999j1308m55314o51554k84170J94953L49849L17993K93101J30491
$$ plain form
39768 1347564 1151512 813037 677201 741654 722314 562190 476652 514966 475561 311165
39758 311165 267061 493938 781874 826557 607028 380481 378840 583754 778925 796930
39748 796930 681465 561987 439538 245153 59356 41821 139382 133458 15277 1215
39738 1215 101373 47301 -196061 -249553 98157 513557 647559 677125 916678 1210581
39728 1210581 1191571 910680 712872 657786 568087 519271 741790 1094073 1170595 942164
39718 942164 773143 758167 567312 70582 -380907 -487213 -385560 -297524 -175860 66675
39708 66675 312970 467369 639918 870642 919854 573626 -19807 -497040 -605428 -292193
39698 -292193 292271 765504 758495 350925 20070 21044 104842 17330 -63668 127555 448934
$$ packed form
39768A347564j96052l38475j35836O4453j9340j60124q5538L8314l9405j64396
39758C11165m4104K26877K87936M4683k19529k26547j641K04914J95171J8005
39748G96930j15465j19478j22449j94385j85797j7535R7561n924j18181j4062
39738A215J00158n4072k43362n3492L47710M15400J34002K9566K39553K93903
39728A210581j9010k80891j97808n5086q9699m8816K22519L52283P6522k28431
39718I42164j69021j4976j90855m96730m51489j06306J01653Q8036J21664K42535
39708F6675K46295J54399J72549K30724M9212l46228n93433m77233j08388L13235
39698b92193N84464M73233p009m07570l30855R74Q3798q7512q0998J91223L21379
$$ plain form
39687 448934 557608 440625 389862 537892 731382 828589 849168 823912 724541 587724
39677 587724 547315 675075 856150 865543 592659 229008 167001 573939 1113354 1289561
39667 1289561 1044495 761619 685948 671768 571623 499234 533881 510845 339174 224497
39657 224497 322312 450662 412993 329906 366415 416539 383737 481025 851429 1138823 896028
39646 896028 261367 -210685 -268624 -95352 139816 396782 530658 425363 309237 463253
39636 463253 665859 449765 -99164 -374938 -161460 76514 -13941 -161395 -28443 227551
39626 227551 312977 303687 397926 484264 352552 99445 -42788 -95770 -218780 -360817 -344633
39615 -344633 -178886 -16520 77145 75204 -135138 -555351 -894942 -879043 -626111 -433542
$$ packed form
39687D48934J08674j16983n0763J48030J93490R7207K0579k5256r9371j36817
39677E87724m0409J27760J81075R393k72884l63651o2007M06938N39415J76207
39667A289561k45066k82876p5671j4180j00145p2389L4647k3036j71671j14677
39657B24497R7815J28350l7669q3087L6509N0124l2802R7288L70404K87394k42795
39646H96028o34661m72052n7939J73272K35168K56966J33876j05295j16126J54016
39636D63253K02606k16094n48929k75774K13478K37974r0455j47454J32952K55994
39626B27551Q5426r290R4239Q6338j31712k53107j42233n2982j23010j42037J6184
39615c44633J65747J62366R3665j941k10342m20213l39591J5899K52932J92569
$$ plain form
39605 -433542 -302737 -16783 366701 481777 189969 -155508 -135730 230955 566620 614433
39595 614433 495750 485009 622344 656750 414424 99896 53709 273654 439417 428151
39585 428151 480289 727416 894425 719421 390796 255401 313416 355819 429673 753184
39575 753184 1237906 1507500 1421488 1227575 1124432 989360 657200 218090 -100760 -185399
39565 -185399 -76059 107113 223814 216430 174736 200831 257408 285645 384045 665044 1008072
39554 1008072 1194365 1224720 1240508 1204879 997008 778658 852311 1102890 1019843 436476
39544 436476 -156190 -266396 -16785 172472 189560 182154 174892 138489 269525 778219 1448563
39533 1448563 1777140 1562979 1073569 637881 373401 322952 525088 837232 962342 812540
$$ packed form
39605d33542J30805K85954L83484J15076k91808l45477J9778L66685L35665M7813
39595F14433j18683j0741J37335L4406k42326l14528m6187K19945J65763j1266
39585D28151N2138K47127J67009j75004l28625j35395N8015M2403P3854L23511
39575G53184M84722K69594q6012j93913j03143j35072l32160m39110l18850q4639
39565a85399J09340J83172J16701p384m1694K6095N6577K8237R8400K80999L43028
39554A008072J86293L0355J5788l5629k07871k18350P3653K50579q3047n83367
39544D36476n92666j10206K49611J89257J7088p406p262l6403J31036N08694O70344
39533A448563L28577k14161m89410m35688k64480n0449K02136L12144J25110j49802
$$ plain form
39523 812540 653231 728621 899187 828296 436410 -4162 -200585 -126430 38889 156258
39513 156258 252401 429053 705790 989916 1185676 1272638 1262146 1161805 1045727 1066521
39503 1066521 1262576 1399114 1181016 661293 269701 330095 676459 894636 857134 821210
39493 821210 1006587 1289171 1397035 1234213 874774 387454 -133604 -467737 -458004 -283355
39483 -283355 -273090 -419956 -376647 -36303 221606 94913 -131817 14825 496424 862785
39473 862785 941265 990052 1167342 1276056 1137795 860979 603534 377133 213263 217933
39463 217933 322574 289128 115689 105293 336221 420814 76875 -382810 -488060 -283108
39453 -283108 -170640 -277068 -389330 -406961 -439906 -495010 -444030 -313975 -286422 -387733
$$ packed form
39523H12540j59309P5390J70566p0891l91886m40572j96423P4155J65319J17369
39513A56258R6143J76652K76737K84126J95760Q6962j0492j00341j16078K0794
39503A066521J96055J36538k18098n19723l91592O0394L46364K18177l7502l5924
39493H21210J85377K82584J07864j62822l59439m87320n21058l34133R733J74649
39483b83355J0265j46866M3309L40344K57909j26693k26730J46642M81599L66361
39473H62785P8480M8787J77290J08714j38261k76816k57445k26401j63870M670
39463B17933J04641l3446j73439j0396K30928Q4593l43939m59685j05250K04952
39453b83108J12468j06428j12262j7631l2945n5104N0980J30055K7553j01311
$$ plain form
39443 -387733 -451877 -380312 -182049 177983 656635 935622 751387 416342 555741 1220350
39433 1220350 1712452 1514431 993488 860039 1214582 1522302 1406476 1097806 1061334 1414985
39423 1414985 1816616 1845304 1442263 971122 825844 1017672 1230503 1238666 1121510 1066593
39413 1066593 1128232 1231640 1289983 1270094 1226797 1261971 1354579 1302513 991985 636738 521748
39402 521748 586660 562950 483364 671101 1150054 1458607 1253023 802314 649154 978223
39392 978223 1513665 1873391 1864813 1590392 1397229 1573088 2005023 2316969 2388557 2477450
39382 2477450 2761034 3080953 3270881 3395932 3491792 3424252 3236826 3274433 3670393 4053156
39372 4053156 4092298 3995082 4068973 4116976 3756921 3115261 2689120 2641119 2700682 2683089 2667577
$$ packed form
39443c87733o4144P1565J98263L60032M78652K78987j84235l35045J39399O64609
39433A220350M92102j98021n20943j33449L54543L07720j15826l08670l6472L53651
39423A414985M01631K8688m03041m71141j45278J91828K12831Q163j17156n4917
39413A066593O1639J03408N8343j9889m3297L5174R2608n2066l10528l55247j14990
39402E21748O4912k3710p9586J87737M78953L08553k05584m50709j53160L29069
39392I78223N35442L59726q578k74421j93163J75859M31935L11946P1588Q8893
39382B477450K83584L19919J89928J25051R5860o7540j87426L7607L95960L82763
39372D053156L9142r7216P3891M8003l60055o41660m26141m8001N9563j7593j5512
$$ plain form
39361 2667577 2713710 2799447 2989646 3308365 3534290 3480545 3344078 3388461 3454096 3244370
39351 3244370 2916453 2836177 2892077 2684991 2310325 2239390 2419294 2270196 1722666 1472640
39341 1472640 1916718 2564599 2889039 3066487 3387353 3566698 3262988 2804204 2739135 2991409
39331 2991409 3078146 2925635 2867838 2994295 3069778 3035879 3103446 3363872 3693722 4003396
39321 4003396 4254183 4320395 4155993 3982455 3995197 4037028 3906872 3810097 4086129 4634858
39311 4634858 5072400 5360661 5786995 6333042 6572557 6317776 5964353 6019642 6557456 7273094
39301 7273094 7879002 8350861 8910021 9783873 10901199 11913147 12626791 13268683 14188183
39292 14188183 15511241 17244467 19434128 22000330 24740292 27758781 31506778 36076402
$$ packed form
39361B667577M6133Q5737J90199L18719K25925n3745j36467M4383O5635k09726
39351C244370l27917q0276N5900k07086l74666p0935J79904j49098n47530k50026
39341A472640M44078O47881L24440J77448L20866J79345l03710m58784o5069K52274
39331B991409Q6737j52511n7797J26457P5483l3899O7567K60426L29850L09674
39321D003396K50787O6212j64402j73538J2742M1831j30156r6775K76032N48729
39311D634858M37542K88261M26334N46047K39515k54781l53423N5289N37814P15638
39301G273094O05908M71859N59160Q73852J117326J011948P13644O41892R19500
39292A4188183J323058J733226K189661K566202K739962L018489L747997M569624
$$ plain form
39284 36076402 40938618 45822069 51347530 58293538 66879413 77479390 91350974 109777689
39276 109777689 133281776 162597041 198581272 238071712 270172340 280853384 264217943
39269 264217943 228232683 187830246 153427114 127036988 106760804 91150209 79203107
39262 79203107 69453217 60840260 53330647 46902900 40962833 35286484 30439062 26648305
39254 26648305 23228597 19719520 16675867 14661346 13272805 11866261 10531152 9601969
39246 9601969 8823056 7783745 6706699 6048675 5698266 5279456 4905596 4901827 5047891
39237 5047891 4839865 4342981 4075842 4125061 4038629 3588555 3026682 2544665 2054178 1598528
39227 1598528 1455602 1669383 1910423 1968059 2009491 2181871 2291628 2087633 1632366 1218230
$$ packed form
39284C6076402M862216M883451N525461O946008Q585875J0599977J3871584J8426715
39276A09777689K3504087K9315265L5984231L9490440L2100628J0681044j6635441
39269B64217943l5985260m0402437l4403132k6390126k0276184j5610595j1947102
39262G9203107r749890q612957p509613o427747n940067n676349m847422l790757
39254B6648305l419708l509077l043653k014521j388541j406544j335109r29183
39246I601969p78913j039311j077046o58024l50409m18810l73860l769J46064
39237E047891k08026m96884k67139M9219q6432m50074n61873m82017m90487m55650
39227A598528j42926K13781K41040N7636M1432J72380J09757k03995m55267m14136
$$ plain form
39217 1218230 1070883 1229207 1558213 1808380 1806037 1626695 1454525 1296445 1020995 663056
39207 663056 461197 542874 754410 864479 809613 710205 744403 998665 1361459 1617339
39197 1617339 1705932 1747268 1728298 1424697 851438 501410 756277 1269888 1409450 1193824
39187 1193824 1250228 1815150 2327122 2190571 1498672 769191 328957 207097 326184 514931
39177 514931 534040 326859 116477 128158 381115 827744 1452089 2110550 2520770 2555397
39167 2555397 2352235 2062282 1745859 1573193 1773331 2239984 2529740 2420489 2139110
39158 2139110 1898299 1635582 1409304 1530904 1943900 1979614 1241125 316869 31403 326285
39148 326285 534938 489078 583695 863591 866950 470620 156538 226223 382605 348849 319913
$$ packed form
39217A218230j47347J58324L29006K50167k343j79342j72170j58080k75450l57939
39207F63056k01859Q1677K11536J10069n4866r9408L4198K54262L62794K55880
39197A617339Q8593M1336j8970l03601n73259l50028K54867N13611J39562k15626
39187A193824N6404N64922N11972j36551o91899p29481m40234j21860J19087J88747
39177E14931J9109k07181k10382J1681K52957M46629O24345O58461M10220L4627
39167B555397k03162k89953l16423j72666K00138M66653K89756j09251k81379
39158B139110k40811k62717k26278J21600M12996L5714p38489r24256k85466K94882
39148C26285K08653m5860R4617K79896L359l96330l14082O9685J56382l3756k8936
$$ plain form
39137 319913 481213 609974 545414 597955 1031219 1485730 1418425 907705 551364 664168
39127 664168 986200 1154784 1106522 965859 798146 562720 198400 -249560 -541123 -409229
39117 -409229 60815 376310 167194 -333457 -565461 -339526 -23100 -24466 -309854 -516557
39107 -516557 -407650 -98980 133708 188138 214154 353566 500133 441239 193217 23049
39097 23049 116693 386990 643261 782865 773562 634523 501762 526306 639627 620640 456015
39086 456015 377104 437105 357865 -8018 -355262 -338786 -70578 104301 134164 221575 390859
39075 390859 444220 287510 696 -352251 -695671 -800826 -490096 54110 477479 699056
39065 699056 864280 932633 701648 237494 -119528 -234849 -286132 -329813 -181779 144922
$$ packed form
39137C19913J61300J28761o4560N2541M33264M54511o7305n10720l56341J12804
39127F64168L22032J68584m8262j40663j67713k35426l64320m47960k91563J31894
39117d09229M70044L15495k09116n00651k32004K25935L16426j366k85388k06703
39107e16557J08907L08670K32688N4430K6016J39412J46567n8894k48022j70168
39097B3049R3644K70297K56271J39604r303j39039j32761K4544J13321j8987j64625
39086D56015p8911O0001p9240l65883l47244J6476K68208J74879K9863Q7411J69284
39075C90859N3361j56710k86814l52947l43420j05155L10730N44206M23369K21577
39065F99056J65224O8353k30985m64154l57022j15321n1283m3681J48034L26701
$$ plain form
39055 144922 325376 265423 341420 786876 1202688 1081963 572083 274805 414976 630681
39045 630681 572071 341140 259659 449938 732851 802509 487971 -43597 -389062 -340835
39035 -340835 -127439 -62923 -89595 71090 408972 613191 582086 585552 795203 974952
39025 974952 854874 562454 405599 393492 293574 105800 146873 582553 1131866 1392371
39015 1392371 1299685 1090219 904303 628543 136279 -480345 -988007 -1231379 -1217673 -1058991
39005 -1058991 -897772 -825393 -786169 -596283 -153385 373065 644963 478622 21334 -402627
38995 -402627 -574027 -502351 -336105 -200510 -111792 -25012 57812 74855 24637 31493 202291
38984 202291 450505 577008 527618 440871 401522 300458 65733 -83717 166965 766068
$$ packed form
39055A44922J80454n9953P5997M45456M15812j20725n09880k97278J40171K15705
39045F30681n8610k30931q1481J90279K82913O9658l14538n31568l45465M8227
39035c40835K13396O4516k6672J60685L37882K04219l1105L466K09651J79749
39025I74952j20078k92420j56855j2107r9918j87774M1073M35680N49313K60505
39015A392371r2686k09466j85916k75760m92264o16624n07662k43372J3706J58682
39005a058991J61219P2379L9224J89886M42898N26450K71898j66341m57288m23961
38995d02627j71400P1676J66246J35595Q8718Q6780Q2824J7043n0218O856J70798
38984B02291K48214J26503m9390q6747l9349j01064k34725j49450K50682N99103
$$ plain form
38974 766068 1237654 1221962 943721 938174 1345356 1725014 1670966 1373910 1321689 1561637
38964 1561637 1608757 1154406 555997 406438 793198 1229658 1255451 891456 501036 368941
38954 368941 466087 548732 451949 272442 199388 195668 38055 -269937 -381064 -84990 321641
38943 321641 417005 232983 136608 268086 461689 632876 811452 801658 305621 -468822
38933 -468822 -778342 -202997 780493 1368430 1327819 1046644 907990 952958 1066946 1186515
38923 1186515 1299544 1426142 1622403 1908129 2209503 2421472 2470677 2319607 2051119 1960772
38913 1960772 2351697 3153196 3942699 4451477 4860863 5499038 6456650 7638546 9019913
38904 9019913 10734279 13036679 16132700 19703725 22576960 23372778 21778953 18872590
$$ packed form
38974G66068M71586j5692k78241n547M07182L79658n4048k97056n2221K39948
38964A561637M7120m54351n98409j49559L86760M36460K5793l63995l90420j32095
38954C68941R7146Q2645r6783j79507p3054l720j57613l07992j11127K96074M06631
38943C21641R5364j84022r6375J31478J93603J71187J78576r794m96037p74443
38933d68822l09520N75345R83490N87937m0611k81175j38654M4968J13988J19569
38923A186515J13029J26598J96261K85726L01374K11969M9205j51070k68488r0347
38913A960772L90925Q01499P89503N08778M09386O38175R57612J181896J381367
38904I019913J714366K302400L096021L571025K873235P95818j593825k906363
$$ plain form
38896 18872590 15976811 13576908 11546575 9831730 8390738 6924473 5326156 4122153
38888 4122153 3826526 4067441 4006711 3467179 2956399 2680939 2307049 1731597 1313941 1164550
38878 1164550 915804 463180 273067 598300 962901 845634 411284 140083 119535 125078
38868 125078 80936 30249 -91781 -275970 -258262 119278 551789 602036 242708 -186737
38858 -186737 -402197 -338536 -84742 145607 186499 206814 528507 1009456 1034169 399494
38848 399494 -240612 -224762 225307 456298 365242 336769 458135 455345 302704 268728 369980
38837 369980 352185 237140 328604 594920 589060 145151 -315648 -371652 -99363 201318
38827 201318 418389 556166 557083 408657 211377 3246 -268945 -519832 -522805 -235245
$$ packed form
38896A8872590k895779k399903k030333j714845j440992j466265j598317j204003
38888D122153k95627K40915o0730n39532n10780k75460l73890n75452m17656j49391
38878A164550k48746m52624j90113L25233L64601j17267m34350k71201k0548N543
38868A25078m4142n0687j22030j84189J7708L77540M32511N0247l59328m29445
38858a86737k15460O3661K53794K30349M0892K0315L21693M80949K4713o34675
38848C99494o40106J5850M50069K30991r1056k8473J21366k790j52641l3976J01252
38837C69980j7795j15045R1464K66316n860m43909m60799n6004K72289L00681
38827B01318K17071J37777R17j48426j97280k08131k72191k50887k973K87560
$$ plain form
38817 -235245 115289 345335 466951 482817 335331 131855 96671 198930 154616 -95049
38807 -95049 -261949 -201493 -137627 -197505 -107884 357783 941623 1207196 1025938 504895
38797 504895 -268239 -1089462 -1525240 -1319225 -748778 -271369 -3954 159416 175436 -4291
38787 -4291 -126304 71420 378922 369092 51803 -169425 -146726 -139295 -313243 -534441 -697621
38776 -697621 -829151 -814819 -485786 -56739 25922 -174848 -42022 627758 1162394 961195
38766 961195 438364 427121 936704 1178347 749528 136124 -78455 55800 163614 153033
38756 153033 179105 263460 289925 256127 248682 218043 8390 -382176 -736240 -837943 -657200
38745 -657200 -312943 47203 311587 425775 391314 238262 20603 -147514 -119675 136750
$$ packed form
38817b35245L50534K30046J21616J5866j47486k03476l5184J02259m4314k49665
38807i5049j66900O0456O3866n9878Q9621M65667N83840K65573j81258n21043
38797E04895p73134q21223m35778K06015N70447M77409K67415J63370J6020j79727
38787d291j22013J97724L07502r830l17289k21228K2699P431j73948k21198j63180
38776f97621j31530J4332L29033M29047Q2661k00770J32826O69780N34636k01199
38766I61195n22831j1243N09583K41643m28819o13404k14579J34255J07814j0581
38756A53033K6072Q4355K6465l3798p445l0639k09653l90566l54064j01703J80743
38745f57200L44257L60146K64384J14188l4461j53052k17659j68117K7839K56425
$$ plain form
38735 136750 441366 525386 274760 -177554 -583809 -764426 -687948 -452323 -220190 -127824
38725 -127824 -199952 -331289 -370117 -270732 -189991 -365882 -806403 -1147121 -988403 -406710
38715 -406710 62366 63390 -149191 -124569 105586 88975 -339551 -781728 -838280 -643690
38705 -643690 -608909 -840461 -1092045 -1168768 -1074496 -795627 -267506 347746 622320 309777
38695 309777 -299444 -665864 -587738 -327696 -188598 -182361 -191248 -248550 -452147 -690870 -710137
38684 -710137 -480249 -266997 -238000 -234981 -124943 -143418 -552414 -1082532 -1145407 -641304
38674 -641304 -131983 -45703 -109323 137406 595995 786955 574100 264744 64195 -121231
38664 -121231 -305511 -280090 -2547 222420 169155 36310 120986 338365 341180 30925
$$ packed form
38735A36750L04616Q4020k50626m52314m06255j80617P6478K35625K32133R2366
38725a27824p2128j31337l8828R9385Q0741j75891m40521l40718J58718N81693
38715d06710M69076J024k12581K4622K30155j6611m28526m42177n6552J94590
38705f43690L4781k31552k51584p6723R4272K78869N28121O15252K74574l12543
38695C09777o09221l66420P8126K60042J39098O237q887n7302k03597k38723j9267
38684g10137K29888K13252K8997L019J10038j8475m08996n30118o2875N04103
38674f41304N09321Q6280o3620K46729M58589J90960k12855l09356k00549j85426
38664a21231j84280K5421K77543K24967n3265j32845Q4676K17379K815l10255
$$ plain form
38654 30925 -301993 -350643 -123817 128267 198042 78050 -102336 -239466 -337827 -434713
38644 -434713 -499233 -481231 -427698 -427114 -422705 -220995 234287 696084 823616 517003 -19150
38633 -19150 -494592 -745771 -770658 -647509 -461358 -297919 -261396 -412993 -651696 -746067
38623 -746067 -587003 -346135 -258537 -310156 -310673 -230733 -231306 -331197 -308508 -60396 166040
38612 166040 108976 -86570 -18442 451296 1031861 1364873 1372814 1198164 947439 626313
38602 626313 287312 98727 166732 324225 241108 -172574 -582006 -592982 -240835 70184
38592 70184 100499 30157 128079 391453 654067 875289 1113371 1291850 1208763 814010
38582 814010 348189 132958 259002 524506 681189 694769 696027 696101 508363 47999 -440982
$$ packed form
38654C0925l32918m8650K26826K52084O9775j19992j80386j37130r8361r6886
38644d34713o4520J8002N3533N84M409K01710M55282M61797J27532l06613n36153
38633a9150m75442k51179k4887J23149J86151J63439L6523j51597k38703r4371
38623g46067J59064K40868Q7598n1619n17P9940n73r9891K2689K48112K26436
38612A66040n7064j95546O8128M69738N80565L33012P941j74650k50725l21126
38602F26313l39001j88585O8005J57493q3117m13682m09432j0976L52147L11019
38592G0184L0315p0342R7922K63374K62614K21222K38082J78479q3087l94753
38582H14010m65821k15231J26044K65504J56683J3580J258P4j87738m60364m88981
$$ plain form
38571 -440982 -636873 -518117 -295065 -74755 142641 221602 -2419 -368613 -507053 -380790
38561 -380790 -346029 -551894 -671209 -444170 -126913 -95191 -281819 -339635 -162022 73863
38551 73863 227293 274753 210833 118661 185296 412877 508938 324899 175901 395649 784517
38540 784517 887611 658492 434592 374980 350710 314905 355652 433071 476920 670201 1163748
38529 1163748 1567125 1295535 488805 -110 279066 808465 916260 646909 440325
38520 440325 365498 166637 -157918 -303619 -132055 159720 348940 415475 435842 420406
38510 420406 301190 24106 -340740 -594783 -601245 -450592 -310065 -177554 7140 90818
38500 90818 -123028 -442357 -422887 -31730 227107 25982 -338686 -461240 -421062 -524372
$$ packed form
38571d40982j95891J18756K23052K20310K17396P8961k24021l66194j38440J26263
38561c80790L4761k05865j19315K27039L17257L1722j86628n7816J77613K35885
38551G3863J53430M7460o3920r2172O6635K27581R6061j84039j48998K19748L88868
38540G84517J03094k29119k23900n9612k4270l5805M0747P7419M3849J93281M93547
38529A163748M03377k71590q06730m88915K79176N29399J07795k69351k06584
38520D40325p4827j98861l24555j45701J71564K91775J89220O6535K0367j5436
38510D20406j19216k77084l64846k54043o462J50653J40527J32511J84694Q3678
38500I0818k13846l19329J9470L91157K58837k01125l64668j22554M0178j03310
$$ plain form
38490 -524372 -743096 -800478 -634928 -411484 -185149 110314 395366 458086 236135 -95359
38480 -95359 -288981 -182560 183621 510583 488743 208815 75388 190063 177836 -148891
38470 -148891 -378252 -141013 225730 192643 -82518 -40935 273374 232161 -307803 -667442
38460 -667442 -326142 337422 635550 469698 245473 187966 156221 17552 -128563 -111256
38450 -111256 90560 296705 270583 -6146 -231446 -125069 154101 183521 -115737 -361586
38440 -361586 -302135 -196118 -393051 -796064 -1012716 -876695 -557712 -247363 21804 262927
38430 262927 416188 374762 82476 -355629 -665223 -643642 -444333 -445229 -754508 -1030727
38420 -1030727 -912733 -460873 -34493 120571 25892 -143440 -185323 -12248 212667 220014
$$ packed form
38490e24372k18724n7382J65550K23444K26335K95463K85052O2720k21951l31494
38480i5359j93622J06421L66181L26962k1840k79928j33427J14675j2227l26727
38470a48891k29361K37239L66743l3087k75161M1583L14309m1213n39964l59639
38460f67442L41300O63564K98128j65852k24225n7507l1745j38669j46115J7307
38450a11256K01816K06145k6122k76729k25300J06377K79170K9420k99258k45849
38440c61586N9451J06017j96933m03013k16652J36021L18983L10349K69167K41123
38430B62927J53261m1426k92286m38105l09594K1581J99309q96l09279k76219
38420a030727J17994M51860M26380J55064r4679j69332m1883J73075K24915P347
$$ plain form
38410 220014 4891 -151807 -150464 -281060 -736525 -1187762 -1176769 -747249 -332071 -158823
38400 -158823 -137502 -208459 -372329 -446178 -253986 -45277 -233042 -684916 -828569 -577499
38390 -577499 -524669 -941365 -1234493 -884198 -345857 -346892 -716779 -731843 -380120 -364820
38380 -364820 -851331 -1144888 -861141 -558441 -755484 -1052253 -832441 -270594 47109 79103
38370 79103 165701 216615 -124603 -629114 -618733 -13783 504628 547601 532478 865363 1249063
38359 1249063 1215692 856590 579407 504694 514975 592646 708597 642150 304360 12625
38349 12625 72471 306797 372906 321199 422661 629885 657374 474124 284949 117344
38339 117344 -147666 -411126 -457765 -372230 -413798 -500971 -284215 238593 644129 706267
$$ packed form
38410B20014k15123j56698J343j30596m55465m51237J0993M29520M15178J73248
38400a58823K1321p0957j63870p3849J92192K08709j87765m51874j43653K51070
38390e77499N2830m16696k93128L50295N38341j035l69887j5064L51723J5300
38380c64820m86511k93557K83747L02700j97043k96769K19812N61847L17703L1994
38370G9103Q6598N0914l41218n04511J0381O04950N18411M2973j5123L32885L83700
38359A249063l3371l59102k77183p4713J0281P7671J15951o6447l37790k91735
38349A2625N9846K34326O6109n1707J01462K07224K7489j83250j89175j67605
38339A17344k65010k63460m6639Q5535m1568q7173K16756N22808M05536O2138
$$ plain form
38329 706267 649406 647170 509023 90075 -348490 -461216 -264211 -41876 9495 -108255
38319 -108255 -260506 -238306 59320 409209 439324 105909 -234401 -319432 -284072 -324739
38309 -324739 -321360 -30761 475432 783510 556314 -75124 -544809 -366946 300360 769497
38299 769497 663341 393541 491286 747336 550908 -84943 -511937 -469811 -406665 -599017
38289 -599017 -650056 -211370 383426 626472 509661 297045 63869 -135643 -64461 304740
38279 304740 573473 494661 362772 427024 397135 43045 -205312 90619 530962 411738
38269 411738 -187703 -595836 -594357 -490244 -308161 235496 953237 1196939 784826 242535
38259 242535 -1147 -22477 87570 439333 894906 1044857 847582 703345 708961 475115
$$ packed form
38329G06267n6861k236j38147m18948m38565j12726J97005K22335N1371j17750
38319a08255j52251K2200K97626L49889L0115l33415l40310q5031L5360m0667
38309c24739L379K90599N06193L08078k27196o31438m69685J77863O67306M69137
38299G69497j06156k69800R7745K56050j96428o35851m26994M2126O3146j92352
38289e99017n1039M38686N94796K43046j16811k12616k33176j99512P1182L69201
38279C04740K68733p8812j31889O4252k9889l54090k48357K95931M40343j19224
38269D11738n99441m08133J479J04113J82083N43657P17741K43702m12113n42291
38259B42535k43682k1330J10047L51763M55573J49951j97275j44237N616k33846
$$ plain form
38249 475115 -85229 -464245 -391473 -312784 -612477 -944699 -839935 -471249 -272979 -224227
38239 -224227 -84062 21785 -126863 -236990 183302 992525 1479891 1288594 804263 545369
38229 545369 554829 535321 316352 7869 -211139 -333565 -498467 -700608 -651518 -136719
38219 -136719 567512 947293 901028 761476 668221 418159 53697 18638 441163 802415
38209 802415 703071 458604 481174 563409 343152 53831 150472 499947 627450 534241
38199 534241 564016 629656 333482 -199143 -369858 -54245 210389 116942 -2692 136900
38189 136900 307464 266600 181593 231295 238280 34503 -169931 -102566 162689 358698 340511
38178 340511 79926 -371294 -757060 -752068 -372153 29464 260308 439755 593614 551295
$$ packed form
38249D75115n60344l79016P2772P8689k99693l32222J04764L68686J98270M8752
38239b24227J40165J05847j48648j10127M20292Q09223M87366j91297m84331k58894
38229E45369R460j9508k18969l08483k19008j22426j64902k02141M9090N14799
38219a36719P04231L79781m6265j39552r3255k50062l64462l5059M22525L61252
38209H02415r9344k44467K2570Q2235k20257k89321R6641L49475J27503r3209
38199E34241K9775O5640k96174n32625j70715L15613K64634r3447j19634J39592
38189A36900J70564m0864q5007M9702O985k03777k04434O7365K65255J96009j8187
38178C40511k60585m51220l85766M992L79915M01617K30844J79447J53859m2319
$$ plain form
38168 551295 380581 430659 738841 903997 799310 845426 1215365 1357115 834149 136430
38158 136430 14774 386118 582836 408253 221415 157364 35005 -4545 447332 1244566
38148 1244566 1624017 1224207 588634 346937 394822 264680 -84375 -291873 -195141 -4518
38138 -4518 43477 -77673 -262027 -380307 -326520 -101815 141587 215065 54345 -241185
38128 -241185 -492218 -575967 -526108 -458117 -366091 -124095 226028 396314 267173 174591
38118 174591 470141 952350 1125656 922992 710062 598938 298581 -227564 -490901 -147775
38108 -147775 473293 834513 844082 721862 516640 147682 -274074 -546437 -681292 -796037
38098 -796037 -816259 -600917 -281407 -166438 -329735 -537049 -567429 -411321 -180896 9688
$$ packed form
38168E51295j70714N0078L08182J65156j04687M6116L69939J41750n22966o97719
38158A36430j21656L71344J96718j74583j86838o4051j22359l9550M51877P97234
38148A244566L79451l99810o35573k41697M7885j30142l49055k07498R6732J90623
38138d518M7995j21150j84354j18280N3787K24705K43402P3478j60720k95530
38128b41185k51033q3749M9859O7991R2026K41996L50123J70286j29141r2582
38118A74591K95550M82209J73306k02664k12930j11124l00357n26145k63337L43126
38108a47775O21068L61220R569j22220k05222l68958m21756k72363j34855j14745
38098g96037k0222K15342L19510J14969j63297k07314l0380J56108K30425J90584
$$ plain form
38088 9688 112873 208511 402074 582137 474564 68591 -268171 -306086 -298674 -519075 -744353
38077 -744353 -613004 -272535 -181592 -381011 -456355 -195772 183247 480851 743919 988174
38067 988174 1087559 1008707 819409 474116 -28295 -333835 -81792 435665 527977 97105
38057 97105 -227759 -90417 116973 48684 4619 306743 665447 692720 562053 600611
38047 600611 652215 451643 268245 511077 948184 989319 588139 232313 153401 160737
38037 160737 167675 253339 243196 -138578 -678957 -840978 -564799 -323024 -332677 -327054 -199419
38026 -199419 -227637 -487776 -664907 -657288 -751307 -946835 -760974 -68044 475792 309797
38016 309797 -242216 -541593 -526407 -510292 -507386 -345917 -150692 -131062 -106499 215139 668346
$$ packed form
38088I688J03185R5638J93563J80063j07573m05973l36762l7915P412k20401k25278
38077g44353J31349L40469R0943j99419p5344K60583L79019K97604K63068K44255
38067I88174R9385p8852j89298l45293n02411l05540K52043N17457R2312m30872
38057I7105l24864J37342K07390o8289m4065L02124L58704K7273j30667L8558
38047F00611N1604k00572j83398K42832M37107M1135m01180l55826p8912P336
38037A60737O938Q5664j0143l81774n40379j62021K76179K41775r653N623J27635
38026a99419k8218k60139j77131P619r4019j95528J85861O92930N43836j65995
38016C09797n52013k99377J5186J6115K906J61469J95225J9630K4563L21638M53207
$$ plain form
38005 668346 856797 787061 763536 796191 644132 348752 191111 177713 93473 26669 284956
37994 284956 762597 954853 713003 453383 443077 388427 2762 -448712 -514395 -172339
37984 -172339 239418 494440 582381 500190 247607 -7412 -6042 287390 554118 398912
37974 398912 -196549 -733129 -647099 37607 679873 762521 457136 262921 335015 488029
37964 488029 645596 855054 979426 842953 636898 709887 963008 948687 606184 367970
37954 367970 432624 484281 314614 162570 167494 39253 -349652 -545630 -162844 446904
37944 446904 684597 556205 506742 632313 607533 289072 -103839 -372056 -487137 -404946
37934 -404946 -115285 160345 186317 91482 177478 399426 425425 203944 73240 249212
$$ packed form
38005F68346J88451o9736k3525L2655j52059k95380j57641j3398q4240o6804K58287
37994B84956M77641J92256k41850k59620j0306n4650l85665m51474o5683L42056
37984a72339M11757K55022Q7941q2191k52583k55019J370K93432K66728j55206
37974C98912n95461n36580Q6030O84706O42266Q2648l05385j94215P2094J53014
37964D88029J57567K09458J24372j36473k06055P2989K53121j4321l42503k38214
37954C67970O4654N1657j69667j52044M924j28241l88905j95978L82786O09748
37944D46904K37693j28392m9463J25571k4780l18461l92911k68217j15081Q2191
37934d04946K89661K75630K5972r4835Q5996K21948K5999k21481j30704J75972
$$ plain form
37924 249212 557908 754476 787942 665660 364739 -91 -177630 -78036 116269 207757
37914 207757 171318 56973 -84386 -142806 -21243 206712 395344 549397 716493 735511
37904 735511 443252 110561 227938 743732 965808 469440 -280398 -548981 -276583 -1181
37894 -1181 -21027 -83588 101240 432550 637601 663834 660987 683379 599684 333085 74271
37883 74271 110364 415861 572509 256077 -290046 -497383 -176310 279519 457683 426155
37873 426155 492027 667768 644076 246469 -295381 -586202 -479271 -206325 -109666 -269545
37863 -269545 -460801 -509473 -546683 -735669 -876105 -602171 19958 457189 420164 281284
37853 281284 520726 999049 1132524 704863 170891 97158 515211 928644 867256 363494
$$ packed form
37924B49212L08696J96568L3466j22282l00921l64830j77539R9594J94305R1488
37914B07757l6439j14345j41359n8420J21563K27955J88632J54053J67096J9018
37904G35511k92259l32691J17377N15794K22076m96368p49838k68583K72398K75402
37894a181j9846o2561J84828L31310K05051K6233k847K2392q3695k66599k58814
37883G4271L6093L05497J56648l16432n46123k07337L21073M55829J78164l1528
37873D26155O5872J75741k3692l97607n41850k90821J06931K72946R6659j59879
37863b69545j91256m8672l7210j88986j40436K73934O22129M37231l7025j38880
37853B81284K39442M78323J33475m27661n33972p3733M18053M13433o1388n03762
$$ plain form
37843 363494 -107428 -137613 216213 597675 809111 914684 939718 762342 379413 3016
37833 3016 -235779 -416788 -527107 -345589 135110 479864 338415 -34114 -149054 23101
37823 23101 146922 157430 312526 635806 787372 582596 240046 -14464 -240676 -527766
37813 -527766 -751280 -770319 -644183 -505721 -408832 -398990 -523103 -672879 -634549 -390365
37803 -390365 -158861 -62828 -3954 55087 -19974 -230500 -327411 -180082 6383 31613 -16356
37792 -16356 -26627 -118847 -359982 -506363 -356306 -121455 -84934 -105812 108110 384787
37782 384787 234668 -401732 -1000950 -1128655 -902091 -683135 -617301 -595670 -448901 -104477
37772 -104477 275891 350377 21079 -292412 -154544 190422 101864 -462038 -810017 -568600
$$ packed form
37843C63494m70922l0185L53826L81462K11436J05573K5034j77376l82929l76397
37833C016k38795j81009j10319J81518M80699L44754j41449l72529j14940J72155
37823B3101J23821J0508J55096L23280J51566k04776l42550k54510k26212k87090
37813e27766k23514j9039J26136J38462R6889R842j24113j49776L8330K44184
37803c90365K31504R6033N8874N9041p5061k10526r6911J47329J86465K5230m7969
37792a6356j0271r2220k41135j46381J50057K34851L6521k0878K13922K76677
37782C84787j50119o36400n99218j27705K26564K18956O5834K1631J46769L44424
37772a04477L80368P4486l29298l13491J37868L44966q8558n63902l47979K41417
$$ plain form
37762 -568600 -276318 -533349 -1043006 -1040639 -370424 435262 979348 1326633 1543983 1467188
37752 1467188 1055996 582279 308634 245283 293979 361428 295982 28258 -171468 65697
37742 65697 597431 786079 340508 -203421 -151271 457098 967966 953444 563641 126246
37732 126246 -222476 -460781 -546810 -494946 -409690 -343563 -247871 -127419 -106902 -249912 -412014
37721 -412014 -384251 -144360 117066 210989 128655 -10574 -141974 -310529 -515987 -594854
37711 -594854 -392523 -34412 156007 80936 35374 303106 720668 853502 552369 123746
37701 123746 -60505 62324 297445 447562 440716 331814 261207 324272 426114 368751
37691 368751 150907 55897 297538 646081 603578 12509 -656881 -778189 -284690 259803
$$ packed form
37762e68600K92282k57031n09657K367O70215Q05686N44086L47285K17350p6795
37752A467188m11192m73717k73645o3351M8696O7449o5446k67724j99726K37165
37742F5697N31734J88648m45571n43929N2150O08369N10868j4522l89803m37395
37732A26246l48722k38305q6029N1864Q5256O6127R5692J20452K0517j43010j62102
37721d12014K7763K39891K61426R3923q2334j39229j31400j68555k05458p8867
37711e94854K02331L58111J90419p5071m5562K67732M17562J32834l01133m28623
37701A23746j84251J22829K35121J50117o846j08902p0607O3065J01842n7363
37691C68751k17844r5010K41641L48543m2503n91069o69390j21308M93499N44493
$$ plain form
37681 259803 346939 84682 -88724 -71006 -143713 -381740 -434219 -100098 214905 -21290
37671 -21290 -696556 -1148798 -1002085 -573589 -402012 -652071 -1078269 -1362825 -1378392 -1241020
37661 -1241020 -1155921 -1138740 -964296 -536360 -163814 -188286 -442537 -452269 -144934 71227
37651 71227 -13475 -117213 -13691 77346 -94075 -388681 -577017 -720237 -922290 -998749
37641 -998749 -743814 -286294 130186 451415 591718 269836 -499988 -1088906 -962548 -443472
37631 -443472 -183578 -128348 280064 1011773 1381661 1122626 722575 501888 140797 -530732
37621 -530732 -995663 -804901 -313073 -123494 -234051 -269068 -193509 -236571 -374754 -427402
37611 -427402 -453810 -548918 -455482 68338 651250 674343 184012 -141315 27766 282543
$$ packed form
37681B59803Q7136k62257j73406J7718p2707k38027n2479L34121L15003k36195
37671b1290o75266m52242J46713M28496J71577k50059m26198k84556j5567J37372
37661a241020Q5099J7181J74444M27936L72546k4472k54251r732L07335K16161
37651G1227q4702j03738J03522R1037j71421k94606j88336j43220k02053p6459
37641i98749K54935M57520M16480L21229J40303l21882p69824n88918J26358N19076
37631d43472K59894N5230M08412P31709L69888k59035m00051k20687l61091o71529
37621e30732m64931J90762M91828J89579j10557l5017P5559m3062j38183n2648
37611d27402k6408r5108R3436N23820N82912K3093m90331l25327J69081K54777
$$ plain form
37601 282543 193794 -98378 -245912 -238921 -302199 -500323 -692130 -733653 -588248 -366315
37591 -366315 -300006 -486483 -639378 -367762 229845 555602 246825 -347771 -623638 -435744
37581 -435744 -134703 -42124 -126326 -144810 60168 399636 602675 488664 188603 -10800
37571 -10800 -41982 -102765 -301849 -481925 -494330 -437544 -473529 -573612 -596457 -477322 -210832
37560 -210832 198421 630958 862869 831555 721713 636578 408511 -33838 -341347 -128947
37550 -128947 459970 949508 1204684 1479827 1791699 1735934 1126357 414261 149297 279611
37540 279611 330375 116170 -93794 -75183 45450 66691 19554 44401 128621 126008 -46594
37529 -46594 -343252 -640351 -752599 -497699 87071 626446 689299 240962 -311828 -578759
$$ packed form
37601B82543q8749k92172j47534O991o3278j98124j91807m1523J45405K21933
37591c66315O6309j86477j52895K71616N97607L25757l08777n94596k75867J87894
37581d35744L01041R2579q4202j8484K04978L39468K03039j14011l00061j99403
37571a0800l1182o0783j99084j80076j2405N6786l5985j00083k2845J19135K66490
37560b10832M09253M32537K31911l1314j09842q5135k28067m42349l07509K12400
37550a28947N88917M89538K55176K75143L11872n5765o09577p12096k64964J30314
37540B79611N0764k14205k09964J8611J20633K1241m7137K4847Q4220k613j72602
37529d6594k96658k97099j12248K54900N84770N39375O2853m48337n52790k66931
$$ plain form
37519 -578759 -557308 -465716 -361325 -125680 222905 446127 408918 314729 444661 727620
37509 727620 763532 322711 -319445 -660173 -514709 -154848 80455 154351 234905 354995
37499 354995 333877 32990 -429955 -758656 -721035 -336871 104471 261700 98450 -18133
37489 -18133 257365 748321 912314 541903 45551 -106421 34778 87349 -86463 -282381
37479 -282381 -326715 -263716 -193038 -144237 -111388 -51884 106750 315986 364370 165429 -45743
37468 -45743 -32861 71643 4743 -167887 -193118 -109387 -148710 -230525 -59526 257489 242162
37457 242162 -194088 -571008 -607165 -592670 -716151 -627199 -124168 258715 -46605 -740744
37447 -740744 -1106732 -1077335 -1141177 -1339084 -1143770 -428912 155574 70500 -365568 -473268
$$ packed form
37519e78759K1451R1592J04391K35645L48585K23222l7209r4189J29932K82959
37509G27620L5912m40821o42156l40728J45464L59861K35303P3896Q0554J20090
37499C54995k1118l00887m62945l28701L7621L84164M41342J57229j63250j16583
37489a8133K75498M90956J63993l70411m96352j51972J41199N2571j73812j95918
37479b82381m4334O2999P0678M8801L2849N9504J58634K09236M8384j98941k11172
37468d5743J2882J04504o6900j72630k5231Q3731l9323q1815J70999L17015j5327
37457B42162m36250l76920l6157J4495j23481Q8952N03031L82883l05320o94139
37447g40744l65988K9397o3842j97907J95314P14858N84486q5074m36068j07700
$$ plain form
37437 -473268 -114100 272780 358321 314105 511728 1019503 1493070 1568788 1299786 1064336
37427 1064336 1038218 994434 734847 433179 314669 258135 33149 -279483 -442464 -436718
37417 -436718 -331007 -16870 496518 772864 479109 32003 91588 545479 706320 458115
37407 458115 382005 640005 612481 -26362 -664903 -656904 -214239 108138 235158 330424
37397 330424 262424 -68684 -297707 -121872 88230 -158811 -612758 -638870 -217927 83448
37387 83448 6135 -188439 -321816 -478436 -585762 -408390 -20075 225166 230758 191634
37377 191634 98965 -256257 -741442 -890960 -577119 -186116 -3151 103850 258838 322245
37367 322245 234444 160669 115521 -101136 -401564 -333117 222009 722569 667833 221288
$$ packed form
37437d73268L59168L86880Q5541m4216J97623N07775M73567P5718k69002k35450
37427A064336k6118m3784k59587l01668j18510n6534k24986l12632j62981N746
37417d36718J05711L14137N13388K76346k93755m47106N9585M53891J60841k48205
37407D58115p6110K58000k7524o38843o38541P999M42665L22377J27020R5266
37397C30424o8000l31108k29023J75835K10102k47041m53947k6112M20943L01375
37387H3448p7313j94574j33377j56620j07326J77372L88315K45241N592l9124
37377A91634r2669l55222m85185j49518L13841L91003J82965J07001J54988O3407
37367C22245q7801p3775m5148k16657l00428O8447N55126N00560n4736m46545
$$ plain form
37357 221288 -190666 -485853 -726947 -707546 -268830 210439 184724 -295677 -667338 -653065
37347 -653065 -526269 -548690 -568654 -326866 126745 485384 496045 136108 -378219 -704242
37337 -704242 -626887 -264456 58252 156023 123785 149743 299210 494660 614596 581406
37327 581406 409308 198068 71707 115868 329948 576798 630897 411148 146373 132686
37317 132686 317489 351964 119562 -62053 72287 315047 318196 136108 89402 205840
37307 205840 205967 60556 139919 623865 1102094 1075641 662168 429778 569831 625670 180690
37296 180690 -518569 -918870 -922378 -894267 -985059 -922238 -591605 -348576 -444381 -536781 -213318
37285 -213318 283900 389767 104204 -47750 99364 148071 -74978 -171706 119161 435950
$$ packed form
37357B21288m11954k95187k41094J9401M38716M79269k5715m80401l71661J4273
37347f53065J26796k2421j9964K41788M53611L58639J0661l59937n14327l26023
37337g04242P7355L62431L22708R7771l2238K5958J49467J95450J19936l3190
37327E81406j72098k11240j26361M4161K14080K46850N4099k19749k64775j3687
37317A32686J84803L4475k32402j81615J34340K42760L149j82088m6706J16438
37307B05840J27j45411P9363M83946M78229k6453m13473k32390J40053N5839m44980
37296A80690o99259m00301l508K8111r0792O2821L30633K43029r5805r2400L23463
37285b13318M97218J05867k85563j51954J47114M8707k23049r6728K90867L16789
$$ plain form
37275 435950 391224 172338 102665 16697 -395711 -905912 -967685 -489375 94624 438116
37265 438116 545726 506758 385966 329691 401610 381138 102278 -120806 127491 630774
37255 630774 726276 257128 -216811 -289825 -229199 -365177 -484987 -249376 155591 256872
37245 256872 -8850 -262471 -253885 -94651 52385 183510 308569 356727 316830 293006
37235 293006 333776 338302 222497 82509 87882 255590 436195 530723 612957 762459 866377
37224 866377 746502 469886 332172 451497 573986 444686 211394 227425 535712 800932
37214 800932 758509 523520 404795 542611 756452 681856 119110 -662070 -1089386 -911379
37204 -911379 -507975 -376987 -498543 -521403 -404349 -417930 -563505 -505400 -168812 89529
$$ packed form
37275D35950m4726k18886o9673q5968m12408n10201o1773M78310N83999L43492
37265D38116J07610l8968j20792n6275P1919k0472k78860k23084K48297N03283
37255F30774R5502m69148m73939p3014O0626j35978j19810K35611M04967J01281
37245B56872k65722k53621Q586J59234J47036J31125J25059M8158l9897k3824
37235B93006M0770M526j15805j39988N373J67708J80605R4528Q2234J49502J03918
37224H66377j19875k76616j37714J19325J22489j29300k33292J6031L08287K65220
37214H00932m2423k34989j18725J37816K13841p4596n62746p81180m27316J78007
37204i11379M03404J30988j21556k2860J17054j3581j45575N8105L36588K58341
$$ plain form
37194 89529 86194 107977 336908 446743 176449 -88676 149243 620155 555035 -185099
37184 -185099 -836601 -771252 -333633 -301015 -796254 -1168465 -908730 -290448 68224 16195
37174 16195 -69400 40252 71060 -260555 -700592 -752437 -395279 -120652 -233817 -489389
37164 -489389 -547885 -462331 -485175 -631299 -704167 -631199 -533258 -509185 -519514 -454747 -222173
37153 -222173 169747 542637 669952 545403 403958 392100 369051 147039 -224230 -542064
37143 -542064 -670939 -548623 -147302 391782 738172 700604 474427 370294 402289 358088
37133 358088 191802 101598 225055 456925 599404 567541 437095 369800 460718 601477
37123 601477 575657 351271 147607 119975 148262 88674 56912 235515 525175 643409
$$ packed form
37194H9529l335K1783K28931J09835k70294k65125K37919M70912o5120p40134
37184a85099o51502O5349M37619L2618m95239l72211K59735O18282L58672n2029
37174A6195q5595J09652L0808l31615m40037n1845L57158K74627j13165k55572
37164d89389n8496Q5554k2844j46124p2868P2968R7941K4073j0329O4767K32574
37153b22173L91920L72890J27315j24549j41445j1858k3049k22012l71269l17834
37143e42064j28875J22316M01321N39084L46390l7568k26177j04133L1995m4201
37133C58088j66286r0204J23457K31870J42479l1863j30446o7295R0918J40759
37123F01477k5820k24386k03664k7632K8287n9588l1762J78603K89660J18234
$$ plain form
37113 643409 514053 330364 257904 271828 270092 183186 7820 -123288 9049 402767
37103 402767 665320 395137 -296226 -869493 -960984 -700570 -443951 -406486 -573667 -758382
37093 -758382 -698231 -275423 298713 641813 564440 177464 -309726 -730386 -943225 -891972
37083 -891972 -706472 -568225 -460434 -224131 138883 430833 560248 655256 783657 767350
37073 767350 441731 -20590 -233806 -45756 258686 262830 -106083 -491033 -547553 -376743
37063 -376743 -343072 -497612 -471330 -60912 370584 345259 -67222 -356356 -248370 35243
37053 35243 173655 106781 -49944 -221757 -411728 -627269 -797931 -740401 -322895 256979
37043 256979 561249 450073 310681 508002 844424 894443 648925 401490 174577 -222978
$$ packed form
37113F43409j29356j83689p2460J3924j736q6906j75366j31108J32337L93718
37103D02767K62553k70183o91363n73267r1491K60414K56619L7465j67181j84715
37093g58382O0151M22808N74136L43100p7373l86976m87190m20660k12839N1253
37083h91972J85500J38247J07791K36303L63014K91950J29415R5008J28401j6307
37073G67350l25619m62321k13216J88050L04442M144l68913l84950n6520J70810
37063c76743L3671j54540K6282M10418M31496k5325m12481k89134J07986K83613
37053C5243J38412o6874j56725j71813j89971k15541j70662N7530M17506N79874
37043B56979L04270j11176j39392J97321L36422N0019k45518k47435k26913l97555
$$ plain form
37033 -222978 -645558 -678830 -304470 17953 28461 -60902 -77514 -148027 -262728 -111933
37023 -111933 344746 614011 348726 -81143 -101650 263764 509321 360415 -9846 -341064
37013 -341064 -512283 -479563 -278235 -66544 26291 58466 161502 352734 545758 616924
37003 616924 408282 -125157 -688403 -824327 -455973 -5665 162338 140143 159696 199985
36993 199985 150841 82604 77274 34787 -84250 -67072 213370 503421 517308 363103 301688
36982 301688 288584 106180 -215763 -468062 -620044 -767706 -837203 -685572 -427212 -340674
36972 -340674 -481465 -640167 -637406 -454243 -160035 95103 133615 -28338 -160333 -145057
36962 -145057 -79311 74517 529367 1110382 1146476 388046 -404548 -389355 184161 408353
$$ packed form
37033b22978m22580l3272L74360L22423J0508q9363j6612p0513j14701J50795
37023a11933M56679K69265k65285m29869k0507L65414K45557j48906l70261l31218
37013c41064j71219L2720K01328K11691R2835L2175J03036J91232J93024P1166
37003F16924k08642n33439n63246j35924L68354M50308J68003k2195J9553M0289
36993A99985m9144o8237n330m2487j19037J7178K80442K90051J3887j54205o1415
36982C01688j3104j82404l21943k52299j51982j47662o9497J51631K58360Q6538
36972c40674j40791j58702K761J83163K94208K55138L8512j61953j31995J5276
36962a45057O5746J53828M54850N81015L6094p58430p92594J5193N73516K24192
$$ plain form
36952 408353 54582 -298115 -331711 -349762 -527991 -598715 -461805 -412641 -523093 -418400
36942 -418400 53525 482038 510463 309952 179396 139484 169220 365167 594061 459231
36932 459231 -88587 -549285 -566376 -365525 -216826 15866 401798 538963 133435 -424302
36922 -424302 -589317 -430097 -347406 -353836 -216398 -60646 -198240 -479912 -418516 80202
36912 80202 627141 958075 1142297 1212581 1092803 918826 945919 1075196 933948 505710
36902 505710 208819 219362 192930 -120617 -417872 -306374 93345 342466 266921 44330
36892 44330 -137503 -224350 -187191 -19682 182036 303365 338019 311164 159425 -160675
36882 -160675 -509076 -669948 -595704 -405838 -176450 105711 372342 429870 177428 -221236
$$ packed form
36952D08353l53771l52697l3596j8051j78229p0724J36910M9164j10452J04693
36942d18400M71925M28513K8425k00511j30556l9912K9736J95947K28894j34830
36932D59231n47818m60698j7091K00851J48699K32692L85932J37165m05528n57737
36922d24302j65015J59220Q2691o430J37438J55752j37594k81672O1396M98718
36912H0202N46939L30934J84222P0284j19778j73977K7093J29277j41248m28238
36902E05710k96891J0543k6432l13547k97255J11498L99719K49121p5545k22591
36892D4330j81833q6847L7159J67509K01718J21329L4654k6855j51739l20100
36882a60675l48401j60872P4244J89866K29388K82161K66631N7528k52442l98664
$$ plain form
36872 -221236 -465025 -366278 68394 715450 1377682 1794349 1770987 1374277 919392 684495
36862 684495 667136 665304 550433 400281 391505 604208 900608 985588 679669 177444 -87013
36851 -87013 75191 379994 445878 254020 59772 -6849 -1074 66719 211025 265364 30206
36840 30206 -356057 -526646 -417884 -340585 -425021 -378311 11419 483331 685942 659393
36830 659393 633496 593934 400772 163163 119501 220677 173243 -111866 -391929 -424758
36820 -424758 -201781 158062 537497 807302 841002 601511 173120 -247625 -378389 -44477
36810 -44477 537187 851509 644418 235901 86671 222029 318480 196937 -57660 -336254
36800 -336254 -535944 -432068 112223 786647 1013420 590776 -61905 -379885 -201909 200351
$$ packed form
36872b21236k43789R8747M34672O47056O62232M16667k3362l96710m54885k34897
36862F84495j7359j832j14871j50152q776K12703K96400Q4980l05919n02225k64457
36851h7013J62204L04803O5884j91858j94248o6621N775O7793J44306N4339k35158
36840C0206l86263j70589J08762P7299q4436M6710L89730M71912K02611k6549
36830F59393k5897l9562j93162k37609m3662J01176m7434k85109k80063l2829
36820d24758K22977L59843L79435K69805L3700k39491m28391m20745j30764L33912
36810d4477N81664L14322k07091m08517j49230J35358R6451j21543k54597k78594
36800c36254j99690J03876N44291O74424K26773m22644o52681l17980J77976M02260
$$ plain form
36790 200351 471217 479423 370090 337315 339734 168813 -145761 -246692 41282 374266
36780 374266 378617 249128 430707 850631 980707 650991 283813 214860 258628 134887
36770 134887 -93163 -248485 -351798 -430578 -315235 66353 407709 352287 -12244 -244998
36760 -244998 -78113 323696 571050 400862 -95808 -510983 -494841 -155084 67453 -28233
36750 -28233 -173974 -85097 99224 31312 -355518 -787702 -985485 -882102 -582785 -250630
36740 -250630 7744 214451 413064 492671 295474 -65487 -230093 -35571 282637 442888
36730 442888 424580 300493 68680 -144627 -43288 365731 552831 126145 -513434 -652801
36720 -652801 -257820 55478 2565 -23219 264927 499438 255223 -224268 -354718 -33820
$$ packed form
36790B00351K70866Q206j09333l2775K419j70921l14574j00931K87974L32984
36780C74266M351j29489J81579M19924J30076l29716l67178o8953M3768j23741
36770A34887k28050j55322j03313p8780J15343L81588L41356n5422l64531k32754
36760b44998J66885M01809K47354j70188m96670m15175J6142L39757K22537r5686
36750b8233j45741Q8877J84321o7912l86830m32184j97783J03383K99317L32155
36740b50630K58374K06707J98613P9607j97197l60961j64606J94522L18208J60251
36730D42888j8308j24087k31813k13307J01339M09019J87100m26686o39579j39367
36720f52801L94981L13298n2913k5784K88146K34511k44215m79491j30450L20898
$$ plain form
36710 -33820 308322 369486 256589 115356 -108444 -418312 -604702 -524077 -315304 -149858
36700 -149858 38109 349301 611701 567490 297982 156410 261428 354794 250188 132987
36690 132987 228417 399322 332034 10293 -236633 -126523 303024 773590 978154 782648
36680 782648 374385 155042 338325 716618 958925 1017029 1036882 999165 748985 349981
36670 349981 108028 193867 470041 720660 832236 738236 449787 204128 328603 840197
36660 840197 1360799 1523172 1321643 1023698 889193 989253 1134809 995033 469103 -105007
36650 -105007 -327777 -239399 -162383 -154482 -18951 197596 214758 78154 187068 610023
36640 610023 883590 719378 415624 279921 139772 -193063 -427640 -232378 188215 433680
$$ packed form
36710c3820L42142O1164j12897j41233k23800l09868j86390Q0625K08773J65446
36700a49858J87967L11192K62400m4211k69508j41572J05018R3366j04606j17201
36690A32987R5430J70905o7288l21741k46926J10110M29547M70566K04564j95506
36680G82648m08263k19343J83283L78293K42307N8104J9853l7717k50180l99004
36670C49981k41953Q5839K76174K50619J11576r4000k88449k45659J24475N11594
36660H40197N20602J62373k01529k97945j34505J00060J45556j39776n25930n74110
36650a05007k22770Q8378P7016P901J35531K16547J7162j36604J08914M22955
36640F10023K73567j64212l03754j35703j40149l32835k34577J95262M20593K45465
$$ plain form
36630 433680 519271 652742 672338 270212 -370748 -700758 -523679 -166993 20354 -33161
36620 -33161 -248462 -459683 -432334 -149272 41129 -113131 -346308 -300502 -150382 -313992
36610 -313992 -717818 -910606 -812369 -770548 -900433 -945127 -810828 -683051 -576740 -340220
36600 -340220 -150526 -381484 -872075 -985427 -591324 -319238 -538720 -757567 -468913 -1155
36590 -1155 29463 -341799 -620587 -641303 -566896 -348063 194322 835677 1054662 709502
36580 709502 196110 -96173 -139486 -69774 19398 21061 -163988 -455030 -625044 -555587 -318566
36569 -318566 -20978 257633 384240 233006 -106049 -311477 -114634 426629 961860 1156420
36559 1156420 983995 698702 501634 339449 135828 54253 259667 522909 442822 64611
$$ packed form
36630D33680Q5591J33471J9596m02126o40960l30010J77079L56686J87347n3515
36620c3161k15301k11221K7349K83062J90401j54260k33177M5806J50120j63610
36610c13992m03826j92788R8237M1821j29885m4694J34299J27777J06311K36520
36600c40220J89694k30958m90591j13352L94103K72086k19482k18847K88654M67758
36590a155L0618l71262k78788k0716P4407K18833N42385O41355K18985l45160
36580G09502n13392k92283m3313O9712Q9172J663j85049k91042j70014O9457K37021
36569c18566K97588K78611J26607j51234l39055k05428J96843N41263N35231J94560
36559A156420j72425k85293j97068j62185k03621q1575K05414K63242q0087l78211
$$ plain form
36549 64611 -144980 -19959 78301 -62299 -118553 132210 276082 -116018 -675935 -659818
36539 -659818 -11068 598729 731306 596839 473051 301785 57076 7935 291011 556624
36529 556624 377914 -174556 -636152 -694128 -403624 30772 443491 701066 725403 608808
36519 608808 602777 881746 1306711 1495025 1203993 629204 220249 187702 324727 360141
36509 360141 306243 323963 406052 401798 272539 122421 16033 -66188 -134335 -212295 -404333
36498 -404333 -763996 -1129630 -1260340 -1119427 -882218 -700737 -597979 -532702 -419080 -166706
36488 -166706 129596 163688 -174934 -481628 -257296 377410 744786 444545 -219812 -767532
36478 -767532 -1134130 -1484184 -1704841 -1468928 -765536 -67474 132975 -178540 -586405 -711378
$$ packed form
36549F4611k09591J25021R8260j40600n6254K50763J43872l92100n59917J6117
36539f59818O48750O09797J32577j34467j23788j71266k44709m9141K83076K65613
36529E56624j78710n52470m61596n7976K90504M34396M12719K57575K4337j16595
36519F08808o031K78969M24965J88314k91032n74789m08955l2547J37025L5414
36509C60141n3898J7720Q2089m254j29259j50118j06388q2221o8147p7960j92038
36498d04333l59663l65634j30710J40913K37209J81481J02758O5277J13622K52374
36488a66706K96302L4092l38622l06694K24332O34706L67376l00241o64357n47720
36478g67532l66598l50054k20657K35913P03392O98062K00449l11515m07865j24973
$$ plain form
36468 -711378 -529544 -242457 27517 279593 446946 408332 254747 297496 632663 912745
36458 912745 811467 544321 588394 971983 1218449 1005656 520915 89297 -203891 -383400
36448 -383400 -390063 -218636 -26564 82611 206562 417231 565714 480670 206082 -110863
36438 -110863 -406748 -619387 -601144 -330908 -71188 -59509 -113041 198760 963596 1712130
36428 1712130 1881631 1391179 678960 217212 79964 32043 -32146 67195 424474 739502
36418 739502 653879 294633 138671 335105 537085 497866 430800 560463 688811 543360
36408 543360 277740 230568 366148 369038 198416 123037 205039 155653 -191613 -587790 -693082
36397 -693082 -461666 -85333 231956 323798 100554 -285940 -462012 -200861 290838 585465
$$ packed form
36468g11378J81834K87087K69974K52076J67353l8614j53585M2749L35167K80082
36458I12745j01278k67146M4073L83589K46466k12793m84741m31618k93188j79509
36448c83400o663J71427J92072J09175J23951K10669J48483q5044k74588l16945
36438a10863k95885k12639J8243K70236K59720J1679n3532L11801P64836P48534
36428A712130J69501m90452p12219m61748j37248m7921o4189R9341L57279L15028
36418G39502q5623l59246j55962J96434K01980l9219o7066J29663J28348j45451
36408E43360k65620m7172J35580K890j70622p5379Q2002m9386l47266l96177j05292
36397f93082K31416L76333L17289R1842k23244l86494j76072K61151M91699K94627
$$ plain form
36387 585465 492440 208665 47799 108161 216740 166689 -18830 -115946 -18090 92344
36377 92344 21873 -89465 62941 455875 699755 578724 353991 350456 478798 430981
36367 430981 185541 -2130 -44446 -119082 -295470 -389332 -306499 -244428 -360535 -472148
36357 -472148 -333281 -43383 100995 59777 51385 143751 171783 103322 159220 439135 714774
36346 714774 778472 745740 784624 770695 503267 105127 -116708 -122284 -135810 -240931 -295824
36335 -295824 -234734 -127798 70942 479770 925903 1000355 631096 259697 236904 357696
36325 357696 263048 13220 -91378 -54048 -136351 -343141 -346860 15079 452451 533759 124473
36314 124473 -526527 -1006157 -1045769 -751217 -517953 -598248 -799934 -748548 -364704 105274
$$ packed form
36387E85465r3025k83775j60866O0362J08579n0051j85519r7116R7856J10434
36377I2344p0471j11338J52406L92934K43880j21031k24733l535J28342m7817
36367D30981k45440j87671m2316p4636j76388r3862Q2833O2071j16107j11613
36357d72148J38867K89898J44378m1218q392R2366K8032o8461N5898K79915K75639
36346G14774O3698l2732L8884j3929k67428l98140k21835n576j3526j05121n4893
36335b95824O1090J06936J98740M08828M46133P4452l69259l71399k2793J20792
36325C57696r4648k49828j04598L7330q2303k06790l719L61939M37372Q1308m09286
36314A24473o51000m79630l9612K94552K33264q0295k01686N1386L83844M69978
$$ plain form
36304 105274 450493 639937 643868 397053 -5527 -311618 -387149 -306675 -143524 96252
36294 96252 282211 190235 -131588 -291859 -68355 217057 105837 -351026 -655119 -519861
36284 -519861 -162811 101647 265973 460955 595816 437286 15445 -292323 -189321 165057
36274 165057 357274 242441 95039 207321 497750 638070 481390 220380 138349 320726
36264 320726 624074 838419 851626 709287 536311 389832 225891 35185 -76060 -31661
36254 -31661 55435 -5194 -233933 -453146 -491218 -324785 -52693 171965 224618 127855 36560
$$ packed form
36304A05274L45219J89444L931k46815m02580l06091p5531Q0474J63151K39776
36294I6252J85959r1976l21823j60271K23504K85412j11220m56863l04093J35258
36284e19861L57050K64458J64326J94982J34861j58530m21841l07768J03002L54378
36274A65057J92217j14833j47402J12282K90429J40320j56680k61010q2031J82377
36264C20726L03348K14345J3207j42339j72976j46479j63941j90706j11245M4399
36254c1661Q7096o0629k28739k19213l8072J66433K72092K24658N2653r6763r1295
$$ [...]
##END NTUPLES=NMR SPECTRUM
##END=
