##TITLE=31Pdec_IBDPBF0102
 CDCl3, 24 sc
 5.2.2019
##JCAMPDX= 6.0         $$ Bruker NMR JCAMP-DX V2.0
##DATA TYPE= NMR SPECTRUM
##DATA CLASS= NTUPLES
##ORIGIN= UXNMR, Bruker Analytische Messtechnik GmbH
##OWNER= root
$$ XWIN-NMR		Version 3.5
$$ Tue Feb  5 16:04:30 2019 Russian Standard Time (UT+4h)  she@DPX200
##.OBSERVE FREQUENCY= 81.013821
##.OBSERVE NUCLEUS= ^31P
##.ACQUISITION MODE= SIMULTANEOUS
##.ACQUISITION SCHEME= undefined
##.AVERAGES= 24
##.DIGITISER RES= 17
##SPECTROMETER/DATA SYSTEM= spect
##.PULSE SEQUENCE= zgpg30
##.SOLVENT NAME= DMSO
##.SHIFT REFERENCE= (INTERNAL, DMSO, 0, 182.463)
##AUDIT TRAIL= $$ (NUMBER, WHEN, WHO, WHERE, WHAT)
$$ ##TITLE= Audit trail, XWIN-NMR		Version 3.5
$$ ##JCAMPDX= 5.01
$$ ##ORIGIN= Bruker BioSpin GmbH
$$ ##OWNER= she
$$ F:/spectra/data/she/nmr/P31/1/pdata/1/auditp.txt
$$ ##AUDIT TRAIL=  $$ (NUMBER, WHEN, WHO, WHERE, WHAT)
(   1,<2019-02-05 16:02:56.64 +0400>,<she>,<DPX200>,
      <created by zg, POWCHK disabled, PULCHK disabled
       configuration hash MD5:
       00 E9 B6 7A A2 85 ED C7 34 08 36 98 17 FE 4E 26
       data hash MD5: 32K
       4A BB 04 9B 0B 77 6F 39 7A 40 6C 72 42 DA B4 F4>)
(   2,<2019-02-05 16:02:59.10 +0400>,<she>,<DPX200>,
      <Start of raw data processing
       efp BC_mod = 2 LB = 1 FT_mod = 6 PKNL = 1 PHC0 = -1467.697 PHC1 = 113.399 SI = 64K 
       data hash MD5: 64K
       DC 29 CB 71 C6 9C AA 32 A9 5D 8C 0A E2 1C E8 47>)
(   3,<2019-02-05 16:03:13.92 +0400>,<she>,<DPX200>,
      <pk PHC0 = 0.09111544 PHC1 = 0 
       data hash MD5: 64K
       E9 D9 06 CC 12 BE EE FB 07 48 16 E4 2C 72 16 FF>)
(   4,<2019-02-05 16:03:19.40 +0400>,<she>,<DPX200>,
      <abs ABSG = 5 
       data hash MD5: 64K
       73 C4 92 67 4E AE 4E D8 AB 17 14 BC 9A B3 A2 A2>)
(   5,<2019-02-05 16:03:46.98 +0400>,<she>,<DPX200>,
      <pk PHC0 = -1.599466 PHC1 = 0 
       data hash MD5: 64K
       E0 CA 20 8C 68 ED 87 F3 38 9A B8 95 E7 43 D6 65>)
(   6,<2019-02-05 16:03:57.93 +0400>,<she>,<DPX200>,
      <abs ABSG = 5 
       data hash MD5: 64K
       0B 53 62 86 45 67 1A CC 39 9D 81 15 04 16 E0 D6>)
$$ ##END=
$$ 
$$ hash MD5
$$ 42 D3 1E 35 E0 8B 7C 82 67 60 32 2E CA BB C8 B0
##$RELAX= 
##$RELAX= 
##$RELAX= 
##$RELAX= 
##$RELAX= 
##$RELAX= 
##$RELAX= 
##$RELAX= 
$$ Bruker specific parameters
$$ --------------------------
##$DU= <F:/spectra>
##$EXPNO= 1
##$NAME= <P31>
##$PROCNO= 1
##$TYPE= <nmr>
##$USER= <she>
##$AMP= (0..31)
100 100 100 100 100 100 100 100 100 100 100 100 100 100 100 100 100 100 
100 100 100 100 100 100 100 100 100 100 100 100 100 100 
##$AQSEQ= 0
##$AQ_mod= 1
##$AUNM= <au_zg>
##$AUTOPOS= <>
##$BF1= 81.014009
##$BF2= 200.13
##$BF3= 200.13
##$BF4= 200.13
##$BF5= 200.13
##$BF6= 200.13
##$BF7= 200.13
##$BF8= 200.13
##$BYTORDA= 1
##$CFDGTYP= 0
##$CFRGTYP= 5
##$CHEMSTR= <none>
##$CNST= (0..31)
1 1 145 1 1 1 1 1 1 1 1 1 1 1 1 1 1 1 1 1 1 1 1 1 1 1 1 1 1 1 1 1 
##$CPDPRG= <waltz16>
##$CPDPRG1= <>
##$CPDPRG2= <waltz16>
##$CPDPRG3= <>
##$CPDPRG4= <mlev>
##$CPDPRG5= <mlev>
##$CPDPRG6= <mlev>
$$ [...]
##$SUBNAM3= <"">
##$SUBNAM4= <"">
##$SUBNAM5= <"">
##$SUBNAM6= <"">
##$SUBNAM7= <"">
##$SUBNAM8= <"">
##$SUBNAM9= <"">
##$SW= 369.568048894756
##$SWIBOX= (0..15)
0 1 3 0 0 0 0 0 0 0 0 0 0 0 0 0 
##$SW_h= 29940.119760479
##$TD= 32768
##$TD0= 1
##$TE= 0
##$TE2= 300
##$TE3= 300
##$TEG= 300
##$TL= (0..7)
0 120 53 12 22 120 120 120 
##$TP= (0..7)
150 150 150 150 150 150 150 150 
##$TP07= 0
##$TPNAME0= <>
##$TPNAME1= <>
##$TPNAME2= <>
##$TPNAME3= <>
##$TPNAME4= <>
##$TPNAME5= <>
##$TPNAME6= <>
##$TPNAME7= <>
##$TPOAL= (0..7)
0.5 0.5 0.5 0.5 0.5 0.5 0.5 0.5 
##$TPOFFS= (0..7)
0 0 0 0 0 0 0 0 
##$TUNHIN= 0
##$TUNHOUT= 0
##$TUNXOUT= 0
##$USERA1= <user>
##$USERA2= <user>
##$USERA3= <user>
##$USERA4= <user>
##$USERA5= <user>
##$V9= 5
##$VALIST= <valist>
##$VCLIST= <CCCCCCCCCCCCCCC>
##$VD= 0
##$VDLIST= <DDDDDDDDDDDDDDD>
##$VPLIST= <PPPPPPPPPPPPPPP>
##$VTLIST= <TTTTTTTTTTTTTTT>
##$WBST= 1024
##$WBSW= 4
##$XGAIN= (0..3)
0 0 0 0 
##$XL= 0
##$YL= 0
##$YMAX_a= 45912
##$YMIN_a= -49189
##$ZGOPTNS= <>
##$ZL1= 120
##$ZL2= 120
##$ZL3= 120
##$ZL4= 120
##$ABSF1= 182.463
##$ABSF2= -187.1042
##$ABSG= 5
##$ABSL= 3
##$ALPHA= 0
##$AQORDER= 0
##$ASSFAC= 0
##$ASSFACI= 0
##$ASSFACX= 0
##$ASSWID= 0
##$AUNMP= <proc_1d>
##$AZFE= 0.1
##$AZFW= 0.5
##$BCFW= 0
##$BC_mod= 2
##$BYTORDP= 0
##$COROFFS= 0
##$CY= -3
##$DATMOD= 1
##$DC= 0
##$DFILT= <>
##$DTYPP= 0
##$F1P= 0
##$F2P= 0
##$FCOR= 1
##$FTSIZE= 65536
##$FT_mod= 6
##$GAMMA= 0
##$GB= 0
##$INTBC= 1
##$INTSCL= 5.30512e-09
##$ISEN= 30
##$LB= 1
##$LEV0= 0
##$LPBIN= 0
##$MAXI= 10000
##$MC2= 0
##$MEAN= 0
##$ME_mod= 0
##$MI= 50
##$NCOEF= 0
##$NC_proc= -3
##$NLEV= 6
##$NOISF1= 182.463
##$NOISF2= 159.3651
##$NSP= 0
##$NTH_PI= 0
##$NZP= 0
##$OFFSET= 182.463
##$PC= 4
##$PHC0= -1469.205
##$PHC1= 113.399
##$PH_mod= 1
##$PKNL= yes
##$PPARMOD= 0
##$PSCAL= 0
##$PSIGN= 0
##$REVERSE= no
##$SF= 81.0140089999434
##$SI= 65536
##$SIGF1= 159.3651
##$SIGF2= -187.1042
##$SINO= 113.3802
##$SIOLD= 16384
##$SREGLST= <1H.CDCl3>
##$SSB= 0
##$STSI= 65536
##$STSR= 0
##$SW_p= 29940.119760479
##$SYMM= 0
##$S_DEV= 0
##$TDeff= 32768
##$TDoff= 0
##$TI= <>
##$TILT= no
##$TM1= 0
##$TM2= 0
##$TOPLEV= 0
##$USERP1= <user>
##$USERP2= <user>
##$USERP3= <user>
##$USERP4= <user>
##$USERP5= <user>
##$WDW= 1
##$XDIM= 65536
##$YMAX_p= 370252615
##$YMIN_p= -4313976
$$ End of Bruker specific parameters
$$ ---------------------------------
##NTUPLES= NMR SPECTRUM
##VAR_NAME=  FREQUENCY,     SPECTRUM/REAL,   SPECTRUM/IMAG
##SYMBOL=    X,             R,               I
##VAR_TYPE=  INDEPENDENT,   DEPENDENT,       DEPENDENT
##VAR_FORM=  AFFN,          ASDF,            ASDF
##VAR_DIM=   65536,         65536,           65536
##UNITS=     HZ,            ARBITRARY UNITS, ARBITRARY UNITS
##FACTOR=    0.456856943014862, 1,           1
##FIRST=     14782.0589164792, 0,            0
##LAST=      -15158.0608439998, 0,           0
##MIN=       -15158.0608439998, -4313976,    0
##MAX=       14782.0589164792, 370252615,    0
$$ Real data points
##PAGE= N=1
##DATA TABLE= (X++(R..R)), XYDATA
$$ [...]
42503c67686j05898j07275l1211R0903J55048O3251j38124k34518o2270K52975
$$ -367686 -473584 -580859 -612070 -521167 -366119 -302868 -440992 -675510 -737780 -484805
42493d84805M01894K61345K8598n9721N70P1929R5744R4066N4127m3373j35515
$$ -484805 -82911 178434 207032 147311 147881 219810 315554 409620 463747 420374 284859
42482B84859j40602p7024k5740j5245k2680l6223m1254q283L4591K227r5225j07965
$$ 284859 144257 67233 41493 26248 3568 -32655 -73909 -82192 -47601 -45374 -140599 -248564
42470b48564L7515J89466J74499M9255o320M3060R4512J00646P7634o091j57148
$$ -248564 -211049 -21583 152916 202171 195851 238911 333423 434069 511703 505612 348464
42459C48464k42302j54323k8605o4139j86842j56334K8899J34843R9495J03089
$$ 348464 106162 -48161 -76766 -140905 -327747 -484081 -455182 -320339 -220844 -117755
42449a17755J79805J18925j18370k36806o4261J45902J23719J0282O9204K08403
$$ -117755 62050 180975 62605 -174201 -238462 -92560 31159 41441 110645 319048
42439C19048J53384n9372j44815m7531J3261m2342n4264K6909K6119j23677k28112
$$ 319048 472432 413060 268245 220714 233975 191633 137369 164278 190397 66720 -161392
42428a61392j41470J3339P3039O6218O8577K8041q5874j27513J9851K00000J64617
$$ -161392 -302862 -289523 -216484 -150266 -81689 -53648 -139522 -267035 -247184 -47184 117433
42417A17433o0442k01057j19965J7624J2596q8561q4877Q5243K51138K15231j6579
$$ 117433 56991 -144066 -264031 -246407 -233811 -322372 -407249 -322006 -70868 144363 127784
42406A27784k51840l27845k44749q2897J08059K68558K84871J31129p348N9842
$$ 127784 -124056 -451901 -696650 -779547 -671488 -402930 -118059 13070 5722 65564
42396F5564K18665J70445j06260k72881j25316R1902P5000o8199l9004J21756
$$ 65564 284229 454674 348414 75533 -49783 42119 117119 48920 9916 131672
42386A31672J02036j28289k32339n1813J29131L8940j66200j78697n43J37680
$$ 131672 233708 105419 -126920 -178733 -49602 -10662 -176862 -355559 -356102 -218422
42376b18422J52714J27295O9696n8834j42701k6664J85679K23557N1580q8704
$$ -218422 -65708 61587 131283 72449 -70252 -96916 88763 312320 363900 275196
42366B75196p4058n3588j29784j71626q0919J6103J2748J5758R8363R7037r7364
$$ 275196 201138 147550 17766 -153860 -234779 -218676 -205928 -190170 -91807 5230 -92134
42355i2134k59458j40512J09390J66866N6281O8638K28128K52506O3057p7615
$$ -92134 -351592 -492104 -382714 -215848 -159567 -90929 137199 389705 452762 375147
42345C75147l0039J0681q2534j26310L931J04124N067r6745J4487J53988K8519
$$ 375147 345108 355789 273255 146945 150876 255000 260067 163322 177809 331797 360316
42334C60316k38224k70324l1920J35992M9598j03835j18857k7491O0680J14264
$$ 360316 122092 -148232 -180152 -44160 5438 -98397 -217254 -244745 -184065 -69801
42324f9801J12670M1418j0859L9348P0252q5519k89357k19460J10122K96629J29220
$$ -69801 42869 84287 73428 112776 183028 97509 -191848 -411308 -301186 -4557 124663
42313A24663j16168j34230j4481K6813L7566J47978K36138J21829o8387q0718
$$ 124663 8495 -125735 -140216 -113403 -75837 72141 308279 430108 361721 281003
42303B81003L3610K1813j07943j09915K1854K002k31953l37468r0607K23376K09722
$$ 281003 314613 336426 228483 118568 140422 142424 -89529 -426997 -517604 -294228 -84506
42292h4506o4722k00962m8159J51311J74482R3432O8118Q4324L5021o6541j04566
$$ -84506 -149228 -350190 -398349 -247038 -72556 20876 88994 173318 208339 141798 37232
42281C7232m0709M5788Q4924Q2684N4893j2597j02637j38968p3075M5174J27396
$$ 37232 -3477 42311 127235 209919 264812 252215 149578 10610 -62465 -17291 110105
42270A10105J37325Q7212K030o4101m7997J2688k7151k04809l13429j52036J41031
$$ 110105 247430 334642 336672 272571 224574 237262 210111 5302 -308127 -460163 -319132
42259c19132K26502M3447j00020L005J54803R5455p0282n2597J40906K03078j789
$$ -319132 -92630 -49183 -149203 -146198 8605 104060 33778 -18819 122087 325165 323376
42248C23376k36344k38465o5797L5233k3034r7450m8704P1735J05690J1605o3393
$$ 323376 87032 -151433 -217230 -181997 -205031 -302481 -351185 -279450 -173760 -162155 -225548
42237b25548K6333K05336K47331P6010j25547j66844q8329m1378m1130P227J02070
$$ -225548 -199215 6121 253452 329462 203915 37071 -51258 -92636 -133766 -126539 -24469
42226b4469J33982O3010l6864j04203j33568j04668k307R5823Q5416l882m1679
$$ -24469 109513 172523 135659 31456 -102112 -206780 -209087 -113264 -27848 -31730 -73409
42215g3409N097M0218J0623l3312o8406j35635k06251j65113N550J62448J98037
$$ -73409 -68312 -28094 -17471 -50783 -119189 -254824 -461075 -626188 -620638 -458190 -260153
42204b60153J76494J89244J94223J06227m2238j41380j49867j12817p9783p1646
$$ -260153 -83659 105585 299808 406035 363797 222417 72550 -40267 -120050 -191696
42194a91696q1386n6853N2447J81162J68853k3074j96905j36265J05823K59170
$$ -191696 -273082 -329935 -277488 -96326 72527 49453 -147452 -283717 -177894 81276
42184H1276J74154n417m8909O0588J15057l5380k64536l02901p1218K09596K81215
$$ 81276 255430 250013 201104 261692 376749 341369 76833 -226068 -297286 -87690 193525
42173A93525J35760l7390j16677j39034j63187j78236j56324r0279K6696J64268
$$ 193525 329285 291895 175218 36184 -127003 -305239 -461563 -551842 -525146 -360878
42163c60878K12059Q8671j12388k05330j36092l663J17344K18448K39181J06113
$$ -360878 -148819 -60148 -172536 -377866 -513958 -517621 -400277 -181829 57352 163465
42153A63465q3484j19305K2723J31441P8347j5076j4329K9610L2495K8302L7334
$$ 163465 79981 -39324 -16601 114840 193187 178111 163782 193392 225887 254189 291523
42142B91523k0782j35721j29414N5711J91527R3796p3855o7064M3369K7625q7737
$$ 291523 270741 135020 5606 61317 252844 346640 272785 205721 249090 276715 188978
42131A88978q0546O3961J30287L5427p6771j11219j20984j12061j3752J15142
$$ 188978 108432 172393 302680 338107 261336 150117 29133 -82928 -96680 18462
42121A8462J02867n1848j43711p3263K3307K3525j7295k4887j8610R278J08968
$$ 18462 121329 69481 -74230 -147493 -124186 -100661 -117956 -142843 -161453 -152175 -43207
42110d3207J85806L8753k90117m44760k10281J63661K95505J59288J9974J5352
$$ -43207 142599 181352 -108765 -553525 -763806 -600145 -304640 -145352 -125378 -110026
42100a10026M8101K8624o163j3295q600p13J6038J1907l1745n7881j9528J7297
$$ -110026 -61925 -33301 -39464 -52759 -61359 -62072 -46034 -34127 -65872 -123753 -143281 -125984
42088a25984k4383p8827l0669P1651O1746p9018j65578o7669J12946J95835J45023
$$ -125984 -150367 -229194 -259863 -188212 -126466 -205484 -371062 -438731 -325785 -129950 15073
42077A5073N4979l475k5786j2676L0571M6987k4856j38180j55158k5699J14615
$$ 15073 70052 66577 40791 28115 58686 105673 80817 -57363 -212521 -238220 -123605
42066a23605J04776j7115n4081P3469K05123J60442r837r7990j4300J26482J74245
$$ -123605 -18829 -35944 -90025 -16556 188567 349009 339172 241182 226882 353364 527609
42055E27609Q9349p7043k36813k81582j52371O3028J77449R1046j13605k65993
$$ 527609 616958 539915 303102 21520 -130851 -67823 109626 200672 87067 -178926
42045a78926k41619k7447K46042L49850J62478j44752k51751o0345J93847K43467
$$ -178926 -420545 -447992 -201950 147900 310378 165626 -86125 -146470 47377 290844
42035B90844Q2762r8569j52903o7498P6102J53454R1749k8418o0531j7478o3423
$$ 290844 373606 275037 122134 54636 130738 284192 375941 347523 286992 269514 206091
42024B06091k17764k58243n7528J65321J38497n0362q6860R3404K30236J48481
$$ 206091 -11673 -269916 -327444 -162123 -23626 -73988 -160848 -67444 162792 311273
42014C11273j1273m6589K8938P7967O1566L9685L9985M1323L6080J8996m5489
$$ 311273 300000 253411 282349 360316 421882 461567 501552 542875 578955 597951 552462
42003E52462j61580k34880j55605L9972J61984O8412j53298k62695j36182Q9321
$$ 552462 390882 156002 397 40369 202353 270765 117467 -145228 -281410 -192089
41993a92089J81774Q0767o6228j04547k1664R3467J41064N8289j14323k06662
$$ -192089 -10315 70452 4224 -100323 -121987 -28520 112544 170833 56510 -150152
41983a50152r0747J03547J09042r5987k24494r9902P8506O3332m9943r865J58709
$$ -150152 -240899 -137352 -28310 -124297 -348791 -448693 -370187 -306855 -356798 -366663 -207954
41972b07954K06611P7123k9567l812M2442K7338K2146N8464M8290k2920m0091
$$ -207954 -1343 75780 46213 42401 84843 112181 134327 192791 241081 218161 178070
41961A78070J9561K3025o1685o5541R0389K08669R1864j56487k83494k10086l6528
$$ 178070 197631 220656 158971 93430 183819 392488 484352 327865 44371 -165715 -202243
41950b02243J50982K97513L02523J20599j09142j95245j22759k8225j990l7237
$$ -202243 -51261 246252 548775 669374 560232 364987 242228 214003 212013 174776
41940A74776j10152j77507j50269K744J75735K55098K46598J70388l2169l17982
$$ 174776 64624 -112883 -263152 -260408 -84673 170425 417023 587411 555242 237260
41930B37260m17444j46676K44535L28072P0492j50749j13480j822p488k1696Q3932
$$ 237260 -180184 -326860 -82325 245747 316239 165490 52010 50188 42700 21004 104936
41919A04936J53367q126k68185l28662j51139L8839J18150J82940K94027L31634
$$ 104936 258303 250177 -18008 -346670 -497809 -458970 -340820 -157880 136147 467781
41909D67781J75677j08217l24594l15675p7682K00995K53669J7736k24213j46937
$$ 467781 643458 535241 210647 -105028 -182710 18285 271954 289690 65477 -81460
41899h1460J79697L50392J64214j10576j33797L7253Q1928r2664k44156j76420
$$ -81460 98237 448629 612843 502267 368470 405723 487651 394987 150831 -25589
41889b5589j529O5406O703l8322j8209j6701p5750j15297o9157O686L1359K7119
$$ -25589 -27118 38288 44991 6669 -11540 -28241 -103991 -219288 -288445 -281759 -250400 -223281
41877b23281N8961R7012N3677n4805j08425o9732m3335q6664q7418N6161K31167
$$ -223281 -164320 -67308 -13631 -68436 -176861 -246593 -289928 -376592 -464010 -407849 -176682
41866a76682K39208P8906o1013p1002j7138L4392J05272J71892J29086k3827j29086
$$ -176682 62526 141432 80419 9417 -7721 26671 131943 303835 432921 409094 280008
41855B80008j16793j36918k88378l79779j88743J47832K76325J28377l956O4274
$$ 280008 163215 26297 -262081 -641860 -830603 -682771 -406446 -278069 -282025 -217751
41845b17751J54155O3838q2335m1434J49875K30892J03280p0123j46042j64026
$$ -217751 -63596 242 -82093 -123527 26348 257240 360520 290397 144355 -19671
41835a9671j79051j24342M3893J98728J86232N0991k5142J3790L9795l3011j08190
$$ -19671 -198722 -323064 -279171 -80443 105789 156780 131638 145428 185223 152212 44022
41824D4022p5018k995l4331j40611j46307R56J39920J29245L2824j8668l1018
$$ 44022 -30996 -33991 -68322 -208933 -355240 -354284 -214364 -85119 -52295 -70963 -101981
41813a01981q4698j56713j51512o4074K6893R4952J54628J49154K0646j15861
$$ -101981 -186679 -343392 -494904 -558978 -532085 -437133 -282505 -133351 -112705 -228566
41803b28566o6481J32587K03034J6164j91538j43297Q7123K00118R4301m3536
$$ -228566 -295047 -162460 40574 56738 -134800 -278097 -190974 9144 103445 59909
41793E9909m7333L0430O7402N0594K2419l2466j30887j83049o9908J61038K84481
$$ 59909 12576 43006 110408 161002 183421 150955 20068 -162981 -232889 -71851 212630
41782B12630J52386r6987j83768l2069J40789J19145m3145j41033j03537k0954
$$ 212630 365016 268029 84261 52192 192981 312126 268981 127948 24411 3457
41772C457M7233J19191J62363R5553n2315j38833j02690k6299K2526O3718R4688
$$ 3457 50690 169881 332244 427797 375482 236649 133959 107660 130186 193904 288592
41761B88592P7334P2072J90361L53270L14052K0639k63483l26373k68249k41582
$$ 288592 365926 437998 628359 981629 1295681 1316320 1052837 726464 458215 216633
41751B16633j83936l2921L7181j07408k42924r7481J62536J45184j36826k61997
$$ 216633 32697 -224 36957 -70451 -313375 -410856 -248320 -103136 -239962 -501959
41741e01959m6329K07186K09401P7407N6135J36995J59482Q5095k3745j44242
$$ -501959 -548288 -341102 -131701 -54294 1841 138836 298318 383413 359668 215426
41731B15426k46197k33277q0247P6628J11915P5358P4153R1407M0224p4926j56913
$$ 215426 -30771 -264048 -344295 -267667 -155752 -80394 -6241 85166 125390 50464 -106449
41720a06449j33999j8554J05331J27894J7770j07581j01739J9136J05735Q5334
$$ -106449 -240448 -259002 -153671 -25777 -8007 -115588 -217327 -198191 -92456 -7122
41710g122K0902k0661j9017N1424J58905J46655o1161k38302j18339J51283J65721
$$ -7122 13780 -6881 -25898 25526 184431 331086 269925 31623 -86716 64567 230288
41699B30288r7573k05026M2198K80059J85359r714L6588J67037J7372l19565m16102
$$ 230288 132715 -72311 -30113 249946 435305 425591 462179 629216 646588 327023 -89079
41688h9079j84870L8577N8517K6639N6545M0313n4507o0121Q3495J86285J14540
$$ -89079 -273949 -235372 -176855 -150216 -93671 -53358 -107865 -167986 -84491 101794 216334
41677B16334p254l7493l4454q2257r9244O038J32416J13937l2892j31534p6452
$$ 216334 209080 171587 137133 54876 -44368 -38330 94086 208023 175131 43597 -32855
41666c2855N2859R5076j3838j56999j60028l0068K0215j14710k21511n9891K35049
$$ -32855 20004 115080 101242 -55757 -215785 -245853 -225638 -340348 -561859 -621750 -386701
41655c86701L13543J38497L4473J58443K49866O2691k31912l00274j16856N3012
$$ -386701 -73158 65339 99812 258255 508121 570812 338900 38626 -78230 -25218
41645b5218L2109j06609j92282j19413Q4943K50322J99228j7789j38994l8343
$$ -25218 6891 -99718 -292000 -411413 -326470 -76148 123080 105291 -33703 -72046
41635g2046R6657O4081n1787p1063m1141j06623j76666m0698K20631K76131M9539
$$ -72046 24611 88692 36905 -34158 -75299 -181922 -358588 -399286 -178655 97476 147015
41624A47015j30613j9045J79170J31438j29015k74305j45478Q5561J92438J44527
$$ 147015 16402 -2643 176527 307965 178950 -95355 -240833 -155272 37166 181693
41614A81693O0278M4148J03733J52660R4550l9038q2733L8573J46149K1303k49951
$$ 181693 241971 286119 389852 542512 637062 598024 515291 553864 700013 721316 471365
41603D71365l42220j32048J25639J52452n380j22488j30162j17834j07316m3966
$$ 471365 129145 -2903 122736 275188 269808 147320 17158 -100676 -207992 -251958
41593b51958L2103J7570n5631m9020M1543P0296L226r926R7208J65949O2186r6860
$$ -251958 -219855 -202285 -257916 -306936 -265393 -195097 -191871 -201797 -104589 61360 123546 26686
41581B6686j18191j3430N5006K0263n2561j14520j62695j53486l1423J49864K45578
$$ 26686 -91505 -104935 -49929 -29666 -82227 -196747 -359442 -512928 -544351 -394487 -148909
41570a48909J81481L4986n3697j7542P9115J05277J6375p1561l0788Q5193J24763
$$ -148909 32572 67558 13861 -3681 75434 180711 197086 125525 94737 179930 304693
41559C04693R2854J30347K15592J31102j64530l76585k69385j7051O2021m3993
$$ 304693 397547 527894 743486 874588 710058 333473 64088 47037 109058 65065
41549F5065r7626M009J46650K13075J65421M648j60086j31113Q1778J59735p1081
$$ 65065 -32561 -28552 118098 331173 496594 501242 341156 210043 291821 451556 380475
41538C80475k91242j47291J37230P6624k69767l55405j8639K76718K07199M5671
$$ 380475 89233 -58058 79172 155796 -113971 -469376 -488015 -211297 -4098 41573
41528D1573J03265K06747P8382j49999j86731o1273Q783P007L3096K7064q3200
$$ 41573 144838 351585 429967 279968 93237 31964 40747 47754 80850 107914 24714
41517B4714j30457N1101K70887K15291o0683k16347j41098n4254j02712j69296
$$ 24714 -105743 -54642 216245 431536 370853 154506 13408 -40846 -143558 -312854
41507c12854j19476J2614J32014J83039J23240l0010j35575q2813J8193j3665
$$ -312854 -432330 -419716 -287702 -104663 18577 -11433 -147008 -229821 -211628 -225293
41497b25293j28235j09274O9219J85629J07518k6583l7212N2250R1768J2930j11298
$$ -225293 -353528 -462802 -393583 -207954 -100436 -127019 -164231 -111981 -20213 -7283 -118581
41486a18581j50905l8679J42983K17796J20085j5174m9970l7305q5635j29260
$$ -118581 -269486 -308165 -165182 52614 172699 157525 107555 70250 -15385 -144645
41476a44645k7197J65170K38826J38872K7967K3357N7835M0195j7663q5094j70869
$$ -144645 -171842 -6672 232154 371026 398993 422350 480185 520380 502717 417623 246754
41465B46754k38291j97148m6275Q3413Q7270N323n4760l7323L9781J11063J01837
$$ 246754 8463 -188685 -234960 -151547 -64277 -58954 -113714 -151037 -111256 -193 101644
41454A01644O537q0452p3879l859N2074P6348O3925l5521j95370k33204l3982
$$ 101644 108181 27729 -46150 -50009 2065 78413 142338 106817 -88553 -321757 -355739
41443c55739K27816K93225J78081R6194Q3917j2558j84046k13108n1431O2472
$$ -355739 -127923 165302 343383 439577 523494 510936 326890 113782 62351 124823
41433A24823j4134j09422o2856l508q5161j70400n1170J69164K05126K5270j16739
$$ 124823 110689 1267 -61589 -65097 -150258 -320658 -371828 -202664 2462 27732 -89007
41422h9007p2044L2143M4153p387l6465n1661p8428n6310O1889J85582J89247
$$ -89007 -161051 -128908 -84755 -92142 -128607 -180268 -258696 -315006 -253117 -67535 121712
41411A21712J04320P5800J20217P2653j42948l17888k02456J04168K23505P981
$$ 121712 226032 301832 422049 494702 351754 33866 -168590 -64422 159083 167064
41401A67064k30170j44470J58319K73206N5635k15693k40517m9563J14413J15117
$$ 167064 -63106 -207576 -49257 223949 279584 63891 -176626 -226189 -111776 3341
41391C341K4629j6882L1150O9414j4278j71052k20073j04644p81n1031j19463
$$ 3341 27970 11088 42238 111652 97374 -73678 -293751 -398395 -399176 -450207 -569670
41380e69670n716J97714K17542L1326q9270O339J55057J76065J15040Q3006O0962
$$ -569670 -575386 -377672 -160130 -128804 -218074 -211735 -56678 119387 234427 317433 378395
41369C78395p020r1024j54402k06008j96200l8460J81228K21185K9077j34325
$$ 378395 371375 280351 125949 -80059 -276259 -314719 -133491 87694 116771 -17554
41359a7554o6314P9833N3360j10950j86776j05983R544Q1353J25450J19511J6916
$$ -17554 -83868 -4035 49325 -61625 -248401 -354384 -344840 -263487 -138037 -18526 -1610
41348a610j19621j55406n4065R5529J94644J90603P7677o3826r9785p026P9127
$$ -1610 -121231 -276637 -330702 -235173 -40529 150074 227751 163925 64140 57114 136241
41337A36241P1662O4443J35608J61212Q320k00254k34111r9666j0108m4503o8123
$$ 136241 207903 272346 407954 569166 577486 377232 143121 43455 33347 -11156 -79279
41326g9279j034N8850L9505K9704J13255K02569J45037o9610k80550l09577j26722
$$ -79279 -80313 -21463 18042 47746 161001 363570 508607 438997 158447 -151130 -277852
41315b77852J11202K04167J21622K0562R772l274j27999k57737j90795O4402K81427
$$ -277852 -166650 37517 159139 179701 189473 186199 58200 -199537 -390332 -325930 -44503
41304d4503L01419J66821j8429j85465k46753j34401N5588J23433L2529m3723
$$ -44503 256916 423737 405308 219843 -26910 -161311 -105723 17710 50239 6516
41294F516j1008q213j49348k78464j70958J15759K93693K16590K1540j04682j28428
$$ 6516 -4492 -12705 -162053 -440517 -611475 -495716 -202023 14567 36107 -68575 -197003
41283a97003r5144j2943R4112J29972M0538q1998j13257o0783q423M2050J31249
$$ -197003 -292147 -305090 -210978 -81006 -40468 -122466 -235723 -296506 -304929 -262879 -131630
41272a31630J87352R7762n9288o7340Q1625J19819q5909k78154j72729J05312
$$ -131630 55722 153484 94196 26856 108481 228300 142391 -135763 -308492 -203180
41262b03180K19426J27161P4998J50534J77472P1471k6691m4176r6977k10791
$$ -203180 16246 143407 218405 368939 546411 617882 591191 547015 450038 239247
41252B39247k11358m0580Q1705j0488j63474j56433j9493Q4574J06652N6442j03179
$$ 239247 27889 -12691 69014 58526 -104948 -261381 -280874 -196300 -89648 -33206 -136385
41241a36385l05144l14404m5668K25477K12295K2665m2168M8763Q2786o225p2758
$$ -136385 -441529 -755933 -801601 -576124 -363829 -341164 -383332 -334569 -251783 -258008 -330766
41230c30766m0616J8419O7961J38358J92186J60258Q3654M3058Q096o5460q7912
$$ -330766 -371382 -352963 -285002 -146644 45542 205800 289454 332512 340608 275148 187236
41219A87236O206P0811l0130j35528k4870J60292R5687j69745k37248K0032K48711
$$ 187236 193442 264253 234123 98595 73725 234017 329704 159959 -77289 -57257 191454
41208A91454J52819r8174j75508l8943J14135J52476Q8369j1273n8444K211R1147
$$ 191454 344273 246099 70591 31648 145783 298259 386628 375355 316911 319122 410269
41197D10269O0425q6664j76631j10200J5715P0634L4229n3947j46615j67037p3939
$$ 410269 470694 384030 207399 97199 112914 183548 217777 163830 17215 -149822 -223761
41186b23761M3082O8308L7810N9654J05571P1329j0441l6248m9278j38750j88422
$$ -223761 -180679 -112371 -74561 -14907 90664 161993 151552 115304 66026 -72724 -261146
41175b61146k9319K01638K02728k647r1728J9011O7409m9774r4126N2782J61713
$$ -261146 -290465 -88827 113901 111254 19526 38537 105946 56172 -37954 14828 176541
41164A76541Q3307J3588J03129J62531J4303j86301k38428j97520j49290r505
$$ 176541 259848 273436 376565 539096 553399 367098 128670 -68850 -218140 -227645
41154b27645J92876J85704q9490k48384m3483J87744P3959j42144k6627K59714
$$ -227645 -34769 150935 61445 -186939 -230422 -42678 31281 -110863 -137490 122224
41144A22224K07206j66962l23249o1881K16292J96591O1426M7492N6278n4312
$$ 122224 329430 162468 -160781 -222662 -6370 190221 251647 299139 355417 301105
41134C01105j45922l9215J51803J67552l7360k49255k50005m2871J35425N2732
$$ 301105 155183 115968 267771 435323 397963 148708 -101297 -144168 -8743 43989
41124D3989k01757k52057O7691M04070L21254q0011l05834j64502N2186R2729
$$ 43989 -157768 -409825 -342134 61936 383190 303179 -2655 -167157 -114971 -22242
41114b2242O4417J19130J61406N1319j45459k81880l20623k69630j03626J24136
$$ -22242 42175 161305 322711 374030 228571 -53309 -373932 -643562 -747188 -623052
41104f23052K51014K05503J03412N3365J4511n7557p8597K3645J51194J46595
$$ -623052 -372038 -166535 -63123 -9758 4753 -52804 -131401 -107756 43438 190033
41094A90033k911j64394k17868j53875m2543N5668J40495K07521J59472q4057
$$ 190033 187122 22728 -195140 -349015 -391558 -335890 -195395 12126 171598 87541
41084H7541l55442l29013K0848K80943J52922p6948L8783L90814M61042J25028
$$ 87541 -267901 -596914 -576066 -295123 -142201 -219149 -180366 210448 671490 796518
41074G96518j77174j36423J8986k2853j91272k46991j57602l3935O7673R0274
$$ 796518 619344 482921 501907 479054 287782 40791 -116811 -150746 -83073 7201
41064G201m6830k45842k41207J5320K22224J60683N064o536M9032q145j00082
$$ 7201 -39629 -285471 -526678 -511358 -289134 -128451 -123387 -129923 -80891 -89036 -189118
41053a89118m7322P9799P8216k5304k1568J29610K52699K31003J13952k4096j49477
$$ -189118 -236440 -156641 -78425 -103729 -125297 4313 257012 488015 601967 577871 428394
41042D28394k18580k11004j79137j56156r4162L755K0256p1936r6204O0099K18309
$$ 428394 209814 -1190 -180327 -336483 -430645 -426890 -406634 -478570 -574774 -514675 -296366
41031b96366J65575l017n4205j0498p7253k37985k39348K428K60673L25524K41207
$$ -296366 -130791 -133808 -188013 -198511 -275764 -513749 -753097 -750669 -489996 -164472 76735
41020G6735J46270Q1801M5786O6407J22378J17399J7940q4729j15081j20583j70084
$$ 76735 223005 304806 350592 416999 539377 656776 674716 589987 474906 354323 184239
41009A84239k20078j58990M0277K56505L18014J75054k9983j12129o4286m2280
$$ 184239 -35839 -194829 -154552 101953 419967 595021 565038 452909 388623 346343
40999C46343j14463j61248r3163k0686p8186j99833k26924j46905o1494R150J16005
$$ 346343 231880 70632 -22531 -43217 -121403 -321236 -548160 -695065 -756559 -747409 -631404
40988f31404K22772K29662J37336M4851K930j0964q944m51l1848j04080j23219
$$ -631404 -408632 -178970 -41634 3217 6147 -4817 -13761 -14212 -46060 -150140 -273359
40977b73359n2570j1770p6592j04168M6308K37922K41441R7819K0655J4072r0949
$$ -273359 -325929 -337699 -414291 -518459 -472151 -234229 7212 105031 125686 139758 48809
40966D8809k49909k14475K3129J51573K6436r1229M0274K59494K62318L2465k11936
$$ 48809 -201100 -415575 -392446 -240873 -214437 -305666 -265392 -5898 256420 288885 76949
40955G6949l34729l27789j79662P4769K61160K29867O6399k5678o1K7558r01k2628
$$ 76949 -257780 -585569 -765231 -690462 -429302 -199435 -133036 -158714 -158775 -131217 -132118 -154746
40943a54746R862O8676J21851J53029J19240q126j63849k37701k01393j20805
$$ -154746 -144884 -76208 45643 198672 317912 309786 145937 -91764 -293157 -413962
40933d13962n9400l4056l8746l8133L4687J89054L03342K37086K3209j45503j51920
$$ -413962 -473362 -507418 -546164 -584297 -549610 -360556 -57214 179872 203081 57578 -94342
40922i4342q6874q2382r3478K5709K42197L05189Q1652j99348k14069J0661J47096
$$ -94342 -181216 -263598 -357076 -331367 -89170 216019 297671 98323 -115746 -105085 42011
40911D2011N9451l1618K7610M1411j66958l64908k26834J22394K66350J24047
$$ 42011 101462 69844 97454 138865 -28093 -393001 -619835 -497441 -231091 -107044
40901a07044R195O2481N9077j12860k02925l6575J54432J09421m0443l0012Q8051
$$ -107044 -97849 -35368 23709 -89151 -292076 -328651 -174219 -64798 -105241 -135253 -47202
40890d7202P6867n5592r4050j054M1898m5269j37116j21515j8495J13115K14326
$$ -47202 29665 -25927 -119977 -121031 -79133 -124402 -261518 -383033 -401528 -288413 -74087
40879g4087J99395N9342n0196K715J06045O5344p3317r4257K0903N6201p5818
$$ -74087 125308 184650 134454 137169 243214 308558 235241 140984 161887 218088 142270
40868A42270j83260r8773P0703J24361N0724m987L0212Q2307N7602l1265p8753
$$ 142270 -40990 -139763 -69060 55301 106025 101038 131250 213557 271159 239894 161141
40857A61141j9439O3202K1205j37163k11730q0053J03596J14546k3630r7436k5439
$$ 161141 141702 204904 226109 88946 -122784 -202837 -99241 15305 -8325 -105761 -131200
40846a31200O4578O2820N080l1523r140Q9862K19689K33871N0651j76512k31250
$$ -131200 -66622 -3802 1278 -30245 -39385 50477 270166 504037 554688 378176 146926
40835A46926j39614r8351j37457j07235N789L9168k5902o536J26200J36786p6721
$$ 146926 7312 -91039 -228496 -335731 -329942 -290774 -316676 -323212 -197012 -60226 -136947
40824a36947k55562j55400Q8683J98781J52474J00819O3296k4157q3049M852J40180
$$ -136947 -392509 -547909 -459226 -260445 -107971 -7152 56144 31987 -51062 -46210 93970
40813I3970J15869m9183j29580m0797N7226K6714p2679j19385q4804n682P6061
$$ 93970 209839 160656 31076 -9721 47505 74219 1540 -117845 -202649 -208331 -132270
40802a32270J06240M8342m7537p7490m535R8200J20775J2714j51518j96531k8475
$$ -132270 -26030 22312 -25225 -102715 -107250 -9050 111725 124439 -27079 -223610 -252085
40791b52085J92488K06937K0928q2394J8945Q5734o9872k33498j30371R8913J22803
$$ -252085 -59597 147340 168268 85874 104819 190553 120681 -112817 -243188 -144275 -21472
40780b1472k7407l7601J19776J34268q9786k51637j46344L4847O6917K8316O9349
$$ -21472 -48879 -86480 33296 167564 77778 -173859 -320203 -285356 -218439 -190123 -120774
40769a20774J17701M4821q4125j40919j41128j33993n8445J05456K08988J49986
$$ -120774 -3073 41748 -42377 -183296 -324424 -458417 -516862 -411406 -202418 -52432
40759e2432N8990P8195J11964J0220j41594j49503k1556P6965R3742R2217N6519
$$ -52432 6558 84753 196717 206937 65343 -84160 -105716 -28751 64991 157208 213727
40748B13727p5657k23924k26500q1168N6765J04858J15119J22230R3937K9638
$$ 213727 138070 -85854 -312354 -393522 -336757 -231899 -116780 5450 99387 129025
40738A29025l0046q1804j31900j29414m9790J0127m1788j26862r9409L7387J61293
$$ 129025 98979 17175 -114725 -244139 -293929 -283802 -325590 -452452 -551861 -514474 -353181
40727c53181K13220K02951J12506l7624j06012k466J31328J11520L678J644Q8469
$$ -353181 -139961 62990 175496 137872 31860 29394 160722 272242 275920 277564 366033
40716C66033P4494o9358j81005j90081j71729j35011k7784O1069n351j20718n1749
$$ 366033 440527 371169 190164 83 -171646 -306657 -334441 -273372 -278723 -399441 -451190
40705d51190J44408J69761n819p4382P2120J45273k1526j63223m7715J18341P0972
$$ -451190 -306782 -137021 -142840 -217222 -145102 171 -21355 -184578 -232293 -113952 -42980
40694d2980l8655O8909K78845K53024j8063k19861j98972j02022o2462n0721l4791
$$ -42980 -81635 -12726 266119 519143 501080 281219 82247 -19775 -82237 -132958 -167749
40683a67749m1393n2734l0370q419n389O0893J92433J89955m8707k58603j38953
$$ -167749 -209142 -261876 -292246 -300665 -306054 -245161 -52728 137227 88520 -170083 -309036
40672c09036J60801K31294J2719j54852q0094N4322O5402J8346N466j2013k7656
$$ -309036 -148235 83059 95778 -59074 -139168 -84846 -19444 -1098 4368 -7645 -35301
40661c5301O4619K28838K48562N2090j61611k31500k25407k13978j19575O3990
$$ -35301 29318 258156 506718 558808 397197 165697 -59710 -273688 -393263 -329273
40651c29273J58008P7769q571K5851N2204l8952r4780K2283J37377L4365j52461
$$ -329273 -171265 -93496 -102067 -76216 -24012 -62964 -157744 -135461 1916 36281 -116180
40640a16180j35334O0471J53249O0783k0215K6837R8605J11702J11853R9356p904
$$ -116180 -251514 -191043 -37794 22989 2774 29611 128216 239918 351771 451127 443223
40629D43223j74851k34249j41261m1376k0095N790O9518N3596o7427r9751P4472
$$ 443223 268372 34123 -107138 -148514 -168609 -162819 -93301 -39705 -107132 -206883 -132411
40618a32411K49125J60464j11997k42255j03346J05867J75004J16380M2147j1805
$$ -132411 116714 277178 165181 -77074 -180420 -74553 100451 216831 258978 247173
40608B47173n1859m7540R197M3485j2350j14656j62039j16054j8875O6744Q9972
$$ 247173 195314 147774 156971 200456 188106 73450 -88589 -204643 -223518 -156774 -66802
40597f6802L3057n0540o7003P77O1241M7185Q428N280n361p8376j52774j39449
$$ -66802 -33745 -84285 -151288 -150511 -89270 -42085 -33657 -28377 -33738 -112114 -264888 -404337
40585d04337p1530k9490J8149J31353K12705J12651j02301k10493j63383j10422
$$ -404337 -475867 -505357 -487208 -355855 -143150 -30499 -132800 -343293 -506676 -617098
40575f17098q6555L1831K01737J81006m3074j36669N9272K28912Q6023j45191
$$ -617098 -703653 -671822 -470085 -289079 -332153 -468822 -409550 -180638 -94615 -239806
40565b39806j18795N1020M3620o0522N1468K85631K41587p6604k28545p8439R819
$$ -239806 -358601 -307581 -263961 -324483 -273015 12616 254203 177599 -50946 -129385 -119566
40554a19566j33218j71417R2432K98431J25644j44216r5933J41528J58831n0723
$$ -119566 -252784 -424201 -331769 -33338 92306 -51910 -147843 -6315 152516 101793
40544A01793j53085n0895N9344J04021J73908K05101L2315k41297l03473r7290
$$ 101793 -51292 -102187 -42843 61178 235086 440187 472502 231205 -72268 -169558
40534a69558J00385J05851L2003J3280J1325k9077p0208r6301j33973j25498O084
$$ -169558 -69173 36678 68681 81961 93286 64209 -5999 -102300 -236273 -361771 -355687
40523c55687J51332J14310n5775r2970P3266K03753J34538Q989k520L1531j7316
$$ -355687 -204355 -90045 -145820 -238790 -165524 38229 172767 181756 179236 210767 193451
40512A93451r8310r9916m6029q272L4543R5175Q0895l8198j05708j0653Q8221
$$ 193451 95141 -4775 -50804 -59076 -24533 70642 151537 113339 7631 -3022 85199
40501H5199q427j85858j51946J01949K52314J12890r5614q3777Q5288J16417o5317
$$ 85199 76772 -109086 -261032 -159083 93231 206121 110507 26730 112018 228435 163118
40490A63118k07243r6140J51632K62266J46240n5365j91650k25760j68376m2386
$$ 163118 -44125 -140265 11367 273633 419873 364508 172858 -52902 -221278 -263664
40480b63664O4633M8502o6044j39230j07461l7178L4933J45036K30955J28216
$$ -263664 -199031 -150529 -216573 -355803 -463264 -500442 -465509 -320473 -89518 38698
40470C8698j40745k82371j17021J39261J94853J04386J00324J62062R2496o9244
$$ 38698 -102047 -384418 -501439 -362178 -167325 -62939 37385 199447 291943 222699
40460B22699q9448K3420P894j75389k36590l8749J68030J60558O6254O8273Q5514
$$ 222699 133251 156671 164565 -10824 -247414 -286163 -118133 42425 108679 176952 262466
40449B62466l886p8315L173J00273J5317j48016j59976o4111o8907j35807m1339
$$ 262466 258580 180265 183438 283711 299028 151012 -8964 -73075 -141982 -277789 -319128
40438c19128J74225K01801k5816j75785k1723J94554J32790j37231k66546j37777
$$ -319128 -144903 56898 31082 -144703 -166426 28128 160918 23687 -242859 -380636
40428c80636L4071P3620N1795P2258P7405r875j06901r0072j405K7774P490N8959
$$ -380636 -346565 -272945 -221150 -148892 -71487 -81362 -188263 -278335 -279740 -251966 -244476 -185517
40416a85517J57992J17651r9350k46947j20270J35535K26145J11774l175j9942
$$ -185517 -27525 90126 -9224 -256171 -376441 -240906 -14761 97013 93838 73896
40406G3896m1919j17916j28469j866J43491J65255O8921n4209j30473r6365O2930
$$ 73896 31977 -85939 -214408 -216274 -72783 92472 161393 107184 -23289 -119654 -56724
40395e6724K09770J51780q0218k17124j08187P7043J20022N5497M7818J12205
$$ -56724 153046 304826 224608 7484 -100703 -23660 96362 151859 199677 311882
40385C11882J40636J00746L3218o5906j92353k38771j27155K0000J6005j14734
$$ 311882 452518 553264 586482 520576 328223 89452 -37703 -17703 -1698 -116432
40375a16432j63607l0818J54558K14385J06938o9337j66522r2753R5403K27215
$$ -116432 -280039 -310857 -156299 58086 165024 95687 -70835 -163588 -68185 159030
40365A59030J98234O6216o8759j69294j84423l3704K00048K34542m9798l50669
$$ 159030 357264 423480 354721 185427 1004 -32700 167348 401890 352092 1423
40355A423k99993J8449J94081Q0756n7126j0960Q6873N6575k9058j2528P9353
$$ 1423 -298570 -280121 -86040 -5284 -62410 -73370 13503 70078 41020 28492 107845
40344A07845J16660Q3133N1210L6454J1236j2652k3889o0615j26090j32840k4353
$$ 107845 224505 307638 358848 395302 406538 393886 369997 309382 183292 50452 26099
40333B6099J17030J69082J12898R706q5987j20409m3581R1079J22416j5640j68860
$$ 26099 143129 312211 425109 434815 348828 228419 184838 275917 398333 382693 213833
40322B13833j58063k3796O0134N3231O2542J15675J02199k1183j24985r0045J4098
$$ 213833 55770 31974 92108 145339 207881 323556 425755 404572 279587 189542 203640
40311B03640L5403l9517p3009L0103J94157K50915J10477j46090l20794k62733
$$ 203640 239043 199526 126517 156620 350777 601692 712169 566079 245285 -17448
40301a7448j9151J83415J54318n8763k25496j97530n5435L8737N4824P0467Q6986
$$ -17448 -36599 146816 301134 242371 16875 -180655 -236090 -197353 -142529 -72062 14924
40290A4924J3827j40184k03813o7208J29336J60494K1343p5882r922R1264N9096
$$ 14924 28751 -111433 -315246 -382454 -253118 -92624 -71281 -147163 -157085 -65821 -6725
40279f725o8011j13188j5514J04238J24821O3176L87l9488o9995o6349j647O9874
$$ -6725 -74736 -187924 -203438 -99200 25621 88797 89184 49696 -20299 -86648 -88295 -18421
40267a8421O7405J8380K8140R6427R5936n878m8710P6473K13451J44728p9638
$$ -18421 48984 67364 95504 191931 287867 281989 233279 309752 523203 667931 588293
40256E88293k19090j90373j11046l0965J04741K05717O4613k56946l81146j41163
$$ 588293 369203 178830 67784 36819 141560 347277 411890 154944 -226202 -367365
40246c67365J26041O8633j45272j10521J76611L48687K54382J14501P5824q81
$$ -367365 -241324 -172691 -317963 -428484 -251873 96814 351196 465697 541521 540640
40236E40640j91957k90495j35702Q1595P3724j32524k55980j53057M0199J36012
$$ 540640 348683 58188 -77514 4081 77805 -54719 -310699 -463756 -423557 -287545
40226b87545J14086Q1742R5939Q2295n0221k28771k41676k3365J79160R2309j74435
$$ -287545 -173459 -91717 4222 86517 36296 -192475 -434151 -457516 -278356 -186047 -360482
40215c60482k24337Q7278M34305M47032J64057r6466j61760j07293l3296M5957
$$ -360482 -584819 -497541 -63236 383796 547853 451387 289627 182334 149038 194995
40205A94995J07983J00528M3306J7623K3303l4862j72655k50250j49677M9102
$$ 194995 302978 403506 446812 464435 487738 452876 280221 29971 -119706 -70604
40195g0604J65396J47009R6102Q1044M9893k9688p4110k9018n876j19384k54826
$$ -70604 94792 241801 337903 418947 468840 439152 365042 336024 330148 210764 -44062
40184d4062j97187J8736J15897j1234j25149j1560J99165K56748J54943N4274
$$ -44062 -241249 -222513 -106616 -117850 -242999 -254559 -55394 201354 356297 410571
40174D10571r745r6889j54957j05957n7664j51587k55279j09533K25703L86317
$$ 410571 400826 303937 148980 43023 -14641 -166228 -421507 -531040 -305337 80980
40164H0980K15365l2159q4575J1122O5382K4823n9225j49656j85512r0450P4103
$$ 80980 296345 264186 179611 190733 256115 280938 221713 72057 -113455 -203905 -129802
40153a29802J23264J0858q1153l290J68453K77108K60343J18084j13040k85498
$$ -129802 -6538 4320 -76833 -80123 88330 365438 625781 743865 630825 345327
40143C45327k37300l6608P0949K0815R60R7466J49912P1365J0485L8250j4440
$$ 345327 108027 71419 142368 163183 164143 261609 411521 482886 493371 531621 517181
40132E17181k01850k62502l9645J87762J09708j27953j81909m2438N5381O8790
$$ 517181 315331 52829 13184 200946 310654 182701 792 -41646 13735 82525
40122H2525J13022J33063K150j55655j28771j7274p3943k21061j53853J07336
$$ 82525 195547 328610 330760 175105 46334 29060 -44883 -265944 -419797 -312461
40112c12461K21243J05062M8225J62657J83730j2217j25778P5481L35470K75734
$$ -312461 -91218 13844 62069 224726 408456 396239 270461 345942 681412 957146
40102I57146o5101l38208l52555j95023k4344M9522l639o7902K6210K24138K43701
$$ 957146 892045 553837 201282 6259 -18085 31437 27798 -40104 -13894 210244 453945
40091D53945o869k21197j14366J43520J80128l0121j71429q4853L8412m453j44190
$$ 453945 447076 225879 111513 255033 435161 405040 233611 148758 187170 182717 38527
40080C8527j88974q9847N0737J35606J40974P7284l6186j53835k00793j20451
$$ 38527 -150447 -240294 -189557 -53951 87023 164307 128121 -25714 -226507 -346958
40070c46958N7680K12533K30410J13022l8383j31183j36223o5711L4944Q9983
$$ -346958 -289278 -76745 153665 266687 228304 97121 -39102 -104813 -69869 20114
40060B0114O1293J809k3739l5591p2646q3998j1005O8627L5801n7463m9750N9722
$$ 20114 81407 83216 59477 23886 -48760 -132758 -143763 -75136 -39335 -96798 -146548 -86826
40048h6826J00826J5517n9277m6267m8440j22611j42887k3656J02609Q6145p150
$$ -86826 14000 29517 -29760 -76027 -124467 -247078 -389965 -413621 -311012 -224867 -232017
40037b32017k0070N7776J22870J26114P8955m202n2892M4460K41806K91091O2098
$$ -232017 -252087 -194311 -71441 54673 133628 129426 76534 120994 362800 653891 715989
40026G15989k17577k32080R442K23729K39236J26603k494j11510j61420j08823
$$ 715989 498412 266332 275774 499503 738739 865342 862848 751338 589918 481095
40016D81095p287L1824n882l8010k9547j8342j4908K131J0442j6931k3538N3762
$$ 481095 473808 505632 499750 461740 432193 413851 398943 401074 411516 394585 371047 424809
40004D24809J47477J31899J3492q0161q2395l4255J9833N1775O123j14672j66119
$$ 424809 572286 704185 717677 637516 555121 520866 540699 592474 598597 483925 317806
39993C17806l5275J42224J39423j5798q7542k5014l1184j74106k26311m8525J31896
$$ 317806 282531 424755 564178 548380 460838 435824 404640 230534 4223 -44302 87594
39982H7594O3305j07398m9157K17219L15194O3603k46432k44879L5211K35166
$$ 87594 150899 43501 -5656 211563 526757 590360 343928 99049 134260 369426
39972C69426J40334r7286k06076j23310j194L3206J261l7751q6229j27158n6774
$$ 369426 509760 412474 206398 83088 81894 115100 116361 78610 -7619 -134777 -191551
39961a91551J64035L47908K45402j07360l63071k61400O2779K63494J91227O185
$$ -191551 -27516 320392 565794 458434 95363 -166037 -103258 160236 351463 357648
39951C57648p1386r273N4388P180j03711j33771k1768J29743J82602J24877L8625
$$ 357648 286262 276989 331377 338557 234846 101075 79307 209050 391652 516529 555154
39940E55154m5000j42742j95651j08000N8069R4638n9263j90378j04802Q4992
$$ 555154 510154 367412 171761 63761 121830 216468 157205 -33173 -137975 -52983
39930e2983J37810M9350K5759J26904J69240L4676j26914j18212K8332J37223
$$ -52983 84827 134177 159936 286840 456080 490756 363842 245630 273962 411185
39920D11185J57360J73331J86009P3182j71998l22432j81654J08137J98364j8801
$$ 411185 568545 741876 927885 1001067 829069 506637 324983 433120 631484 612683
39910F12683k70446k81050j17654j1246J2449Q5862J68921P1532j69991k53552
$$ 612683 342237 61187 -56467 -67713 -55264 30598 199519 271051 101060 -152492
39900a52492o4177J28744J06443M1155J36181K01441k5706l24547k33630K01127
$$ -152492 -216669 -87925 18518 59673 195854 397295 371589 47042 -186588 14539
39890A4539M18416J60779j70293j58887N9690J48553J05811R9906O7136j20880
$$ 14539 432955 593734 423441 264554 324244 472797 578608 678514 745650 624770
39880F24770k91940j94333M5359R6467l1100m3226Q1336N9747j24598j11326K08379
$$ 624770 332830 138497 183856 280323 249223 205997 287333 347080 222482 111156 319535
39869C19535M07232J51251k53429l04075k7823J39900N0124j4786J22594K45808
$$ 319535 726767 878018 624589 320514 292691 432591 482715 467929 590523 836331
39859H36331J15160j48378k37660p9555R3793O0567j29162k46008j77265m6415
$$ 836331 951491 803113 565453 485898 579691 640258 511096 265088 87823 41408
39849D1408j1211l6521J4659J19982J12025l0649j10372r934J25375J26942M6950
$$ 41408 30197 -6324 8335 128317 240342 209693 99321 89387 214762 341704 388654
39838C88654R663j5725j01717j58238n7996J28667K29390K13372J40965j5956
$$ 388654 398317 382592 280875 122637 64641 193308 422698 636070 777035 761079
39828G61079k53849l43015p4488L29350L93395K9612l21446k93773m4700N9429
$$ 761079 507230 164215 89727 419077 812472 842084 520638 226865 182165 241594
39818B41594m6324j41391p9822P1972J71806J34485l409p3805O1867K84013K99213
$$ 241594 195270 53879 -25943 46029 217835 352320 348911 275106 336973 620986 920199
39807I20199L1231k47970k82844j39722j3456O3449J28635J05106m3231j29880
$$ 920199 951430 703460 420616 280894 267438 330887 459522 564628 521397 391517
39797C91517k274J43997K8013k22083k09973R4620K62579N3889k19238j85415
$$ 391517 389243 533240 561253 339170 129197 223817 486396 540285 321047 135632
39787A35632N3462J67208J20431J04163J12681j8858k13262j85311P7434K32128
$$ 135632 189094 356302 476733 580896 693577 674719 461457 276146 353580 585708
39777E85708R5117r4402r8492n1541j53935k68992j62172M8420O3219q1788p1383
$$ 585708 680825 586423 487931 436390 282455 13463 -148709 -100289 -37070 -118858 -190241
39766a90241J40593K48717J15784k4308p047Q23j29173k07726p2813Q4221L0584
$$ -190241 -49648 199069 314853 290545 283498 284321 155148 -52578 -125391 -41170 -10586
39755a0586j12348r1019O2271J39002J10060P4451K2000n3310O765K34841K94102
$$ -10586 -122934 -213953 -151682 -12680 97380 171831 193831 140521 147286 382127 676229
39744F76229o3423m76334m03023M7796K66902Q4749m3377J31975K65236Q4889
$$ 676229 612806 136472 -266551 -218755 48147 132896 89519 221494 486730 571619
39734E71619j14683J323K39369K30706K1204q2792j5818N6552O5374M5420k9412
$$ 571619 456936 458259 697628 928334 949538 866746 850928 907480 972854 1018274 988862
39723I88862j49161j55777L6523K62695L48805L41106K98121J02303k63712n01449
$$ 988862 839701 683924 720447 983142 1331947 1673053 1971174 2073477 1809765 1308316
39713A308316l76297j12418p5260k30641k69407j30166k5164k7776P01R7125J30771
$$ 1308316 932019 819601 744341 513700 244293 114127 88963 61187 61888 159013 289784
39702B89784N5379l7829j08143j69457j43441M5141K55510K55271M6342j41316
$$ 289784 345163 307334 199191 29734 -113707 -68566 186944 442215 488557 347241
39692C47241j55138l0445J50244L12952L64571K90506K05637J52914o698l12863
$$ 347241 192103 161658 311902 624854 989425 1279931 1485568 1638482 1631784 1318921
39682A318921n04378l62680p7584L4259J826M4373J16370K1591j45031j24246
$$ 1318921 814543 451863 374279 408538 410364 454737 571107 592698 447667 323421
39672C23421J3711k3764j87706j37769J24309K06261O902r5052Q4694K01828L288
$$ 323421 337132 313368 125662 -12107 112202 318463 325365 230313 315007 516835 520123
39661E20123j98800m7553K46531K42187m7320k33764j57675j2770N3412J02644
$$ 520123 321323 273770 520301 762488 715168 481404 323729 310959 364371 467015
39651D67015J72479J74163P5782j7576k4595N649j1577q5859j62372j87884j50497
$$ 467015 639494 813657 889439 871863 847268 852917 841340 755481 593109 405225 254728
39640B54728p6810L382P2753R3456J5468j28442k08171j58616p1611k7270M2976
$$ 254728 177918 181300 254053 347509 362977 234535 26364 -132252 -203863 -231133 -188157
39629a88157J76570K13683M0948j29582k5287K23842K32573m4432k31368j04754
$$ -188157 -11587 202096 243044 113462 88175 312017 544590 500158 268790 164036
39619A64036J04520J10599k9021q1768K2817J78733K55247J62644p2577k49721
$$ 164036 268556 379155 350134 268366 291183 469916 725163 887807 815230 565509
39609E65509j93557k1852J2607o7138j0907J85487K24143J3205j50938p6462J3467
$$ 565509 371952 350100 362707 295569 284662 470149 694292 707497 556559 480097 493564
39598D93564j02763k41585j23010J57417K78948J70119M9000O2420J12788L7660
$$ 493564 390801 149216 26206 183623 462571 632690 681690 744110 856898 894558
39588H94558j62605k86612j31039K08717L36501M1889l26538k81247R3252K59350
$$ 894558 731953 445341 314302 523019 859520 901409 574871 293624 386876 646226
39578F46226M4935j48164n5243N5959o4546j90544n2181J72067J80957N2728L3288
$$ 646226 691161 542997 487754 543713 479167 288623 236442 408509 589466 642194 675482
39567F75482P9754O383j12808o6903J03025J72221Q7545k1574q4508j09086p7587
$$ 675482 755236 761619 648811 581908 684933 857154 944699 923125 838617 729531 651944
39556F51944k1758n6586j64381j37564P6964K06908N4861j61166j29585R4734
$$ 651944 630186 573600 409219 271655 348619 555527 610388 449222 319637 414371
39546D14371K19970J36597l5502j58040j27768R5203L29606K71708o0616k50540
$$ 414371 634341 770938 735436 577396 449628 544831 874437 1146145 1085529 834989
39536H34989n9384K18580K25398M4202o1641r8063j79803j97206j5959K09753
$$ 834989 775605 994185 1219583 1263785 1202144 1104081 924278 727072 711113 920866
39526I20866K62535J94950J45150O2074r8272j77494j07409r0340j94254j39670
$$ 920866 1183401 1378351 1523501 1585575 1487303 1309809 1202400 1112060 917806 778136
39516G78136J69077L23174M2926k96438k61374n1506l8397n4024J95405M07943
$$ 778136 947213 1270387 1313313 1016875 755501 703995 665598 611574 806979 1214922
39506A214922J53390k46914j50838K94764L55981n9330k67344M2519L70186K90220
$$ 1214922 1368312 1121398 970560 1265324 1621305 1561975 1294631 1337150 1707336 1997556
39496A997556K7722q6174r6460j12109n0680P8636R3950O327M2716K04764K40055
$$ 1997556 2025278 1939104 1842644 1730535 1679855 1758491 1852441 1858768 1901484 2106248 2346303
39485B346303J19592R3245K19311K96390K89781L48016L89482J88306j18789j55286
$$ 2346303 2465895 2559140 2778451 3074841 3364622 3712638 4102120 4290426 4171637 4016351
39475D016351M7846R1424q7264j51604m5844r2797l20592l49774j00326K7492
$$ 4016351 4064197 4155621 4068357 3916753 3870909 3778112 3457520 3107746 3007420 3034912
39465C034912j40869k80169j84674o0761j4866J39722L65831L18304K272j16224
$$ 3034912 2894043 2613874 2429200 2368439 2353573 2493295 2859126 3177430 3179702 3063478
39455C063478R1186J53988j60100m01416k11902O7493Q657k10704j97083P343
$$ 3063478 3154664 3308652 3148552 2747136 2535234 2602727 2611384 2400680 2203597 2210940
39445B210940J19106J14876J31365J42919P9049L2896R7185J96592K32412J76637
$$ 2210940 2330046 2444922 2576287 2719206 2798255 2831151 2928336 3124928 3357340 3533977
39435C533977j5255l02040m07970j44800J97612K18197L1379N601O0316j15140
$$ 3533977 3518722 3216682 2808712 2663912 2861524 3079721 3111100 3116701 3177017 3061877
39425C061877l18387j06966L02637K94045n3226q6845K17770K33369q6701q9426
$$ 3061877 2743490 2636524 2939161 3233206 3179980 3093135 3310905 3544274 3457573 3368147
39415C368147L05524L99965M2937m8846L55874N56802K57936J12257M27255N70058
$$ 3368147 3673671 4073636 4116573 4067727 4423601 4980403 5238339 5350596 5777851 6347909
39405F347909K41944J04328M89884P19877L99183J78042N07650Q42166P86484
$$ 6347909 6589853 6694181 7184065 7903942 8303125 8481167 8988817 9830983 10617467
39396A0617467Q12572J162377J333949J286994J736033K656380L120397L183962
$$ 10617467 11430039 12592416 13926365 15213359 16949392 19605772 22726169 25910131
39388B5910131M006827N462141N924484N255505N343898O686874P651602Q483402
$$ 25910131 29916958 35379099 41303583 46559088 51902986 58589860 66241462 74724864
39380G4724864J2101114J8911893K5721787L2846806M5584538O1726745O3684442
$$ 74724864 86825978 105737871 131459658 164306464 209891002 271617747 335302189
39373C35302189L4950426j5694363n7435798o8422424n5335385l8783629k8756155
$$ 335302189 370252615 354558252 297122454 228700030 173364645 134581016 105824861
39366A05824861k1720693j4367661r119137p451888o748455n285373m553746n236486
$$ 105824861 84104168 69736507 60617370 53165482 46417027 41131654 36577908 31341422
39358C1341422n411604m110689k960518k988766k914843j836347q85463r74552
$$ 31341422 25929818 21819129 18858611 15869845 12955002 11118655 10233192 9258640
39350I258640j217124p78317l13363m73142o98150m85577l42391o08104p01777
$$ 9258640 8041516 7263199 6949836 6476694 5778544 5292967 4950576 4342472 3640695
39341C640695l09442m8699k66710l82336m9211J85667k5621j93175o316P7330
$$ 3640695 3331253 3282554 3015844 2633508 2584297 2769964 2744343 2551168 2544852 2622182
39331B622182j94260l29614o8479Q3388j76464l72657j62820O1573j7218q2917
$$ 2622182 2427922 2098308 2029829 2113217 1936753 1564096 1401276 1462849 1445631 1362714
39321A362714Q7286J52271o9929j92906j6707P4799j12982j86973M3418J51909
$$ 1362714 1450000 1602271 1532342 1339436 1322729 1397528 1284546 1097573 1140991 1292900
39311A292900r4132k63467m9728J92744J45199N5916J43658J60844k4019r4828
$$ 1292900 1198768 935301 885573 1078317 1223516 1279432 1423090 1583934 1559915 1465087
39301A465087N1903K2666k84674l53589L2415L06874Q0020j70289L8952L55334
$$ 1465087 1516990 1539656 1254982 901393 933808 1240682 1320702 1150413 1189365 1544699
39291A544699K70521j704j3129J24112J12313J06211K93021L45387K051k89695
$$ 1544699 1815220 1813516 1800387 1924499 2036812 2143023 2436044 2781431 2783482 2493787
39281B493787o4504K69644M4812n16515o27801j92439J32892M9807k5356K13299
$$ 2493787 2429283 2698927 2743739 2227224 1599423 1406984 1539876 1589683 1564327 1777626
39271A777626M83320M44170J83279k2032o9054k0747J5547n7907k17362k96451
$$ 1777626 2260946 2705116 2888395 2866363 2797309 2776562 2792109 2734202 2516840 2220389
39261B220389k27458j73890k56511l42793l05036k48593k55335j78913L0658J04479
$$ 2220389 1992931 1819041 1562530 1219737 914701 666108 410773 231860 262518 366997
39251C66997j06921k77564q6878K20319K05219o2964j63103j5521P8242m581q1869
$$ 366997 260076 -17488 -104366 115953 321172 258208 95105 79584 157826 153245 71376
39240G1376o1191l4519p02J17611K06313Q9164r7413m2938K21313L26024J22718
$$ 71376 10185 -24334 -25036 92575 298888 388052 290639 247701 469014 795038 917756
39229I17756j22370j69548j11048j19610j67058j38434l7214N0444Q2414P8410
$$ 917756 795386 625838 514790 395180 228122 89688 52474 102918 185332 263742
39219B63742Q0919J09886J09560R3j62869k01916p9041K0874m295J6022K17012
$$ 263742 344661 454547 564107 564200 401331 199415 120374 141248 136953 152975 369987
39208C69987M00249L03940J7971j54937j39592j01558j07636p4266j4517m8925
$$ 369987 770236 1074176 1092147 937210 797618 696060 588424 514158 499641 450716
39198D50716j65924k12424j33436k0306O9284J47525J72509P8118q0276j70710
$$ 450716 284792 72368 -61068 -81374 -12090 135435 307944 386062 305786 135076
39188A35076j54578q1720J8744J03321O9529q3033j54449o488J80637J40940p1904
$$ 135076 -19502 -101222 -82478 20843 90372 7339 -147110 -153598 27039 167979 96075
39177I6075j61023k1759J46827J58513M8424n0713o4647L780Q1047O4668m0198
$$ 96075 -64948 -86707 60120 218633 267057 216344 151697 155477 236524 301192 260994
39166B60994r3505l0497K3330j8959k3380J24635K59638J69525l6564p7331O7092
$$ 260994 167489 136992 160322 141363 117983 242618 502256 671781 635217 557886 624978
39155F24978J63045J20156Q7561J51936K07124J64968Q1719L2592K2527L4030
$$ 624978 788023 908179 995740 1147676 1354800 1519768 1601487 1634079 1656606 1690636
39145A690636L4045l4729j52476j97387j45821j50067k53586k36946L261J53840
$$ 1690636 1724681 1689952 1537476 1340089 1194268 1044201 790615 553669 556930 710770
39135G10770p1777l81633k65167J92061L84705J04538j65776l8663K06245J32460
$$ 710770 638993 257360 -7807 184254 568959 673497 507721 469058 675303 807763
39125H07763j69139k84255j15434N8967N0348l7010m5213L1177J02493J06179
$$ 807763 638624 354369 238935 297902 348250 311240 266027 297204 399697 505876
39115E05876N0080M7J3144N9009N6556n467o4865r9694j35652j41371n4423P2661
$$ 505876 555956 556003 569147 628156 684712 679245 614380 514686 379034 237663 183240 255901
39103B55901J04472L3693K635O6814J02361K1714p8157p9746j6796K4875N3096
$$ 255901 360373 394066 396701 463515 565876 587590 509433 429687 412891 437766 490862
39092D90862R8129J04279K3602o2939n0418K1020L2427j8291k7462J6338j016
$$ 490862 588991 693270 716872 653933 603515 624535 656962 638671 611209 627547 626531
39081F26531j04628j26839N6439K75260K35119o5009k83204j84637M9769J18505
$$ 626531 521903 395064 451503 726763 961882 896873 613669 429032 478801 597306
39071E97306K5682k2617n543n5115j13145K995J87128J13239j88246k63400N8667
$$ 597306 622988 600371 594828 539713 426568 429563 616691 729930 541684 278284 336951
39060C36951L28391J51527j93613k19486J3653Q6038n6846q9257Q0654J78158
$$ 336951 665342 816869 623256 403770 417423 503461 446615 357358 438012 616170
39050F16170N0230j30673j95293j70737j13725m1656k8449j00821q9315J32827
$$ 616170 666400 535727 340434 169697 55972 14316 -14133 -114954 -204269 -71442
39040g1442L52432K90020O9238K4833J30767P1153j61002k34986q0963l823r8988
$$ -71442 280990 571010 640248 665081 795848 867001 705999 471013 390050 386227 287239
39029B87239o6567K10849L83252J79821j58929k68246j48434j0058P6554J27037
$$ 287239 220672 431521 814773 994594 835665 567419 418985 408927 485481 612518
39019F12518R0737j9490o1652m423o612j14318j37539K1834J84504J84689Q2011
$$ 612518 703255 683765 622113 617690 611078 496760 359221 381055 565559 750248 832259
39008H32259m0948j94947k80094j12797J97391K77739P6905K146K41883M09067
$$ 832259 791311 596364 316270 203473 400864 678603 755508 757654 999537 1408604
38998A408604J97428m7174J37234N69581P11977M83171K80944L29037M76781N95204
$$ 1408604 1606032 1558858 1696092 2265673 2977650 3460821 3741765 4070802 4547583 5142787
38988E142787P52776R81114J193063J385428J721894K381931L354175M214711
$$ 5142787 5895563 6876677 8069740 9455168 11177062 13558993 16913168 21127879
38980B1127879M105734K363030n58917l146489m191413l862416l138785k566022
$$ 21127879 25233613 27596643 27037726 23891237 19699824 15837408 12698623 10132601
38972A0132601k034671j442928r31607n63540l07883k82974n46131p44200m87860
$$ 10132601 8097930 6655002 5723395 5159855 4851972 4568998 4022867 3278667 2790807
38963B790807p967R8099k42683m90727l38490r3470r0245k22419k56392j99131
$$ 2790807 2782840 2880939 2638256 2147529 1809039 1715569 1625324 1402905 1146513 947382
38953I47382j43632o8321L8056J08222J50832K35589L12496L16440L86073O13464
$$ 947382 803750 735429 773485 881707 1032539 1268128 1580624 1897064 2283137 2896601
38943B896601O67018J59623o27996r61741o66469l31177l53351m10337j61154
$$ 2896601 3563619 3723242 3095246 2133505 1467036 1135859 782508 372171 211017
38934B11017J36659J26622l1285j1744J01218N3142q4921r8203l5559l4160m865
$$ 211017 347676 474298 443013 431269 532487 585629 500708 402505 366946 332786 327921
38923C27921J21571J23749j21526k78170m5584K65236J78840j53116j93925R4197
$$ 327921 449492 573241 451715 173545 127961 393197 572037 418921 224996 319193
38913C19193K25512N765k25824k10859q2067K5748J70181K92833J89215p5708
$$ 319193 544705 550470 324646 113787 31720 57468 227649 520482 709697 633989
38903F33989j61313J228R0085l5301j05452K4097Q6195p8871j74782K7175K19641
$$ 633989 472676 473904 563989 528688 423236 447333 533528 454657 279875 307050 526691
38892E26691L8363l08602l49783o1361J85709K24934J87928J10987q8445k76172
$$ 526691 565054 256452 -93331 -154692 31017 255951 443879 554866 466421 190249
38882A90249j87313J12012K43077O9825j18308p4353Q8159J70688J75291J54046
$$ 190249 2936 114948 358025 427850 309542 235189 323348 494036 669327 823373
38872H23373M4788j49680k36435r0905J19846J59970N0801J2131J68500M32807
$$ 823373 868161 718481 482046 391141 510987 670957 721758 733889 902389 1335196
38862A335196N92791M41146m3217n65731p35275n08479k31946j47793j08549N1619
$$ 1335196 1927987 2369133 2325916 1760185 1024910 516431 284485 136692 28143 79762
38852G9762J56548l589k35998j99069M0746J11462n7934j51276j4898J19746Q1353
$$ 79762 236310 232721 -3277 -202346 -161600 -50138 -108072 -259348 -274246 -154500 -73147
38841g3147M6554J80650L01945J64361j36715k98353k15768l5702R3121J27714
$$ -73147 -26593 154057 456002 620363 483648 185295 -30473 -66175 26946 154660
38831A54660O7227m3785j01162o3238k4832o0436q7712j4777P7388N6623l4398
$$ 154660 221887 178102 76940 13702 -11130 -71566 -159278 -174055 -96667 -40044 -74442
38820g4442m3986M1038P9536O30r4474p5283O0295J82847J48534m8051k16181
$$ -74442 -118428 -77390 2146 2776 -91698 -166981 -106686 76161 224695 176644 -39537
38809c9537j49559R6061K28637R8023r5512r2914O4235J37731M9212o6422j03435
$$ -39537 -189096 -93035 135602 233625 138113 45199 109434 247165 296377 229955 126520
38798A26520q2852k9962O4230J52018J49196O2722j4378l3074j6208J7282N4969
$$ 126520 43668 13706 77936 229954 379150 441872 427494 394420 378212 395494 450463
38787D50463N3952K003l2326r051r29n1158m3539J27119L41675L97004K88210
$$ 450463 504415 506418 474092 465041 464112 412954 369415 496534 838209 1235213 1523423
38776A523423J55026J7908j99489m24558m66985l07345j28223m2353q292j6722
$$ 1523423 1678449 1696357 1496868 1072310 605325 297980 169757 127404 119112 102390
38766A02390j05101j62149m337K76370L33838O9288j67691o9485J86342K30856
$$ 102390 -2711 -164860 -169197 107173 441011 510299 342608 273123 459465 690321
38756F90321M9112o3768P311N8145o8803k31154k00799J6917J99777J91456O5712
$$ 690321 739433 675665 682976 741121 672318 441164 240365 257282 457059 648515 714227
38745G14227j1742j5809o3106j78967k01785k8196J60676J05983j46536k88358
$$ 714227 702485 686676 623570 444603 242818 214622 375298 481281 334745 46387
38735D6387j76998K194N2060J2258p316k7647q7899j03923n813J09745J17273
$$ 46387 -130611 -128417 -76357 -64099 -71415 -99062 -186961 -290884 -296697 -186952 -69679
38724f9679M4591j7030o6437j14740q1236O3942J69708J09501J5408Q3322K18830
$$ -69679 -25088 -42118 -108555 -223295 -304531 -240589 -70881 38620 54028 137350 356180
38713C56180J44221j45488l11831j44205J35053J91450L2999n7599L8102J25593
$$ 356180 500401 354913 43082 -101123 33930 225380 258379 200780 238882 364475
38703C64475J5716j89394k45055j03049M7463O2045J2398K3063P3353P5842N2020
$$ 364475 380191 190797 -54258 -157307 -109844 -47799 -35401 -12338 61015 136857 188877
38692A88877P6638J06889M4930n1395j9599J23039J57933O041j16391j9449J59888
$$ 188877 265515 372404 417334 365939 346340 469379 627312 633353 516962 497513 657401
38681F57401J63402j0095j43358j42327j13628j15488n5440J04051K17424J40254
$$ 657401 820803 810708 667350 525023 411395 295907 240467 344518 561942 702196
38671G02196o8330k30187k61629k05515j07544K0634J26008J24976L5274J715
$$ 702196 633866 403679 142050 -63465 -171009 -150375 -24367 100609 135883 137598
38661A37598J06512K16779J34444j22651l14831k75975r3959M8962R0645O6901
$$ 137598 244110 460889 595333 472682 157851 -118124 -212083 -163121 -72476 -5575
38651e575j725q3273q9335J0994J02030P3173j0683k4054J1225p866n9419m0521
$$ -5575 -7300 -90573 -179908 -168914 -66884 6289 -4394 -28448 -17223 -25089 -84508 -125029
38639a25029K7420L1062k1090j3694N6266P5435L2560L5370Q7788N7510q7379
$$ -125029 -97609 -66547 -87637 -101331 -45065 30370 62930 98300 186088 243598 156219
38628A56219k00471j74548p2797L061K3610j2008p2421m4816J33236L05502K67756
$$ 156219 -44252 -218800 -291597 -288536 -264926 -276934 -349355 -394171 -260935 44567 312323
38617C12323Q8887J8266Q3430O9087q0674j59122o6884L4254L9679N5822J10547
$$ 312323 401210 419476 502906 571993 491319 332197 265313 299567 339246 395068 505615
38606E05615L7303j85543k96988j55498J3566j1818j08583o6488O7631J38538
$$ 505615 542918 357375 60387 -95111 -81545 -93363 -201946 -268434 -200803 -62265
38596f2265J42656J20672K4527j02257o6993J39540K31947P3918p8115k7673J4501
$$ -62265 80391 201063 225590 123333 56340 195880 427827 501745 423630 395957 410458
38585D10458j43851k62247q6402J39455N6140j71632j21195J60467K35279m053
$$ 410458 266607 4360 -82042 57413 113553 -58079 -179274 -18807 216472 212419
38575B12419k04739j36690M9964J76515K47401K64781J66322l741j14765j37805
$$ 212419 7680 -129010 -79046 97469 344870 609651 775973 772232 657467 519662
38565E19662j13259j9484J20707J54493M4406k653J10334J59063K1496k6388K05438
$$ 519662 406403 386919 507626 662119 706525 703872 814206 973269 994765 968377 1173815
38554A173815M15891L16665J38952J58269J74197K2609O2981M62921O20580J82479
$$ 1173815 1589706 1906371 2045323 2203592 2377789 2400398 2463379 2926300 3546880 3729359
38544C729359n3093O25124J486499J792198K755702N690258Q414515O556657m39160
$$ 3729359 3676266 4301390 5787889 7580087 10335789 16026047 24440562 30997219 30558059
38535C0558059p266857q666862n436091k337867j664418j721793q90270K8731
$$ 30558059 23291202 14624340 9188249 6850382 5185964 3464171 2573901 2602632
38527B602632j7349m15947k71994M4320j18428m17621k85927j8831j23158l36415
$$ 2602632 2585283 2169336 1897342 1941662 1823234 1405613 1119686 1100855 977697 641282
38517F41282j92011N5182p9384l81920l14075M6755J88672L2689n1239P7381K16240
$$ 641282 449271 504453 425069 43149 -270926 -224171 -35499 -2810 -54049 23332 239572
38506B39572K58373K51414J43773r4492k41482j26848J055j58053l92207k65467
$$ 239572 497945 749359 893132 798640 557158 430310 431365 273312 -118895 -384362
38496c84362J44536L22527J11966q4388J5179J71387R2082r7107j16732O564L3934
$$ -384362 -239826 82701 194667 110279 125458 296845 388927 291820 175088 181652 215586
38485B15586q3566j61447q7315L9940Q7615N7932L1264L2805K8341J7496M4931
$$ 215586 132020 -29427 -116742 -76802 10813 68745 100009 132814 161155 178651 223582
38474B23582R1660L6554j77741l78691l05736M5906L54905L33857O1810j47220
$$ 223582 315242 351796 174055 -204636 -510372 -464466 -109561 224296 286106 138886
38464A38886j30137q58O8193M6210M885p543O978L7252P2157Q7698O4489J9055
$$ 138886 8749 7891 76084 122294 127179 119636 126614 163866 236023 323721 388210 407265
38452D07265m482J5576M5550L0407l3473p6500k9191Q4393J51030Q6265n6782
$$ 407265 402783 418359 463909 494316 460843 384343 355152 439545 590575 676840 620058
38441F20058j25769l9850J03970J49675R1060O7344J40782K17356K43022K95570
$$ 620058 494289 454439 558409 708084 799144 866488 1007270 1224626 1467648 1763218
38431A763218L67158L06828K19457O10357J630936K368515J632825m00672k060612
$$ 1763218 2130376 2437204 2656661 3267018 4897954 7266469 8899294 8498622 6438010
38422F438010k092034j081370m33039n07880n80346k70891j6767j08107j84493
$$ 6438010 4345976 3264606 2831567 2323687 1743341 1472450 1455683 1347576 1163083
38413A163083K3646J82235k5614l22175k98735l6872J31310J44107J19814M0395
$$ 1163083 1186729 1368964 1343350 1021175 722440 685568 816878 960985 1080799 1121194
38403A121194j14004j67391k5785P7154o4298k57589k27384o8189k1616k2146
$$ 1121194 1007190 839799 814014 891168 826870 569281 341897 273708 252092 229946
38393B29946J29543L17855K75215P8655M3779J88325K37347J35633J10890K02733
$$ 229946 359489 677344 952559 1031214 1074993 1263318 1500665 1636298 1747188 1949921
38383A949921J76062o278n2206J68531L94051M28719M73772P44421J052511J064712
$$ 1949921 2125983 2119705 2067499 2236030 2630081 3058800 3532572 4276993 5329504 6394216
38373F394216P60812L49666q9498n74285r55955j021423q28135o52008n92183
$$ 6394216 7155028 7504694 7415196 6840911 5884956 4863533 4035398 3383390 2791207
38364B791207m86146k57051q6621j31408k75734l22610k79661k74871k87812j76208
$$ 2791207 2305061 2048010 1961389 1829981 1554247 1231637 951976 677105 389293 213085
38354B13085M8874J78258Q8903q9114j75615j68446j47701q3326P4639J91605
$$ 213085 261959 440217 529120 440006 264391 95945 -51756 -135082 -60443 131162
38344A31162P3223j92707k60443R264L15020L01031J6538k06778k19602j57865
$$ 131162 204385 11678 -248765 -239501 75519 376550 393088 186310 -33292 -191157
38334a91157j28848n9980Q4156J63582P4758n4078m0167P3394Q8312l0358q9332
$$ -191157 -320005 -379985 -295829 -132247 -57489 -111567 -151734 -78340 9972 -20386 -109718
38323a09718L3105J80583J34475n8987j45069k6390J09842R0522Q346L5400J20383
$$ -109718 -76613 103970 238445 179458 34389 7999 117841 208363 216709 252109 372492
38312C72492P8927p7448j40792m8864P220j00675k21348j58516L7244J64247J45659
$$ 372492 451419 373971 233179 184315 191535 90860 -130488 -289004 -251760 -87513 58146
38301E8146O3300M47j7195M831O422r0187k21165j86394N0031K15108Q8430j20635
$$ 58146 121446 121893 104698 109529 115951 25764 -195401 -381795 -331764 -116656 -28226 -148861
38289a48861l4375L11900M64780J77142k50337l85972k05252k9970o4142j88019
$$ -148861 -183236 128664 593444 770586 520249 134277 -70975 -100945 -165087 -353106
38279c53106j83592j7927J38009J21138k9526j12150k964J94760K91463K36351
$$ -353106 -536698 -554625 -416616 -295478 -325004 -437154 -440118 -245358 46105 282456
38269B82456J13921j7420j48060k15810j42648J8343J15827R9323N6062M2165
$$ 282456 396377 378957 230897 15087 -127561 -109218 6609 105932 161994 204159
38259B04159K5435J2562O5213J46586J22952j4354r4633k2741P0236L8421o1857
$$ 204159 229594 242156 307369 453955 576907 562553 467920 445179 515415 553836 491979
38248D91979r0181l3643K5162M4052R904r4413j93083j17761J44449L25728J82785
$$ 491979 401798 368155 393317 437369 447273 352860 159777 42016 186465 512193 694978
38237F94978j63865l84290l56862k30646j31839m0190M9880P1091K8309K0364
$$ 694978 531113 146823 -210039 -440685 -572524 -612714 -562834 -491743 -463434 -443070
38227d43070P4976J22312J58659K55865L63877K99535K4753k31279k43932o3255
$$ -443070 -368094 -245782 -87123 168742 532619 832154 856907 625628 381696 318441
38217C18441R0309R0642k4570j40466j34409L1478K06416J64075r4122k93127
$$ 318441 408750 499392 474822 334356 199947 231425 437841 601916 507794 214667
38207B14667k47177j01900o8735r8732l3148P7071P2776L320M0936J32865O5084
$$ 214667 -32510 -134410 -203145 -301877 -335025 -257954 -185178 -181858 -140922 -8057 57027
38196E7027j24025j38930Q9152K51612J39844m1136m0754L7206k9711j69370j48857
$$ 57027 -66998 -205928 -116776 134836 274680 233544 192790 229996 200285 30915 -117942
38185a17942J9084J13823P1550K2851J3429l2766q9936m2393O9463P2445m1962
$$ -117942 -98858 14965 86515 109366 122795 90029 93 -42300 27163 99608 57646
38174E7646q9767l451P6697P1153O7030Q1097j5977k17640k80982p9364J61004
$$ 57646 -32121 -35572 41125 112278 179308 260405 244428 26788 -254194 -333558 -172554
38163a72554J69498J145r4333k4322J12853K11375J94993N949k56478l23986r0618
$$ -172554 -3056 -1911 -96244 -120566 -7713 203662 398655 404604 148126 -175860 -266478
38152b66478J75249J72316j0013o5088M9639J07534K5567m0561j3515Q03l4845
$$ -266478 -91229 81087 71074 5986 55625 163159 188726 148165 134650 135453 100608
38141A00608j7990N0569K4468j08293j66218q6985l1724o3517n906K10475L36088
$$ 100608 82618 133187 157655 49362 -116856 -203841 -235565 -299082 -304988 -94513 241575
38130B41575J67867j04100j80263r5536q7130j62491j27756K1195O8721m7882
$$ 241575 409442 305342 125079 29543 -57587 -220078 -347834 -326639 -257918 -305800
38120c05800j29591l9420J12068J84023J93435J95323J65015J01560Q1581J06020
$$ -305800 -435391 -474811 -362743 -178720 14715 210038 375053 476613 558194 664214
38110F64214N0362j20231k40161j80476n2664j8675l0817M1956J31291N6193j41619
$$ 664214 714576 594345 354184 173708 121044 102369 71552 113508 244799 300992 159373
38099A59373k05371n1173Q4109q180j98620k12798q168K10356K79116K16018J05279
$$ 159373 -45998 -97171 -13062 -21242 -219862 -432660 -440828 -230472 48644 264662 369941
38088C69941R73m5679Q47Q2750Q5753j0437j03671j18354r0378o8399l4269J4649
$$ 369941 370914 325235 326082 408832 494585 484148 380477 262123 171745 103346 69077 83726
38076H3726L008j03068j83977r6700J07944K19433J33728k2328q1368n9693r5194
$$ 83726 86734 -16334 -200311 -297011 -189067 30366 164094 141766 60398 705 -94489
38065i4489k01186k12380k9231J86083J86957j4597j43575m2983J15456J22950
$$ -94489 -295675 -508055 -537286 -351203 -164246 -178843 -322418 -365401 -249945 -126995
38055a26995O4616J37977K59444J61976j27124k48637m8442J76312J48530J9686
$$ -126995 -62379 75598 335042 497018 369894 121257 72815 249127 397657 417343
38045D17343M2137J10540o544j78600r6755J46911J39948j63828l14784p0630
$$ 417343 459480 570020 563476 384876 288121 435032 574980 411152 96368 25738
38035B5738K09960J29534j59058k56179j30898n2565q2864l5906J20384J93913
$$ 25738 235698 365232 206174 -50005 -180903 -233468 -316332 -352238 -231854 -37941
38025c7941J11922J6445k7690j24493k67708k54711j9652J86541J32018n8856
$$ -37941 73981 90426 62736 -61757 -329465 -584176 -603828 -417287 -285269 -344125
38015c44125j01840M2939J69612J49003M7621m0127q5173n0978Q8098K23501J79499
$$ -344125 -445965 -403026 -233414 -84411 -36790 -76917 -162090 -213068 -124970 98531 278030
38004B78030l0383j66587p7853Q1229P3064q7761j78062q5765P7604J65990J44109
$$ 278030 247647 81060 3207 84436 157500 69739 -108323 -194088 -116484 49506 193615
37993A93615L5865j17587k12422j42894L0647J08667K1738o1836P147J33411J44209
$$ 193615 229480 111893 -100529 -243423 -212776 -104109 -82371 -144207 -137060 -3649 140560
37982A40560N8382J1767K545p9440k04436k05318n4236O6017L9222j1370O0750
$$ 140560 198942 210709 213254 133814 -70622 -275940 -330176 -264159 -224937 -236307 -175557
37971a75557J72298J24158r2224k47471j49769J19604K93786K15878m980j54671
$$ -175557 -3259 120899 28675 -218796 -368565 -248961 44825 260703 255723 101052
37961A01052j75561j72737j81414r7811Q6549J67027J2047j81124j49447K3225
$$ 101052 -74509 -247246 -428660 -526471 -439922 -272895 -260848 -441972 -591419 -568194
37951e68194M5641p9396m0997K41788M27227K61274k7557q5425M9735P3310r6841
$$ -568194 -522553 -601949 -642946 -401158 26069 287343 259786 174361 224096 297406 200565
37940B00565k52398k45117j38379k7084O7275J15227Q4502M0988Q0466J50336
$$ 200565 -51833 -296950 -435329 -462413 -395138 -279911 -195409 -154421 -73955 76381
37930G6381R7272r3480k60623k93539k47354j92891r8717O3661K12375K48276
$$ 76381 173653 80173 -180450 -473989 -721343 -914234 -1012951 -949290 -736915 -488639
37920d88639J92417J47843J50293J21588j6243k06868k78719j35623R2950J74619
$$ -488639 -296222 -148379 1914 123502 107259 -99609 -378328 -513951 -421001 -246382
37910b46382O0444n6199j4661J01861J25895N7807J3005M348m5470j16034r7783
$$ -246382 -185938 -242137 -256798 -154937 -29042 28765 41770 46118 648 -115386 -213169
37899b13169R560P5016L9163j1393j0906j3700o9049j21424j05723m0940L6140
$$ -213169 -203609 -128593 -89430 -100823 -111729 -125429 -194478 -315902 -421625 -462565 -426425
37888d26425J31637K15627J83395L447j65997j39923L2846J03771m4510k16002
$$ -426425 -294788 -79161 104234 107681 -58316 -198239 -165393 -61622 -106132 -322134
37878c22134j48154J21865K82585J59982m9311o5519P6077J02461p5021k46911
$$ -322134 -470288 -348423 -65838 94144 44833 -20686 55391 157852 82831 -164080
37868a64080k43462j50978r2913k0388J13184J63343O933j88637j56890P7555
$$ -164080 -407542 -558520 -651433 -671821 -558637 -395294 -388361 -576998 -733888 -656333
37858f56333K37495J84228M2916m4774o5472k3521R2113J94710J55434J5608m5702
$$ -656333 -418838 -234610 -191694 -236468 -301940 -325461 -233348 -38638 116796 132404 86702
37847H6702O149J4843p8674j24143l6047L4167n3226j78461j37464N5084K09160
$$ 86702 92851 107694 29020 -95123 -131170 -97003 -150229 -328690 -466154 -411070 -201910
37836b01910K25843J59511O3719o5258j87255j89068j6837K05722K52143K8793
$$ -201910 23933 183444 247163 181905 -5350 -194418 -211255 -5533 246610 275403
37826B75403k70674l32023r5649J40670J09017n7595m2836J52951K18646L8891
$$ 275403 4729 -327294 -422943 -282273 -173256 -230851 -273687 -120736 97910 136801
37816A36801j27190p6503L0170k4923j52747j38630m468O6813N0831P6509J66069
$$ 136801 9611 -66892 -36722 -61645 -214392 -353022 -357490 -290677 -239846 -163337 2732
37805B732K02562J29605Q691r2010j23718l4199J30278J79114R756j88947j66275
$$ 2732 205294 334899 343590 251580 127862 93663 223941 403055 412811 223864 57589
37794E7589J8027P7448p4280k21420j85735l2172J13721K29114K90165K11330
$$ 57589 75616 153064 78784 -142636 -328371 -360543 -246822 -17708 272457 483787
37784D83787J0527j28097q8359R951M136o8282o4908J3005L2115m9224j20353
$$ 483787 494314 366217 277858 287809 291945 223663 158755 171760 203875 154651 34298
37773C4298q9634K454P2521J07851J43036J74537J50704L9772j15605k18029j95755
$$ 34298 -55336 -52882 19639 127490 270526 445063 595767 635539 519934 301905 106150
37762A06150p4151L7067M3571m1590j14741r5239j0140N1812O0266P2637J24091
$$ 106150 31999 69066 112637 71047 -43694 -138933 -149073 -97261 -36995 35642 159733
37751A59733J44002M8827j13497k02705j67658r1985m4383M617P5310J09233Q2949
$$ 159733 303735 352562 239065 36360 -131298 -223283 -267666 -263049 -187739 -78506 4443
37740D443P6377J25113J17977j9005j39375o4178J11061J19983p0979j99781j05691
$$ 4443 80820 205933 323910 304905 165530 101352 212413 332396 261417 61636 -44055
37729d4055M2872M0524l8129J36J30224J53352J3116j42250j93140j50618k7967
$$ -44055 -1183 39341 1212 1348 131572 284924 298040 155790 -37350 -187968 -215935
37718b15935J78406L35706K26716j21544l49620j89897J51592K53089L9316j58888
$$ -215935 -37529 298177 524893 403349 53729 -136168 15424 268513 307829 148941
37708A48941r9273P3646J05142j2662j01191o4467M6370J33288R7517j03173l23489
$$ 148941 49668 123314 228456 215794 114603 50136 96506 229794 327311 224138 -99351
37697i9351k91874L5463L13452K12216j21591k59354q1945J12651R0618l5313
$$ -99351 -391225 -355762 -42310 169906 48315 -211039 -292984 -180333 -89715 -125028
37687a25028q0148n8828m6162q69R8882J27032n451j73270k04161j09246q091
$$ -125028 -205176 -264004 -310166 -311035 -212153 -85121 -90572 -263842 -468003 -577249 -585340
37676e85340O0236J15765J41485J41868J83990K53980K04545r864j86509j38885
$$ -585340 -525104 -409339 -267854 -125986 58004 311984 516529 506665 320156 181271
37666A81271J7869M0553q9622j92511j76638q9359M3121K00736K49570P3609j89230
$$ 181271 199140 239693 150071 -42440 -219078 -308437 -265316 -64580 184990 258599 69369
37655F9369k61053q0928J39992K17720J66392P2727j4609n6410m3409m6583j06590
$$ 69369 -191684 -272612 -132620 85100 251492 324219 309610 253200 209791 163208 56618
37644E6618j15033K4544J77547J35487n0813j37066o2083M050j3230o120L8527
$$ 56618 -58415 -33871 143676 279163 228350 91284 29201 33251 20021 13901 52428
37633E2428k3581j93519k54425j18332K4232M3341Q5706K65173L90859K46188
$$ 52428 28847 -164672 -419097 -537429 -513197 -469856 -384150 -118977 271882 518070
37623E18070m9665k08748j66912p7141k4435J8230L0463k8176p4240N149J30671
$$ 518070 468405 259657 92745 15604 -8831 9399 39862 11686 -62554 -57405 73266
37612G3266R7486j21702l03831k48673j1221J83098J86414N7542k7282K3383J19248
$$ 73266 170752 49050 -254781 -503454 -514675 -331577 -145163 -87621 -114903 -91520 27728
37601B7728J22991L9324k2621l8821p1373q5673L5339K41789K93460J00348j04861
$$ 27728 150719 190043 167422 128601 57228 -28445 6894 248683 542143 642491 537630
37590E37630q9279M7415M5950j27958k68536k33949r4421j781k4190q2926k740
$$ 537630 448351 495766 541716 413758 145222 -88727 -183148 -184929 -209119 -292045 -294785
37579b94785K89818N82434N44254J51592k32080l08330j80545j03799j19531j34921
$$ -294785 -4967 577467 1121721 1273313 1041233 732903 552358 448559 329028 194107
37569A94107j57400k05001j53510O7453K68679K45199Q1486l9236j49865l17582
$$ 194107 36707 -168294 -321804 -254351 14328 259527 341013 301777 151912 -165670
37559a65670l41431l1792L41017L28348k2888k34677j24664J1164j0644O966J75076
$$ -165670 -507101 -538893 -197876 130472 107584 -127093 -251757 -240593 -251237 -244271 -69195
37548f9195K62742J28868p279K5805N7816m1455o4169J30244K59527M9247k67785
$$ -69195 193547 322415 315136 340941 398757 357302 293133 423377 682904 732151 464366
37537D64366k97455j03687m1006j29603o7995J91626L35930J98576o286m7695
$$ 464366 166911 63224 22218 -107385 -175380 16246 352176 550752 544466 496771
37527D96771K9289P2300M0663l0872r5441p3215N4852J25815k6726k72822l08211
$$ 496771 526060 598360 639023 608151 512710 439495 494347 620162 593436 320614 12403
37516A2403j06170J6919j29088l27050k79402j0055K25497K81660K09985J07758
$$ 12403 -93767 -76848 -205936 -532986 -812388 -822443 -596946 -315286 -105301 2457
37506B457L1971J2112L7756N9126N0789K8324j4006r3127j45501o6656J10044
$$ 2457 34428 46540 84296 143422 194211 222535 208529 115402 -30099 -96755 13289
37495A3289J98718J00088n2015o8321N8965J78299J64241J0663j88213k83206
$$ 13289 212007 312095 260080 191759 250724 429023 593264 603927 415714 132508
37485A32508j71456P3877K34921J73558k4891j71984j72963o8500L6485M0869
$$ 132508 -38948 34929 269850 443408 418517 246533 73570 5070 41555 82424
37475H2424p0926j70706j02381R8832K09189R6055j15747k23374j75797m8515
$$ 82424 11498 -159208 -261589 -162757 46432 142487 26740 -196634 -372431 -420946
37465d20946Q5367J62019J26319L2587K7656J25069J36957l1157j74529p3753
$$ -420946 -335579 -173560 -47241 -14654 13002 138071 275028 243871 69342 -4411
37455d411J47179J88049J3512j29703r7957M561O2951Q0069M1098j02103k54709
$$ -4411 142768 330817 344329 214626 116669 121230 184181 264250 305348 203245 -51464
37444e1464k23503j6604J24686Q1783J4571M7391M7996j00704k32371j41595O4307
$$ -51464 -274967 -291571 -166885 -85102 -70531 -23140 24856 -75848 -308219 -449814 -385507
37433c85507J22595K1389k4886M2534N1180p1599j50197l7346J57795K41648J96126
$$ -385507 -262912 -241523 -266409 -223875 -172695 -244294 -394491 -431837 -274042 -32394 163732
37422A63732J33600Q7777k498j30543j76106o1452J16722J72170M1963j23730
$$ 163732 297332 385109 382611 252068 75962 14510 131232 303402 345365 221635
37412B21635j18591P4436K37298J53940j27494l25009k32468M3648K04409J04583
$$ 221635 103044 177480 414778 568718 441224 116215 -116253 -72605 131804 236387
37402B36387q7426j16314L5903J57907J23553M3190L8352L0239r3430k23951j62599
$$ 236387 148961 32647 68550 226457 350010 393200 431552 461791 368361 144410 -18189
37391a8189M4196J34198K819j74138k28504j89225j22804j3239J02253J04196
$$ -18189 26007 160205 163024 -11114 -239618 -428843 -551647 -564886 -462633 -358437
37381c58437K3182P4464L00950M10021J78684j79468l02633j73780n4727n6187
$$ -358437 -335255 -260791 40159 450180 628864 449396 146763 -27017 -81744 -137931
37371a37931o5973k8066m130J1689Q0554J39968P2087o7421j08479k7109O2426
$$ -137931 -203904 -231970 -236100 -224411 -143857 -3889 68198 777 -107702 -134811 -72385
37360g2385J24070J83702J65313M00j62830j35310n786J5056j4774J05531K71917
$$ -72385 51685 235387 400700 401100 238270 102960 97174 112230 97456 202987 474904
37349D74904J86107r5676j96008m8560K122j57491k02544j092R3838j16080k63529
$$ 474904 661011 565335 369327 320767 322889 165398 -37146 -38238 55600 -60480 -324009
37338c24009l8490K47518J89782k4866O972J82066J25665r7192j13745O9384J13420
$$ -324009 -362499 -114981 74801 49935 56907 238973 364638 267446 153701 223085 336505
37327C36505o601L433J48855J23393q1752j29580K4861L1257j83549k26808M9445
$$ 336505 329904 333337 482192 605585 523833 394253 419114 450371 266822 40014 89459
37316H9459K11459n4847l98102l58280o8156M3389n9822r0544J8620R3712J07565
$$ 89459 300918 246071 -152031 -510311 -578467 -535078 -594900 -685444 -666824 -573112 -465547
37305d65547J67039J95445L3331j79087j19928J84876L28830J20512j28623q0529
$$ -465547 -298508 -103063 -69732 -248819 -368747 -183871 144959 265471 136848 56319
37295E6319J45406J97598J2399j58984j61582j07964j13143q8688P0755K40490
$$ 56319 201725 399323 411722 252738 91156 -16808 -129951 -218639 -147884 92606
37285I2606J90648p9011l04721k90118j18254L5338J46296K66077L25732K04275
$$ 92606 283254 204243 -100478 -390596 -508850 -473512 -327216 -61139 264593 468868
37275D68868m7109k19665j91118l5540R4976Q9141p8646k90698l25923j10550
$$ 468868 421759 202094 10976 -24564 70412 159553 80907 -209791 -535714 -646264
37265f46264J28813J42717K2816N5849K59106L51278K06625L1460J351J5251n2727
$$ -646264 -517451 -374734 -351918 -296069 -36963 314315 520940 552400 553751 569002 516275
37254E16275j27177j30396j61023k66707k58236J789K93661K94285L2995j62780
$$ 516275 389098 258702 97679 -169028 -427264 -425475 -131814 162471 195466 32686
37244C2686j20220J8363O9434K6057k7668n5514o6289o2513l0785M3647J36299
$$ 32686 -87534 -69171 263 26320 -1348 -56862 -123151 -185664 -216449 -172802 -36503
37233c6503J55163L3119j32966j55276j3121J03321P7596L1443R1572J58908P8900
$$ -36503 118660 151779 18813 -136463 -149584 -46263 31333 62776 154348 313256 392156
37222C92156q5191j41132n3837L6319L8315k380k1238j3937k533J645J3768P1112
$$ 392156 306965 165833 111996 148315 186630 184250 163012 149075 146542 148187 161955 233067
37210B33067J51996J26196o3013j88060M0846M91719O56450L27060r2534j84424
$$ 233067 385063 511259 448246 260186 301032 792751 1449201 1776261 1683727 1499303
37200A499303j07925k47464n30934n47699k19219J01846J80719J38804J12601
$$ 1499303 1391378 1143914 612980 65281 -153938 -52092 128627 267431 380032
37191C80032N2791n5935j02039p2245q8330j39182o0710J26974J61054m7252k14724
$$ 380032 432823 376888 274849 202604 114274 -24908 -85618 41356 202410 155158 -59566
37180e9566q9809J73177K52560J04500m3593m0042M6173Q5353M3097k6904o8660
$$ -59566 -149375 23802 276362 380862 337269 297227 343400 428753 471850 444946 376286
37169C76286q7402j25709j62117r7817P8479J98101J23223k8780n4734R582l2794
$$ 376286 288884 163175 1058 -96759 -18280 179821 303044 274264 219530 229112 196318
37158A96318j76034k01492n1550O9019L3479l6118l6760n6194j40934j44319J7195
$$ 196318 20284 -181208 -232758 -163739 -130260 -166378 -203138 -259332 -400266 -544585 -527390
37147e27390J68956J31122r981p3081o3140p9300q0529L4424K00430K49867J59335
$$ -527390 -358434 -227312 -237293 -310374 -373514 -452814 -533343 -498919 -298489 -48622 110713
37136A10713N6444P253m6964j41412j99201j21729P9794K52966K23351M66j75002
$$ 110713 167157 174410 127446 -13966 -213167 -334896 -255102 -2136 221215 221681 46679
37125D6679j06893P4799Q9678o0209r2074Q0184J77435J0523j89424j32985P2060
$$ 46679 -60214 14585 104263 44054 -48020 32164 209599 220122 30698 -102287 -30227
37114c0227J19835m843n7059L5953R0801Q240q0964n8107J3199K7632q592k8789
$$ -30227 89608 84765 27706 63659 154460 162700 81736 23629 36828 64460 55868 27079
37102B7079l028N3570R2953N2744o4312j49549j03235L7461J51780J69330Q7526
$$ 27079 24051 77621 170574 223318 159006 9457 -93778 -56317 95463 264793 352319
37091C52319o7585k13187k28363j05868l804l6530j03950n6215O3280R4643J5205
$$ 352319 284734 71547 -156816 -262684 -266488 -303018 -406968 -463183 -399903 -305260 -290055
37080b90055m3853Q07J02522J73511J46539o62j78865k18787q0713N5322K7306
$$ -290055 -333908 -333101 -230579 -57068 89471 88809 -90056 -308843 -389556 -334234 -306928
37069c06928q9462j36202j11293q4041q041J57642K62118J55027k6416l7783P9129
$$ -306928 -396390 -532592 -643885 -727926 -735967 -578325 -316207 -161180 -187596 -225379 -146250
37058a46250Q4678k9155l9659P7453Q7677o3204j14241O2930K13845J03732j07493
$$ -146250 -61572 -90727 -130386 -52933 34744 -28460 -142701 -79771 134074 237806 130313
37047A30313j34152P305R4708O2309Q261m7888j56010k37970j42284R6181K45942
$$ 130313 -3839 3466 98174 160483 168744 120856 -35154 -273124 -415408 -319227 -73285
37036g3285J70409r180r1748l8105K5121o721q4696p6975N0740J80796K00647
$$ -73285 97124 87944 -3804 -41909 -16788 -23509 -108205 -185180 -134440 46356 247003
37025B47003J43798R3687K4164j22628k53936k14831n0894L1622m873J9734J49323
$$ 247003 390801 484488 508652 386024 132088 -82743 -133637 -102015 -106888 -87154 62169
37014F2169J59283o0845k45170j20343J49894J88063l4032j77188o3797Q9971
$$ 62169 221452 160607 -84563 -204906 -55012 133051 99019 -78169 -141966 -51995
37004e1995N1465q2985p9074P0484J60397Q4266l2547k3443J01416J82838J22237
$$ -51995 -530 -83515 -162589 -92105 68292 152558 120011 96568 197984 380822 503059
36993E03059J464l5080J9739K7728r2047k33359k28244m7398J79129K92928K10744
$$ 503059 504523 469443 489182 516910 424863 191504 -36740 -84138 94991 387919 598663
36982E98663l5384k86424l44135j64294P4178J73944J42753J17036J27508Q7958
$$ 598663 563279 276855 -67280 -231574 -157396 16548 159301 276337 403845 491803
36972D91803j1241p0559o1914p1852j09731m7264J42760K48994R6902j44398j46812
$$ 491803 480562 410003 348089 276237 166506 119242 262002 510996 607898 463500 316688
36961C16688J14448L06370J91093p2584j92466j36767q9783j19966j05444K3735
$$ 316688 431136 737506 928599 856015 663549 526782 436999 317033 211589 235324
36951B35324J61352J89042J20446K5093o9879j41021j44049r4256o6522n6713
$$ 235324 396676 585718 706164 731257 661378 520357 376308 282052 215530 158817
36941A58817K7154J57578J34985j11308l18123j97818J35261K86981J06558j48401
$$ 158817 185971 343549 478534 367226 49103 -148715 -13454 273527 380085 231684
36931B31684j94525m9268R3341J22578M8098p6264j65914j48626o4622k4514k9964
$$ 231684 37159 -12109 81232 203810 251908 175644 9730 -138896 -203518 -228032 -257996
36920b57996L1078J66838K22795J18714j8254n9485n3071p2905n4963N1921J20223
$$ -257996 -226918 -60080 162715 281429 263175 203690 150619 77714 22751 74672 194895
36909A94895K9296r7713o5390O7461P7708m6315q5277L1795R3528m9135k26054
$$ 194895 224191 126478 61088 128549 206257 159942 74665 106460 199988 150853 -75201
36898g5201j89754L8673K32245K69120K15402J50472P2398k2756r8384j41234
$$ -75201 -264955 -226282 5963 275083 490485 640957 713355 690599 592215 450981
36888D50981j73459j79415j11600K382N7271K4543O212N2686L8707j31735k82370
$$ 450981 277522 98107 -13493 -11111 46160 70703 76915 129601 168308 36573 -245797
36877b45797j50361J86430L24520P7333k40972k59675o5572J344q8491n7850J46762
$$ -245797 -396158 -209728 114792 192125 -48847 -308522 -374094 -372750 -461241 -519091 -372329
36866c72329K25098K9189j54319m2080J93779J87916o9669k40131j26253J04409
$$ -372329 -147231 -118042 -272361 -314441 -120662 67254 -2415 -242546 -368799 -264390
36856b64390J95718R7777o0918j50809j29426l6398N1019Q7211Q7712P8981O0175
$$ -264390 -68672 29105 -31813 -182622 -312048 -348446 -297427 -210216 -122504 -43523 16652
36845A6652L9706M9714Q5589R2551M9371j480l6024p8484j22608j20973p5946
$$ 16652 56358 106072 191661 284212 333583 332103 296079 217595 94987 -25986 -101932
36834a01932k9502M3447J78544K57862J20874j23105j64222L2878J32465l0099
$$ -101932 -131434 -87987 90557 348419 469293 346188 181966 214844 347309 317210
36824C17210j50277L3802K59764J48591j68652k79491j58162j09863j59590l7776
$$ 317210 166933 200735 460499 609090 440438 160947 2785 -107078 -266668 -304444
36814c04444K30868K72631O35k00415r5164N7921N48j13396o7777L0752J9843
$$ -304444 -73576 199055 199690 -725 -95889 -37968 -37420 -150816 -218593 -187841 -167998
36803a67998R845J28651K21042J28701J8083Q9001J80125K8434k58089l59812
$$ -167998 -158153 -29502 191540 320241 338324 427325 607450 635884 377795 17983
36793A7983k41826j23829o0529P3033K40730K60217J42790Q0237R3681J9095j45749
$$ 17983 -223843 -347672 -408201 -335168 -94438 165779 308569 388806 482487 501582 355833
36782C55833k01232q8811K6196N3883O7515N8146p8361k48611j97787N1998J42206
$$ 355833 154601 65790 91986 145869 213384 271530 193169 -55442 -253229 -201231 -59025
36771e9025p9770k89315j78831P3697J12372n4105j34357k4462J18869J88931
$$ -59025 -138795 -428110 -606941 -533244 -420872 -474977 -609334 -633796 -514927 -325996
36761c25996K21933K15754J12840l7852j12127j01304q8718n9023O8139K23908
$$ -325996 -104063 111691 224531 186679 74552 -26752 -115470 -174493 -106354 117554
36751A17554K26347N9529q7244j10041j19141j93233k01535k0019K13427K44278
$$ 117554 343901 403430 316186 206145 87004 -106229 -307764 -327783 -114356 129922
36741A29922M8366j30511r6057P5291J70859J14724K0896k56P118o0850j79525
$$ 129922 178288 47777 -48280 27011 197870 312594 333490 333234 340352 279502 99977
36730I9977k03402o7995J13786J97350J60952O4379m5555j12390o4422N5642O5705
$$ 99977 -103425 -171420 -57634 139716 300668 365047 319492 207102 142680 198322 264027
36719B64027j03523k41913j41677N5846N9230q8393o1042J86869K89940N3953
$$ 264027 160504 -81409 -223086 -167240 -108010 -196403 -257445 -70576 219364 273317
36709B73317j97452j21595J07439J15459n3162o2578R7183R8562j14274j82793
$$ 273317 75865 -45730 61709 177168 124006 61428 158611 257173 142899 -39894
36699c9894O0662K71142J23891j66756j83081P0180K29458J39977N289j2714j7505
$$ -39894 20768 291910 415801 249045 65964 136144 365602 505579 510868 498154 480649
36688D80649j20532k12661j38603M8209J49951P6777p1727j48014j04208o563
$$ 480649 360117 147456 8853 57062 207013 283790 212063 64049 -40159 -46722
36678d6722M8749K6594k2811k6887K3939O3768K6681p1026j31758p5643N5274
$$ -46722 2027 28621 5810 -21077 2862 66630 93311 22285 -109473 -185116 -129842
36667a29842J25027O6974k2987j9112M8480M3142n7507j19718o2561J9177P831
$$ -129842 -4815 62159 39172 20060 68540 111682 54175 -65543 -128104 -108927 -101096
36656a01096o6238r0242k9363N5199R1072M5155m8208q0813J6760J36389R9991
$$ -101096 -167334 -257576 -286939 -231740 -140668 -95513 -143721 -224534 -207774 -71385 28606
36645B8606n9599j05682L5561J27700o757j80215j26186P9845J61108Q3871N4879
$$ 28606 -30993 -136675 -101114 26586 19829 -160386 -286572 -206727 -45619 38252 93131
36634I3131J29558J37994J2150j06159j33165j50558j77529r8210Q0684J46237
$$ 93131 222689 360683 372833 266674 133509 -17049 -194578 -292788 -212104 -65867
36624f5867m429j68486j17022Q8964K16014J65171K0810j02681j35466n7993O2757
$$ -65867 -70296 -238782 -355804 -266840 -50826 114345 135155 32474 -102992 -160985 -98228
36613i8228J13865Q0688N8870P5417L1451j03864j88990j07460N2771J27513P7747
$$ -98228 15637 96325 155195 230612 262063 158199 -30791 -138251 -85480 42033 119780
36602A19780l4268j55450k25883j69231j4428P8459K6225m7298j083J11693J46158
$$ 119780 85512 -69938 -295821 -465052 -479480 -401021 -374796 -422094 -423177 -311484 -165326
36591a65326P9470p162p0255j00795o4575K7233O8739N629m9635K2556J50108
$$ -165326 -85856 -93018 -163273 -264068 -328643 -301410 -232671 -227042 -276677 -254121 -104013
36580a04013J65002M0094r3421j19829l3408Q7174J25100K4203r8189n3208J37937
$$ -104013 60989 101083 7662 -112167 -145575 -58401 66699 90902 -7287 -60495 77442
36569G7442K22491P6009j00237q7284L3660N9176j8241r1395j70881k79744k67193
$$ 77442 299933 375942 275705 188421 222081 281257 263016 171621 740 -279004 -546197
36558e46197k6793K15854J66301n7723o3803K08174L80316K00882j19538k56779
$$ -546197 -572990 -357136 -190835 -248558 -312361 -104187 276129 477011 357473 100694
36548A00694j80206o2974n232k173l2259n1759j4846L1770l814q2623o0080P4578
$$ 100694 -79512 -142486 -147718 -149891 -182150 -233909 -248755 -216985 -220799 -303422 -363502 -288924
36536b88924J53969Q2884l0501n6900j0250K9854K6735k3158q2329m7266J20685
$$ -288924 -134955 -52071 -82572 -139472 -149722 -119868 -93133 -116291 -198620 -245886 -125201
36525a25201K53838J53351j04802k50852k00224j08577n3007M6805J57145J16098
$$ -125201 128637 281988 177186 -73666 -273890 -382467 -435474 -388669 -231524 -115426
36515a15426j9585L0625K77026L28917m181l28106k14238J40845K05535j04757
$$ -115426 -135011 -104386 172640 501557 497376 169270 -44968 95877 301412 196655
36505A96655l52774k35584O4003K23469J75509O3689J2498M2108R6185R8344L8959
$$ 196655 -156119 -391703 -327700 -104231 71278 134967 147465 189573 285758 384102 423061
36494D23061q737p892j5201m5044K075J53307K39262J30088k0095K1065J93208
$$ 423061 414324 406432 391231 346187 348262 501569 740831 870919 850824 871889 1065097
36483A065097K17020J2174j95858k14602j22784j01756j85296k62561k36664j16849
$$ 1065097 1282117 1294291 1098433 883831 761047 659291 473995 211434 -25230 -142079
36473a42079k232M851r3596j80729j54315k9557J14602K17425K25710J08241n1755
$$ -142079 -144311 -139460 -233056 -413785 -568100 -597657 -483055 -265630 -39920 68321 16566
36462A6566r9123k6987j4764j35087j90912j8559K05037J96526K388o9366Q2574
$$ 16566 -82557 -109544 -124308 -259395 -450307 -468866 -263829 -67303 -64915 -134281 -51707
36451e1707K20183J35050p3369j66261o2877J03305J42282p083k01183k31889
$$ -51707 168476 303526 230157 63896 1019 104324 246606 239523 38340 -193549
36441a93549q3232M7138M4541L3518J11287J24796o1251k46138j42173J61756
$$ -193549 -276781 -229643 -185102 -151584 -40297 84499 23248 -222890 -365063 -203307
36431b03307L04550J69062k2678j04354j26170j12091L521J38003Q4294j33292
$$ -203307 101243 270305 247627 143273 17103 -94988 -91467 46536 130830 -2462
36421b462k27919q3149P4902O3772R854O2946J19191L7384q7370q2698L1584J20444
$$ -2462 -230381 -313530 -238628 -174856 -165002 -102056 17135 54519 -32851 -115549 -83965 36479
36409C6479J41082J18391N3706o179M0589J65193J79538K0843j21017j02463m7820
$$ 36479 177561 295952 349658 343479 384068 549261 728799 749642 628625 526162 478342
36398D78342r7737j46915n7323N1466j0245j56523j42924M5367J78824J24410
$$ 478342 380605 233690 176367 227833 217588 61065 -81859 -36492 142332 266742
36388B66742j8737j11168j17132o4497p685j2738o7807o2697L7969R6422O399
$$ 266742 248005 136837 19705 -44792 -52477 -65215 -133022 -195719 -157750 -61328 -54929
36377e4929j15520j04909r499J2650l3038p537J15611K23274K38702J60333j2770
$$ -54929 -170449 -275358 -284857 -272207 -305245 -312782 -197171 26103 264805 425138 412368
36366D12368k26278l16531j96162k2322R919l8349K6661J92921K65631J74654
$$ 412368 186090 -130441 -326603 -348925 -339006 -377355 -350694 -157773 107858 282512
36356B82512K0915j31307k59101k38736Q094K57981J99668q4544j87254K3183
$$ 282512 303427 172120 -86981 -325717 -317623 -59642 140026 55482 -131772 -108589
36346a08589K19050J35150p1980j51579j25762j13654o6276P2493J64655R5888
$$ -108589 110461 245611 173631 22052 -103710 -217364 -283640 -211147 -46492 49396
36336D9396Q629O2512J35299L9065j16259q6736Q0688J18269j1741p5572K481
$$ 49396 58025 120537 255836 294901 178642 91906 172594 290863 279122 203550 206031
36325B06031Q896j54725k42547l6152K72628L12640L7084k34758k49839r2247
$$ 206031 214927 60202 -182345 -218497 54131 366771 403855 169097 -80742 -172989
36315a72989J3534M264j6408J9726O3507N7067K1821K800m560j8268j3014K9618
$$ -172989 -159455 -155191 -171599 -151873 -88366 -31299 -9478 -6678 -11238 -29506 -42520 -12902
36303a2902N1823o996q2323m3297R6483J45793j2091k25341k40814k3567K00422
$$ -12902 38921 31925 -50398 -93695 2788 148581 136490 -88851 -329665 -353232 -152810
36292a52810K19684O1124q9369j15062n7333r249M772J4902J9379j7604p8573
$$ -152810 66874 127998 38629 -76433 -133766 -143015 -138243 -123341 -103962 -121566 -200139
36281b00139q0604L230P6424M8516k1941j8092L6714O175j27238k02599j05674
$$ -200139 -280743 -277513 -201089 -152573 -174514 -192606 -155892 -149717 -276955 -479554 -585228
36270e85228P0773J69111J64443J29605R4103M8287K4376N9555J14879J26722
$$ -585228 -514455 -345344 -180901 -51296 42807 91094 115470 175025 289904 416626
36260D16626R9275N0584p6104l09240m88251l82756j5009K92077K81311O0679
$$ 416626 515901 566485 490381 181141 -307110 -689866 -704875 -412798 -131487 -70808
36250g0808p4674k6813M7709K0365m6205n1498j8583j0087M938P7396J43021R9744
$$ -70808 -145482 -172295 -124586 -104221 -150426 -201924 -220507 -230594 -225656 -148260 -5239 94505
$$ [...]
##END NTUPLES=NMR SPECTRUM
##END=
