##TITLE=31Pdec_IBDP3001
 CDCl3, 24 sc
 8.2.2019
##JCAMPDX= 6.0         $$ Bruker NMR JCAMP-DX V2.0
##DATA TYPE= NMR SPECTRUM
##DATA CLASS= NTUPLES
##ORIGIN= UXNMR, Bruker Analytische Messtechnik GmbH
##OWNER= root
$$ XWIN-NMR		Version 3.5
$$ Fri Feb  8 16:59:37 2019 Russian Standard Time (UT+4h)  she@DPX200
##.OBSERVE FREQUENCY= 81.013821
##.OBSERVE NUCLEUS= ^31P
##.ACQUISITION MODE= SIMULTANEOUS
##.ACQUISITION SCHEME= undefined
##.AVERAGES= 24
##.DIGITISER RES= 17
##SPECTROMETER/DATA SYSTEM= spect
##.PULSE SEQUENCE= zgpg30
##.SOLVENT NAME= CDCl3
##.SHIFT REFERENCE= (INTERNAL, CDCl3, 0, 182.463)
##AUDIT TRAIL= $$ (NUMBER, WHEN, WHO, WHERE, WHAT)
$$ ##TITLE= Audit trail, XWIN-NMR		Version 3.5
$$ ##JCAMPDX= 5.01
$$ ##ORIGIN= Bruker BioSpin GmbH
$$ ##OWNER= she
$$ F:/spectra/data/she/nmr/P31/1/pdata/1/auditp.txt
$$ ##AUDIT TRAIL=  $$ (NUMBER, WHEN, WHO, WHERE, WHAT)
(   1,<2019-02-08 16:57:36.53 +0400>,<she>,<DPX200>,
      <created by zg, POWCHK disabled, PULCHK disabled
       configuration hash MD5:
       00 E9 B6 7A A2 85 ED C7 34 08 36 98 17 FE 4E 26
       data hash MD5: 32K
       72 3E D4 EE F9 72 C6 83 9B 03 A0 8F 14 99 BA F0>)
(   2,<2019-02-08 16:57:39.17 +0400>,<she>,<DPX200>,
      <Start of raw data processing
       efp BC_mod = 2 LB = 1 FT_mod = 6 PKNL = 1 PHC0 = -1456.42 PHC1 = 81.19894 SI = 64K 
       data hash MD5: 64K
       FA F4 D8 B5 E0 32 24 7A 63 F3 3F 78 8D 27 D2 A5>)
(   3,<2019-02-08 16:57:54.60 +0400>,<she>,<DPX200>,
      <pk PHC0 = 2.66629 PHC1 = 0 
       data hash MD5: 64K
       24 60 A4 F1 B3 11 B2 F5 77 C6 BF 2C C3 F9 FC 5B>)
(   4,<2019-02-08 16:58:04.18 +0400>,<she>,<DPX200>,
      <abs ABSG = 5 
       data hash MD5: 64K
       39 3C 27 47 B3 04 BD 08 8C 1F 12 76 76 F5 6F F6>)
$$ ##END=
$$ 
$$ hash MD5
$$ BC 23 A4 E5 3B E2 5E 46 40 23 FF E3 70 DD 7E 33
##$RELAX= 
##$RELAX= 
##$RELAX= 
##$RELAX= 
##$RELAX= 
##$RELAX= 
##$RELAX= 
##$RELAX= 
$$ Bruker specific parameters
$$ --------------------------
##$DU= <F:/spectra>
##$EXPNO= 1
##$NAME= <P31>
##$PROCNO= 1
##$TYPE= <nmr>
##$USER= <she>
##$AMP= (0..31)
100 100 100 100 100 100 100 100 100 100 100 100 100 100 100 100 100 100 
100 100 100 100 100 100 100 100 100 100 100 100 100 100 
##$AQSEQ= 0
##$AQ_mod= 1
##$AUNM= <au_zg>
##$AUTOPOS= <>
##$BF1= 81.014009
##$BF2= 200.13
##$BF3= 200.13
##$BF4= 200.13
##$BF5= 200.13
##$BF6= 200.13
##$BF7= 200.13
##$BF8= 200.13
##$BYTORDA= 1
##$CFDGTYP= 0
##$CFRGTYP= 5
##$CHEMSTR= <none>
##$CNST= (0..31)
1 1 145 1 1 1 1 1 1 1 1 1 1 1 1 1 1 1 1 1 1 1 1 1 1 1 1 1 1 1 1 1 
##$CPDPRG= <waltz16>
##$CPDPRG1= <>
##$CPDPRG2= <waltz16>
##$CPDPRG3= <>
##$CPDPRG4= <mlev>
##$CPDPRG5= <mlev>
##$CPDPRG6= <mlev>
##$CPDPRG7= <mlev>
##$CPDPRG8= <mlev>
##$CPDPRGB= <>
##$CPDPRGT= <>
##$D= (0..31)
0 1 0 0 0 0 0 0 0 0 0 0.03 2e-05 3e-06 0 0 0 0 0 0 0 0 0 0 0 0 0 0 0 0 
0 0 
##$DATE= 1549630655
##$DBL= (0..7)
120 120 120 11 120 120 24 19 
##$DBP= (0..7)
150 150 150 150 150 150 150 150 
##$DBP07= 0
##$DBPNAM0= <>
##$DBPNAM1= <>
##$DBPNAM2= <>
$$ [...]
##$SUBNAM3= <"">
##$SUBNAM4= <"">
##$SUBNAM5= <"">
##$SUBNAM6= <"">
##$SUBNAM7= <"">
##$SUBNAM8= <"">
##$SUBNAM9= <"">
##$SW= 369.568048894756
##$SWIBOX= (0..15)
0 1 3 0 0 0 0 0 0 0 0 0 0 0 0 0 
##$SW_h= 29940.119760479
##$TD= 32768
##$TD0= 1
##$TE= 0
##$TE2= 300
##$TE3= 300
##$TEG= 300
##$TL= (0..7)
0 120 53 12 22 120 120 120 
##$TP= (0..7)
150 150 150 150 150 150 150 150 
##$TP07= 0
##$TPNAME0= <>
##$TPNAME1= <>
##$TPNAME2= <>
##$TPNAME3= <>
##$TPNAME4= <>
##$TPNAME5= <>
##$TPNAME6= <>
##$TPNAME7= <>
##$TPOAL= (0..7)
0.5 0.5 0.5 0.5 0.5 0.5 0.5 0.5 
##$TPOFFS= (0..7)
0 0 0 0 0 0 0 0 
##$TUNHIN= 0
##$TUNHOUT= 0
##$TUNXOUT= 0
##$USERA1= <user>
##$USERA2= <user>
##$USERA3= <user>
##$USERA4= <user>
##$USERA5= <user>
##$V9= 5
##$VALIST= <valist>
##$VCLIST= <CCCCCCCCCCCCCCC>
##$VD= 0
##$VDLIST= <DDDDDDDDDDDDDDD>
##$VPLIST= <PPPPPPPPPPPPPPP>
##$VTLIST= <TTTTTTTTTTTTTTT>
##$WBST= 1024
##$WBSW= 4
##$XGAIN= (0..3)
0 0 0 0 
##$XL= 0
##$YL= 0
##$YMAX_a= 41668
##$YMIN_a= -42670
##$ZGOPTNS= <>
##$ZL1= 120
##$ZL2= 120
##$ZL3= 120
##$ZL4= 120
##$ABSF1= 182.463
##$ABSF2= -187.1042
##$ABSG= 5
##$ABSL= 3
##$ALPHA= 0
##$AQORDER= 0
##$ASSFAC= 0
##$ASSFACI= 0
##$ASSFACX= 0
##$ASSWID= 0
##$AUNMP= <proc_1d>
##$AZFE= 0.1
##$AZFW= 0.5
##$BCFW= 0
##$BC_mod= 2
##$BYTORDP= 0
##$COROFFS= 0
##$CY= -3
##$DATMOD= 1
##$DC= 0
##$DFILT= <>
##$DTYPP= 0
##$F1P= 0
##$F2P= 0
##$FCOR= 1
##$FTSIZE= 65536
##$FT_mod= 6
##$GAMMA= 0
##$GB= 0
##$INTBC= 1
##$INTSCL= 5.30512e-09
##$ISEN= 30
##$LB= 1
##$LEV0= 0
##$LPBIN= 0
##$MAXI= 10000
##$MC2= 0
##$MEAN= 0
##$ME_mod= 0
##$MI= 50
##$NCOEF= 0
##$NC_proc= -4
##$NLEV= 6
##$NOISF1= 182.463
##$NOISF2= 159.3651
##$NSP= 0
##$NTH_PI= 0
##$NZP= 0
##$OFFSET= 182.463
##$PC= 4
##$PHC0= -1453.754
##$PHC1= 81.19894
##$PH_mod= 1
##$PKNL= yes
##$PPARMOD= 0
##$PSCAL= 0
##$PSIGN= 0
##$REVERSE= no
##$SF= 81.0140089999434
##$SI= 65536
##$SIGF1= 159.3651
##$SIGF2= -187.1042
##$SINO= 113.3802
##$SIOLD= 16384
##$SREGLST= <1H.CDCl3>
##$SSB= 0
##$STSI= 65536
##$STSR= 0
##$SW_p= 29940.119760479
##$SYMM= 0
##$S_DEV= 0
##$TDeff= 32768
##$TDoff= 0
##$TI= <>
##$TILT= no
##$TM1= 0
##$TM2= 0
##$TOPLEV= 0
##$USERP1= <user>
##$USERP2= <user>
##$USERP3= <user>
##$USERP4= <user>
##$USERP5= <user>
##$WDW= 1
##$XDIM= 65536
##$YMAX_p= 501976405
##$YMIN_p= -27529754
$$ End of Bruker specific parameters
$$ ---------------------------------
##NTUPLES= NMR SPECTRUM
##VAR_NAME=  FREQUENCY,     SPECTRUM/REAL,   SPECTRUM/IMAG
##SYMBOL=    X,             R,               I
##VAR_TYPE=  INDEPENDENT,   DEPENDENT,       DEPENDENT
##VAR_FORM=  AFFN,          ASDF,            ASDF
##VAR_DIM=   65536,         65536,           65536
##UNITS=     HZ,            ARBITRARY UNITS, ARBITRARY UNITS
##FACTOR=    0.456856943014862, 1,           1
##FIRST=     14782.0589164792, 0,            0
##LAST=      -15158.0608439998, 0,           0
##MIN=       -15158.0608439998, -27529754,   0
##MAX=       14782.0589164792, 501976405,    0
$$ Real data points
##PAGE= N=1
##DATA TABLE= (X++(R..R)), XYDATA
$$ [...]
$$ plain form
42274 -373082 91943 203171 140046 236107 324946 25594 -562342 -923531 -802062 -456074
42264 -456074 -281163 -419684 -677181 -686240 -304038 77434 -86332 -697894 -1038695 -785826
42254 -785826 -474728 -591264 -780842 -519940 -58856 27424 -156482 -78425 225576 271984
42244 271984 116641 320011 899920 1201525 981735 802653 1062772 1372915 1266321 908408
42234 908408 695372 652245 614702 587631 591922 538959 518187 787066 1227665 1291647 785984
42223 785984 227265 69912 83744 -75453 -171364 173442 703729 811046 406859 -14170
42213 -14170 -90404 63335 169698 94508 -122228 -303959 -293323 -202745 -286329 -446773 -262592
42202 -262592 270142 518255 128598 -329187 -189415 275601 335997 -17358 -181628 -46673
$$ packed form
42274c73082M65025J11228o3125R6061Q8839k99352n87936l61189J21469L45988
42264d56074J74911j38521k57497r059L82202L81472j63766o11562l40801K52869
42254g85826L11098j16536j89578K60902M61084Q6280j83906P8057L04001M6408
42244B71984j55343K03370N79909L01605k19790j79082K60119L10143j06594l57913
42234I08408k13036m3127l7543k7071M291n2963k0772K68879M40599O3982n05663
42223G85984n58719j57353J3832j59197r5911L44806N30287J07317m04187m21029
42213a4170p6234J53739J06363p5190k16736j81731J0636R0578q3584j60444J84181
42202b62592N32734K48113l89657m57785J39772M65016O0396l53355j64270J34955
$$ plain form
42192 -46673 -111032 -474916 -585646 -207357 119802 -65202 -470006 -639371 -677326 -899010
42182 -899010 -1179501 -1173944 -921616 -734451 -639479 -388728 41326 370425 453964 466877
42172 466877 574875 683649 633661 472098 394553 485927 618915 604675 398055 139288
42162 139288 14626 114237 419374 832660 1150706 1103498 576919 -209172 -862397 -1161727
42152 -1161727 -1161925 -1016349 -848181 -768658 -832943 -936523 -902775 -715228 -532568 -448530 -389737
42141 -389737 -293751 -220336 -202980 -143145 28149 195996 199476 56241 -67545 -72496 -13394
42130 -13394 4602 -66239 -198152 -302074 -266215 -66715 128721 52972 -362134 -803809
42120 -803809 -840917 -437277 -58763 -110674 -390068 -364047 48442 330104 107452 -325752
$$ packed form
42192d6673o4359l63884j10730L78289L27159j85004m04804j69365l7955k21684
42182h99010k80491N557K52328J87165R4972K50751M30054L29099Q3539J2913
42172D66877J07998J08774m9988j61563p7545R1374J32988j4240k06620k58767
42162A39288j24662R9611L05137M13286L18046m7208n26579p86091o53225k99330
42152a161727j98J45576J68168P9523o4285j03580L3748J87547J82660Q4038N8793
42141c89737R5986P3415J7356N9835J71294J67847L480j43235j23786m951N9102
42130a3394J7996p0841j31913j03922L5859J99500J95436p5749m15106m41675
42120h03809l7108M03640L78514n1911k79394K6021M12489K81662k22652m33204
$$ plain form
42110 -325752 -483706 -375720 -331385 -345838 -97873 393641 628921 317245 -174046 -329248
42100 -329248 -182761 -189752 -528632 -861672 -811066 -416524 -9508 195645 223993 151358
42090 151358 9112 -106030 -45870 144437 183556 -49265 -244955 -78461 242866 243240
42080 243240 -57493 -145157 125198 224955 -191128 -633201 -456746 166769 503275 263306
42070 263306 -175981 -426607 -453534 -340260 -166348 -111371 -273989 -413687 -246513 83033
42060 83033 224127 184779 205090 207607 -54683 -398490 -410416 -220408 -365227 -831745 -1006309
42049 -1006309 -723992 -545736 -714271 -685906 -147310 317136 179691 -126509 26512 401038
42039 401038 404056 167802 239327 527997 472141 76863 -100741 45371 21867 -344812
$$ packed form
42110c25752j57954J07986M4335j4453K47965M91514K35280l11676m91291j55202
42100c29248J46487o991l38880l33040N0606L94542M07016K05153K8348p2635
42090A51358j42246j15142O0160J90307L9119k32821j95690J66494L21327L74
42080B43240l00733q7664K70355R9757m16083m42073J76455O23515L36506k39969
42070B63306m39287k50626k6927J13274J73912N4977j62618j39698J67174L29546
42060H3033J41094l9348K0311K517k62290l43807j1926J90008j44819m66518j74564
42049a006309K82317J78256j68535K8365N38596M64446j37445l06200J53021L74526
42039D01038L018k36254P1525K88670n5856l95278j77604J46112k3504l66679
$$ plain form
42029 -344812 -612988 -508997 -328398 -341783 -389529 -318192 -323765 -591820 -967638 -1179491
42019 -1179491 -1076307 -567160 278770 985066 969127 256666 -487590 -775551 -741654 -652276
42009 -652276 -452316 -58624 302354 376098 236167 114010 97797 163041 247346 173258
41999 173258 -196255 -616225 -645198 -301497 -92165 -200700 -166245 305113 739942 600234
41989 600234 155639 52692 302476 344553 -17209 -371694 -385090 -173872 63338 291358
41979 291358 413203 242952 -148997 -424304 -431665 -337018 -215713 84018 519292 717334
41969 717334 524058 319975 448741 627077 337019 -375716 -930166 -971403 -695683 -405279
41959 -405279 -145366 87724 124775 -151985 -564312 -829225 -855973 -686993 -320944 164823
$$ packed form
42029c44812k68176J03991J80599j3385m7746P1337n573k68055l75818k11853
42019a179491J03184N09147Q45930P06296j5939p12461p44256k87961L3897Q9378
42009f52276J99960L93692L60978P3744j39931j22157j6213O5244Q4305p4088
41999A73258l69513m19970k8973L43701K09332j08535L4455M71358M34829j39708
41989F00234m44595j02947K49784M2077l61762l54485j3396K11218K37210K28020
41979B91358J21845j70251l91949k75307p361R4647J21305K99731M35274J98042
41969G17334j93276k04083J28766J78336k90058p12735n54450m1237K75720K90404
41959d05279K59913K33090L7051k76760m12327k64913k6748J68980L66049M85767
$$ plain form
41949 164823 453962 273220 -182107 -402640 -195222 109090 157468 7242 -94193 -105290
41939 -105290 -149273 -271857 -464030 -744877 -974235 -782829 -37323 756448 925629 476715
41929 476715 61632 71315 199577 28435 -394427 -794858 -1096640 -1288778 -1187053 -713642
41919 -713642 -207008 -69977 -240141 -356689 -323007 -321509 -364976 -268461 -63969 -6710 -90930
41908 -90930 20336 430743 768940 734153 529961 463772 425318 144617 -246527 -349271
41898 -349271 -106588 151163 275058 491778 919317 1270073 1254420 1002696 841324 851697
41888 851697 891185 877300 787067 516114 41160 -355115 -333388 40601 363456 417083
41878 417083 332603 233154 73886 -74497 35607 403143 619335 406439 53691 8344
$$ packed form
41949A64823K89139j80742m55327k20533K07418L04312M8378j50226j01435j1097
41939a05290m3983j22584j92173k80847k29358J91406P45506P93771J69181m48914
41929D76715m15083R683J28262j71142m22862m00431l01782j92138J01725M73411
41919g13642N06634J37031j70164j16548L3682J498m3467R6515K04492N7259q4220
41908i0930J11266M10407L38197l4787k04192o6189l8454k80701l91144j02744
41898c49271K42683K57751J23895K16720M27539L50756j5653k51724j61372J0373
41888H51697L9488j3885r0233k70953m74954l96275K1727L73989L22855N3627
41878D17083q4480r9449j59268j48383J10104L67536K16192k12896l52748m5347
$$ plain form
41868 8344 239621 349769 178793 -47420 -98593 45396 312326 576382 624247 381342
41858 381342 147226 306971 807862 1198920 1178266 821363 307910 -226736 -564091 -520460
41848 -520460 -282801 -264653 -501509 -537211 -80084 546612 816414 607565 206988 -78424
41838 -78424 -151516 -155244 -378463 -922777 -1419985 -1377898 -859874 -446146 -427134 -482150 -324796
41827 -324796 -158269 -200350 -258975 -171990 -195477 -476569 -581491 -127318 482636 596309
41817 596309 287214 95170 41891 -281028 -742357 -672522 45073 688376 750218 564417
41807 564417 565738 601347 415398 243049 384879 601798 476797 102171 -92281 965
41797 965 134022 180404 211783 192168 4176 -249704 -328510 -237582 -219523 -335965 -342088
$$ packed form
41868H344K31277J10148j70976k26213n1173J43989K66930K64056M7865k42905
41858C81342k34116J59745N00891L91058k0654l56903n13453n34646l37355M3631
41848e20460K37659J8148k36856l5702M57127O26696K69802k08849m00577k85412
41838g8424p3092l728k23219n44314m97208M2087N18024M13728J9012n5016J57354
41827c24796J66527m2081n8625Q6985k3487k81092j04922M54173O09954J13673
41817E96309l09095j92044n3279l22919m61329O9835P17595O43303O1842j85801
41807E64417J321L5609j85949j72349J41830K16919j25001l74626j94452R3246
41797I65J33057M6382L1379j9615j87992k53880p8806R0928J8059j16442o123
$$ plain form
41786 -342088 -48232 409655 740556 794518 644778 494912 527264 734106 880458 726140
41776 726140 298698 -124179 -303199 -247973 -146979 -145743 -211744 -210838 -106641 -23182 -53618
41765 -53618 -92259 7338 172286 204647 113206 116137 279051 395397 312565 145378 50131
41754 50131 7228 -30066 21717 213687 408368 439590 285904 -15173 -421378 -739635
41744 -739635 -694133 -337975 -139723 -406214 -847450 -994714 -823512 -625005 -466015 -194559
41734 -194559 135500 285464 252436 268852 377193 397813 351026 493047 824362 964723
41724 964723 705193 344165 251127 385546 493374 521720 539655 434374 28723 -550826
41714 -550826 -906482 -801182 -387169 7882 186394 166075 80231 33861 23811 10202
$$ packed form
41786c42088K93856M57887L30901N3962j49740j49866L2352K06842J46352j54318
41776G26140m27442m22877j79020N5226J00994J236o6001R06J04197Q3459l0436
41765e3618l8641R9597J64948L2361r1441K931J62914J16346q2832j67187r5247
41754E0131m2903l7294N1783J91970J94681L1222j53686l01077m06205l18257
41744g39635M5502L56158J98252k66491m41236j47264J71202J98507J58990K71456
41734a94559L30059J49964l3028J6416J08341K0620m6787J42021L31315J40361
41724I64723k59530l61028r3038J34419J07828K8346J7935j05281m05651n79549
41714e50826l55656J05300M14013L95051J78512k0319q5844m6370j0050j3609
$$ plain form
41704 10202 53071 260765 548942 605949 256732 -228119 -378941 -69313 359249 538679
41694 538679 474886 425826 512075 594797 504028 252955 -5827 -144265 -128892 -9066 81727
41683 81727 -20152 -327063 -605058 -617456 -461223 -454611 -635641 -642016 -275807 78559 -55023
41672 -55023 -496525 -599833 -182751 214835 155006 -81086 -19461 243020 264966 27454
41662 27454 -61650 110460 165071 -121892 -448673 -510754 -502109 -727964 -988725 -806492 -175278
41651 -175278 361537 437362 272685 203669 154289 -118812 -473398 -471716 -27884 363863
41641 363863 196454 -447297 -1035801 -1222151 -1131066 -1030903 -948056 -748716 -478468 -392153
41631 -392153 -604037 -883080 -915800 -659601 -291753 92762 519048 901797 1033902 878875
$$ packed form
41704A0202M2869K07694K88177N7007l49217m84851j50822L09628M28562J79430
41694E38679o3793m9060Q6249Q2722r0769k51073k58782j38438J5373J19826R0793
41683H1727j01879l06911k77995j2398J56233O612j81030o375L66209L54366j33582
41672e5023m41502j03308M17082L97586n9829k36092O1625K62481K1946k37512
41662B7454q9104J72110N4611k86963l26781o2081Q645k25855k60761J82233O31214
41651a75278N36815P5825j64677o9016m9380k73101l54586J682M43832L91747
41641C63863j67409o43751n88504j86350R1085J00163Q2847J99340K70248Q6315
41631c92153k11884k79043l2720K56199L67848L84515M26286L82749J32105j55027
$$ plain form
41621 878875 661847 562283 505420 372091 200920 21844 -279132 -692271 -895430 -643760
41611 -643760 -181960 86783 199271 462937 777620 681867 162860 -139929 199852 786720
41601 786720 989813 748871 416088 139531 -132500 -282171 -170553 -27254 -197028 -552307
41591 -552307 -637589 -389476 -206647 -226100 -62175 498578 1005008 919905 392187 36633
41581 36633 91036 200556 39229 -211381 -153402 261069 652640 667630 370300 130902
41571 130902 190554 436832 616838 653562 659057 711694 755443 709999 573451 406548 284227
41560 284227 244010 215942 54159 -266904 -544189 -556805 -341842 -129199 -49296 -62055
41550 -62055 -133292 -281367 -444755 -513737 -544500 -736382 -1093340 -1287705 -1025319 -450348
$$ packed form
41621H78875k17028r9564n6863j33329j71171j79076l00976m13139k03159K51670
41611f43760M61800K68743J12488K63666L14683r5753n19007l02789L39781N86868
41601G86720K03093k40942l32783k76557k72031j49671J11618J43299j69774l55279
41591e52307q5282K48113J82829j9453J63925N60753N06430q5103n27718l55554
41581C6633N4403J09520j61327k50610N7979M14471L91571J4990k97330k39398
41571A30902N9652K46278J80006L6724N495N2637M3749m5444j36548j66903j22321
41560B84227m0217k8068j61783l21063k77285j2616K14963K12643P9903j2759
41550f2055p1237j48075j63388o8982l0763j91882l56958j94365K62386N74971
$$ plain form
41540 -450348 -21747 -9816 -246957 -392484 -316021 -118622 143300 532618 940795 966499
41530 966499 398883 -280453 -312875 339752 871667 739864 419467 613526 1099201 1008200
41520 1008200 110963 -845705 -1144685 -875125 -552898 -444035 -469354 -414079 -66838 536081
41510 536081 936791 713536 158290 -4294 317037 403438 -123577 -616287 -333503 472201
41500 472201 981645 924849 646481 359443 15690 -235061 -133702 158508 206441 -3385
41490 -3385 -68464 84634 43034 -352851 -661338 -503358 -139885 -64648 -338169 -649218
41480 -649218 -809573 -868522 -865264 -749224 -514448 -233967 24451 217380 301229 264150
41470 264150 154209 52767 56919 246830 567827 787866 718447 456688 254793 178341
$$ packed form
41540d50348M28601J1931k37141j45527P6463J97399K61922L89318M08177K5704
41530I66499n67616o79336l2422O52627N31915j31803l20397J94059M85675r1001
41520A008200q97237r56668k98980K69560L22227J08863k5319N5275L47241O02919
41510E36081M00710k23255n55246j62584L21331Q6401n27015m92710K82784Q05704
41500D72201N09444n6796k78368k87038l43753k50751J01359K92210M7933k09826
41490c385o5079J53098m1600l95885l08487J57980L63473P5237k73521l11049
41480f49218j60355n8949L258J16040K34776K80481K58418J92929Q3849l7079
41470B64150j09941j01442M152J89911L20997K20039o9419k61759k01895p6452
$$ plain form
41460 178341 83133 -79497 -158365 -50149 146016 288433 339029 294194 144856 -17134
41450 -17134 -10974 217335 499036 630577 573946 445004 390446 467320 549822 415289 54108
41439 54108 -221452 -198564 -156998 -477375 -916017 -762699 141647 1023506 1122310 649999
41429 649999 408768 707300 1121018 1220728 1061924 889133 751237 593646 476544 485586
41419 485586 546551 501260 321630 133264 49165 64998 114307 159083 200201 229042 202338
41408 202338 74739 -145645 -371044 -465114 -336326 -50926 161240 98368 -182273 -396575
41398 -396575 -338181 -75332 194384 366262 417144 303152 30317 -242222 -328710 -213351
41388 -213351 -8315 203643 349673 309430 85931 -55835 132328 515040 737687 715376
$$ packed form
41460A78341r5208j62630p8868J08216J96165J42417N0596m4835j49338j61990
41450a7134O160K28309K81701J31541n6631j28942n4558P6874Q2502j34533l61181
41439E4108k75560K2888M1566l20377m38642J53318R04346Q81859R8804m72311
41429F49999k41231K98532M13718R9710j58804j72791j37896j57591j17102R042
41419D85586O0965m5291j79630j88366q4099J5833M9309M4776M1118K8841k6704
41408B02338j27599k20384k25399r4070J28788K85400K12166o2872k80641k14302
41398c96575N8394K62849K69716J71878N0882j13992k72835k72539q6488J15359
41388b13351K05036K11958J46030m0243k23499j41766J88163L82712K22647k2311
$$ plain form
41378 715376 676107 738830 771986 702842 632154 561817 342975 14906 -135428 -9198 133448
41367 133448 126773 191243 523598 910622 1063400 1064796 1129655 1155049 925615 606328 572362
41356 572362 800033 870256 609300 310253 214377 161220 -51426 -281594 -293657 -191096
41346 -191096 -291672 -636070 -890513 -778878 -416724 -120248 -17423 2976 16696 -63267
41336 -63267 -279945 -472289 -470352 -335217 -225757 -129091 36018 122533 -108807 -532887
41326 -532887 -695099 -425822 -85367 -14942 -79440 -20685 49720 -120473 -421958 -518575
41316 -518575 -366419 -212917 -147377 -32149 139919 189918 83061 -21234 -90074 -255379
41306 -255379 -467609 -457720 -174610 57810 5949 -118832 6048 333458 548256 517201
$$ packed form
41378G15376l9269O2723L3156o9144p0688p0337k18842l28069j50334J26230J42646
41367A33448o675O4470L32355L87024J52778J396O4859K5394k29434l19287l3966
41356E72362K27671P0223k60956k99047r5876n3157k12646k30168j2063J02561
41346a91096j00576l44398k54443J11635L62154K96476J02825K0399J3720p9963
41336f3267k16678j92344J937J35135J09460R6666J65109Q6515k31340m24080
41326e32887j62212K69277L40455P0425o4498N8755P0405j70193l01485r6617
41316e18575J52156J53502O5540J15228J72068M9999j06857j04295o8840j65305
41306b55379k12230R889K83110K32420n1861j24781J24880L27410K14798l1055
$$ plain form
41296 517201 384722 270592 106241 -180527 -471018 -551627 -376276 -160982 -170797 -425624
41286 -425624 -680676 -711401 -535749 -326423 -217944 -256609 -395436 -445083 -205921 206419
41276 206419 369681 107660 -174116 -17727 401225 529103 269444 57772 76007 -50594
41266 -50594 -547983 -970320 -767132 -68995 490893 558044 288809 -76345 -470979 -814934
41256 -814934 -911243 -684910 -354790 -223829 -348243 -493208 -413949 -141489 57295 15924
41246 15924 -129849 -174521 -167488 -291258 -466928 -385371 -1224 316328 300896 178659 279852
41235 279852 480464 378165 -70904 -449392 -442229 -206907 -81911 -152893 -249589 -219653
41225 -219653 -51006 187044 372176 347008 78202 -183786 -84832 370106 675067 369580
$$ packed form
41296E17201j32479j14130j64351k86768k90491q0609J75351K15294r815k54827
41286d25624k55052l0725J75652K09326J08479l8665j38827m9647K39162M12340
41276B06419J63262k62021k81776J56389M18952J27878k59659k11672J8235j26601
41266e0594m97389m22337K03188O98137N59888O7151k69235l65154l94634l43955
41256h14934r6309K26333L30120J30961j24414j44965P9259K72460J98784m1371
41246A5924j45773m4672P033j23770j75670Q1557L84147L17552j5432j22237J01193
41235B79852K00612j02299m49069l78488P163K35322J24996p0982r6696K9936
41225b19653J68647K38050J85132k5168k68806k61988R8954M54938L04961l05487
$$ plain form
41215 369580 -320389 -677935 -396773 39583 77584 -146511 -143403 93865 134460 -95313
41205 -95313 -180360 1642 -26113 -552054 -1093291 -1054776 -611843 -420854 -660823 -881564
41195 -881564 -728940 -348428 -44189 69968 7071 -193386 -413084 -517678 -506849 -438724
41185 -438724 -283075 -82035 -127838 -617522 -1192019 -1255805 -799823 -451725 -560248 -685218
41175 -685218 -289112 431505 805717 588776 228128 287279 873022 1601192 1936041 1625083
41165 1625083 970557 582045 690006 837511 478370 -259622 -718363 -536831 14295
41156 14295 502384 734216 618074 84945 -589927 -767586 -156647 669438 893006 475901
41146 475901 116368 217990 416791 280394 -11346 -12639 313286 669548 941141 1180725
$$ packed form
41215C69580o89969l57546K81162M36356L8001k24095L108K37268M0595k29773
41205i5313q5047J82002k7755n25941n41237L8515M42933J90989k39969k20741
41195h81564J52624L80512L04239J14157o2897k00457k19698j04594J0829O8125
41185d38724J55649K01040m5803m89684n74497o3786M55982L48098j08523j24970
41175f85218L96106P20617L74212k16941l60648N9151N85743P28170L34849l10958
41165A625083o54526l88512J07961J47505l59141p37992m58741J81532N51126
41156A4295M88089K31832j16142n33129o74872j77659O10939Q26085K23568m17105
41146D75901l59533J01622J98801j36397k91740j293L25925L56262K71593K39584
$$ plain form
41136 1180725 1201794 700436 -145848 -651371 -413187 166758 381794 41155 -425521 -533139
41126 -533139 -190412 333120 690664 715284 509908 293269 146946 -14038 -227005 -387103
41116 -387103 -405831 -302931 -86252 269973 637758 733898 449383 4148 -364049 -658777
41106 -658777 -895937 -857141 -376287 263801 550519 331524 -72633 -324774 -388746 -381662
41096 -381662 -351314 -279845 -160832 -6562 156267 303891 459534 625982 640250 301840
41086 301840 -235382 -467949 -179606 184295 108870 -267293 -453403 -423623 -562526 -867015
41076 -867015 -853411 -383963 21521 -39738 -284143 -270086 -41015 140283 304379 577390
41066 577390 776493 676168 464053 471102 616758 592609 463424 563164 835937 830725 441439
$$ packed form
41136A180725K1069n01358q46284n05523K38184N79945K15036l40639m66676j07618
41126e33139L42727N23532L57544K4620k05376k16639j46323j60984k12967j60098
41116c87103j8728J02900K16679L56225L67785R6140k84515m45235l68197k94728
41106f58777k37160L8796M80854O40088K86718k18995m04157k52141o3972P084
41096c81662L0348P1469J19013J54270J62829J47624J55643J66448J4268l38410
41086C01840n37222k32567K88343L63901p5425l76163j86110K9780j38903l04489
41076h67015J3604M69448M05484o1259k44405J4057K29071J81298J64096K73011
41066E77390J99103j00325k12115P049J45656k4149j29185R9740K72773n212l89286
$$ plain form
41055 441439 141998 284513 595887 649945 497056 486539 688079 840697 774393 578714
41045 578714 378502 187679 7226 -110629 -135574 -94976 -42750 -68056 -258389 -520868
41035 -520868 -534891 -112307 415490 447283 -154132 -818159 -929279 -550791 -274704 -489281
41025 -489281 -1046483 -1559507 -1726329 -1384784 -598682 211900 537996 352687 168454 352493
41015 352493 652601 640913 354676 144586 86402 -29789 -219621 -266289 -167359 -176792 -314804
41004 -314804 -261747 95659 403077 347998 85070 -109653 -282587 -564195 -754275 -553589
40994 -553589 -63124 340818 554017 789894 1099776 1223626 989452 553511 142233 -188804
40984 -188804 -434969 -527609 -484837 -476794 -572034 -575383 -308113 55673 145578 -128910 -442031
$$ packed form
41055D41439k99441J42515L11374N4058j52889j0517K01540J52618o6304j95679
41045E78714k00212j90823j80453j17855k4945M0598N2226k5306j90333k62479
41035e20868j4023M22584N27797L1793o01415o64027j11120L78488K76087k14577
41025d89281n57202n13024j66822L41545P86102Q10582L26096j85309j84233J84039
41015C52493L00108j1688k86237k10090n8184j16191j89832m6668R8930r433j38012
41004c14804N3057L57406L07418n5079k62928j94723j72934k81608j90080K00686
40994e53589M90465M03942K13199K35877L09882J23850k34174m35941m11278l31037
40984a88804k46165r2640M2772Q043r5240l349K67270L63786Q9905k74488l13121
$$ plain form
40973 -442031 -449527 -206874 -92687 -341773 -733777 -788504 -263303 567768 1140355 1103699
40963 1103699 612536 143752 35031 204556 327714 256097 173900 304456 572687 687310
40953 687310 511189 207435 25187 76155 327700 670590 958471 1102453 1153126 1181519
40943 1181519 1105588 808913 415981 214043 262763 332729 297803 292960 348111 190575 -329756
40932 -329756 -868486 -949179 -545613 -35985 272621 304712 68787 -317190 -554454 -447063
40922 -447063 -194360 -102876 -103127 93197 429291 516614 230124 -113435 -237271 -175591 18742
40911 18742 407449 835619 885776 435171 -81482 -266397 -305453 -561403 -890350 -835841
40901 -835841 -393849 -94465 -250488 -523325 -424558 18564 342935 277889 63811 115545
$$ packed form
40973d42031p496K42653J14187k49086l92004n4727N25201Q31071N72587l6656
40963A103699m91163m68784j08721J69525J23158p1617q2197J30556K68231J14623
40953F87310j76121l03754j82248N0968K51545L42890K87881J43982N0673K8393
40943A181519p5931k96675l92932k01938M8720O9966l4926m843N5151j57536n20331
40932c29756n38730q0693M03566N09628L08606L2091k35925l85977k37264J07391
40922d47063K52703R1484k51J96324L36094Q7323k86490l43559j23836O1680J94333
40911A8742L88707M28170N0157m50605n16653j84915l9056k55950l28947N4509
40901h35841M41992K99384j56023k72837R8767M43122L24371o5046k14078N1734
$$ plain form
40891 115545 504763 885822 926275 699525 543449 574434 519478 108590 -504925 -866025
40881 -866025 -714150 -231577 198412 377574 407755 482856 619660 620197 319987 -150957
40871 -150957 -427327 -260911 223581 641668 682251 334938 -140632 -442449 -475639 -404220
40861 -404220 -429550 -541383 -563023 -420571 -233524 -89922 138323 619493 1230627 1542191
40851 1542191 1231432 490408 -91176 -136030 99544 66244 -352091 -699974 -614087 -334573
40841 -334573 -316251 -556505 -662139 -486616 -322249 -429197 -690736 -822238 -688853 -360859
40831 -360859 -64100 -82133 -456887 -783798 -599508 -2360 426058 350398 -24126 -425842
40821 -425842 -823550 -1101038 -917703 -217890 501988 787146 769617 791228 833791 735646
$$ packed form
40891A15545L89218L81059M0453k26750j56076L0985n4956m10888o13515l61100
40881h66025J51875M82573M29989J79162L0181P5101J36804N37l00210m70944
40871a50957k76370J66416M84492M18087M0583l47313m75570l01817l3190P1419
40861d04220k5330j11833k1640J42452J87047J43602K28245M81170O11134L11564
40851A542191l10759p41024n81584m4854K35574l3300m18335l47883Q5887K79514
40841c34573J8322k40254j05634J75523J64367j06948k61539j31502J33385L27994
40831c60859K96759j8033l74754l26911J84290N97148M28418p5660l74524m01716
40821d25842l97708k77488J83335O99813P19878K85158j7529K1611M2563r8145
$$ plain form
40811 735646 647327 766485 859040 585504 144517 38223 290764 456262 354901 216899
40801 216899 83892 -296174 -834323 -978838 -505858 86915 299726 273868 331780 310195
40791 310195 -127492 -782621 -1080181 -852375 -487210 -290507 -131069 166499 425469 336746
40781 336746 -91949 -507824 -609115 -465403 -410227 -625081 -876826 -758084 -202166 367909
40771 367909 493611 190543 -115494 -111528 71757 66500 -275366 -686623 -763947 -427665
40761 -427665 -18407 123826 54910 39882 90550 -11133 -238013 -237615 121671 454522 366044
40750 366044 2377 -208735 -164971 -82976 -31526 111317 279144 237781 51381 91378
40740 91378 398872 446092 -144321 -942504 -1187547 -769362 -299950 -224891 -305663 -129065
$$ packed form
40811G35646q8319J19158R2555k73536m40987j06294K52541J65498j01361j38002
40801B16899j33007l80066n38149j44515M72980N92773K12811k5858N7912k1585
40791C10195m37687o55129k97560K27806L65165J96703J59438K97568K58970q8723
40781C36746m28695m15875j01291J43712N5176k14854k51745J18742N55918N70075
40771C67909J25702l03068l06037L966J83285n257l41866m11257p7324L36282
40761d27665M09258J42233o8916j5028N0668j01683k26880L98L59286L32851q8478
40750C66044l63667k11112M3764Q1995N1450J42843J67827m1363j86400L9997
40740I1378L07494M7220n90413p98183k45043M18185M69412P5059q0772J76598
$$ plain form
40730 -129065 244113 425699 268519 -41257 -361513 -723962 -1056868 -1087689 -686316 -122894
40720 -122894 196897 155677 -67389 -317498 -585625 -812261 -781277 -343314 325367 811491
40710 811491 841168 520035 163719 -71071 -293169 -596921 -823037 -755103 -471694 -273676
40700 -273676 -258047 -212826 2399 245010 386483 526219 694206 641375 256298 -65578
40690 -65578 97573 515369 605461 324456 191489 393095 484959 184469 -135832 -100809
40680 -100809 35522 -118626 -373379 -281336 88314 278597 195244 150180 213790 111579
40670 111579 -172444 -253398 7076 193319 -52632 -487693 -640969 -447922 -205052 -108717
40660 -108717 -154571 -347042 -682485 -969554 -939713 -565953 -105100 183188 241399 175215
$$ packed form
40730a29065L73178J81586j57180l09776l20256l62449l32906l0821M01373N63422
40720a22894L19791m1220k23066k50109k68127k26636L0984M37963O68681M86124
40710H11491K9677l21133l56316k34790k22098l03752k26116O7934K83409J98018
40700b73676J5629M5221K15225K42611J41473J39736J67987n2831l85077l21876
40690f5578J63151M17796R0092k81005j32967K01606R1864l00490l20301L5023
40680a00809J36331j54148k54753R2043L69650J90283q3353m5064O3610j02211
40670A11579k84023q0954K60474J86243k45951m35061j53276J93047K42870R6335
40660a08717m5854j92471l35443k87069K9841L73760M60853K88288N8211o6184
$$ plain form
40650 175215 140501 242592 434057 542406 490480 418353 466180 527807 406762 164505
40640 164505 78191 220111 308492 94077 -275927 -442508 -286035 -27068 83769 21362
40630 21362 -72590 -63270 108238 413354 708641 794643 608854 340268 259206 423950 629845
40619 629845 663132 523289 355067 249039 202126 222237 335787 466413 429857 146944
40609 146944 -197069 -320383 -168760 33861 84649 32130 19143 2393 -198620 -593374
40599 -593374 -952429 -1108013 -1151367 -1216645 -1219792 -986765 -544153 -86804 288395 613226
40589 613226 846176 871333 717828 553739 414612 172907 -145496 -275758 -96067 140249
40579 140249 155735 29602 -6610 32794 -3495 -20460 238340 723302 1025218 882458
$$ packed form
40650A75215l4714J02091J91465J08349n1926p2127M7827O1627j21045k42257
40640A64505q6314J41920Q8381k14415l70004j66581J56473K58967J10837o2407
40630B1362r3952R320J71508L05116K95287Q6002j85789k68586q1062J64744K05895
40619F29845L3287j39843j68222j06028m6913K0111J13550J30626l6556k82913
40609A46944l44013j23314J51623K02621N0788n2519j2987j6750k01013l94754
40599e93374l59055j55584m3354o5278l147K33027M42612M57349L75199L24831
40589F13226K32950K5157j53505j64089j39127k41705l18403j30262J79691K36316
40579A40249J5486j26133l6212L9404l6289j6965K58800M84962L01916j42760
$$ plain form
40569 882458 501041 265498 322525 550014 761083 810479 626935 272962 -89803 -368481
40559 -368481 -601504 -803117 -848048 -611043 -176594 173861 190703 -139029 -592042 -907089
40549 -907089 -993227 -924736 -758654 -485855 -207340 -165956 -421609 -638013 -451070 15163
40539 15163 279453 142945 -92134 -95026 88594 216725 180625 2414 -276996 -528446
40529 -528446 -529915 -221820 156403 334862 285135 88057 -282561 -816486 -1240656 -1221221
40519 -1221221 -785534 -328339 -168134 -250795 -317985 -235538 -103195 -114393 -353419 -719089
40509 -719089 -1044458 -1256511 -1350340 -1259435 -924647 -506602 -313954 -424321 -573407 -543593
40499 -543593 -451485 -476000 -520941 -409196 -248579 -289808 -501566 -608393 -542709 -551022 -786013
$$ packed form
40569H82458l81417k35543N7027K27489K11069M9396j83544l53973l62765k78678
40559c68481k33023k01613m4931K37005M34449L50455J6842l29732m53013l15047
40549i07089q6138O8491J66082K72799K78515M1384k55653k16404J86943M66233
40539A5163K64290j36508k35079k892J83620J28131l6100j78211k79410k51450
40529e28446j469L08095L78223J78459m9727j97078l70618n33925m24170J9435
40519a221221M35687M57195J60205q2661o7190Q2447J32343j1198k39026l65670
40509g19089l25369k12053r3829R0905L34788M18045J92648j10367j49086K9814
40499e43593R2108k4515m4941J11745J60617m1229k11758j06827O5684q313k34991
$$ plain form
40488 -786013 -1052481 -1074170 -830394 -510459 -258658 -74432 93840 229060 226490 24392
40478 24392 -238885 -311895 -145876 21747 27440 50973 307208 621518 622799 302234 54911
40467 54911 135686 359221 415158 245889 20144 -96935 -87487 -115236 -379183 -780175 -863461
40456 -863461 -378154 221396 232499 -368913 -900908 -897735 -552999 -143792 381790 945722
40446 945722 1051755 459765 -260055 -399399 -56124 137974 -8324 -156720 -178417 -301525
40436 -301525 -502689 -422431 -66737 7139 -483639 -1020723 -976833 -484082 -184453 -340404
40426 -340404 -627725 -707474 -582871 -361742 -27538 395473 674167 578152 201969 -89314
40416 -89314 -78308 43476 -57900 -368402 -484068 -150515 331347 451924 144692 -185865
$$ packed form
40488g86013k66468k1689K43776L19935K51801J84226J68272J35220k570k02098
40478B4392k63277p3010J66019J67623N693K3533K56235L14310J281l20565k47323
40467E4911Q0775K23535N5937j69269k25745j17079R448k7749k63947m00992q3286
40456h63461M85307N99550J1103o01412n31995L173L44736M09207N25582N63932
40446I45722J06033n91990p19820j39344L43275J94098j46298j48396k1697j23108
40436c01525k01164Q0258L55694P3876m90778n37084M3890M92751K99629j55951
40426c40404k87321p9749J24603K21129L34204M23011K78694r6015l76183k91283
40416h9314J1006J21784j01376l10502j15666L33553M81862J20577l07232l30557
$$ plain form
40406 -185865 -268030 -267472 -388828 -492991 -347997 -50177 86029 -39149 -232259 -305534
40396 -305534 -235637 -63626 141360 228991 102920 -65416 20649 362599 601728 480692
40386 480692 170473 -17140 -60867 -147575 -280103 -255845 -29864 183456 260287 370098
40376 370098 658156 919168 835292 448868 134003 97048 156616 98612 24485 174341
40366 174341 529288 781804 682401 287529 -141526 -393721 -439755 -366131 -230459 -27241
40356 -27241 179445 179811 -166329 -635600 -757346 -335721 274760 543763 321752 -95883
40346 -95883 -360916 -373968 -255569 -183315 -266761 -482496 -717460 -897136 -1008796 -987405
40336 -987405 -732915 -323916 -39396 -18326 -50665 116447 411311 578850 542390 383323
$$ packed form
40406a85865q2165N58j21356j04163J44994K97820J36206j25178j93110p3275
40396c05534O9897J72011K04986Q7631j26071j68336Q6065L41950K39129j21036
40386D80692l10219j87613m3727q6708j32528K4258K25981K13320P6831J09811
40376C70098K88058K61012q3876l86424l14865l6955N9568n8004p4127J49856
40366A74341L54947K52516r9403l94872m29055k52195m6034P3624J35672K03218
40356b7241K06686L66l46140m69271j21746M21625O10481K69003k22011m17635
40346i5883k65033j3052J18399P2254q3446k15735k34964j79676j11660K1391
40336i87405K54490M08999K84520K1070l2339J67112K94864J67539l6460j59067
$$ plain form
40326 383323 96417 -341856 -749823 -891011 -799249 -671668 -513581 -218726 66677 63746
40316 63746 -144882 -149096 186932 537205 621610 534672 471948 502593 701595 1081832 1281464
40305 1281464 823352 -97206 -599044 -204041 542100 898777 876822 887364 940370 828604
40295 828604 743990 985308 1259119 1008574 363741 50265 317558 628137 529779 212634
40285 212634 13518 -56730 -37915 211312 649704 869013 612074 179131 33022 244152
40275 244152 554012 745399 741276 567444 397925 409680 458833 185752 -413429 -859117
40265 -859117 -837858 -632959 -631337 -723213 -544287 -82345 318119 414742 239508 -51560
40255 -51560 -248147 -159434 134168 259969 11353 -363848 -563453 -663466 -843214 -952783
$$ packed form
40326C83323k86906m38273m07967j41188R1762J27581J58087K94855K85403k931
40316F3746k08628m214L36028L50273Q4405q6938o2724L0645J99002L80237J99632
40305A281464m58112r20558n01838L95003P46141L56677k1955J0542N3006j11766
40295H28604q4614K41318K73811k50545o44833l13476K67293L10579r8358l17145
40285B12634j99116p0248J8815K49227M38392K19309k56939m32943j46109K11130
40275B44152L09860J91387m123j73832j69519J1755M9153k73081n99181m45688
40265h59117K1259K04899J622r1876J78926M61942M00464R6623j75234k91068
40255e1560j96587Q8713K93602J25801k48616l75201j99605j00013j79748j09569
$$ plain form
40245 -952783 -779860 -544114 -626973 -904630 -863436 -384528 75742 167230 54303 10945
40235 10945 34642 61869 186117 397889 419417 108467 -197905 -74418 386301 679825
40225 679825 560871 310894 285424 441068 458395 194918 -174188 -446321 -631459 -799147
40215 -799147 -830915 -553678 -106546 89166 -152354 -506531 -558971 -314762 -56605 133400
40205 133400 381264 633700 648578 423349 276446 353248 353691 -20514 -567333 -812618
40195 -812618 -631719 -372525 -369027 -571515 -733899 -777705 -803912 -825539 -702812 -414006
40185 -414006 -223910 -400149 -822906 -1086883 -1001668 -767523 -593781 -407490 -109619 120750
40175 120750 45114 -263918 -547491 -739610 -920059 -977959 -692146 -171464 138064 6629
$$ packed form
40245i52783J72923K35746q2859k77657M1194M78908M60270R1488j12927m3358
40235A0945K3697K7227J24248K11772K1528l10950l06372J23487M60719K93524
40225F79825j18954k49977k5470J55644J7327k63477l69106k72133j85138j67688
40215g99147l1768K77237M47132J95712k41520l54177n2440K44209K58157J90005
40205A33400K47864K52436J4878k25229j46903P6802M43l74205n46819k45285
40195h12618J80899K59194L498k02488j62384m3806k6207k1627J22727K88806
40185d14006J90096j76239m22757k63977Q5215K34145J73742J86291K97871K30369
40175A20750p5636l09032k83573j92119j80449n7900K85813N20682L09528j31435
$$ plain form
40165 6629 -295247 -412252 -368226 -419188 -596786 -626720 -299946 209601 484450 344083
40155 344083 117399 275482 781736 1071262 818514 410600 351324 490300 323044 -127014
40145 -127014 -323103 -96203 104161 -24697 -201055 -130148 12006 -5831 -29872 110676
40135 110676 171713 -144292 -677435 -1051271 -1164725 -1074267 -683306 -1701 530995 488231
40125 488231 71658 -188975 -204925 -291908 -486007 -478129 -228641 -74269 -131958 -131574 13938
40114 13938 -1325 -290398 -470758 -265967 4686 -78131 -363357 -369848 6581 423208
40104 423208 604987 569982 417469 226101 125572 158118 85838 -351691 -978696 -1320337
40094 -1320337 -1270483 -1259398 -1571456 -1849183 -1622536 -1088698 -886637 -1137033 -1216322 -665787
$$ packed form
40165F629l01876j17005M4026n0962j77598k9934L26774N09547K74849j40367
40155C44083k26684J58083N06254K89526k52748m07914n9276J38976j67256m50058
40145a27014j96089K26900K00364j28858j76358P0907J42154j7837k4041J40548
40135A10676O1037l16005n33143l73836j13454R0458L90961O81605N32696m2764
40125D88231m16573k60633j5950q6983j94099P878K49488J54372n7689L84J45512
40114A3938j5263k89073j80360K04791K70653q2817k85226o491L76429M16627
40104D23208J81779l5005j52513j91368j00529L2546p2280m37529o27005l41641
40094a320337M9854J1085l12058k77727K26647N33838K02061k50396p9289N50535
$$ plain form
40084 -665787 107603 387756 115305 -146816 -75754 68162 -21565 -287536 -584420 -938495
40074 -938495 -1265490 -1182198 -477901 424343 853105 650681 236223 -27989 -201862 -472105
40064 -472105 -777359 -853842 -536368 37222 474775 451003 73272 -178104 1993 387328
40054 387328 561824 439428 217781 -3704 -237309 -360428 -236574 -61081 -214434 -711627
40044 -711627 -1112139 -1062026 -663744 -244277 -15635 -29730 -205633 -309089 -131964 229700
40034 229700 475861 501675 456277 401105 222834 -54615 -197755 -111472 40211 163291
40024 163291 359560 596558 608739 331759 110285 221851 463645 467032 187205 -160037
40014 -160037 -415093 -484745 -275780 104989 286980 44038 -404659 -721343 -851661 -867929
$$ packed form
40084f65787P73390K80153k72451k62121P1062J43916q9727k65971k96884l54075
40074i38495l26995Q3292P04297R02244M28762k02424m14458k64212j73873k70243
40064d72105l05254p6483L17474N73590M37553k3772l77731k51376J80097L85335
40054C87328J74496j22396k21647k21485k33605j23119J23854J75493j53353m97193
40044g11627m00512N0113L98282M19467K28642j4095j75903j03456J77125L61664
40034B29700K46161K5814m5398n5172j78271k77449j43140Q6283J51683J23080
40024A63291J96269K36998J2181k76980k21474J11566K41794L387k79827l47242
40014a60037k55056o9652K08965L80769J81991k42942m48697l16684j30318j6268
$$ plain form
40004 -867929 -703510 -373827 -188006 -336353 -496654 -303296 -9775 -149327 -645603 -856823
39994 -856823 -538074 -177965 -213706 -428716 -396621 -104458 191154 413524 621394 727836
39984 727836 614120 416496 386593 499585 474243 213455 -9585 82539 368601 461248
39974 461248 214916 -68011 -28256 278262 489335 476819 513955 806020 1106162 1020678
39964 1020678 542491 31719 -258790 -408606 -610584 -912886 -1165613 -1115276 -650987 -76433
39954 -76433 55468 -394522 -847673 -683895 -70012 272749 28801 -429669 -698399 -782856
39944 -782856 -775340 -561811 -94097 379365 592926 529399 252178 -231167 -749236 -921439
39934 -921439 -600669 -138276 37914 -82219 -232683 -291515 -306219 -275993 -172111 -61137
$$ packed form
40004h67929J64419L29683J85821j48347j60301J93358K93521j39552m96276k11220
39994h56823L18749L60109l5741k15010L2095K92163K95612K22370K07870J06442
39984G27836j13716j97624k9903J12992k5342k60788k23040R2124K86062R2647
39974D61248k46332k82927L9755L06518K11073j2516L7136K92065L00142q5484
39964A020678m78187n10772k90509j49816k01978l02302k52727N0337M64289N74554
39954g6433J31901m49990m53151J63778O13883L42761k43948m58470k68730q4457
39944g82856P516K13529M67714M73462K13561o3527k77221m83345n18069j72203
39934i21439L20770M62393J76190j20133j50464n8832j4704L0226J03882J10974
$$ plain form
39924 -61137 -1630 64272 155997 158397 47430 10088 146499 276920 271786 327617 627869
39913 627869 962300 1018751 849545 691937 535226 283570 149343 367431 638644 445713
39903 445713 -81641 -237741 193835 552924 256557 -382581 -666694 -430316 -25191 298051
39893 298051 531114 618334 472771 220342 85296 81415 95507 176743 417344 625146
39883 625146 495779 121342 -45598 171275 403321 260537 -153042 -453736 -501079 -465536
39873 -465536 -491258 -535030 -523478 -473757 -402967 -237437 94831 500600 723096 579906
39863 579906 214501 21852 229300 607793 730276 482779 147871 -17586 -60312 -101744
39853 -101744 -73407 105648 241196 35622 -470078 -872910 -894941 -714514 -701074 -926339
$$ packed form
39924f1137N9507O5902R1725K400j10967l7342J36411J30421n134N5831L00252
39913F27869L34431N6451j69206j57608j56711k51656j34227K18088K71213j92931
39903D45713n27354j56100M31576L59089k96367o39138k84113K36378M05125L23242
39893B98051K33063Q7220j45563k52429j35046l881J4092Q1236K40601K07802
39883F25146j29367l74437j66940K16873K32046j42784m13579l00694m7343L5543
39873d65536k5722m3772J1552M9721P0790J65530L32268M05769K22496j43190
39863E79906l65405j92649K07448L78493J22483k47497l34908j65457m2726m1432
39853a01744K8337J79055J35548k05574n05700m02832k2031J80427J3440k25265
$$ plain form
39843 -926339 -1066305 -780587 -120648 480655 647426 461864 335653 463819 567180 305025
39833 305025 -210239 -547204 -532013 -408529 -403808 -419575 -262093 64028 437181 786990
39823 786990 1018889 964759 613202 247210 156168 331577 616228 974680 1370529 1551594
39813 1551594 1308068 873857 711345 893629 1048415 959019 847628 927308 1032616 938193
39803 938193 763101 746591 798043 611847 177346 -142513 -103140 85188 41412 -297006
39793 -297006 -622362 -672995 -565047 -614529 -876586 -1016594 -716069 -88216 441715 585447
39783 585447 374803 93 -308072 -297048 114212 620205 772941 513809 217157 143496
39773 143496 148571 51746 -44296 -23171 -42633 -252659 -448356 -327330 61852 438418 724526
$$ packed form
39843i26339j39966K85718O59939O01303J66771j85562j26211J28166J03361k62155
39833C05025n15264l36965J5191J23484M721j5767J57482L26121L73153L49809
39823G86990K31899n4130l51557l65992r1042J75409K84651L58452L95849J81065
39813A551594k43526m34211j62512J82284J54786q9396j11391P9680J05308r4423
39803I38193j75092j6510N1452j86196m34501l19859L9373J88328m3776l38418
39793b97006l25356n0633J07948m9482k62057j40008L00525O27853N29931J43732
39783E85447k10644l74710l08165J1024M11260N05993J52736k59132k96652p3661
39773A43496N075r6825r6042K1125j9462k10026j95697J21026L89182L76566K86108
$$ plain form
39762 724526 1036199 1326986 1373334 1103723 684235 300227 63183 44280 158284 134909
39752 134909 -109103 -219952 105254 531603 476318 18030 -163498 178226 505191 402139
39742 402139 217544 384239 620580 391295 -155551 -346639 34764 501269 614374 480171
39732 480171 374421 298621 126589 -90396 -199764 -190054 -196325 -326366 -537214 -619696 -343843
39721 -343843 234405 666846 551925 86603 -94534 296311 863483 1110761 1053622 999217
39711 999217 987472 839417 625601 630714 815907 758752 327133 42171 420660 1171717
39701 1171717 1469314 997947 342828 232720 704189 1208857 1316923 1049892 638973
39692 638973 257190 27325 66570 376248 745547 863609 571853 31181 -378120 -402186
$$ packed form
39762G24526L11673K90787M6348k69611m19488l84008k37044j8903J14004k3375
39752A34909k44012j10849L25206M26349n5285m58288j81528L41724L26965j03052
39742D02139j84595J66695K36341k29285n46846j91088L81403M66505J13105j34203
39732D80171j05750p5800j72032k16985j09368R710o271j30041k10848q2482K75853
39721c43843N78248M32441j14921m65322j81137L90845N67172K47278n7139n4405
39711I99217j1745j48055k13816N113J85193n7155m31619k84962L78489P51057
39701A171717K97597m71367o55119j10108M71469N04668J08066k67031m10919
39692F38973l81783k29865L9245L09678L69299J18062k91756n40672m09301k4066
$$ plain form
39682 -402186 -177718 -53625 -132551 -160546 44836 276605 247819 32072 -90546 -100784
39672 -100784 -205891 -387548 -374031 -117789 79947 58006 59539 311806 651553 804852
39662 804852 764237 624947 311801 -208586 -661042 -763118 -627488 -510811 -343670 49946
39652 49946 407019 260090 -267171 -478385 -86508 364627 353310 156588 326195 759773
39642 759773 864711 490421 137635 221826 598093 917047 1048078 991880 729460 386703
39632 386703 273364 494533 715039 567428 148269 -144726 -142765 6348 183079 400931
39622 400931 586176 593198 502998 587603 856931 944552 626014 175051 -31397 -17269 -26024
39611 -26024 -44365 128775 452623 663683 693249 713825 768678 707365 524829 409669 390579
$$ packed form
39682d02186K24468J24093p8926k7995K05382K31769k8786k15747j22618j0238
39672a00784j05107j81657J3517K56242J97736k1941J533K52267L39747J53299
39662H04852m0615j39290l13146n20387m52456j02076J35630J16677J67141L93616
39652D9946L57073j46929n27261k11214L91877M51135j1317j96722J69607M33578
39642G59773J04938l74290l52786Q4191L76267L18954J31031n6198k62420l42757
39632C86703j13339K21169K20506j47611m19159k92995J961J49113J76731K17852
39622D00931J85245P022r0200Q4605K69328Q7621l18538m50963k06448J4128q755
39611b6024j8341J73140L23848K11060K9566K0576N4853o1313j82536j15160j9090
$$ plain form
39600 390579 299609 172887 275150 570006 616674 269360 50044 429281 1084412 1342209
39590 1342209 1099118 788856 618121 401413 95115 -70184 -47496 -58931 -115908 74445
39580 74445 562317 948289 933425 701967 543001 454938 369994 416342 649131 812785
39570 812785 692108 454041 331405 225587 -13145 -149383 140078 659534 847856 521753
39560 521753 59991 -172644 -195125 -139546 8187 246594 432052 474306 431387 296053
39550 296053 -51438 -520828 -705816 -348127 257119 569067 422258 121704 -15577 17769
39540 17769 61269 48409 47522 145654 357321 602253 748101 713090 541509 363062 294856
39529 294856 393940 637554 880550 895091 585088 167128 1352 173543 358476 217861
$$ packed form
39600C90579r0970j26722J02263K94856M6668l47314k19316L79237O55131K57797
39590A342209k43091l10262j70735k16708l06298j65299K2688j1435n6977J90353
39580G4445M87872L85972j4864k31458j58966q8063q4944M6348K32789J63654
39570H12785j20677k38067j22636j05818k38732j36238K89461N19456J88322l26103
39560E21753m61762k32635k2481N5579J47733K38407J85458M2254m2919j35334
39550B96053l47491m69390j84988L57689O05246L11948j46809l00554j37281L3346
39540A7769M3500j2860q87R8132K11667K44932J45848l5011j71581j78447o8206
39529B94856R9084K43614K42996J4541l10003m17960j65776J72191J84933j40615
$$ plain form
39519 217861 -146235 -310267 -85813 259860 422331 470708 626401 803342 713335 413950
39509 413950 372665 825859 1372328 1454802 1043394 567221 321132 260027 299771 459866
39499 459866 661542 692436 490847 249905 144799 157800 260188 538067 986941 1366888
39489 1366888 1434647 1188033 748535 180084 -381175 -590614 -193066 572295 1130097 1175187
39479 1175187 918433 684106 491780 184750 -189624 -357493 -165461 228819 572131
39470 572131 783188 890320 816661 454715 -24527 -187086 166857 687364 885853 751320
39460 751320 675209 823010 946880 889920 885066 1123071 1340254 1183226 804027 708933
39450 708933 1046852 1379803 1227354 607870 -39226 -301431 -94048 355774 745638 958088
$$ packed form
39519B17861l64096j64032K24454L45673J62471M8377J55693J76941r0007k99385
39509D13950m1285M53194N46469Q2474m11408m76173k46089o1105L9744J60095
39499D59866K01676L0894k01589k40942j05106J3001J02388K77879M48874L79947
39489A366888O7759k46614m39498n68451n61259k09439L97548P65361N57802M5090
39479A175187k56754k34327j92326l07030l74374j67869J92032L94280L43312
39470E72131K11057J07132p3659l61946m79242j62559L53943N20507J98489j34533
39460G51320p6111J47801J23870n6960m854K38005K17183j57028l79199r5094
39450G08933L37919L32951j52449o19484o47096k62205K07383M49822L89864K12450
$$ plain form
39440 958088 1082282 1168915 1104265 850672 651017 752148 1012731 1069666 873913 758191
39430 758191 916568 1110271 1035246 768175 675299 992259 1601038 2129137 2226819 1880459
39420 1880459 1484228 1442486 1683547 1776217 1552111 1322631 1367708 1520900 1482195 1286909
39410 1286909 1187858 1262789 1432037 1713340 2132212 2472557 2467113 2231145 2185513 2494531
39400 2494531 2861416 2973660 2901812 2913633 3075123 3200485 3102804 2768745 2336908 1986446
39390 1986446 1815110 1783510 1801096 1855594 1996261 2208890 2404198 2540834 2673720 2861906
39380 2861906 3102938 3381855 3729113 4199533 4794967 5387653 5751914 5791970 5753303 6017182
39370 6017182 6581414 6957201 6778034 6308955 6058772 6042627 5819179 5216245 4598590 4334877
$$ packed form
39440I58088J24194Q6633o4650k53593j99655J01131K60583N6935j95753j15722
39430G58191J58377J93703p5025k67071r2876L16960O08779N28099R7682l46360
39420A880459l96231m1742K41061R2670k24106k29480M5077J53192l8705j95286
39410A286909r9051P4931J69248K81303M18872L40345n444k35968m5632L09018
39400B494531L66885J12244p1848J1821J61490J25362r7681l34059m31837l50462
39390A986446j71336l1600J7586N4498J40667K12629J95308J36636J32886J88186
39380B861906K41032K78917L47258M70420N95434N92686L64261M0056l8667K63879
39370F017182N64232L75787j79167m69079k50183j6145k23448o02934o17655k63713
$$ plain form
39360 4334877 4374665 4497233 4643998 4819408 4960607 5111316 5442036 5865110 5921494 5368235
39350 5368235 4645880 4384407 4586957 4698472 4425421 4084269 4079364 4375853 4632125 4633452
39340 4633452 4459906 4358022 4525189 4920073 5261881 5318385 5170391 5059677 5032431 4927900
39330 4927900 4683837 4420967 4230045 4127297 4231212 4678200 5285497 5626944 5610226 5668350
39320 5668350 6133749 6700288 6840124 6558331 6342999 6456269 6680132 6783722 6861011 7090869
39310 7090869 7483940 8036903 8864190 9941089 10903119 11375448 11451809 11649453 12390227
39301 12390227 13630033 14956641 15963119 16599412 17263660 18475676 20356909 22515635
39293 22515635 24541439 26480661 28684084 31362608 34552659 38407418 43192824 48986133
$$ packed form
39360D334877L9788J22568J46765J75410J41199J50709L30720M23074N6384n53259
39350E368235p22355k61473K02550J11515k73051l41152m905K96489K56272J327
39340D633452j73546j01884J67167L94884L41808N6504j47994j10714k7246j04531
39330D927900k44063k62870j90922j02748J03915M46988O07297L41447j6718N8124
39320E668350M65399N66539J39836k81793k15332J13270K23863J03590P7289K29858
39310G090869L93071N52963Q27287J076899R62030M72329P6361J97644P40774
39301A2390227J239806J326608J006478O36293O64248J212016J881233K158726
39293B2515635K025804J939222K203423K678524L190051L854759M785406N793309
$$ plain form
39285 48986133 55653220 63151255 71605836 81088290 91609132 103368118 116747645 132131132
39277 132131132 150190771 172401610 200721711 236552011 280373519 331995749 389282591
39270 389282591 445153861 486982955 501976405 485321573 443413136 389064460 333786850
39263 333786850 283847821 241219892 205929665 177278730 154205389 135541143 120116695
39256 120116695 106779779 94685109 83622768 73802247 65292822 57874367 51349396
39249 51349396 45686669 40840747 36686697 33164339 30275454 27909793 25843391 23923023
39241 23923023 22135215 20541347 19251516 18335969 17604542 16642628 15306297 14033028
39233 14033028 13358961 13210958 12971394 12188496 10950755 9638375 8612906 8090653 7987953
$$ packed form
39285D8986133O667087P498035Q454581R482454J0520842J1758986J3379527J5383487
39277A32131132J8059639K2210839K8320101L5830300M3821508N1622230N7286842
39270C89282591N5871270M1829094J4993450j6654832m1908437n4348676n5277610
39263C33786850m9939029m2627929l5290227k8650935k3073341j8664246j5424448
39256A20116695j3336916j2094670j1062341r820521q509425p418455o524971
39249E1349396n662727m845922m154050l522358k888885k365661k066402j920368
39241B3923023j787808j593868j289831r15547p31427r61914j336331j273269
39233A4033028o74067j48003k39564p82898j237741j312380j025469n22253j02700
$$ plain form
39224 7987953 7907041 7568771 7198657 7156633 7284572 7063583 6394926 5738597 5420005 5290148
39214 5290148 5182091 5185989 5275400 5172193 4861871 4760246 5020906 5139643 4689503 4042598
39204 4042598 3820991 3934705 3785002 3271766 2953051 3160250 3510372 3477437 3054517 2650242
39194 2650242 2600151 2942528 3464541 3828050 3811514 3544925 3398924 3591944 4018044 4458985
39184 4458985 4790759 4949801 4895229 4713933 4624902 4742404 4889662 4761088 4283201 3752323
39174 3752323 3549082 3705695 3855037 3720756 3562428 3891526 4747478 5572404 5930504
39165 5930504 6028857 6286337 6688082 6923648 6936348 6889363 6706562 6143267 5329269 4758557
39155 4758557 4599677 4430380 3868529 3123620 2664324 2607802 2720486 2823141 2895068 2892090
$$ packed form
39224G987953q0912l38270l70114m2024J27939k20989o68657o56329l18592j29857
39214E290148j08057L898Q9411j03207l10322j01625K60660J18737m50140o46905
39204D042598k21607J13714j49703n13236l18715K07199L50122l2935m22920m04275
39194B650242n0091L42377N22013L63509j6536k66589j46001J93020M26100M40941
39184D458985L31774J59042n4572j81296q9031J17502J47258j28574m77887n30878
39174C752323k03241J56613J49342j34281j58328L29098Q55952Q24926L58100
39165E930504R8353K57480M01745K35566J2700m6985j82801n63295q13998n70712
39155D758557j58880j69297n61851p44909m59296n6522J12684J02655P1927k978
$$ plain form
39145 2892090 2740426 2475788 2194263 1921638 1704094 1727475 2097837 2541547 2599157 2174179
39135 2174179 1658374 1417132 1366583 1219370 963508 841668 921146 956361 733367 339575
39125 339575 -672 -166466 -92847 299661 892974 1251555 1043521 534536 323690 571380
39115 571380 858054 893200 926303 1203403 1432136 1225063 803401 725246 1007982 1067575
39105 1067575 599226 15949 -193254 -121191 -147055 -288184 -237339 92150 445476 657468
39095 657468 870585 1191537 1374987 1090020 420290 -149556 -302440 -242338 -334334 -553035
39085 -553035 -542861 -169753 292990 587340 775708 971680 1043725 831070 457935 173466
39075 173466 26681 -52046 841 268425 611192 835390 1002446 1272513 1546966 1599896
$$ packed form
39145B892090j51664k64638k81525k72625k17544K3381L70362M43710N7610m24978
39135B174179n15805k41242n0549j47213k55862j21840P9478L5215k22994l93792
39125C39575l40247j65794P3619L92508N93313L58581k08034n08985k10846K47690
39115E71380K86674L5146L3103K77100K28733k07073m21662p8155K82736N9593
39105A067575m68349n83277k09203P2063k5864j41129N0845L29489L53326K11992
39095F57468K13117L20952J83450k84967o69730n69846j52884O0102r1996k18701
39085e53035J0174L73108M62743K94350J88368J95972P2045k12655l73135k84469
39075A73466j46785p8727N2887K67584L42767K24198J67056K70067K74453N2930
$$ plain form
39065 1599896 1471802 1365729 1232121 876511 442396 318779 524169 644025 471643
39056 471643 256009 193146 144435 29244 12462 78007 -85474 -476315 -560887 -64160
39046 -64160 478012 444319 17631 -199201 -130270 -155855 -307714 -227028 117505 323084
39036 323084 241827 194080 346723 416186 225764 97337 377998 917621 1330137 1512953
39026 1512953 1594393 1563268 1287057 823037 437579 311973 388829 483856 424257 136826
39016 136826 -247209 -410226 -139382 379049 699340 610460 377039 391980 682664 933755
39006 933755 987493 1084445 1452113 1835266 1731171 1076006 407115 249150 568074 950148
38996 950148 1099239 992758 743571 524401 510066 708518 930207 1031407 1042481 972850
$$ packed form
39065A599896j28094j06073j33608l55610m34115j23617K05390J19856j72382
39056D71643k15634o2863m8711j15191j6782O5545j63481l90841q4572M96727
39046f4160N42172l3693m26688k16832O8931k5585j51859Q0686L44533K05579
39036C23084q1257m7747J52643O9463j90422j28427K80661N39623M12516J82816
39026A512953Q1440l1125k76211m64020l85458j25606P6856R5027n9599k87431
39016A36826l84035j63017K70844N18431L20291q8880k33421J4941K90684K51091
39006I33755N3738R6952L67668L83153j04095o55165o68891j57965L18924L82074
38996I50148J49091j06481k49187k19170j4335J98452K21689J01200J1074o9631
$$ plain form
38986 972850 752553 534082 712231 1318498 1710368 1338226 613907 449176 998057 1460318
38976 1460318 1215440 569394 163132 166552 385253 724818 1121392 1312322 1135435 901674
38966 901674 1053102 1516771 1771824 1557583 1176095 1017450 1068548 1050472 875126 776134
38956 776134 995966 1441299 1712925 1507268 962257 524367 461095 612464 675808 608848
38946 608848 623596 853319 1180368 1399757 1432163 1326924 1140714 914489 765425 878202
38936 878202 1280434 1669017 1652650 1236923 875318 888805 1033930 909494 634457 729893
38926 729893 1340947 2001801 2307384 2428288 2708817 3078071 3214875 3100770 3025524 3119582
38916 3119582 3244157 3362645 3696733 4409140 5365915 6333002 7233655 8104317 8967795
$$ packed form
38986I72850k20297k18471J78149O06267L91870l72142p24319j64731N48881M62261
38976A460318k44878o46046m06262L420K18701L39565L96574J90930j76887k33761
38966I01674J51428M63669K55053k14241l81488j58645N1098j8076j75346r8992
38956G76134K19832M45333K71626k05657n45011m37890o3272J51369O3344o6960
38946F08848J4748K29723L27049K19389L2406j05239j86210k26225j49064J12777
38936H78202M02232L88583j6367m15727l61605J3487J45125j24436k75037R5436
38926G29893O11054O60854L05583J20904K80529L69254J36804j14105p5246R4058
38916C119582J24575J18488L34088P12407R56775R67087R00653Q70662Q63478
$$ plain form
38907 8967795 9903191 11119961 12786414 14846263 17182165 19947879 23549481 28211151
38899 28211151 33639387 39117665 43753453 46570617 46684122 43835795 38835692 33174585
38891 33174585 28013067 23650222 19952331 16919908 14591500 12711659 10938876 9307594
38883 9307594 8113245 7356571 6666593 5829543 5049908 4555118 4226702 3800835 3228824
38874 3228824 2665041 2239665 1981047 1855252 1792506 1770363 1885730 2183759 2419271 2240798
38864 2240798 1681407 1204536 1141038 1331251 1471104 1539359 1646895 1682554 1415804 873058
38854 873058 372391 195291 349704 606763 691347 532438 387681 581411 1062094 1403977
38844 1403977 1316044 928017 502021 158300 13678 229560 673065 862306 569594 193355
$$ packed form
38907H967795R35396J216770J666453K059849K335902K765714L601602M661670
38899B8211151N428236N478278M635788K817164J13505k848327n000103n661107
38891C3174585n161518m362845l697891l032423k328408j879841j772783j631282
38883I307594j194349p56674o89978q37050p79635m94790l28416m25867n72011
38874C228824n63783m25376k58618j25795o2746k2143J15367K98029K35512j78473
38864B240798n59391m76871o3498J90213J39853O8255J07536L5659k66750n42746
38854H73058n00667j77100J54413K57059Q4584j58909j44757J93730M80683L41883
38844A403977q7933l88027m25996l43721j44622K15882M43505J89241k92712l76239
$$ plain form
38834 193355 185438 402354 446511 373265 518376 796933 783566 462116 296258 462491
38824 462491 569978 337877 64380 141995 480427 716985 731176 654470 545751 321479
38814 321479 -60963 -495254 -756050 -640341 -225342 71117 -46586 -269785 -45612 548579
38804 548579 771621 252427 -423641 -514582 -104568 182139 157184 189499 464107 702816
38794 702816 708390 694545 857546 980663 751174 257492 -112081 -165720 -58347 17551
38784 17551 54600 88769 36437 -162082 -328191 -186667 238645 552593 440542 70205
38774 70205 -126780 3757 217547 258831 136333 -17984 -131384 -139052 35885 301859
38764 301859 357688 3453 -591914 -1050353 -1128812 -838438 -376678 -51905 -94761 -366417
$$ packed form
38834A93355p917K16916M4157p3246J45111K78557j3367l21450j65858J66233
38824D62491J07487k32101k73497P7615L38432K36558J4191p6706j08719k24272
38814C21479l82442m34291k60796J15709M14999K96459j17703k23199K24173N94191
38804E48579K23042n19194o76068r0941M10014K86707k4955L2315K74608K38709
38794G02816N574j3845J63001J23117k29489m93682l69573n3639J07373P5898
38784A7551L7049L4169n2332j98519j66109J41524M25312L13948j12051l70337
38774G0205j96985J30537K13790M1284j22498j54317j13400p668J74937K65974
38764C01859N5829l54235n95367m58439p8459K90374M61760L24773m2856k71656
$$ plain form
38754 -366417 -408601 7033 524148 653929 455104 412156 660688 739978 267871 -467166
38744 -467166 -850017 -675511 -263013 45461 193658 235518 166907 49026 61372 247872
38734 247872 376023 269833 161246 414229 921953 1124705 750878 218338 48298 144260
38724 144260 32383 -327403 -449719 -94975 329266 373196 196517 262629 590717 727097
38714 727097 434204 27240 -98291 12303 50129 -18427 112852 580091 1024982 986348
38704 986348 521055 175558 290164 585933 612861 378611 222148 196100 1171 -410427
38694 -410427 -590775 -195431 468198 798986 638573 352836 283760 424511 609537 732769
38684 732769 720799 527230 262827 171285 358401 637341 731860 566828 284980 41179
$$ packed form
38754c66417m2184M15634N17115J29781j98825m2948K48532P9290m72107p35037
38744d67166l82851J74506M12498L08474J48197M1860o8611j17881J2346J86500
38734B47872J28151j06190j08587K52983N07724K02752l73827n32540j70040R5962
38724A44260j11877l59786j22316L54744M24241M3930j76679O6112L28088J36380
38714G27097k92893m06964j25531J10594L7826o8556J31279M67239M44891l8634
38704I86348m65293l45497J14606K95769K6928k34250j56463k6048j94929m11598
38694d10427j80348L95344O63629L30788j60413k85737o9076J40751J85026J23232
38684G32769j1970j93569k64403r1542J87116K78940R4519j65032k81848k43801
$$ plain form
38674 41179 -114693 -163133 -47203 228730 487459 519233 381761 405382 760383 1145150
38664 1145150 1122093 699323 319616 275996 421785 512403 529266 535291 491387 391467 333762
38653 333762 293936 104456 -155948 -98964 360941 698896 506855 196585 405033 920271
38643 920271 900655 143169 -586577 -663711 -388388 -344274 -534677 -598628 -473700 -351798
38633 -351798 -236157 -10599 203908 176625 -40987 -200731 -252855 -339081 -484070 -616834
38623 -616834 -807036 -1126808 -1343633 -1137686 -613170 -197869 -2512 296745 829198 1221583
38613 1221583 1150690 831300 637895 528993 226322 -216775 -443049 -347464 -236050 -366090
38603 -366090 -610056 -683953 -510809 -249567 -97642 -139056 -274577 -261310 44095 435885
$$ packed form
38674D1179j55872m8440J15930K75933K58729L1774j37472K3621L55001L84767
38664A145150k3057m22770l79707m3620J45789R0618J6863O025m3904r9920n7705
38653C33762l9826j89480k60404N6984M59905L37955j92041l10270K08448N15238
38643I20271j9616p57486p29746p7134K75323M4114j90403o3951J24928J21902
38633c51798J15641K25558K14507k7283k17612j59744n2124q6226j44989j32764
38623f16834j90202l19772k16825K05947N24516M15301J95357K99257N32453L92385
38613A221583p0893l19390j93405j08902l02671m43097k26274R5585J11414j30040
38603c66090k43966p3897J73144K61242J51925m1414j35521J3267L05405L91790
$$ plain form
38593 435885 507802 135602 -329582 -461460 -236679 9733 6789 -218808 -461550 -530902
38583 -530902 -349000 3460 327775 489952 550606 617933 615707 357638 -135391 -564217
38573 -564217 -678125 -546831 -407619 -347144 -275401 -168077 -174090 -431839 -867068 -1241504
38563 -1241504 -1366909 -1217426 -863449 -395261 44965 247094 81803 -318887 -624925
38554 -624925 -595369 -253303 215609 627822 845070 802440 587798 394952 320719 304044
38544 304044 299415 328574 288073 -30785 -547692 -796413 -515210 -87468 -15407 -179150
38534 -179150 -116046 120854 16094 -489606 -808833 -614057 -293999 -213673 -143432 151792
38524 151792 337120 90300 -215474 -75322 257071 169420 -265039 -435541 -276935 -358118
$$ packed form
38593D35885P1917l72200m65184j31878K24781K46412k944k25597k42742o9352
38583e30902J81902L52460L24315J62177O0654O7327k226k58069m93029m28826
38573e64217j13908J31294J39212O0475P1743J07324o013k57749m35229l74436
38563a241504j25405J49483L53977M68188M40226K02129j65291m00690l06038
38554f24925K9556L42066M68912M12213K17248m2630k14642j92846p4233j6675
38544C04044m629K9159m0501l18858n16907k48721K81203M27742P2061j63743
38534a79150O3104K36900j04760n05700l19227J94776L20058Q0326P0241K95224
38524A51792J85328k46820l05774J40152L32393q7651m34459j70502J58606q1183
$$ plain form
38514 -358118 -807055 -983776 -518020 54766 138390 -22124 169740 669742 888045 595923
38504 595923 202150 140379 394375 702104 929940 1106285 1231432 1189528 869392 365009
38494 365009 -8218 -5148 261974 459462 433467 311440 235714 228817 334831 622834 972832
38483 972832 1116047 995262 844294 802049 713904 466228 247556 264386 420738 514479
38473 514479 567319 707252 859100 817648 579470 391351 456337 689471 756777 364239
38463 364239 -375330 -883013 -637488 197975 899240 987306 662271 389195 380417 598769
38453 598769 916188 1089318 913370 578391 505086 656165 501507 -51683 -285426 266694
38443 266694 931996 799098 122805 -31427 613029 1192881 1024224 460141 189732 348480
$$ packed form
38514c58118m48937j76721M65756N72786Q3624j60514J91864N00002K18303k92122
38504E95923l93773o1771K53996L07729K27836J76345J25147m1904l20136n04383
38494C65009l73227L070K67122J97488k5995j22027p5726o897J06014K88003L49998
38483I72832J43215j20785j50968m2245q8145k47676k18672J6830J56352R3741
38473E14479N2840J39933J51848m1452k38178j88119O4986K33134O7306l92538
38463C64239p39569n07683K45525Q35463P01265Q8066l25035k73076q778K18352
38453E98769L17419J73130j75948l34979p3305J51079j54658n53190k33743N52120
38443B66694O65302j32898o76293j54232O44456N79852j68657n64083k70409J58748
$$ plain form
38433 348480 641711 827373 761464 392744 -6710 11216 441809 711869 432217 -86885
38423 -86885 -301886 -69078 402389 854151 1000178 643782 56863 -143745 199115 506962
38413 506962 332352 39070 140385 399326 244463 -201642 -259512 213377 589992 439982
38403 439982 90655 -10108 40179 -87379 -340464 -371829 -69989 299057 434445 309519
38393 309519 146770 141735 196550 -1018 -515348 -904366 -688808 -24938 429907 355059
38383 355059 98198 52578 110076 9796 -111998 62226 442872 608195 450846 347068
38373 347068 582962 946354 1074110 957219 857354 871850 861261 777796 796576 1031772
38363 1031772 1317440 1421784 1361142 1323315 1340929 1259019 1057570 981334 1196765 1466058
$$ packed form
38433C48480K93231J85662o5909l68720l99454J7926M30593K70060k79652n19102
38423h6885k15001K32808M71467M51762J46027l56396n86919k00608L42860L07847
38413E06962j74610k93282J01315K58941j54863m46105n7870M72889L76615j50010
38403D39982l49327j00763N0287j27558k53085l1365L01840L69046J35388j24926
38393C09519j62749n035N4815j97568n14330l89018K15558O63870M54845p4848
38383C55059k56861m5620N7498j00280j21794J74224L80646J65323j57349j03778
38373C47068K35894L63392J27756j16891r9865J4496j0589q3465J8780K35196
38363A031772K85668J04344o0642l7827J7614q1910k01449p6236K15431K69293
$$ plain form
38353 1466058 1385185 925562 540576 666401 1239087 1784583 1907777 1614694 1204695 939225
38343 939225 833573 736938 580952 500529 658824 978698 1152299 972872 590973 360034
38333 360034 457219 743025 984096 1095049 1105278 1007167 790304 588767 601171 798957
38323 798957 886534 687442 423468 401750 529604 439532 102400 -24486 379522 1006068
38313 1006068 1306243 1189317 1032567 1083464 1173520 1049833 713573 331183 11421 -208943
38303 -208943 -292463 -228280 -64866 134776 305989 356223 242437 75011 2460 -14232
38293 -14232 -140714 -358685 -421005 -185446 214544 622380 1042656 1425440 1523833 1217280
38283 1217280 782078 549444 450159 237923 47254 293051 981829 1544207 1519640 1086882
$$ packed form
38353A466058q0873m59623l84986J25825N72686N45496J23194k93083m09999k65470
38343I39225j05652r6635j55986q0423J58295L19874J73601j79427l81899k30939
38333C60034R7185K85806K41071J10953J0229r8111k16863k01537J2404J97786
38323G98957Q7577j99092k63974k1718J27854r0072l37132j26886M04008O26546
38313A006068L00175j16926j56750N0897R0056j23687l36260l82390l19762k20364
38303b08943q3520O4183J63414J99642J71213N0234j13786j67426p2551j6692
38293a4232j26482k17971o2320K35559L99990M07836M20276L82784R8393l06553
38283A217280m35202k32634r9285k12236j90669K45797O88778N62378k4567m32758
$$ plain form
38273 1086882 721815 609621 629975 684344 745490 730527 610069 555311 716806 928098
38263 928098 902396 690869 651289 915238 1156282 1014061 564322 226388 310139 762793
38253 762793 1285772 1599526 1618312 1432501 1165132 910364 813067 1031469 1463443 1658978
38243 1658978 1274732 561005 100708 66802 79907 -122010 -264927 -24197 393295 508915
38233 508915 250858 20038 121731 424581 607861 528968 299109 134684 158185 267036
38223 267036 237987 27657 -136786 -66342 131715 242509 225927 129773 -88622 -395575
38213 -395575 -509983 -230960 180544 306790 172245 133069 216187 50172 -468202 -911836
38203 -911836 -911510 -601514 -261322 101937 530611 813360 757363 546281 509190 691509
$$ packed form
38273A086882l65067j12194K0354N4369O1146j4963j20458n4758J61495K11292
38263I28098k5702k11527l9580K63949K41044j42221m49739l37934Q3751M52654
38253G62793N22979L13754J8786j85811k67369k54768r7297K18402M31974J95535
38243A658978l84246p13727m60297l3906J3105k01917j42917K40730M17492J15620
38233E08915k58057k30820J01693L02850J83280p8893k29859j64425K3501J08851
38223B67036k9049k10330j64443P0444J98057J10794j6582r6154k18395l06953
38213c95575j14408K79023M11504J26246j34545l9176Q3118j66015n18374m43634
38203i11836L26L09996L40192L63259M28674K82749n5997k11082l7091J82319
$$ plain form
38193 691509 915214 1091287 1209796 1187033 987604 747337 540579 228292 -189841 -322885
38183 -322885 112331 712954 778904 234558 -276057 -239864 183974 551439 693588 742755
38173 742755 862807 1081728 1223397 996625 365465 -221558 -280874 61168 250148 124924
38163 124924 78428 294736 373517 13822 -410058 -397268 -90973 5931 -150795 -165801
38153 -165801 59054 174037 26082 -56955 183634 507475 560995 405019 354676 461500
38143 461500 459053 184786 -180301 -336086 -203054 1344 -12460 -284591 -501103 -316451
38133 -316451 162199 369258 -72848 -812795 -1123100 -775469 -286142 -201165 -416599 -436138
38123 -436138 -110494 211400 238673 124573 182836 438304 628412 541801 210529 -186034
$$ packed form
38193F91509K23705J76073J18509k2763j99429k40267k06758l12287m18133j33044
38183c22885M35216O00623O5950n44346n10615L6193M23838L67465J42149M9167
38173G42755J20052K18921J41669k26772o31160n87023n9316L42042J88980j25224
38163A24924m6496K16308P8781l59695m23880J2790L06295R6904j56726j5006
38153a65801K24855J14983j47955q3037K40589L23841N3520j55976n0343J06824
38143D61500k447k74267l65087j55785J33032K04398j3804k72131k16512J84652
38133c16451M78650K07059m42106p39947l10305L47631M89327Q4977k15434j9539
38123d36138L25644L21894K7273j14100N8263K55468J90108q6611l31272l96563
$$ plain form
38113 -186034 -504682 -734888 -946581 -1129245 -1137469 -899804 -610703 -511107 -508761 -298181
38103 -298181 108277 322534 193470 88342 287645 476437 262100 -100589 -49140 385648
38093 385648 622744 454148 309883 483179 677241 571825 335166 242212 193419 -24636
38083 -24636 -328000 -541318 -727174 -950329 -982815 -643996 -223165 -150957 -401237 -610972
38073 -610972 -656980 -706391 -802429 -834059 -870755 -1096337 -1389719 -1361379 -867390 -170229 430700
38062 430700 814902 911772 732516 540001 588630 671289 374933 -149302 -207648 432833
38052 432833 1076335 980467 292550 -291239 -451905 -379260 -252061 -109085 -110988 -426532
38042 -426532 -859625 -1004555 -804159 -591615 -543903 -468607 -233374 -51437 -143825 -370428
$$ packed form
38113a86034l18648k30206k11693j82664q224K37665K89101R9596K346K10580
38103b98181M06458K14257j29064j05128J99303J88792k14337l62689N1449M34788
38093C85648K37096j68596j44265J73296J94062j05416k36659r2954m8793k18055
38083b4636l03364k13318j85856k23155l2486L38819M20831P2208k50280k09735
38073f10972m6008m9411r6038l1630l6696k25582k93382K8340M93989O97161O00929
38062D30700L84202R6870j79256j92515M8629Q2659k96356n24235n8346O40481
38052D32833O43502r5868o87917n83789j60666P2645J27199J42976j903l15544
38042d26532m33093j44930K00396K12544M7712P5296K35233J81937r2388k26603
$$ plain form
38032 -370428 -420028 -223381 9709 84004 3264 -103983 -143760 -131624 -125317 -95066 55856
38021 55856 280671 330991 75570 -231302 -247398 -57237 -83224 -446447 -748576 -644825
38011 -644825 -343488 -284682 -518132 -692869 -578752 -320075 -164508 -161856 -197380 -180938
38001 -180938 -115859 -30061 106325 360906 685620 816994 494192 -151334 -597636 -484996
37991 -484996 -44022 218366 157597 69661 173509 311223 253944 70337 15426 169385
37981 169385 349872 355193 193687 66034 150898 399304 558806 453130 207153 97688
37971 97688 194515 278329 142739 -148084 -362967 -364254 -196154 14205 183507 346221
37961 346221 620345 1035822 1405255 1472608 1198358 778237 379068 19003 -266444 -351889
$$ packed form
38032c70428m9600J96647K33090P4295q0740j07247l9777J2136O307L0251J50922
38021E5856K24815N0320k55421l06872j6096J90161k5987l63223l02129J03751
38011f44825L01337N8806k33450j74737J14117K58677J55567K652l5524J6442
38001a80938O5079Q5798J36386K54581L24714J31374l22802o45526m46302J12640
37991d84996M40974K62388o0769q7936J03848J37714n7279j83607n4911J53959
37981A69385J80487N321j61506j27653Q4864K48406J59502j05676k45977j09465
37971I7688R6827Q3814j35590k90823k14883j287J68100K10359J69302J62714
37961C46221K74124M15477L69433O7353k74250m20121l99169l60065k85447q5445
$$ plain form
37951 -351889 -222357 -69723 -53755 -103162 -70722 63382 266107 554473 861326 968884
37941 968884 771261 448401 180157 -121576 -532353 -773938 -542414 -70079 78674 -218363
37931 -218363 -486341 -346384 31230 289191 313393 122429 -298434 -789666 -952191 -599294
37921 -599294 -56692 262575 364741 466112 513711 314488 15069 19127 408613 794030
37911 794030 803858 455605 1155 -334031 -410514 -244988 -110374 -321569 -804983 -1096196
37901 -1096196 -899774 -461151 -227054 -298079 -401619 -300367 -36588 189495 227401 60844
37891 60844 -206850 -432267 -546186 -583991 -589711 -553366 -486259 -471883 -539597 -533753 -239546
37880 -239546 328562 849588 975241 675506 276274 154266 402363 776344 933585 715038
$$ packed form
37951c51889J29532J52634J5968m9407L2440J34104K02725K88366L06853J07558
37941I68884j97623l22860k68244l01733m10777k41585K31524M72335J48753k97037
37931b18363k67978J39957L77614K57961K4202j90964m20863m91232j62525L52897
37921e99294N42602L19267J02166J01371M7599j99223k99419M058L89486L85417
37911G94030R828l48253m54450l35186p6483J65526J34614k11195m83414k91213
37901a096196J96422M38623K34097p1025j03540J01252K63779K26083L7906j66557
37891F0844k67694k25417j13919l7805n720L6345O7107J4376o7714N844K94207
37880b39546N68108N21026J25653k99735l99232j22008K48097L73981J57241k18547
$$ plain form
37870 715038 239645 -219288 -452271 -462355 -421055 -465838 -573204 -678195 -845631 -1167074
37860 -1167074 -1491962 -1472255 -991075 -387919 -93170 -147396 -261496 -263433 -257590 -355433 -471309
37849 -471309 -447055 -227106 143114 565144 893923 1026924 1035313 1081982 1157191 1028846
37839 1028846 540895 -145963 -707917 -971867 -981926 -829100 -551449 -203359 94411 252646
37829 252646 334882 504626 816657 1119184 1244067 1249224 1328705 1481573 1470008 1192733
37819 1192733 890886 811778 849023 746087 508766 333353 230262 49571 -157793 -157921
37809 -157921 49180 165052 35228 -142616 -156832 -42451 106071 285539 411780 304982
37799 304982 24403 -85782 97826 219492 -50478 -522863 -786795 -739708 -501667 -66415
$$ packed form
37870G15038m75393m58933k32983j0084M1300m4783j07366j04991j67436l21443
37860a167074l24888J9707M81180O03156K94749n4226j14100j937N843r7843j15876
37849d71309K4254K19949L70220M22030L28779J33001Q389M6669P5209j28345
37839A028846m87951o86858n61954k63950j0059J52826K77651L48090K97770J58235
37829B52646Q2236J69744L12031L02527J24883N157P9481J52868j1565k77275
37819A192733l01847p9108L7245j02936k37321j75413j03091j80691k07364j28
37809a57921K07101J15872j29824j77844j4216J14381J48522J79468J26241j06798
37799C04982k80579j10185J83608J21666k69970m72385k63932M7087K38041M35252
$$ plain form
37789 -66415 551411 1014327 970332 580827 317084 287767 203011 -17338 -82595 134817
37779 134817 347815 303625 113944 -51400 -263006 -587637 -818694 -723301 -395139 -138425
37769 -138425 -109521 -226130 -315693 -233149 42114 325759 376639 190617 -20322 -172408
37759 -172408 -365199 -506572 -234840 544350 1341917 1631175 1490505 1350537 1295584 1065508
37749 1065508 673178 510152 720794 899344 654976 183939 -13887 181208 407319
37740 407319 347171 78382 -161288 -342988 -611318 -952197 -1084141 -764608 -124634 410973
37730 410973 529676 280545 -63662 -283532 -335951 -313709 -330136 -368431 -250264 113459
37720 113459 450768 337048 -235782 -737107 -718212 -349177 -116143 -171703 -272379 -228698
$$ packed form
37789f6415O17826M62916m3995l89505k63743k9317q4756k20349o5257K17412
37779A34817K12998m4190j89681j65344k11606l24631k31057R5393L28162K56714
37769a38425K8904j16609q9563Q2544K75263K83645N0880j86022k10939j52086
37759a72408j92791j41373K71732P79190P97567K89258j40670j39968n4953k30076
37749A065508l92330j63026K10642J78550k44368m71037j97826J95095K26111
37740D07319o0148k68789k39670j81700k68330l40879j31944L19533O39974N35607
37730D10973J18703k49131l44207k19870n2419K2242j6427l8295J18167L63723
37720A13459L37309j13720n72830n01325J8895L69035K33034n5560j00676M3681
$$ plain form
37710 -228698 -91484 50317 145852 87786 -155314 -342709 -224079 29224 37507 -141518
37700 -141518 -47266 401914 677707 443057 98300 147643 431687 467845 241337 110410
37690 110410 118254 -24805 -339507 -503626 -403589 -277973 -265345 -269593 -321054 -570387 -829030
37679 -829030 -665670 -156090 22730 -438232 -944243 -859302 -438831 -353492 -635310 -738789
37669 -738789 -468167 -195534 -184898 -289684 -387698 -579254 -806317 -745303 -295809 180388
37659 180388 305036 74741 -328447 -783790 -1123762 -1128245 -859140 -699360 -814334 -872920
37649 -872920 -593632 -275497 -391847 -844423 -1060639 -790197 -414205 -396155 -710118 -916743
37639 -916743 -639401 86920 817240 1048505 696890 201019 30305 161587 213519 20005
$$ packed form
37710b28698J37214J41801R5535n8066k43100j87395J18630K53303Q283j79025
37700a41518R4252M49180K75793k34650l44757M9343K84044L6158k26508j30927
37690A10410P844j43059l14702j64119J00037J25616J2628m248n1461k49333k58643
37679h29030J63360N09580J78820m60962n06011Q4941M20471Q5339k81818j03479
37669g38789K70622K72633J0636j04786r8014j91556k27063O1014M49494M76197
37659A80388J24648k30295m03188m55343l39972m483K69105J59780j14974n8586
37649h72920K79288L18135j16350m52576k16216K70442L75992J8050l13963k06625
37639i16743K77342P26321P30320K31265l51615m95871j70714J31282N1932j93514
$$ plain form
37629 20005 -191784 -217997 -208637 -424673 -799597 -935976 -573276 35153 332219 88389
37619 88389 -299532 -303616 37657 211925 20107 -135495 74152 358333 295454 45653
37609 45653 94493 466209 703116 565931 264197 -9191 -280970 -470249 -347776 26432
37599 26432 258459 194459 139242 310635 487370 453769 410531 628953 1008010 1280838
37589 1280838 1377054 1291499 911492 324712 -2670 227603 651297 711617 424512 244862
37579 244862 349730 520691 603601 603952 430929 52308 -178500 94872 560318 564829 147679
37568 147679 49078 510552 817982 443477 -53897 92723 593351 528411 -184421 -596401
37558 -596401 -90554 767250 1037758 574632 -154 -185382 -51913 97739 156775 202890
$$ packed form
37629B0005k11789k6213R360k16036l74924j36379L62700O08429K97066k43830
37619H8389l87921m084L41273J74268j91818j55602K09647K84181o2879k49801
37609D5653M8840L71716K36907j37185l01734k73388k71779j89279J22473L74208
37599B6432K32027o4000n5217J71393J76735l3601m3238K18422L79057K72828
37589A280838R6216q5555l80007n86780l27382K30273M23694O0320k87105j79650
37579B44862J04868J70961Q2910L51j73023l78621k30808K73372M65446M511m17150
37568A47679r8601M61474L07430l74505m97374J46620N00628o4940p12832m11980
37558e96401N05847Q57804K70508m63126n74786j85228J33469J49652N9036M6115
$$ plain form
37548 202890 256379 227921 112817 114891 435194 923544 1105224 693293 -26827 -508356
37538 -508356 -583030 -559321 -672138 -725334 -455727 -29594 130252 -40900 -125970 183107
37528 183107 630023 744134 484653 251306 298838 452205 474671 416883 418603 416663 312830
37517 312830 241646 351659 447846 215750 -263754 -622662 -803931 -1063600 -1289611 -904706
37507 -904706 211541 1206645 1201905 456314 -6503 215653 520769 324542 -165650 -427083
37497 -427083 -362941 -205794 -15924 320225 744481 1015701 995721 733887 347241 8516
37487 8516 -59256 175396 372168 137784 -465615 -957499 -1027153 -875751 -883628 -1113498 -1281459
37476 -1281459 -1116066 -610192 26196 534886 746492 665938 459997 306907 235813 146114
$$ packed form
37548B02890N3489k8458j15104K074L20303M88350J81680m11931p20120m81529
37538e08356p4674K3709j12817n3196K69607M26133J59846j71152q5070L09077
37528A83107M46916J14111k59481k33347M7532J53367K2466n7788J720j940j03833
37517C12830p1184J10013R6187k32096m79504l58908j81269k59669k26011L84905
37507i04706J116247R95104m740p45591m62817K22156L05116j96227m90192k61433
37497d27083O4142J57147J89870L36149M24256K71220j9980k61834l86646l38725
37487H516o7772K34652J96772k34384o03399m91884o9654J51402p877k29870j67961
37476a281459J65393N05874O36388N08690K11606q0554k05941j53090p1094q9699
$$ plain form
37466 146114 -19337 -175527 -181920 21367 371920 712849 849649 689557 394662 281870
37456 281870 444700 584192 409293 112843 150388 541615 756791 449752 -40899 -187961
37446 -187961 23298 243269 358721 486211 521627 252882 -76731 100753 817320 1366205
37436 1366205 1237758 792796 635569 727639 613834 244617 10324 63154 137843 75863
37426 75863 71282 278989 538034 640790 621488 638592 753952 920528 1036495 967344 667953
37415 667953 296291 46855 -106034 -310025 -528932 -583720 -474484 -380861 -336902 -205994
37405 -205994 -8882 47824 -62139 -120386 -55579 -47231 -115836 -5971 308360 396452 -25642
37394 -25642 -576795 -674959 -310710 3828 -91615 -509362 -953216 -1135014 -873652 -292652
$$ packed form
37466A46114j65451j56190o393K03287L50553L40929J36800j60092k94895j12792
37456B81870J62830J39492j74899k96450L7545L91227K15176l07039m90651j47062
37446a87961K11259K19971J15452J27490L5416k68745l29613J77484P16567N48885
37436A366205j28447m44962j57227R2070j13805l69217k34293N2830P4689o1980
37426G5863m581K07707K59045J02756j9302J7104J15360J66576J15967o9151k99391
37415F67953l71662k49436j52889k03991k18907n4788J09236R3623M3959J30908
37405b05994J97112N6706j09963n8247O4807Q348o8605J09865L14331Q8092m22094
37394b5642n51153r8164L64249L14538r5443m17747m43854j81798K61362N81000
$$ plain form
37384 -292652 180987 295925 313436 562119 848344 734607 279328 -2560 85842 186446
37374 186446 25514 -164377 -54117 306341 631833 749501 629891 319003 -4366 -131999
37364 -131999 -113844 -200702 -392129 -345757 80640 490364 409572 -116565 -633011 -821237
37354 -821237 -720944 -547714 -490445 -580247 -620330 -387952 -4356 132242 -68012 -165237
37344 -165237 186352 668302 705905 246998 -262345 -549119 -727646 -879996 -864990 -641523
37334 -641523 -430127 -401080 -448712 -406042 -283037 -174271 -95923 -24665 21017 13782 -55224
37323 -55224 -194293 -355194 -398603 -271123 -172137 -337731 -674572 -835095 -662986 -329935
37313 -329935 -24966 214958 332152 233074 48953 74786 283223 250764 -177865 -504137
$$ packed form
37384b92652M73639J14938J7511K48683K86225j13737m55279k81888Q8402J00604
37374A86446j60932j89891J10260L60458L25492J17668j19610l10888l23369j27633
37364a31999J8155q6858j91427M6372M26397M09724q0792n26137n16446j88226
37354h21237J00293J73230N7269q9802m0083K32378L83596J36598k00254r7225
37344a65237L51589M81950L7603m58907n09343k86774j78527j52350J5006K23467
37334f41523K11396K9047m7632M2670J23005J08766P8348P1258M5682p235o9006
37323e5224j39069j60901m3409J27480R8986j65594l36841j60523J72109L33051
37313c29935L04969K39924J17194r9078j84121K5833K08437l2459m28629l26272
$$ plain form
37303 -504137 -244285 285407 353919 -135102 -529289 -411139 -161920 -323245 -834138 -1240926
37293 -1240926 -1356334 -1320584 -1206841 -986507 -794230 -797328 -799251 -413297 258857 561761
37283 561761 147772 -471685 -594674 -256437 -35428 -119384 -114926 216659 585913 699544
37273 699544 680068 699770 606468 262491 -71217 -100387 -10064 -163543 -434705 -324101
37263 -324101 272213 850563 935744 576601 118510 -194625 -275584 -141336 45178 87690
37253 87690 3096 -39654 -43927 -164707 -329784 -256348 21335 44189 -397434 -845065 -776165
37242 -776165 -332996 -37490 -12365 12960 37023 -290987 -977752 -1427541 -1169109 -516065
37232 -516065 -168232 -329439 -550333 -400636 -1501 191845 -53439 -540504 -899074 -907417
$$ packed form
37303e04137K59852N29692O8512m89021l94187J18150K49219j61325n10893m06788
37293a240926j15408L5750J13743K20334J92277l098j923L85954O72154L02904
37283E61761m13989o19457j22989L38237K21009q3956M458L31585L69254J13631
37273F99544j9476J9702r3302l43977l33708k9170R0323j53479k71162J10604
37263c24101N96314N78350Q5181l59143m58091l13135q0959J34248J86514M2512
37253H7690q4594m2750m273j20780j65077P3436K77683K2854m41623m47631O8900
37242g76165M43169K95506K5125K5325K4063l28010o86765m49789K58432O53044
37232e16065L47833j61207k20894J49697L99135J93346k45284m87065l58570q343
$$ plain form
37222 -907417 -572799 -37771 496993 816014 777978 401249 -164809 -730009 -1092182 -1074759
37212 -1074759 -689979 -234209 -35975 -83684 -83662 78442 165921 -15016 -290570 -378171 -270434
37201 -270434 -127783 35423 256923 336822 7386 -600234 -994338 -911760 -587787 -338202
37191 -338202 -166387 29824 124985 -60643 -377503 -446977 -163845 129290 42694 -439779
37181 -439779 -1021665 -1445922 -1655132 -1662267 -1433165 -977223 -480849 -231244 -362592 -709066
37171 -709066 -936720 -818008 -396305 69497 318400 304722 226997 294784 466543 505303
37161 505303 313255 84285 40938 131211 115429 -114744 -438181 -678676 -745476 -638946
37151 -638946 -458806 -378486 -454668 -479730 -210717 235015 423663 134884 -335724 -540102
$$ packed form
37222i07417L34618N35028N34764L19021l8036l76729n66058n65200l62173J7423
37212a074759L84780M55770J98234m7709K2J62104Q7479j80937k75554q7601J07737
37201b70434J42651J63206K21500P9899l29436o07620l94104Q2578L23973K49585
37191c38202J71815J96211R5161j85628l16860o9474K83132K93135q6596m82473
37181d39779n81886m24257k09210p135K29102M55942M96374K49605j31348l46474
37171g09066k27654J18712M21703M65802K48903j3678p7725O7787J71759L8760
37161E05303j92048k28970m3347R0273j5782k30173l23437k40495o6800J06530
37151f38946J80140Q0320p6182k5062K69013M45732J88648k88779m70608k04378
$$ plain form
37141 -540102 -394395 -163634 -51057 -28523 -36970 -113806 -262427 -393158 -501236 -732384
37131 -732384 -1105247 -1301303 -976671 -256874 333591 494009 456419 551279 722262 714100
37121 714100 536767 394523 255459 -96355 -553552 -657737 -248910 218141 256091 -42483
37111 -42483 -253347 -230842 -141477 -83468 -45496 -130839 -444760 -796959 -863160 -647816 -483564
37100 -483564 -570781 -809113 -1065552 -1275873 -1274362 -898598 -344893 -66796 -197042 -384373
37090 -384373 -320838 -105848 46888 119086 128814 7911 -141132 -1076 482278 887945
37080 887945 874275 643957 537672 484299 265744 49550 154770 455694 533283 332855
37070 332855 167924 118888 -36869 -268865 -222356 160725 466369 468223 485577 787818
$$ packed form
37141e40102J45707K30761J12577K2534q447p6836j48621j30731j08078k31148
37131g32384l72863j96056L24632P19797N90465J60418l7590R4860J70983q162
37121G14100j77333j42244j39064l51814m57197j04185M08827M67051L7950k98574
37111d2483k10864K2505Q9365N8009L7972q5343l13921l52199o6201K15344J64252
37100d83564q7217k38332k56439k10321J511L75764N53705K78097j30246j87331
37090c84373O3535K14990J52736P2198R728j20903j49043J40056M83354M05667
37080H87945j3670k30318j06285n3373k18555k16194J05220L00924P7589k00428
37070C32855j64931m9036j55757k31996M6509L83081L05644J854J7354L02241
$$ plain form
37060 787818 1062200 860424 276835 -215547 -403060 -429304 -400143 -268950 -65770 76444
37050 76444 122662 131560 88202 -39351 -136557 -81025 2708 -101810 -305893 -268800 93602
37039 93602 431103 420622 188617 102420 281611 497546 503225 320421 193456 327096
37029 327096 680724 1006050 1090580 939671 698153 465819 270353 139842 57358 -103238
37019 -103238 -410675 -659659 -538132 -59474 384951 503987 442868 499084 667775 662111
37009 662111 302674 -275688 -754588 -854051 -505924 56935 445953 474966 313695 192489
36999 192489 87465 -131838 -371952 -392969 -187994 -40630 -163775 -457990 -660958 -599276
36989 -599276 -303220 -18292 -56273 -450475 -820477 -808562 -576121 -561371 -801218 -900792
$$ packed form
37060G87818K74382k01776n83589m92382j87513k6244K9161J31193K03180J42214
37050G6444M6218Q898m3358j27553r7206N5532Q3733j04518k04083L7093L62402
37039I3602L37501j0481k32005q6197J79191K15935N679j82804j26965J33640
37029C27096L53628L25326Q4530j50909k41518k32334j95466j30511q2484j60596
37019a03238l07437k48984J21527M78658M44425J19036o1119N6216J68691n664
37009F62111l59437n78362m78900r9463L48127N62859L89018K9013j61271j21206
36999A92489j05024k19303k40114k1017K04975J47364j23145k94215k02968O1682
36989e99276K96056K84928l7981l94202l70002J1915K32441J4750k39847r9574
$$ plain form
36979 -900792 -704790 -520813 -520784 -423581 -78704 98592 -274843 -863680 -1036839 -738019
36969 -738019 -406631 -211022 48604 340095 323027 -39675 -332806 -299851 -132716 -2802
36959 -2802 213788 532917 656945 462904 289219 423516 679629 808488 928687 1128728
36949 1128728 1019991 249601 -766144 -1213985 -911451 -426320 -199529 -103136 54052
36940 54052 130742 -5890 -162399 -125649 -2732 -9020 -149214 -331577 -581856 -900250
36930 -900250 -1080207 -928478 -558025 -234398 -17952 216633 468719 565967 441459 246120
36920 246120 122589 27126 -133060 -299280 -319236 -167176 4351 62760 76101 221002
36910 221002 520342 761627 732309 478612 248585 209591 316912 448118 547605 602992
$$ packed form
36979i00792J96002J83977K9R7203L44877J77296l73435n88837j73159K98820
36969g38019L31388J95609K59626K91491j7068l62702k93131L2955J67135J29914
36959b802K16590L19129J24028j94041j73685J34297K56113J28859J20199K00041
36949A128728j08737p70390j015745m47841L02534M85131K26791R6393J57188
36940E4052P6690j36632j56509L6750J22917o288j40194j82363k50279l18394
36930i00250j79957J51729L70453L23627K16446K34585K52086R7248j24508j95339
36920B46120j23531r5463j60186j66220j9956J52060J71527N8409J3341J44901
36910B21002K99340K41285k9318k53697k30027l8994J07321J31206R9487N5387
$$ plain form
36900 602992 588971 519880 498441 614156 792447 817744 556908 148480 -89034 8960
36890 8960 239529 245359 -51235 -351969 -371347 -166229 43660 210289 376146 381152 5688
36879 5688 -556775 -730752 -257553 396867 584471 243152 -156034 -284493 -215043 -37364
36869 -37364 354244 900819 1139497 668074 -279318 -1045927 -1314996 -1344435 -1393390 -1272497
36859 -1272497 -702577 124681 686376 746626 518607 229534 -128730 -524420 -698019 -477285
36849 -477285 -71582 179732 213204 191898 189193 154699 95903 54366 -38255 -262125 -525043
36838 -525043 -683342 -764783 -837925 -768631 -424839 -55184 -69483 -412158 -563624 -286250
36828 -286250 33496 560 -203540 -172133 64980 118827 -152372 -481222 -617176 -615152
$$ packed form
36900F02992j4021o9091k1439J15715J78291K5297k60836m08428k37514R7994
36890H960K30569N830k96594l00734j9378K05118K09889J66629J65857N006l75464
36879E688n62463j73977M73199O54420J87604l41319l99186j28459O9450J77679
36869c7364L91608N46575K38678m71423r47392p66609k69069k9439m8955J20893
36859a272497N69920Q27258N61695O0250k28019k89073l58264l95690j73599K20734
36849d77285M05703K51314L3472k1306k705l4494n8796m1537r2621k23870k62918
36838e25043j58299q1441p3142O9294L43792L69655j4299l42675j51466K77374
36828b86250L19746l2936k04100L1407K37113N3847k71199l28850j35954K024
$$ plain form
36818 -615152 -640160 -688447 -607287 -331505 -49934 -81720 -490920 -877548 -771371 -244470
36808 -244470 161656 196660 210679 495611 737168 535260 151223 189047 677460 1032358
36798 1032358 918276 608205 414662 293765 193988 310560 702877 1029284 972266 652699
36788 652699 361464 165388 62126 225670 715870 1152399 1091551 628692 262962 237685
36778 237685 370584 480256 581002 619018 400825 -72566 -480294 -544158 -320752 -29298
36768 -29298 210929 361983 379982 285805 190169 149184 118594 107681 209310 401479 502555
36757 502555 420433 263250 108352 -114516 -368336 -383671 -16253 460035 665809 569083
36747 569083 386784 212905 46920 29210 265417 505304 409923 109790 56177 290024
$$ packed form
36818f15152k5008m8287Q1160K75782K81571l1786m09200l86628J06177N26901
36808b44470M06126L5004J4019K84932K41557k01908l84037L7824M88413L54898
36798A032358j14082l10071j93543j20897r9777J16572L92317L26407n7018l19567
36788F52699k91235j96076j03262J63544M90200M36529o0848m62859l65730k5277
36778B37685J32899J09672J00746L8016k18193m73391m07728o3864K23406K91454
36768b9298K40227J51054J7999r4177r5636m0985l0590j0913J01629J92169J01076
36757E02555q2122j57183j54898k22868k53820j5335L67418M76288K05774r6726
36747E69083j82299j73879j65985j7710K36207K39887r5381l00133n3613K33847
$$ plain form
36737 290024 352794 58628 -163721 18573 256773 50540 -499017 -933382 -1156259 -1381156
36727 -1381156 -1536890 -1311036 -763288 -339550 -197648 -42849 214456 170818 -397017 -1010128
36717 -1010128 -1049957 -553108 -27983 306839 636211 1000255 1130492 920114 662315 643561
36707 643561 785930 890697 997156 1234004 1457251 1346816 868498 383790 213220 286912
36697 286912 357776 384317 478082 564631 395257 -44953 -405266 -402756 -186442 -66686 -58264
36686 -58264 22333 114267 -62637 -499041 -762765 -546497 -98226 106926 -50409 -303269
36676 -303269 -428205 -453131 -462494 -423274 -276961 -80848 28097 -13728 -110276 -91845 80667
36665 80667 223910 133274 -130631 -289287 -212782 -83817 -116127 -269796 -380499 -431572
$$ packed form
36737B90024O2770k94166k22349J82294K38200k06233n49557m34365k22877k24897
36727a381156j55734K25854N47748M23738J41902J54799K57305m3638n67835o13111
36717a010128l9829M96849N25125L34822L29372L64044J30237k10378k57799j8754
36707F43561J42369J04767J06459K36848K23247j10435m78318m84708j70570P3692
36697B86912P0864K6541R3765Q6549j69374m40210l60313K510K16314J19756Q422
36686e8264Q0597R1934j76904m36404k63724K16268M48271K05152j57335k52860
36676c03269j24936k4926r363L9220J46313J96113J08945m1825r6548J8431J72512
36665H0667J43243r0636k63905j58656P6505J28965l2310j53669j10703n1073
$$ plain form
36655 -431572 -514290 -607984 -605055 -525116 -509223 -580816 -578756 -385695 -99902 94862 151753
36644 151753 172671 229405 252897 141864 -45970 -100024 82938 316501 331056 134275
36634 134275 1239 88520 246713 290064 262714 304103 405351 463895 471241 488498 520205
36623 520205 549177 598163 612046 394433 -143801 -745387 -1019218 -872660 -576578 -432317
36613 -432317 -520442 -730964 -867879 -738024 -302689 228686 552226 526653 248532 -44894
36603 -44894 -102261 157136 479722 475974 127217 -114868 59914 344588 254444 -166453
36593 -166453 -471152 -497441 -467500 -449836 -221869 248717 635372 717858 637130 534300
36583 534300 314479 -33625 -246443 -172659 -56826 -170540 -408626 -509001 -442790 -318648
$$ packed form
36655d31572q2718r3694K929P9939J5893p1593K060J93061K85793J94764N6891
36644A51753K0918N6734K3492j11033j87834n4054J82962K33563J4555j96781
36634A34275j33036Q7281J58193M3351k7350M1389J01248N8544P346J7257L1707
36623E20205K8972M8986J3883k17613n38234o01586k73831J46558K96082J44261
36613d32317q8125k10522j36915J29855M35335N31375L23540k5573k78121k93426
36603d4894n7367K59397L22586l748l48757k42085J74782K84674r0144m20897
36593a66453l04699k6289K9941J7664K27967M70586L86655Q2486q0728j02830
36583E34300k19821l48104k12818P3784J15833j13714k38086j00375O6211J24142
$$ plain form
36573 -318648 -110290 230436 549166 654857 590720 507866 401514 197613 -42188 -234594
36563 -234594 -443590 -693888 -783335 -567523 -279079 -237896 -366548 -355145 -220885 -290401
36553 -290401 -624936 -884349 -866024 -807250 -977061 -1260994 -1352899 -1145530 -755895 -355263
36543 -355263 -144585 -308906 -783778 -1194064 -1220984 -931017 -571503 -182269 328089 798958
36533 798958 856340 437553 10658 60576 495466 789649 662581 375783 311346 481100
36523 481100 607328 543134 398103 291530 195768 64955 -53789 -120990 -192948 -319487
36513 -319487 -441846 -468221 -372186 -155636 184249 562357 776226 694419 433435 253655
36503 253655 312644 579741 911721 1108626 971904 467485 -162438 -567030 -599948 -411400
$$ packed form
36573c18648K08358L40726L18730J05691o4137q2854j06352k03901k39801j92406
36563b34594k08996k50298q9447K15812K88444M1183j28652J1403J34260o9516
36553b90401l34535k59413J8325N8774j69811k83933r1905K07369L89635M00632
36543c55263K10678j64321m74872m10286k6920K89967L59514L89234N10358M70869
36533G98958N7382m18787m26895M9918M34890K94183j27068k86798o4437J69754
36523D81100J26228o4194j45031j06573r5762j30813j18744o7201p1958j26539
36513c19487j22359k6375R6035K16550L39885L78108K13869q1807k60984j79780
36503B53655N8989K67097L31980J96905j36722n04419o29923m04592l2918J88548
$$ plain form
36493 -411400 -242588 -204407 -248083 -254887 -119651 180027 526902 691983 493339 -6674
36483 -6674 -465706 -511344 -108887 354020 438612 101549 -305097 -450693 -330591 -164635
36473 -164635 -129486 -233114 -356554 -382535 -342447 -406630 -631025 -787055 -631439 -299975
36463 -299975 -175331 -339119 -440242 -208814 172824 374737 358342 314427 356354 480774
36453 480774 670658 831293 769908 451964 155520 160609 381817 496003 340662 22141
36443 22141 -256775 -316272 -84191 267795 421614 312718 238120 368024 403356 25340
36433 25340 -544634 -833212 -804728 -809074 -909146 -753436 -199129 360093 461683 86060
36423 86060 -431434 -761928 -750516 -445923 -82369 115992 159703 187845 187138 52536 -99909
$$ packed form
36493d11400J68812L8181m3676o804J35236K99678L46875J65081j98644n00013
36483f674m59032m5638M02457M62907Q4592l37063m06646j45596J20102J65956
36473a64635L5149j03628j23440k5981M0088o4183k24395j56030J55616L31464
36463b99975J24644j63788j01123K31428L81638K01913j6395m3915M1927J24420
36453D80774J89884J60635o1385l17944k96444N089K21208J14186j55341l18521
36443B2141k78916n9497K32081L51986J53819j08896p4598J29904L5332l78016
36433B5340n69974k88578K8484m346j00072J55710N54307N59222J01590l75623
36423H6060n17494l30494J1412L04593L63554J98361M3711K8142p07j34602j52445
$$ plain form
36412 -99909 13774 409902 717830 612944 193318 -153786 -132596 218733 525250 359891
36402 359891 -303021 -998346 -1305458 -1302308 -1231170 -969627 -298871 465111 697599 321584
36392 321584 -126757 -328966 -468835 -582495 -331971 272428 588962 239901 -261774 -308108
36382 -308108 -143862 -397469 -1009659 -1313769 -1032216 -573053 -369576 -449376 -666497 -894038
36372 -894038 -933696 -632556 -173263 52678 -94413 -411295 -686189 -847131 -826130 -594820
36362 -594820 -328826 -232709 -196251 77981 588228 968594 951537 631184 231939 -119544
36352 -119544 -345665 -406020 -410650 -516846 -642182 -501079 -17674 485796 614025 290772
36342 290772 -212873 -518493 -408099 -6871 284941 170472 -243597 -626586 -802194 -774454
$$ packed form
36412i9909J13683L96128L07928j04886m19626l47104K1190L51329L06517j65359
36402C59891o62912o95325l07112L150P1138K61543O70756P63982K32488l76015
36392C21584m48341k02209j39869j13660K50524O04399L16534l49061n01675m6334
36382c08108J64246k53607o12190l04110K81553M59163K03477p9800k17121k27541
36372h94038l9658L01140M59293K25941j47091l16882k74894j60942K1001K31310
36362e94820K65994R6117L6458K74232N10247L80366j7057l20353l99245l51483
36352a19544k26121o0355m630j06196j25336J41103M83405N03470J28229l23253
36342B90772n03645l05620J10394M01228K91812j14469m14069l82989j75608K7740
$$ plain form
36332 -774454 -519205 -55481 329408 272268 -193469 -634664 -738350 -569854 -281194 111464
36322 111464 545198 805710 775931 568620 293707 -46859 -297139 -102239 603987 1303050
36312 1303050 1409671 961885 502180 364447 393803 348318 238245 150523 -12040 -411953
36302 -411953 -992490 -1478546 -1656559 -1556950 -1347836 -1125556 -860820 -515734 -138406 182831
36292 182831 405593 524502 510861 331597 36587 -218295 -262859 -40928 322510 585162
36282 585162 582325 384682 198969 95606 -50423 -284442 -384583 -116185 394958 734331
$$ packed form
36332g74454K55249M63724L84889n7140m65737m41195j03686J68496K88660L92658
36322A11464M33734K60512k9779k07311k74913l40566k50280J94900P06226O99063
36312A303050J06621m47786m59705j37733K9356m5485j10073q7722j62563l99913
36302d11953n80537m86056j78013R9609K09114K22280K64736L45086L77328L21237
36292A82831K22762J18909j3641j79264k95010k54882m4564K21931L63438K62652
36282E85162k837j97643j85713j03363j46029k34019j00141K68398N11143L39373
$$ [...]
##END NTUPLES=NMR SPECTRUM
##END=
