##TITLE=31Pdec_IBDM0104A
 CDCl3, 24 sc
 2.4.2019
##JCAMPDX= 6.0         $$ Bruker NMR JCAMP-DX V2.0
##DATA TYPE= NMR SPECTRUM
##DATA CLASS= NTUPLES
##ORIGIN= UXNMR, Bruker Analytische Messtechnik GmbH
##OWNER= root
$$ XWIN-NMR		Version 3.5
$$ Tue Apr  2 14:19:04 2019 Russian Standard Time (UT+4h)  she@DPX200
##.OBSERVE FREQUENCY= 81.013821
##.OBSERVE NUCLEUS= ^31P
##.ACQUISITION MODE= SIMULTANEOUS
##.ACQUISITION SCHEME= undefined
##.AVERAGES= 24
##.DIGITISER RES= 17
##SPECTROMETER/DATA SYSTEM= spect
##.PULSE SEQUENCE= zgpg30
##.SOLVENT NAME= CDCl3
##.SHIFT REFERENCE= (INTERNAL, CDCl3, 0, 182.463)
##AUDIT TRAIL= $$ (NUMBER, WHEN, WHO, WHERE, WHAT)
$$ ##TITLE= Audit trail, XWIN-NMR		Version 3.5
$$ ##JCAMPDX= 5.01
$$ ##ORIGIN= Bruker BioSpin GmbH
$$ ##OWNER= she
$$ F:/spectra/data/she/nmr/P31/1/pdata/1/auditp.txt
$$ ##AUDIT TRAIL=  $$ (NUMBER, WHEN, WHO, WHERE, WHAT)
(   1,<2019-04-02 14:17:58.89 +0400>,<she>,<DPX200>,
      <created by zg, POWCHK disabled, PULCHK disabled
       configuration hash MD5:
       00 E9 B6 7A A2 85 ED C7 34 08 36 98 17 FE 4E 26
       data hash MD5: 32K
       EA 4E DC 11 AF CA 2D 3B FF ED C1 32 5B B7 48 D4>)
(   2,<2019-04-02 14:18:02.25 +0400>,<she>,<DPX200>,
      <Start of raw data processing
       efp BC_mod = 2 LB = 1 FT_mod = 6 PKNL = 1 PHC0 = -1811.675 PHC1 = 61.79897 SI = 64K 
       data hash MD5: 64K
       E1 19 F4 6A E3 B1 FC 7D EA 91 98 FD 55 52 9A 20>)
(   3,<2019-04-02 14:18:22.34 +0400>,<she>,<DPX200>,
      <pk PHC0 = 18.70378 PHC1 = -21.4 
       data hash MD5: 64K
       30 E5 04 F5 78 3C 93 5F E1 87 AA B7 5B E4 4E AD>)
(   4,<2019-04-02 14:18:24.96 +0400>,<she>,<DPX200>,
      <abs ABSG = 5 
       data hash MD5: 64K
       EC C8 95 45 F1 2C 80 EE D5 A7 AE 5C 81 9D DF 82>)
$$ ##END=
$$ 
$$ hash MD5
$$ 12 CB 22 ED 3A B4 95 7D 2E E1 DF 05 85 D8 CD 84
##$RELAX= 
##$RELAX= 
##$RELAX= 
##$RELAX= 
##$RELAX= 
##$RELAX= 
##$RELAX= 
##$RELAX= 
$$ Bruker specific parameters
$$ --------------------------
##$DU= <F:/spectra>
##$EXPNO= 1
##$NAME= <P31>
##$PROCNO= 1
##$TYPE= <nmr>
##$USER= <she>
##$AMP= (0..31)
100 100 100 100 100 100 100 100 100 100 100 100 100 100 100 100 100 100 
100 100 100 100 100 100 100 100 100 100 100 100 100 100 
##$AQSEQ= 0
##$AQ_mod= 1
##$AUNM= <au_zg>
##$AUTOPOS= <>
##$BF1= 81.014009
##$BF2= 200.13
##$BF3= 200.13
##$BF4= 200.13
##$BF5= 200.13
##$BF6= 200.13
##$BF7= 200.13
##$BF8= 200.13
##$BYTORDA= 1
##$CFDGTYP= 0
##$CFRGTYP= 5
##$CHEMSTR= <none>
##$CNST= (0..31)
1 1 145 1 1 1 1 1 1 1 1 1 1 1 1 1 1 1 1 1 1 1 1 1 1 1 1 1 1 1 1 1 
##$CPDPRG= <waltz16>
##$CPDPRG1= <>
##$CPDPRG2= <waltz16>
##$CPDPRG3= <>
##$CPDPRG4= <mlev>
##$CPDPRG5= <mlev>
##$CPDPRG6= <mlev>
##$CPDPRG7= <mlev>
##$CPDPRG8= <mlev>
##$CPDPRGB= <>
##$CPDPRGT= <>
##$D= (0..31)
0 1 0 0 0 0 0 0 0 0 0 0.03 2e-05 3e-06 0 0 0 0 0 0 0 0 0 0 0 0 0 0 0 0 
0 0 
##$DATE= 1554200278
##$DBL= (0..7)
120 120 120 11 120 120 24 19 
##$DBP= (0..7)
150 150 150 150 150 150 150 150 
##$DBP07= 0
##$DBPNAM0= <>
##$DBPNAM1= <>
##$DBPNAM2= <>
$$ [...]
##$SUBNAM3= <"">
##$SUBNAM4= <"">
##$SUBNAM5= <"">
##$SUBNAM6= <"">
##$SUBNAM7= <"">
##$SUBNAM8= <"">
##$SUBNAM9= <"">
##$SW= 369.568048894756
##$SWIBOX= (0..15)
0 1 3 0 0 0 0 0 0 0 0 0 0 0 0 0 
##$SW_h= 29940.119760479
##$TD= 32768
##$TD0= 1
##$TE= 0
##$TE2= 300
##$TE3= 300
##$TEG= 300
##$TL= (0..7)
0 120 53 12 22 120 120 120 
##$TP= (0..7)
150 150 150 150 150 150 150 150 
##$TP07= 0
##$TPNAME0= <>
##$TPNAME1= <>
##$TPNAME2= <>
##$TPNAME3= <>
##$TPNAME4= <>
##$TPNAME5= <>
##$TPNAME6= <>
##$TPNAME7= <>
##$TPOAL= (0..7)
0.5 0.5 0.5 0.5 0.5 0.5 0.5 0.5 
##$TPOFFS= (0..7)
0 0 0 0 0 0 0 0 
##$TUNHIN= 0
##$TUNHOUT= 0
##$TUNXOUT= 0
##$USERA1= <user>
##$USERA2= <user>
##$USERA3= <user>
##$USERA4= <user>
##$USERA5= <user>
##$V9= 5
##$VALIST= <valist>
##$VCLIST= <CCCCCCCCCCCCCCC>
##$VD= 0
##$VDLIST= <DDDDDDDDDDDDDDD>
##$VPLIST= <PPPPPPPPPPPPPPP>
##$VTLIST= <TTTTTTTTTTTTTTT>
##$WBST= 1024
##$WBSW= 4
##$XGAIN= (0..3)
0 0 0 0 
##$XL= 0
##$YL= 0
##$YMAX_a= 38740
##$YMIN_a= -45305
##$ZGOPTNS= <>
##$ZL1= 120
##$ZL2= 120
##$ZL3= 120
##$ZL4= 120
##$ABSF1= 182.463
##$ABSF2= -187.1042
##$ABSG= 5
##$ABSL= 3
##$ALPHA= 0
##$AQORDER= 0
##$ASSFAC= 0
##$ASSFACI= 0
##$ASSFACX= 0
##$ASSWID= 0
##$AUNMP= <proc_1d>
##$AZFE= 0.1
##$AZFW= 0.5
##$BCFW= 0
##$BC_mod= 2
##$BYTORDP= 0
##$COROFFS= 0
##$CY= -3
##$DATMOD= 1
##$DC= 0
##$DFILT= <>
##$DTYPP= 0
##$F1P= 0
##$F2P= 0
##$FCOR= 1
##$FTSIZE= 65536
##$FT_mod= 6
##$GAMMA= 0
##$GB= 0
##$INTBC= 1
##$INTSCL= 5.30512e-09
##$ISEN= 30
##$LB= 1
##$LEV0= 0
##$LPBIN= 0
##$MAXI= 10000
##$MC2= 0
##$MEAN= 0
##$ME_mod= 0
##$MI= 50
##$NCOEF= 0
##$NC_proc= -7
##$NLEV= 6
##$NOISF1= 182.463
##$NOISF2= 159.3651
##$NSP= 0
##$NTH_PI= 0
##$NZP= 0
##$OFFSET= 182.463
##$PC= 4
##$PHC0= -1792.971
##$PHC1= 40.39897
##$PH_mod= 1
##$PKNL= yes
##$PPARMOD= 0
##$PSCAL= 0
##$PSIGN= 0
##$REVERSE= no
##$SF= 81.0140089999434
##$SI= 65536
##$SIGF1= 159.3651
##$SIGF2= -187.1042
##$SINO= 113.3802
##$SIOLD= 16384
##$SREGLST= <1H.CDCl3>
##$SSB= 0
##$STSI= 65536
##$STSR= 0
##$SW_p= 29940.119760479
##$SYMM= 0
##$S_DEV= 0
##$TDeff= 32768
##$TDoff= 0
##$TI= <>
##$TILT= no
##$TM1= 0
##$TM2= 0
##$TOPLEV= 0
##$USERP1= <user>
##$USERP2= <user>
##$USERP3= <user>
##$USERP4= <user>
##$USERP5= <user>
##$WDW= 1
##$XDIM= 65536
##$YMAX_p= 409572410
##$YMIN_p= -47658333
$$ End of Bruker specific parameters
$$ ---------------------------------
##NTUPLES= NMR SPECTRUM
##VAR_NAME=  FREQUENCY,     SPECTRUM/REAL,   SPECTRUM/IMAG
##SYMBOL=    X,             R,               I
##VAR_TYPE=  INDEPENDENT,   DEPENDENT,       DEPENDENT
##VAR_FORM=  AFFN,          ASDF,            ASDF
##VAR_DIM=   65536,         65536,           65536
##UNITS=     HZ,            ARBITRARY UNITS, ARBITRARY UNITS
##FACTOR=    0.456856943014862, 1,           1
##FIRST=     14782.0589164792, 0,            0
##LAST=      -15158.0608439998, 0,           0
##MIN=       -15158.0608439998, -47658333,   0
##MAX=       14782.0589164792, 409572410,    0
$$ Real data points
##PAGE= N=1
##DATA TABLE= (X++(R..R)), XYDATA
$$ [...]
40766a927534R33575P44639p73800p77300M24167j04232k152521k103711R53234
$$ -1927534 -993959 -249320 -1023120 -1800420 -1376253 -1480485 -3633006 -5736717 -4783483
40757d783483L347356K481133M53097L5431M02695n18830k025087j979391o19077
$$ -4783483 -1436127 1045006 1498103 1533534 1936229 1417399 -607688 -2587079 -3206156
40748c206156o8191p64467j012155j2268R14358N68587l64946n32530K05081Q80401
$$ -3206156 -3274347 -4038814 -5050969 -5063237 -4148879 -3580292 -3945238 -4477768 -4272687 -3392286
40738c392286Q51973N08704O98143J729002K865406K788291Q34667k010085l549808
$$ -3392286 -2540313 -2031609 -1333466 395536 3260942 6049233 6883900 4873815 1324007
40729A324007k297152P54216K639414J362640j739849l404792k319525m23657
$$ 1324007 -973145 -218929 2420485 3783125 2043276 -1361516 -3681041 -4104698
40721d104698K02606K33700J407469L132469L054104P03875j772826k830614l114076
$$ -4104698 -3902092 -3668392 -2260923 871546 3925650 4629525 2856699 26085 -3087991
40712c087991l083083j620612J281631K754039P21411k044533r34915L600718
$$ -3087991 -6171074 -7791686 -6510055 -3756016 -3034605 -5079138 -6014053 -2413335
40704b413335N733102K051163l467599m758737j663832Q65868N14847K37359K255401
$$ -2413335 3319767 5370930 1903331 -2855406 -4519238 -3653370 -3138523 -2901164 -645763
40695f45763L687638J220752k833399l534603j047691l40049k767804l337146
$$ -645763 3041875 4262627 1429228 -2105375 -3153066 -3493115 -6260919 -9598065
40687i598065J138311N953989N038049J97690j847307N903K36323l320708n211670
$$ -9598065 -8459754 -2505765 2532284 2729974 882667 888570 1124893 -2195815 -7407485
40678g407485j086819M810934N631840J754210q65673k24065j91298k836418m474977
$$ -7407485 -8494304 -3683370 1948470 3702680 2837007 2612942 2421644 -414774 -4889751
40669d889751j563410L480388N411863K849061j014982l113479l310855k927240
$$ -4889751 -6453161 -2972773 2439090 5288151 4273169 1159690 -2151165 -5078405
40661e078405k638334k211345j149252O95975K632909L462815K782403J490462
$$ -5078405 -7716739 -9928084 -11077336 -10381361 -7748452 -4285637 -1503234 -12772
40653a2772M96374l07694j041824q52976O57718J807380O08845j928330k426826
$$ -12772 483602 175908 -865916 -1718892 -1061174 746206 1355051 -573279 -3000105
40644c000105K76497L180744L097913R30986o9127O36131K41913k578048m753402
$$ -3000105 -2723608 457136 3555049 4486035 4416908 5053039 5294952 2716904 -2036498
40635b036498k615021K611343N533304L139271j360403k633772L2302K307055
$$ -2036498 -4651519 -2040176 3493128 6632399 5271996 2638224 2670526 4977581
40627D977581J137334j129312o94201J563927J158641l003252o259961m449030
$$ 4977581 6114915 4985603 4291402 5855329 7013970 4010718 -2249243 -6698273
40619f698273K78119K570159J015789j004733p84219P56960J720954J710763Q77351
$$ -6698273 -6420154 -3849995 -2834206 -3838939 -4623158 -3866198 -2145244 -434481 442870
40610D42870p52933j945459q64007J714840K454251L45021j303800o7608J320291
$$ 442870 -310063 -2255522 -3119529 -1404689 1049562 1394583 90783 23175 1343466
40601A343466o32291l785760k923646K134869N710018M135553K40027j550300
$$ 1343466 711175 -3074585 -5998231 -3863362 1846656 5982209 6222236 4671936
40593D671936r87553o12339j295973j890753j816128j551868j211363l98765Q19070
$$ 4671936 3684383 3072044 1776071 -114682 -1930810 -3482678 -4694041 -5092806 -4273736
40584d273736J858737K160228J341141k96439j140943L55898L073025L717029
$$ -4273736 -2414999 -254771 1086370 789931 -351012 4886 3077911 6794940
40576F794940R53938k602785l759432k488150r18854k22253k03046n69783p79495
$$ 6794940 7748878 5146093 1386661 -1101489 -2020343 -2242596 -2445642 -3015425 -3794920
40567c794920J16659J684880J608548r33786k908417j119127K880516M576949
$$ -3794920 -3678261 -1993381 -384833 -1318619 -4227036 -5346163 -2465647 2111302
40559B111302K525504n20149k103092k284678j311139J217776L913329L849395
$$ 2111302 4636806 4116657 2013565 -271113 -1582252 -364476 3548853 7398248
40551G398248Q78999j335359n16880Q40720l46905k755825k863029l71857J802846
$$ 7398248 8277247 6941888 6425008 7265728 6918823 4162998 1299969 928112 2730958
40542B730958J950164Q47685q14060l145589n086437m628237j766544J001696
$$ 2730958 4681122 5528807 4714747 1569158 -3517279 -8145516 -9912060 -8910364
40534h910364J893969J633725J378475R30345Q1616j40119R10433J964173J498781
$$ -8910364 -7016395 -5382670 -4004195 -3073850 -2992234 -3132353 -2221920 -257747 1241034
40525A241034N9945n47318J62528R21992O14672m42724j062872m14645J089095
$$ 1241034 1300979 753661 916189 1838181 2452853 2010129 947257 532612 1621707
40516A621707J831441N92962j560262k141250o58463L74299q34712k281741j057111
$$ 1621707 3453148 4046110 2485848 344598 -313865 60434 -774278 -3056019 -4113130
40507d113130J923128L041720J419095m6868N14479J433971R77871J11028j29933
$$ -4113130 -2190002 851718 2270813 2223945 2738424 4172395 5150266 5261294 5131361
40498E131361j028435l308978m461641k264233R90272J528812m4452p2855J780191
$$ 5131361 4102926 793948 -3667693 -5931926 -4941654 -3412842 -3457294 -3530149 -1749958
40489a749958K147148J21096j026331M43883J867942J086807k0122L42703K24213
$$ -1749958 397190 518286 -508045 -64162 1803780 2890587 2870465 3213168 3437381
40480C437381k029984l598486j513927J519127P39992k883907l904361q42934
$$ 3437381 1407397 -2191089 -3705016 -2185889 -1445897 -4329804 -8234165 -9077099
40472i077099K065062K014936J205682J823741K371100J365606M92829J135489
$$ -9077099 -7012037 -4997101 -3791419 -1967678 403422 1769028 2261857 3397346
40464C397346J278939q32674k867984j857684P32055J148736q88040k239284j253195
$$ 3397346 4676285 3843611 975627 -882057 -150002 998734 110694 -2128590 -3381785
40455c381785Q12993K676229M008727L894737J627961r94282j394061k69582n24456
$$ -3381785 -2568792 107437 4116164 8010901 9638862 8644580 7250519 6980937 6456481
40446F456481j963475j095064K707794N123286L212034o6324q96931p82258l328559
$$ 6456481 4493006 3397942 6105736 11229022 14441056 14374732 13477801 12695543 9366984
40437I366984p175817p344382l025752J066465J795025J312671K003854K177714
$$ 9366984 2191167 -5153215 -8178967 -7112502 -5317477 -4004806 -2000952 176762
40429A76762j52356k694563k110902L24315O53159j197209j381102J101342K300604
$$ 176762 24406 -2670157 -4781059 -4456744 -3803585 -5000794 -6381896 -5280554 -2979950
40420b979950j86586k701300q22692L571932M751069J505521j364982m73529J398057
$$ -2979950 -3166536 -5867836 -6690528 -3118596 1632473 3137994 1773012 1299483 2697540
40411B697540J88119k873844l105625M41311L377075K142914j246985k401671
$$ 2697540 2885659 11815 -3093810 -2652499 724576 2867490 1620505 -781166
40403g81166m63018J665648K111056K174515L141005L509734J315455k178190
$$ -781166 -1244184 421464 2532520 4707035 7848040 11357774 12673229 10495039
40395A0495039l511202j629702O46928L93919j813861l101817j947704N52030
$$ 10495039 6983837 5354135 6001063 6394982 4581121 1479304 -468400 83630
40387H3630K295827J893338o11843l468285m086420j542016J960376L412194K559898
$$ 83630 2379457 4272795 3660952 192667 -3893753 -5435769 -3475393 -63199 2496699
40378B496699J570596J325906L80334j647636k260253J90533K841324J558112
$$ 2496699 4067295 5393201 5773535 4125899 1865646 2056179 4897503 6455615
40370F455615k727203m432278r62380L280256K758581j632266m035018j680125
$$ 6455615 3728412 -703866 -1666246 1614010 4372591 2740325 -1294693 -2974818
40362b974818K050538L034704J615108O74270R36097P72869m63913j555789j707990
$$ -2974818 -924280 2110424 3725532 4399802 5335899 6108768 5644855 4089066 2381076
40353B381076j529768j382235n72578J094642K323028J763796k68416j995941
$$ 2381076 851308 -530927 -1103505 -8863 2314165 4077961 3809545 1813604
40345A813604j595590J417164N218579O376151L127786j945225m358174l178610
$$ 1813604 218014 1635178 6853757 13229908 16357694 14412469 10054295 6875685
40337F875685j870080k934038m367600l254249l73127J580821K475843L830664
$$ 6875685 5005605 2071567 -2296033 -5550282 -5923409 -4342588 -1866745 1963919
40329A963919M434455J252292m628469p126920k620021M524113O841185K721884
$$ 1963919 6398374 7650666 3022197 -4104723 -6724744 -2200631 4640554 7362438
40321G362438k485625l731641j562371M61565R09532R84821J286189P88031o48481
$$ 7362438 4876813 1145172 -417199 44366 953898 1938719 3224908 4012939 3364458
40312C364458j112186M96159K059617R60413j657125k166495k1031J222654m14311
$$ 3364458 2252272 2748431 4808048 5768461 4111336 1944841 1923810 3146464 2732153
40303B732153j982992l98981K262132J845597j327360l128101k097686r41800
$$ 2732153 749161 350180 2612312 4457909 3130549 2448 -2095238 -3037038
40295c037038j292199j227579O48289K357243J847990L17420J4968Q80988J435592
$$ -3037038 -4329237 -5556816 -4908527 -2551284 -703294 -385874 -370906 510082 1945674
40286A945674J231661N60897o45000j925552j962851p39590j89230j011877r90458
$$ 1945674 3177335 3738232 3093232 1167680 -795171 -1534761 -1723991 -2735868 -3726326
40277c726326J349174L612428K926488N99993m829J052016P86771j258646k150098
$$ -3726326 -2377152 1235276 4161764 4761757 4756928 5808944 6595715 5337069 3186971
40268C186971o47308O93723q9542j199607m22235R99609N44509j239503j605608
$$ 3186971 2539663 3233386 3143844 1944237 1522002 2521611 3066120 1826617 221009
40259B21009k25119J02914k014257l847736k104157K245628M944542L942853J597956
$$ 221009 -4110 98804 -1915453 -5763189 -7867346 -5621718 -677176 3265677 4863633
40250D863633P56323R47692K22332j087852j157599k22929j85981r00567l38524
$$ 4863633 5619956 6567648 6789980 5702128 4544529 4321600 4135619 3235052 2896528
40241B896528J044915J4891l747792n521880j996736L339922M935854K873083
$$ 2896528 3941443 3956334 208542 -5313338 -7310074 -3970152 965702 3838785
40233C838785J575890K381109K200047n46607l178216l014071r10814Q24607J369289
$$ 3838785 5414675 7795784 9995831 9449224 6271008 3256937 2346123 3170730 4540019
40224D540019R31728l80993j906158k307283j177873M30498J487656J708089Q75683
$$ 4540019 5471747 5090754 3184596 877313 -300560 129938 1617594 3325683 4201366
40215D201366q50042k084537j597549l32812M7447R9341J292010K259023J16854
$$ 4201366 3351324 1266787 -330762 -663574 -616127 -516786 775224 3034247 3151101
40206C151101m115366n615583k693433M41427N3717j835805j561103K85321R68562
$$ 3151101 -964265 -6579848 -9273281 -8831854 -8778137 -10613942 -12175045 -11889724 -10921162
40197a0921162R10281K255235L776610K242287j383753j997329K247586O692808
$$ -10921162 -10010881 -7755646 -3979036 -1736749 -3120502 -5117831 -2870245 3822563
40189C822563O374103K310481r88509j948934k544400l480492k504182J380442
$$ 3822563 10196666 12507147 11518638 9569704 7025304 3544812 1040630 2421072
40181B421072M761819L454784j625839m924285l039295J276220L200605J800201
$$ 2421072 7182891 10637675 9011836 4087551 1048256 2324476 5525081 7325282
40173G325282l30058j691648k837510l239824j019617L198606N438251L280249
$$ 7325282 6995224 5303576 2466066 -773758 -1793375 1405231 6843482 10123731
40165A0123731p42436k627107j778326l11086O74233J498358J715362K93788k174483
$$ 10123731 9381295 6754188 4975862 4664776 5339009 6837367 8552729 8846517 6672034
40156F672034l616832l074009j686953r42082j020993j004616o4254J470996K103304
$$ 6672034 3055202 -18807 -1705760 -2647842 -3668835 -4673451 -4737705 -3266709 -1163405
40147a163405R43565n08551J14579K380366L032891P42661j449688m24319K315125
$$ -1163405 -219840 -728391 -613812 1766554 4799445 5542106 4092418 3668099 5983224
40138E983224K890510N72942j926729k870043l023397k877751j481505J124318
$$ 5983224 8873734 9446676 7519947 4649904 1626507 -1251244 -2732749 -1608431
40130a608431K799861J976703j19199j132808n38602M9019q77738k788540l558238
$$ -1608431 1191430 3168133 3048934 1916126 1377524 1426543 548805 -2239735 -5797973
40121e797973j947426O25305J683742J016324Q00513J937675K425759P85415j062747
$$ -5797973 -7745399 -7120094 -5436352 -4420028 -3619515 -1681840 743919 1529334 466587
40112D66587o17209J206867J636867M23771l05885R0415J23437p17399j055000
$$ 466587 -150622 1056245 2693112 3116883 2810998 2901413 3024850 2307451 1252451
40103A252451j18539J223567K091567K082662L42174l267417o161294n167782
$$ 1252451 1133912 2357479 4449046 6531708 6873882 3606465 -2554829 -7722611
40095g722611j085314J785475J314944j47881q848J112092J647934J941716K702853
$$ -7722611 -8807925 -7022450 -5707506 -5855387 -5864235 -4752143 -3104209 -1162493 1540360
40086A540360K794556R32784j763796k990527k194886p79527r7468l54227p50689
$$ 1540360 4334916 5267700 3503904 513377 -1681509 -2461036 -2558504 -2912731 -3663420
40077c663420j169K277095M228137L329005m6028k450655j772882Q7806L54583
$$ -3663420 -3664589 -1387494 2840643 6169648 6123620 3672965 1900083 1987889 2342472
40068B342472p10021j009685k74253p7209p90986q57078O39491K346593K302301
$$ 2342472 1632451 622766 348513 271304 -519682 -1376760 -737269 1609324 3911625
40059C911625L89108j536660j827400r08975n18249j184844j527235o25709L08767
$$ 3911625 4300733 2764073 936673 27698 -490551 -1675395 -3202630 -3828339 -3519572
40050c519572N6408k18287J047864K518249J627911r10749j676769J64500J677176
$$ -3519572 -3463164 -3681451 -2633587 -115338 1512573 601824 -1074945 -910445 766731
40041G66731J060936J35805N44893J014176L52960q6157P41349J273917L98699
$$ 766731 1827667 1963472 2508365 3522541 3875501 3789344 4530693 5804610 6203309
40032F203309j30323Q91251J217667j036874l398373k661688k43828K80104q45011
$$ 6203309 6072986 6964237 8181904 7145030 3746657 1084969 841141 1121245 276234
40023B76234o58978O21075j75180l149866m338043j638475K264923M172906M167987
$$ 276234 -382744 238331 63151 -3086715 -7424758 -9063233 -6798310 -2625404 1542583
40014A542583L707052K845726J143183o44745j289472m21739J323984K382485
$$ 1542583 5249635 8095361 9238544 8593799 7304327 6882588 8206572 10589057
40006A0589057Q86760k998413o002307n340302k722137j891003k763599j755684
$$ 10589057 11475817 8477404 2475097 -2865205 -5587342 -7478345 -10241944 -11997628
39998a1997628J935121M601700L790658J765329J165313Q44925j131399l288110
$$ -11997628 -10062507 -5460807 -1670149 95180 1260493 2105418 974019 -2314091
39990b314091k972338r19392q3940p78422k62965K669124N340113M432227K06192
$$ -2314091 -5286429 -6205821 -6289761 -7068183 -7331148 -4662024 678089 5110316 5316508
39981E316508l577296l671997o80111K005068K366586J673141J572824J089623
$$ 5316508 1739212 -1932785 -2612896 -607828 1758758 3431899 5004723 6094346
39973F094346j275693l775123l129291J44667J811081J50079j544387l57963J846913
$$ 6094346 4818653 1043530 -2085761 -1941094 -130013 20066 -1524321 -1882284 -35371
39964c5371J981383P61616R63979K618586L264473J877459m00071k629868m439675
$$ -35371 1946012 2707628 3671607 6290193 9554666 11432125 11032054 8402186 3962511
39955C962511m681884k506081M75392J639369R45694P14482J691241J760693o75900
$$ 3962511 -719373 -3225454 -2750062 -1110693 -164999 549483 2240724 4001417 3325517
39946C325517l978835n069851k909543O88224L167562L596834L061769K875326
$$ 3325517 -653318 -5723169 -8632712 -7944488 -4776926 -1180092 1881677 4757003
39938D757003K755468J525042n58537j662034j025795j13528k30988p08682o85832
$$ 4757003 7512471 9037513 8478976 6816942 5791147 5677619 5446631 4737949 4052117
39929D052117q89251j923345k480636j372452O1509j25199j316862j451584k69322
$$ 4052117 3162866 1239521 -1241115 -2613567 -2552058 -2677257 -3994119 -5445703 -5715025
39920e715025R61029J892137K677635K248079N1963j489425J62477K962256K435907
$$ -5715025 -4753996 -2861859 -184224 2063855 2115818 626393 788870 3751126 6187033
39911F187033j495897m139757l103938j244985j062716p15968J685182L756709
$$ 6187033 4691136 551379 -2552559 -3797544 -4860260 -5576228 -3891046 -134337
39903a34337K453930p22034j896975m48611J003290R79149K60043n21983j392246
$$ -134337 2319593 1597559 -299416 -748027 255263 1234412 1494455 972472 -419774
39894d19774j666242p54724J74043j77850o81475L98374J790292P85850j785107
$$ -419774 -2086016 -2840740 -2666697 -2844547 -3526022 -3127648 -1337356 -551506 -2336613
39885b336613j924631J409654M172879K920084m24459j788657n85591N96648M09660
$$ -2336613 -4261244 -2851590 1321289 4241373 3816914 2028257 1442666 2039314 2448974
39876B448974m6682J22992L20741j9209n49547r87187j456383j569068o14596
$$ 2448974 2402292 2525284 2846025 2826816 2277269 1290082 -166301 -1735369 -2349965
39867b349965Q94695J290389J25621p51031L81140K495068L014155J269585p11232
$$ -2349965 -1455270 -164881 -39260 -790291 -409151 2085917 5100072 6369657 5658425
39858E658425j056396l24633k20975j084319j753910j384717k10891J293272K785816
$$ 5658425 4602029 4277396 4056421 2972102 1218192 -166525 -377416 915856 3701672
39849C701672L501204K617490O81826n00129j89064J42124r17058k285812j878531
$$ 3701672 7202876 9820366 10502192 10002063 9812999 9955123 9038065 6752253 4873722
39840D873722J2994Q81550k05696j078795J72800K047329J687160q82499k762327
$$ 4873722 4886716 5768266 5562570 4483775 4656575 6703904 8391064 7508565 4746238
39831D746238k316759j116208j031197j310893j01685K298967L614784K682420
$$ 4746238 2429479 1313271 282074 -1028819 -1130504 1168463 4783247 7465667
39823G465667O25227j144238k365550k853897j757614Q04264K627000J732064
$$ 7465667 8090894 6946656 4581106 1727209 -30405 773859 3400859 5132923
39815E132923p01363j499954L34364K267729J636796r32229k531161j635023L49262
$$ 5132923 4431560 2931606 3265970 5533699 7170495 6238266 3707105 2072082 2421344
39806B421344J028105l28613k266937k828762j455047O99032K046902J887261
$$ 2421344 3449449 3120836 853899 -1974863 -3429910 -2730878 -683976 1203285
39798A203285O10170p83722j245926n78614j25421j451355l587463l126763J214893
$$ 1203285 1813455 1029733 -216193 -794807 -920228 -2371583 -5959046 -9085809 -7870916
39789g870916N516150M884638J91679k764686j150357J592647J776651Q93124
$$ -7870916 -2354766 2529872 2721551 -43135 -1193492 399155 2175806 3068930
39781C068930J942064L519307K028134j765129l237681j017468R11701n20880
$$ 3068930 5010994 8530301 10558435 8793306 5555625 4538157 5449858 4928978
39773D928978k915990k337559R53956L332685K753518M42237j473125j914343
$$ 4928978 2012988 -324571 629385 3962070 6715588 7157825 5684700 3770357
39765C770357q10886J121030K427622J895532k16415k339072k934549j606591
$$ 3770357 2959471 4080501 6508123 8403655 8187240 5848168 2913619 1307028
39757A307028N80731J702723O14764j656863k782352j604624Q70379K854420L142947
$$ 1307028 1887759 3590482 4205246 2548383 -233969 -1838593 -968214 1886206 5029153
39748E029153J298084j924107m093510k927879N79469K545384Q13135k342624
$$ 5029153 6327237 4403130 309620 -2618259 -2038790 506594 1319729 -1022895
39740a022895l394195j969123m56987l47963q32083n92222N09191J469386J150811
$$ -1022895 -4417090 -6386213 -6843200 -7191163 -8023246 -8615468 -8106277 -6636891 -5486080
39731e486080l41979j061649Q20925M084888N274570L247562P52483J61472J30114
$$ -5486080 -5828059 -6889708 -6068783 -1983895 3290675 6538237 7290720 7452192 7582306
39722G582306j350750l038124k614931q82311k54723m14779O77174K239148J332331
$$ 7582306 6231556 3193432 578501 -303810 -558533 -973312 -296138 1943010 3275341
39713C275341j884689l647688k080528M47200J457644J441838J545422J359392
$$ 3275341 1390652 -2257036 -4337564 -3890364 -2432720 -990882 554540 1913932
39705A913932N08329l00735j027653k299394k769993m2605M336692M923976M4097
$$ 1913932 2422261 2121526 1093873 -1205521 -3975514 -4018119 318573 5242549 5286646
39696E286646m424816k599111L110770N533043K516226j394665k141658n80884
$$ 5286646 861830 -1737281 1373489 6906532 9422758 8028093 5886435 5305551
39688E305551N26781L04420m68394r70624q34686m23140p42561j933255k394396
$$ 5305551 5832332 6136752 5668358 4697734 3863048 3439908 2697347 764092 -1630304
39679a630304q30177J582973K644157J896487L57645j375218k825076k634360
$$ -1630304 -2460481 -877508 1766649 3663136 4020781 2645563 -179513 -2813873
39671b813873k00435K525674L119284J789346L50730p55344j991121k489726j183447
$$ -2813873 -3014308 -488634 2630650 4419996 4770726 4015382 2024261 -465465 -1648912
39662a648912O89521J095941M64661N85857J228352J021829O56912J540050K186913
$$ -1648912 -959391 136550 601211 1187068 2415420 3437249 4094161 5634211 7821124
39653G821124J73219k881799k963028k54886R08332p54508j591754K90715J748820
$$ 7821124 7994343 5112544 2149516 1894630 2802962 2048454 456700 747415 2496235
39644B496235K92611j790348j883020j305217j907799k174853j72524K700289
$$ 2496235 2788846 998498 -884522 -2189739 -4097538 -6272391 -6444915 -3744626
39636c744626M077138L985448L236678J574819j04241N91817K905701K264406
$$ -3744626 332512 4317960 7554638 9129457 9025216 9617033 12522734 14787140
39628A4787140k267227m702514j006778L587260K299838k366859l015780M56585
$$ 14787140 12519913 7817399 6810621 10397881 12697719 10330860 7315080 7771665
39620G771665J570492j208636k568788m32778O61364j714686l550077j876938
$$ 7771665 9342157 8133521 5564733 5131955 5793319 4078633 528556 -1348382
39612a348382K22777k34820r85795M03954J656806M32397q50976L99389J689230
$$ -1348382 -1125605 -1360425 -2346220 -1942266 -285460 146937 -704039 -304650 1384580
39603A384580j36123k735366k011861P69862J340958p5008M04168K938838L418627
$$ 1384580 1248457 -1486909 -3498770 -2728908 -1387950 -1462958 -1058790 1880048 5298675
39594E298675O13122j548394j55112K671682L637043K514452P17149j316124l306356
$$ 5298675 5911797 4363403 4208291 6879973 10517016 13031468 13748617 12432493 9126137
39585I126137m041737l029140j615496j052140r01995m07046J64343N10340R19249
$$ 9126137 5084400 2055260 439764 -612376 -1514371 -1921417 -1757074 -1246734 -327485
39576c27485R18478o99927l127738k983384J240835N767575N422251L65666l869149
$$ -327485 590993 -108934 -3236672 -6220056 -4979221 788354 6210605 6576271 2707122
39567B707122l345048j69351J089843o26876k348785j551590Q68561K345325K010563
$$ 2707122 -637926 -807277 282566 -344310 -2693095 -4244685 -3376124 -1030799 979764
39558I79764J394633K052384L263044K692470n47213m145220m797483k066938
$$ 979764 2374397 4426781 7689825 10382295 9835082 5689862 892379 -1174559
39550a174559J118957K174420J638373J246933P91581r34543k864799k215507
$$ -1174559 -55602 2118818 3757191 5004124 5795705 4861162 1996363 -219144
39542b19144J226688M020043L498207J058728n47125j087429j828073k380460
$$ -219144 1007544 5027587 8525794 9584522 9037397 7949968 6121895 3741435
39534C741435j369465O26108J579798J203816J117230J802281J750108N141k398604
$$ 3741435 2371970 2998078 4577876 5781692 6898922 8701203 10451311 10456452 8057848
39525H057848l897922l696054j657690J323743L091724K380768R02834J024413
$$ 8057848 4159926 463872 -1193818 129925 3221649 5602417 6505251 7529664
39517G529664J887502Q16133j706029k237662j27317R65067j187369l884021l896340
$$ 7529664 9417166 10233299 8527270 6289608 6162291 7127358 5939989 2055968 -1840372
39508a840372j953184l04874J020200K567371K899876J036553q49093n21486N69653
$$ -1840372 -3793556 -4098430 -3078230 -510859 2389017 3425570 2576477 2054991 2624644
39499B624644M515j202688o62616P66040N78244n49126M4958J899909K099647
$$ 2624644 2629159 1426471 763855 1529895 2108139 1559013 1603971 3503880 5603527
39490E603527N56816r3066J88850j348819m464507n060731j690454J800750K301770
$$ 5603527 6160343 6067277 6256127 4907308 442801 -4617930 -6308384 -4507634 -2205864
39481b205864J682005K276954K328631l40188l372100k935817J96735J799777
$$ -2205864 -523859 1753095 4081726 3741538 369438 -2566379 -2369644 -569867
39473e69867M65160j033582m24823J271425K039562J452789L11497n37041m42847
$$ -569867 -104707 -1138289 -1563112 -291687 1747875 3200664 3512161 2975120 2532273
39464B532273P25800K071395K346559J407471M11525M35492J183173J127136q13480
$$ 2532273 3258073 5329468 7676027 9083498 9495023 9930515 11113688 12240824 11427344
39455A1427344l410803l757395r68247J686419O23792k606746k957308O60641
$$ 11427344 8016541 4259146 3290899 4977318 5601110 2994364 37056 697697
39447F97697L399078J594651k032299l210524k600906l224967m029746j393131
$$ 697697 4096775 5691426 3659127 448603 -2152303 -5377270 -9407016 -10800147
39439a0800147L801438O109922L423174J51761N59582K813855K500218o78984
$$ -10800147 -6998709 -888787 2534387 2686148 3245730 6059585 8559803 7880819
39431G880819l026970k382553n04265j5307j179365k286221j975274m71272R96514
$$ 7880819 4853849 2471296 1967031 1951724 772359 -1513862 -3489136 -3960408 -2963894
39422b963894J477280J013658L84964M03990J252810J966599Q60729k316560m679356
$$ -2963894 -1486614 -472956 -87992 315998 1568808 3535407 4396136 2079576 -2599780
39413b599780k728114K443928M903068J158073m335979m434140J009310M949701
$$ -2599780 -5327894 -2883966 2019102 3177175 -1158804 -5592944 -4583634 366067
39405C66067K934642j340179k078734Q00093K916028J971409l75091j925499k116184
$$ 366067 3300709 1960530 -118204 681889 3597917 5569326 5194235 3268736 1152552
39396A152552j199737J99753Q03753k3683q81652j40231J195142P05767j328774
$$ 1152552 -47185 152568 956321 932638 50986 -89245 1105897 1811664 482890
39387D82890j635690J334668M668959M578281J194475k038315k835035k024784
$$ 482890 -1152800 181868 4850827 9429108 10623583 8585268 5750233 3725449
39379C725449j387064j425393j604350j311895o6008J964846L133941J568862
$$ 3725449 2338385 912992 -691358 -2003253 -2069261 -104415 3029526 4598388
39371D598388j748100k913448j3894L422304K737265j032767k492591j89423J150372
$$ 4598388 2850288 -63160 -77054 3345250 6082515 5049748 2557157 2367734 3518106
39362C518106j361663l439383n11242L962049L110437k400296m955784j582533
$$ 3518106 2156443 -1282940 -1794182 2167867 5278304 2878008 -2077776 -3660309
39354c660309K044752J134561j256414n18951J774311J522002m92427n24236J232096
$$ -3660309 -1615557 -480996 -1737410 -2256361 -482050 1039952 547525 23289 1255385
39345A255385J301608p60799j996663j514472j412892k121970j442769J059031
$$ 1255385 2556993 1796194 -200469 -1714941 -3127833 -5249803 -6692572 -5633541
39337e633541K815170K406709J341041P16874l92562k092676k537127j006998
$$ -5633541 -2818371 -411662 929379 1646253 1253691 -838985 -3376112 -4383110
39329d383110P97054J688543K322280K645988J321927j056469j646335P5466Q98587
$$ -4383110 -3586056 -1897513 424767 3070755 4392682 3336213 1689878 1765344 2663931
39320B663931r02303k395973o83789K331705K902614O82302j893409l255298l025898
$$ 2663931 1761628 -634345 -1318134 1013571 3916185 4598487 2705078 -550220 -3576118
39311c576118r95787J493619J571348q99773j756999J509160N107660M217968
$$ -3576118 -4571905 -3078286 -1506938 -2406711 -4163710 -2654550 2453110 6671078
39303F671078J99430k097074j832054j681363j720497J56027K617721K019980
$$ 6671078 6870508 4773434 2941380 1260017 -460480 -304453 2313268 4333248
39295D333248q00532j086681J759198K911297L65475j835487q95429L80428l16771
$$ 4333248 3532716 2446035 4205233 7116530 7482005 5646518 4751089 5131517 4814746
39286D814746l05593K235874L316815n89499n528120n303726q38559J769429O85474
$$ 4814746 4509153 6745027 10061842 9472343 3944223 -1359503 -2198062 -428633 256841
39277B56841k71337J035512K243926J586308O85683Q08788L96039j752489l776677
$$ 256841 -14496 1021016 3264942 4851250 5536933 6345721 6741760 4989271 1212594
39268A212594l228692m58289J962665K202476Q05807o4541R03427K098714O07114
$$ 1212594 -2016098 -2474387 -511722 1690754 2496561 2432020 3335447 5434161 6041275
39259F041275l209834m920585j935833K064983K003609j054720j636334J580625
$$ 6041275 2831441 -2089144 -4024977 -1959994 43615 -1011105 -2647439 -1066814
39251a066814L939938K245988q03429j572443o98308m92327m32594J188086L167070
$$ -1066814 2873124 5119112 4315683 2743240 2044932 1552605 1120011 2308097 5475167
39242E475167K678342o0236j657603l40022J629219J189660j490261l417597k526419
$$ 5475167 8153509 8093273 6435670 6095648 7724867 8914527 7424266 4006669 1480250
39233A480250J00614J893816J816264Q77632N6727p68218j429234q21271J038271
$$ 1480250 1580864 3474680 5290944 6168576 6225303 5457085 4027851 3206580 4244851
39224D244851J919807L43312j636902j093257J187996J685157n74700k810466
$$ 4244851 6164658 6507970 4871068 3777811 4965807 6650964 6076264 3265798
39216C265798k904588j952472j469660q81964P60453K809935M173331M556774
$$ 3265798 361210 -1591262 -3060922 -3942886 -3182433 -372498 3800833 8357607
39208H357607L501758L42732l607131n101098k891674L01387J428193Q09348M07938
$$ 8357607 11859365 12202097 8594966 3493868 602194 903581 2331774 3141122 3549060
39199C549060M08730j33440p66413l25456P65125J168186R23149R48825Q89491
$$ 3549060 3957790 3824350 3057937 2732481 3497606 4665792 5588941 6537766 7427257
39190G427257l46860k191496k659848j139534P00304J036415k16647j686112j838631
$$ 7427257 7080397 4888901 2229053 1089519 1789823 2826238 2609591 923479 -915152
39181i15152k37621J705652J745019n60024k850937k591131j5721K516557L329057
$$ -915152 -1152773 552879 2297898 1737874 -1113063 -3704194 -3719915 -1203358 2125699
39172B125699K494710R76447J4215O22830K332159L047499J433777j251734k931805
$$ 2125699 4620409 5596856 5611071 6233901 8566060 11613559 13047336 11795602 8863797
39163H863797l351733l410033k894043j010275J369444K297040J626024J202488
$$ 8863797 5512064 2102031 -792012 -1802287 -432843 1864197 3490221 4692709
39155D692709J807499J869232Q8732k166348k376309j74309J935636J350913j532772
$$ 4692709 6500208 8369440 8458172 6291824 3915515 3741206 5676842 7027755 5494983
39146E494983l534911k365058N02016J765530P56645J9912J089608K075570Q33291
$$ 5494983 1960072 -404986 97030 1862560 2619205 2639117 3728725 5804295 6637586
39137F637586j602579k755120k169031r24174P61345K855873L733520K075043
$$ 6637586 5035007 2279887 110856 -813318 -51973 2803900 6537420 8612463
39129H612463k07996q7403J847929J999272p07174l144796k708431p93951j74227
$$ 8612463 8404467 8317064 10164993 12164265 11457091 8312295 5603864 4809913 4635686
39120D635686j222337k335054k435010j593086l29256O51338R68612J312998K478375
$$ 4635686 3413349 1078295 -1356715 -2949801 -3279057 -2627719 -1659107 -346109 2132266
39111B132266L451539K254597p86113k673567j711103P0373o3100j687771k171863
$$ 2132266 5583805 7838402 7052289 4378722 2667619 2737992 2674892 987121 -1184742
39102a184742m05948K200997L770560L359703Q99162k422887l915110j641737
$$ -1184742 -1590690 610307 4380867 7740570 8639732 6216845 2301735 659998
39094F59998K423018L455301m17208m760953l783206J714943M565152P06689m853961
$$ 659998 3083016 6538317 6121109 1360156 -2423050 -708107 3857045 4563734 -290227
39085b90227m729323O84493M492601L681538K254754L049849K832490j109508
$$ -290227 -5019550 -4335057 157544 3839082 6093836 9143685 11976175 10866667
39077A0866667n057502m500173j394719j84773j29182J955229M111903J930097
$$ 10866667 5809165 1308992 -85727 -270500 -399682 1555547 5667450 7597547
39069G597547k611932l029863R25620K570899m06367k255587M27382K684949J30938
$$ 7597547 4985615 1955752 2881372 5452271 5045904 2790317 3217699 5902648 6033586
39060F033586l191891j782251K029115K232350j348655l932383l303608q09392
$$ 6033586 2841695 1059444 3088559 5320909 3972254 39871 -3263737 -4073129
39052d073129K587019N751522N342840J15663m744394l535502J286181K517603
$$ -4073129 -1486110 4265412 9608252 9723915 4979521 1444019 2730200 5247803
39044E247803q70065k977759j024294R09949l45126j947043m70801K630112M141754
$$ 5247803 4377738 1399979 375685 1285634 940508 -1006535 -1477336 1152776 5294530
39035E294530L757976K603085L67947k919444m749695k967339O36344K177734
$$ 5294530 9052506 11655591 12023538 9104094 4354399 1387060 2023404 4201138
39027D201138M48947j977189k038047M99661K833250K062608j311830l553330
$$ 4201138 4650085 2672896 634849 1134510 3967760 6030368 4718538 1165208
39019A165208k320867K16429P68726k12856o6659J066279P96890n52281j83842
$$ 1165208 -1155659 -939230 -170504 -383360 -450019 616260 1413150 860869 677027
39010F77027J703743J635815p88998j428624J266918K702361p38040n315864n223440
$$ 677027 2380770 4016585 3227587 1798963 3065881 5768242 5030202 -285662 -5509102
39001e509102j159845J290923K982j821273j416884K76199J354888J557924J518798
$$ -5509102 -6668947 -5378024 -5375042 -7196315 -8613199 -8337000 -6982112 -5424188 -3905390
38992c905390J716509K417109L086125K446238O34012j50991P82359M57775l165721
$$ -3905390 -2188881 228228 3314353 5760591 6394603 6243612 7025971 7483746 4318025
38983D318025o436118m354166J389424M011611J459568r80461N49023K743522
$$ 4318025 -2118093 -6472259 -5082835 -1071224 388344 -592117 -43094 2700428
38975B700428J431670j262656q36416J792967J914415j013102k435666J08895
$$ 2700428 4132098 2869442 2033026 3825993 5740408 4727306 2291640 2400535
38967B400535L496101L833210J194304j801239l192695k135553J064391L802737
$$ 2400535 5896636 9729846 10924150 9122911 5930216 3794663 4859054 8661791
38959H661791K660138k019279n263237l333717J474426M148791L186889Q41728
$$ 8661791 11321929 9302650 4039413 705696 2180122 6328913 9515802 10357530
38951A0357530j133205k589478k769312o80502K234766L066465J527194J72642
$$ 10357530 9224325 6634847 3865535 3185033 5419799 8486264 10013458 10186100
38943A0186100J51949j06029j265178j582387m07249J60582r64467j599122k09723
$$ 10186100 10338049 10232020 8966842 7384455 6977206 7137788 6173321 4574199 4364476
38934D364476R32434m35150k218607j098651J896661K899832J140007n38112n09640
$$ 4364476 5296910 4861760 2643153 1544502 3441163 6340995 7481002 6942890 6433250
38925F433250P5849M50633J259855K077747J274480r17894k109679j232509K43267
$$ 6433250 6509099 6959732 8219587 10297334 11571814 10653920 8544241 7311732 7554999
38916G554999R88829J093879M28987j318079k609649j301475J434807J866609
$$ 7554999 8543828 9637707 10066694 8748615 6138966 4837491 6272298 8138907
38908H138907o38203k335969r66937Q63196L52707r88608m12054J411289K057585
$$ 8138907 7500704 5164735 4197798 5060994 5413701 4425093 4013039 5424328 7481913
38899G481913J436850R78677N15080q60720k233173k161544j349984j238756j173943
$$ 7481913 8918763 9897440 10412520 9551800 7318627 5157083 3807099 2568343 1394400
38890A394400J48646J626213J233812l63542q05986R5890O19412N53578R90344
$$ 1394400 1543046 3169259 4403071 4039529 3233543 3329433 3948845 4502423 5492767
38881E492767J193432n71160l005791k476000J436408M634049M017507J115370
$$ 5492767 6686199 6115039 3109248 633248 2069656 6703705 10721212 11836582
38873A1836582j189422k370740k801587j614900J287259L272355J986596r34149
$$ 11836582 10647160 8276420 5474833 3859933 5147192 8419547 10406143 9471994
38865I471994j898247m20042M18569j437464m094849m068805m62064L864810N169080
$$ 9471994 7573747 7153705 7572274 6134810 2039961 -2028844 -2490908 1373902 6542982
38856F542982K841511J45155J52862J635817J043604j660810k506143r5245J232071
$$ 6542982 9384493 9529648 9682510 11318327 12361931 10701121 8194978 8099733 9331804
38847I331804j886369n298665k774298L670348N351095m30138n826944l658490
$$ 9331804 7445435 2146770 -627528 3042820 8393915 7963777 2136833 -1521657
38839a521657K406487L933510P8628k460452j33468L335746L810156J898367k96762
$$ -1521657 884830 4818340 4896968 2436516 2303048 5638794 9448950 11347317 11050555
38830A1050555k553528m332663l535246l08908J588455K95377p42471J587249
$$ 11050555 8497027 4164364 629118 320210 1908665 2204042 1461571 3048820
38822C048820M293630K634510k155933m464549k341016Q57247K211096K005528
$$ 3048820 7342450 9976960 7821027 3356478 1015462 1872709 4083805 6089333
38814F089333R76386o79737j361772N52536L040123K362685j053505l104742k602381
$$ 6089333 7065719 6385982 5024210 5576746 8616869 10979554 9926049 6821307 4218926
38805D218926k256118k458577j11490M511923O011118K174091j781507j376806
$$ 4218926 1962808 -495769 -607259 3904664 9915782 12089873 10308366 8931560
38797H931560K17934j478003m029648k538142J435386K390001O4607q63987Q04753
$$ 8931560 9149494 7671491 3641843 1103701 2539087 4929088 4993695 4129708 4934461
38788D934461J387693o30017k206847j268075N02988J440931K052374K418730
$$ 4934461 6322154 5692137 3485290 2217215 2720203 4161134 6213508 8632238
38780H632238J406050o31156j832642j983087k312438k236504j87196K369048
$$ 8632238 10038288 9407132 7574490 5591403 3278965 1042461 855265 3224313
38772C224313K117403n55532j679041j4940J304082M31123m96227K81305J448061
$$ 3224313 5341716 4786184 3107143 3092203 4396285 4827408 4331181 4612486 6060547
38763F060547J857115K306969K549250P82518k228667k912216n58697J277048
$$ 6060547 7917662 10224631 12773881 13556399 11327732 8415516 7856819 9133867
38755I133867Q91753R19870K358200J719347k288962m731854j869723K155964
$$ 9133867 10025620 10945490 13303690 15023037 12734075 8002221 6132498 8288462
38747H288462J667085j420868j120207K675015M405868J837892j374195k108536
$$ 8288462 9955547 8534679 7414472 10089487 14495355 16333247 14959052 12850516
38739A2850516j431841j142746r82059l03795N97913J431558J857037Q03251j787800
$$ 12850516 11418675 10275929 9293870 8990075 9587988 11019546 12876583 13679834 11892034
38730A1892034l398859j893439Q67512J340826o01388j939548j093742Q37195
$$ 11892034 8493175 6599736 7467248 8808074 8206686 6267138 5173396 6010591
38722F010591K688872L982054L702224J318548j576282l231224m161859m981521
$$ 6010591 8699463 12681517 16383741 17702289 16126007 12894783 8732924 3751403
38714C751403l874806J11227L365350J964765j874778k661627J54742K273203
$$ 3751403 -123403 -12176 3353174 5317939 3443161 781534 936276 3209479
38706C209479K128233K361991L596671K977357M8831j762686j140356q75128k144165
$$ 3209479 5337712 7699703 11296374 14273731 14322562 12559876 11419520 10544392 8400227
38697H400227k250854j38005J217148K66506m99242J66089j84566k144546k217632
$$ 8400227 6149373 6011368 7228516 7495022 6995780 7161869 6977303 4832757 2615125
38688B615125N78117J824561n81443j939812J073358L805900J345013k755577
$$ 2615125 3193242 5017803 4436360 2496548 3569906 7375806 8720819 5965242
38680E965242k678036l80066j159950l107568l78201N265351O075986J108412
$$ 5965242 3287206 2907140 1747190 -1360378 -1738579 3526772 9602758 10711170
38672A0711170k151376L4813K806263K060335J84879n32631k227485n239455m956553
$$ 10711170 8559794 8594607 11400870 13461205 13646084 13113453 10885968 5646513 689960
38663F89960J80001M023227J806674j726728J41491M909427M721459j050302m748643
$$ 689960 869961 4893188 6699862 4973134 5114625 10024052 14745511 13695209 8946566
38654H946566j771049L565292M880338J609815k040195k897705j474004k13816
$$ 8946566 7175517 10740809 15621147 17230962 15190767 12293062 10819058 10605242
38646A0605242m68320j167341o49308N33999L84380p85497k31192K396626L537615
$$ 10605242 10136922 8969581 8320273 8854272 9238652 8453155 8221963 10618589 14156204
38637A4156204J344558p58840M18187K200624N64467k568268k369024L18805J37916
$$ 14156204 15500762 14741922 15160109 17360733 17925200 15356932 12987908 13306713 13444629
38628A3444629l248156l843584P68926M800825K950623j644789k656941J15774
$$ 13444629 10196473 6352889 7121815 11922640 14873263 13228474 10571533 10687307
38620A0687307J765963L95568r15956J32635J601077N91039k606652m892117l810238
$$ 10687307 12453270 12848838 11932882 12065517 13666594 14257633 11650981 6758864 2948626
38611B948626j8362L377527L982700K451010R81806J28373r98639j735021j84879
$$ 2948626 2930264 6307791 10290491 12741501 13723307 13851680 12853041 11118020 10933141
38602A0933141K698962K851335j089626m877370m340571j155582M68686L40952
$$ 10933141 13632103 16483438 15393812 10516442 6175871 5020289 5488975 5829927
38594E829927J190693K760922K095415o56800j825659l34512N79983o74737j000559
$$ 5829927 7020620 9781542 11876957 11220157 9394498 9059986 9639969 8965232 7964673
38585G964673J800835M410343K751458j411410k917032p71262J059780J17437
$$ 7964673 9765508 14175851 16927309 15515899 12598867 11827605 12887385 13004822
38577A3004822j440810j118216P5214j3652j000895j095230l86977l85198r14262
$$ 13004822 11564012 10445796 10521010 10507358 9506463 8411233 8024256 7639058 6724796
38568F724796j60475J943683K961129J677234K85766R08506J820210P7487l062174
$$ 6724796 6564321 8508004 11469133 13146367 13432133 14340639 16160849 16238336 13176162
38559A3176162l052471J130023M773174L826414L41184j230776o05261q12233
$$ 13176162 10123691 11253714 16026888 19853302 20194486 18963710 18358449 17546216
38551A7546216k264003k024564Q77698L368942K848368P36572k59121j65604r77722
$$ 17546216 15282213 13257649 14135347 17504289 20352657 21089229 20830108 20664504 19686782
38542A9686782l164446m800774l855024m32791L062806L980410K248621O85379
$$ 19686782 16522336 11721562 7866538 7433747 10496553 14476963 16725584 17410963
38534A7410963J338780K458065J276276j061421p82533K159511L126625j88225
$$ 17410963 18749743 21207808 22484084 21422663 20640130 22799641 25926266 25738041
38526B5738041l693693k757242R48576K136009n61378l605127m047483k338434
$$ 25738041 22044348 19287106 20235682 22371691 21810313 18205186 14157703 11819269
38518A1819269m6850J857361K416753J357876M80796J619800L216263J985772
$$ 11819269 11772419 13629780 16046533 17404409 17885205 19505005 22721268 24707040
38510B4707040j737870l751065k004361N94383J073218P09837J807822L025392
$$ 24707040 22969170 19218105 17213744 17808127 18881345 19591182 21399004 24424396
38502B4424396J592556j449392k271576j98357J222521j76992j973157j232629
$$ 24424396 26016952 24567560 22295984 22097627 23320148 23143156 21169999 19937370
38494A9937370J017893J877568J152608Q57851J187570L49047j488298j458982
$$ 19937370 20955263 22832831 23985439 24843290 26030860 26379907 24891609 23432627
38486B3432627J433375L810347K245988j762872l794571k443476n02838m38819
$$ 23432627 24866002 28676349 30922337 29159465 25364894 22921418 22418580 21979761
38478B1979761j312366p93040J703904M642788N841572M014882J09496k868064
$$ 21979761 20667395 19874355 21578259 26221047 32062619 36077501 36186997 33318933
38470C3318933k772883r26087j83729q71324r85505j63693l10095j726635j995928
$$ 33318933 30546050 29619963 29436234 28564910 27579405 27415712 27105617 25378982 23383054
38461B3383054j00066J547232J119315L99551J303584K165803O36445j894442
$$ 23383054 23282988 24830220 25949535 26349086 27652670 29818473 30454918 28560476
38453B8560476k286770o29406L07517k07948j21968J591128L351401L489104K100376
$$ 28560476 26273706 25644300 25951817 25743869 25621901 27213029 30564430 34053534 36153910
38444C6153910K58347q75938m18131J144883J798414M64109j361782j984497j928759
$$ 36153910 36412257 35536319 35118188 36263071 38061485 38525594 37163812 35179315 33250556
38435C3250556j969879q48480K083059L936577J893991j657568j971487Q38388
$$ 33250556 31280677 30432197 32515256 36451833 38345824 36688256 34716769 35555157
38427C5555157K138629K88566j157784K59184K117950J564042l19558r62658k36883
$$ 35555157 37693786 37982352 36824568 37083752 39201702 40765744 40446186 39483528 39246645
38418C9246645L23208J34469l77689p66798n84710J35653K62313p20657r41574
$$ 39246645 39569853 39704322 39326633 38559835 37975125 38110778 38373091 37652434 36710860
38409C6710860J178180L274084J896022j426118j705308J582370L378924J150729
$$ 36710860 37889040 41163124 43059146 41633028 39927720 41510090 44889014 46039743
38401D6039743j311571m93457J602252J856619R86646O29449k29803k141270k455315
$$ 46039743 44728172 44234715 45836967 47693586 48680232 49309681 49079878 46938608 44483293
38392D4483293K64773K679917J642148o71086p92957K87681m321n62405O69654
$$ 44483293 44748066 47427983 49070131 48399045 47606088 47893769 47889448 47327043 47996697
38383D7996697J704355j00087k124491n7701M292068N006450J114098k313625
$$ 47996697 49701052 49600965 47476474 47418773 51710841 56717291 57831389 55517764
38375E5517764j987278J63169J543219J808568Q96681j184020k311757l29312
$$ 55517764 53530486 53693655 55236874 57045442 57942123 56758103 54446346 54117034
38367E4117034K863056L551686K041795J589741K319282J660988K34453J024156
$$ 54117034 56980090 60531776 62573571 64163312 66482594 68143582 68378035 69402191
38359F9402191K754972J028605l180957l623728Q04830L401211M58197k819787
$$ 69402191 72157163 73185768 70004811 66381083 67185913 70587124 71045321 68225534
38351F8225534j481455J268423Q72031l17054J689050M218512K503393j220771
$$ 68225534 66744079 68012502 68884533 68567479 70256529 74475041 76978434 75757663
38343G5757663j059956K425234L271812K30967j712122j03493J666146J011924
$$ 75757663 74697707 77122941 80394753 80625720 78913598 78810105 80476251 81488175
38335H1488175q568O04184J430516J138981R87541J640658J359384l74293r11698
$$ 81488175 81479607 82083791 83514307 84653288 85640829 87281487 88640871 88266578 87354880
38326H7354880J420513M168016M256963K288434R74142J278223K293643L214668
$$ 87354880 88775393 92943409 97200372 99488806 100462948 101741171 104034814 107249482
38318A07249482L426139K235055L37933j09658J333289K064984M06196j151483
$$ 107249482 110675621 112910676 113248609 113138951 114472240 116537224 116943420 115791937
38310A15791937M71025L732705M373651J798320j53622R57999L062759L284987
$$ 115791937 116262962 119995667 124369318 126167638 126014016 126972015 130034774 133319761
38302A33319761J704906l2243j213574j406351L11720L338569M786702L132029
$$ 133319761 135024667 134992424 133778850 132372499 132684219 136022788 140809490 143941519
38294A43941519R11366J203704L081059L647808L096755L766090M950505L374593
$$ 143941519 144852885 146056589 149137648 152785456 155882211 159648301 164598806 167973399
38286A67973399o64328k413812M00496M124879N017549M378691M739109M910375
$$ 167973399 167309071 164895259 165295755 169420634 174438183 178816874 183555983 188466358
38278A88466358L004406J095253J928543L446146K069459k58695J519832O621880
$$ 188466358 191470764 192566017 194494560 197940706 200010165 199751470 201271302 207893182
38270B07893182Q417633M487325M77598J381718M362102L991919O06607r11807
$$ 207893182 216310815 220798140 221275738 222657456 227019558 231011477 231618084 230706277
38262B30706277J660492N812793Q240236P819402N354423K663600J509351K027022
$$ 230706277 232366769 238179562 246419798 254239200 259593623 262257223 263766574 265793596
38254B65793596K825629L248998M078419N401591N907429N337331N364271O673388
$$ 265793596 268619225 271868223 275946642 281348233 287255662 292592993 297957264 304630652
38246C04630652P433040O227610M283943L133728K366005J525993J850036L930007
$$ 304630652 312063692 318291302 322575245 325708973 328074978 329600971 331451007 335381014
38238C35381014N847279N928744N307971N456245N311978L429716J026529K54745
$$ 335381014 341228293 347157037 352465008 357921253 363233231 366662947 367689476 367944221
38230C67944221J190868K869203N128551O923450N536364Q45127k270877P3187
$$ 367944221 369135089 372004292 377132843 384056293 389592657 390437784 388166907 388240094
38222C88240094M607270N426318K772483J776327L459029L290889o34191m055468
$$ 388240094 392847364 398273682 401046165 402822492 406281521 409572410 408938219 404882751
38214D04882751l321102o47288L44445K64712J545849L264848K337112j296753
$$ 404882751 401561649 400914361 401258806 401523518 403069367 406334215 408671327 407374574
38206D07374574m003958l025050L82026K727207K075854l58995k035983k087009
$$ 407374574 403370616 400345566 400727592 403454799 405530653 405171658 403135675 401048666
38198D01048666j933401k804479l867139l808864l066163k893364l138022k728616
$$ 401048666 399115265 396310786 392443647 388634783 385568620 382675256 379537234 376808618
38190C76808618j667337p96379l36272l79699j814329m760474p224778p549049
$$ 376808618 375141281 374344902 374008630 373628931 371814602 367054128 359829350 352280301
38182C52280301o944858p113394o942431m771485k386991k741976m732450m711008
$$ 352280301 345335443 338222049 331279618 326508133 324121142 321379166 316646716 311935708
38174C11935708k657065k007486l388202l752540k430503k550265m904653n869891
$$ 311935708 309278643 307271157 303882955 300130415 297699912 295149647 290244994 284375103
38166B84375103l803055k246808l618661m710998k520666j12605j704326n291618
$$ 284375103 280572048 278325240 274706579 269995581 267474915 267362310 265657984 260366366
38158B60366366n662050k681093j104000k945701n013485m261584j557177O23294
$$ 260366366 254704316 252023223 250919223 247973522 242960037 238698453 237141276 237764570
38150B37764570J204204M30409j035361k358642l243317m245987n298731m944403
$$ 237764570 238968774 239399183 238363822 236005180 232761863 228515876 223217145 218272742
38142B18272742k609970l78250m71566k097915k964286k785609k831619k969859
$$ 218272742 215662772 215284522 214812956 212715041 209750755 206965146 204133527 201163668
38134B01163668j943486j03761Q30272N84223M35048N53015l54797k503029m260715
$$ 201163668 199220182 199116421 199946693 200530916 200965964 201518979 201164182 198661153 194400438
38125A94400438m346110l124177j514673j35735M08215j42980j097332j825943
$$ 194400438 190054328 186930151 185415478 185279743 185687958 185544978 184447646 182621703
38117A82621703k996755n220663o953019n816745k074811J155855J532085k83307
$$ 182621703 179624948 174404285 167451266 161634521 159559710 160715565 162247650 161964343
38109A61964343k345319l717854m323753l868570k119687Q4734R60593n88092
$$ 161964343 159619024 155901170 151577417 147708847 145589160 145673894 146634487 146046395
38101A46046395l313793m201254j741066J615459J865177j510117m873119n346242
$$ 146046395 142732602 138531348 136790282 138405741 140270918 138760801 133887682 128541440
38093A28541440m006438k988198k082014m09914P86932j25924k154441l079662
$$ 128541440 124535002 121546804 119464790 119054876 119841808 119715884 117561443 114481781
38085A14481781k662940j978057j016187K95483L00626j868916l452173j568496
$$ 114481781 111818841 109840784 108824597 109120080 109420706 107551790 104099617 102531121
38077A02531121J584524J420958j805301l395774j935088j216302l188064m491128
$$ 102531121 104115645 105536603 103731302 100335528 98400440 97184138 93996074 89504946
38069H9504946k690677r33979k426466m287994j908372L109836M785872J631782
$$ 89504946 86814269 85880290 83453824 79165830 77257458 80367294 85153166 86784948
38061H6784948j528222j140521L52773p33329l467500m112099j752301R24900
$$ 86784948 85256726 84116205 84468978 83735649 80268149 76156050 74403749 75328649
38053G5328649J719683J049988o9375j646878l371683l699008j904678K54766
$$ 75328649 77048332 78098320 78028945 76382067 73010384 69311376 67406698 67661464
38045F7661464O97141j18680l51700Q9962r3249p57493o80472m83309j825003
$$ 67661464 68358605 68239925 67888225 67978187 67884938 67127445 66446973 65963664 64138661
38036F4138661l488691k291478J088218J753000j772753m311670j975527J231529
$$ 64138661 60649970 58358492 59446710 61199710 59426957 55115287 53139760 54371289
38028E4371289k32624m248214m439247l75968K460629J880044J195690K057912
$$ 54371289 54138665 49890451 45451204 45075236 47535865 49415909 50611599 52669511
38020E2669511J869308l44417j739322j261424j643614l498454l138418P09485
$$ 52669511 54538819 54194402 52455080 51193656 49550042 46051588 42913170 43622655
38012D3622655L448160J609109j542193j621331j7473m27851k150966k055488
$$ 43622655 47070815 48679924 47137731 45516400 45498927 45071076 42920110 40864622
38004D0864622n71465m51651j360938p63259R66712J170674L012K06465J813566
$$ 40864622 40293157 39841506 38480568 37717309 38684021 39854695 39857707 40064172 41877738
37995D1877738J556409j600531m156194k816416J140781L805033L265881J053787
$$ 41877738 43434147 41833616 37677422 34861006 36001787 39806820 43072701 44126488
37987D4126488j90128K76394N46466j429828m722831o122689m271409j243723
$$ 44126488 43936360 44212754 44759220 43329392 38606561 32483872 28212463 26968740
37979B6968740P07050J694231K288884J675293l40181j832502j494170p33543
$$ 26968740 27675790 29370021 31658905 33334198 32994017 31161515 29667345 28933802
37971B8933802r00915q26774M81809J361863N65439K4487J198701J564274j150057
$$ 28933802 28032887 27206113 27687922 29049785 29615224 29639711 30838412 32402686 31252629
37962C1252629l959034k780519N72092J062149j364426k129234N3627J605130
$$ 31252629 27293595 24513076 25085168 26147317 24782891 22653657 22707284 24312414
37954B4312414O75655m17827j63415O8343q7102P85083J676939m39129m528487
$$ 24312414 24988069 24570242 24406827 24475170 24388068 25173151 26850090 26410961 21882474
37945B1882474n322484j278245K662756K686175J071632P04064K42807j471460
$$ 21882474 16559990 15281745 17944501 20630676 21702308 22406372 22649179 21177719
37937B1177719j638621J143678K660638k72549l240127o40537M677915N193970
$$ 21177719 19539098 20682776 23343414 23070865 19830738 19190201 23868116 29062086
37929B9062086O6827m407296m714591l364422k207616J92451L086204K407159
$$ 29062086 29128913 24721617 20007026 16642604 14434988 14627439 17713643 20120802
37921B0120802j977565l933303M9096M624415L133817k376274m334240q04259
$$ 20120802 18143237 14209934 14259030 18883445 22017262 19640988 15306748 14502489
37913A4502489K414542P59020l267741m726717k721898P4971J695383K062970
$$ 14502489 16917031 17676051 14408310 9681593 6959695 7034666 8730049 10793019
37905A0793019J474710M39389L71942K216442M452658M327512J293188k291656
$$ 10793019 12267729 12707118 13079060 15295502 19748160 24075672 25368860 23077204
37897B3077204m064769l710574j938415N97034K598886K407151L64763q64301
$$ 23077204 19012435 15301861 13363446 13960480 16559366 18966517 19331280 18466979
37889A8466979K3833P99307o29182k225207o89580K811590L655405N70185k416886
$$ 18466979 18490812 19290119 18660937 16435730 15746150 18557740 22213145 22783330 20366444
37880B0366444j975638l5244l88990l207748n179541l754400L55498L953486L907999
$$ 20366444 18390806 18355562 17966572 14758824 9579283 5824883 6180381 10133867 14041866
37871A4041866K93067k730560j231226L027696M302138P65744k910554k576479
$$ 14041866 14334933 11604373 10373147 13400843 17702981 18468725 15558171 12981692
37863A2981692k70286J51015n39855Q06574L448432L688335J050302j189656j490894
$$ 12981692 12711406 12862421 12322566 13129140 16577572 20265907 21316209 20126553 18635659
37854A8635659j687259k688551k673411p55072J073564J220586Q06783J021916
$$ 18635659 16948400 14259849 11586438 10831366 11904930 13125516 13932299 14954215
37846A4954215P00155j486304m239319m999915l082496j20450J790003J605459
$$ 14954215 15654370 14168066 9928747 4928832 1846336 1725886 3515889 5121348
37838E121348J295q99520M05068K612335K908431Q13467j067680q48635J02819
$$ 5121348 5122643 4223123 4628191 7240526 10148957 10962424 9894744 9046109 9148928
37829I148928k24331j120997l71849K126759L914673K992219J7108k521745k611663
$$ 9148928 8924597 7803600 7431751 9558510 13473183 16465402 16482510 13960765 11349102
37820A1349102m47989J621906J334712r14832k465662j761881j90820K65656j29903
$$ 11349102 10901113 12523019 13857731 12942899 10477237 8715356 8524536 8790192 8660289
37811H660289P0008O17829n3683j769743k295675q02353M71276m77766k101939
$$ 8660289 8730297 9348126 9294443 7524700 5229025 4426672 4897948 4420182 2318243
37802B318243j502036R51012J915005J60391j435018j86486K566166L923606L642408
$$ 2318243 816207 1767219 3682224 3842615 2407597 2221111 4787277 8710883 12353291
37793A2353291L166039K091738p75876l570742k801607Q19382K246881n59796
$$ 12353291 15519330 17611068 16835192 13264450 10462843 11282225 13529106 12969310
37785A2969310l235070j638361J759655J929079r81022k511526j083528L94989
$$ 12969310 9734240 8095879 9855534 11784613 10803591 8292065 7208537 7603526
37777G603526m1300p36904m4784R40070P08084k61256q66980j129807j256119
$$ 7603526 7562226 6825322 6780538 7720608 8428692 8167436 7300456 6170649 4914530
37768D914530n73800J315567L347206L931783K624395N67980m66591P1634L55208
$$ 4914530 4340730 5656297 9003503 12935286 15559681 16127661 15661070 15732704 16087912
37759A6087912j784667m977187m796864j0064M271088K920719j855085l698253
$$ 16087912 14303245 9326058 4529194 4519130 8790218 11710937 9855852 6157599
37751F157599j165610J317784J023716K2240Q3323j90320j437771j478375O14604
$$ 6157599 4991989 6309773 7333489 7355729 7439052 7248732 5810961 4332586 4947190
37742D947190K460491K547909K502987L012782J733082j964765m332181k756798
$$ 4947190 7407681 9955590 12458577 15471359 17204441 15239676 10907495 8150697
37734H150697k08223m03201j929341j385806N32867O74112r68303j753588j016807
$$ 8150697 7942474 7539273 5609932 4224126 4756993 5431105 4462802 2709214 1692407
37725A692407j85725L98907J125473J035408l47086q22826J121130K697392P73099
$$ 1692407 1506682 1905589 3031062 4066470 3719384 2896558 4017688 6715080 7488179
37716G488179k449789k466462L85815J980783J375736J112047J309454l72679
$$ 7488179 5038390 2571928 2957743 4938526 6314262 7426309 8735763 8363084
37708H363084k809951j936663J703548K375413j752954n066743l129044P72999
$$ 8363084 5553133 3616470 5320018 7695431 5942477 875734 -2253310 -1480311
37700a480311J641590L85812O30258J790004P50446j935451k837414j495906p26111
$$ -1480311 161279 547091 1177349 2967353 3717799 1782348 -1055066 -2550972 -3277083
37691c277083j405316j224530Q77478K601840J774634n52050j783604j009546
$$ -3277083 -4682399 -5906929 -5029451 -2427611 -652977 -1205027 -2988631 -3998177
37683c998177N65721J511640J533527J172203Q09406M78373O22261J990010L915301
$$ -3998177 -3432456 -1920816 -387289 784914 1594320 2072693 2694954 4684964 8600265
37674H600265L922157R05605k258125j990575N31903O36161k699136m844133k340452
$$ 8600265 12522422 13428027 11169902 9179327 9711230 10347391 7648255 2804122 463670
37665D63670J916783L046189Q74624r82818p47487K03881N28812L53846P941k95385
$$ 463670 2380453 5426642 6301266 5318448 4570961 4774842 5303654 5657500 5665441 5370056
37655E370056R511P65476M75846j335995k397372o02913K504609L691795K438355
$$ 5370056 5379567 6145043 6620889 5284894 2887522 2284609 4789218 8481013 10919368
37646A0919368O90935p66930k516156l658376k323544P19462K231514J006616
$$ 10919368 11610303 10843373 8327217 4668841 2345297 3064759 5296273 6302889
37638F302889o95749j056292j119496k050124k740262j991243q19081m61747R6791
$$ 6302889 5607140 4550848 3431352 1381228 -1359034 -3350277 -4169358 -4631105 -4534314
37629d534314K190510M302963L538278l3793k921360k499701J18844K137466K330378
$$ -4534314 -2343804 1959159 5497437 5463644 2542284 42583 161427 2298893 4629271
37620D629271J233515m35114j893597j760613M55639K504108J455087j755141
$$ 4629271 5862786 5427672 3534075 1773462 2229101 4733209 6188296 4433155
37612D433155k535603Q87569L916869J664017l427420m518755l09915L159006
$$ 4433155 1897552 2785121 6701990 8366007 4938587 419832 109917 3268923
37604C268923J666275j547064k022015j083712k148288l685936j583884L171640
$$ 3268923 4935198 3388134 1366119 282407 -1865881 -5551817 -7135701 -3964061
37596c964061N013607K029261j426216j354034R78805K303514J845046N61760
$$ -3964061 1049546 3078807 1652591 298557 1277362 3580876 5425922 5987682
37588E987682j181740k967853l424574j965105J119R93765J176321J079173L42918
$$ 5987682 4805942 1838089 -1586485 -3551590 -3550471 -2556706 -1380385 -301212 41706
37579D1706r32484j239318K87493K053606J823476m10010k617201l108746j685696
$$ 41706 -890778 -2130096 -1842603 211003 2034479 1624469 -992732 -4101478 -5787174
37570e787174Q63489L276096M167440K806177k57424l328545m270730j882747
$$ -5787174 -4923685 -1647589 2519851 5326028 5068604 1740059 -2530671 -4413418
37562d413418K396251M841411L072032j021484l580022l454743k503309j813657
$$ -4413418 -2017167 2824244 5896276 4874792 1294770 -2159973 -4663282 -6476939
37554f476939n80061J176772K081318K361781L905541O014603M798681q07965
$$ -6476939 -7057000 -5880228 -3798910 -1437129 2468412 8483015 13281696 12473731
37546A2473731n822726n346554j291388Q33498j38899o81298Q71645K117092J267218
$$ 12473731 6651005 1304451 13063 846561 707662 26364 898009 3015101 4282319
37537D282319j66521n89111p06905j032206p3986K695634M426798K252868k185537
$$ 4282319 4115798 3526687 2819782 1787576 1713590 4409224 8836022 11088890 8903353
37528H903353m328706k493446L19047P69120p07110j229553L88454K404088K765301
$$ 8903353 4574647 2081201 2400248 3169368 2462258 1232705 1621159 4025247 6790548
37519F790548J546453K53193l81605r54255j978004k774085k061006N77590L776351
$$ 6790548 8337001 8590194 8208589 7254334 5276330 2502245 441239 1018829 4795180
37510D795180M910436K258589k656742n591722l752048P26867K829556L60923
$$ 4795180 9705616 11964205 9307463 3715741 -36307 690560 3520116 3881039
37502C881039l678656m799182j947083J835665K829959K47306l035945l327426
$$ 3881039 202383 -4596799 -6543882 -4708217 -1878258 -1630952 -4666897 -7994323
37494g994323k41512K644054K300235K91202K13564K106720K666804Q71018n40062
$$ -7994323 -8235835 -5591781 -3291546 -3000344 -2786780 -680060 1986744 2857762 2317700
37485B317700j45239k82943k316289l368035r68275K251205K336831N2640r31828
$$ 2317700 2172461 1889518 -426771 -3794806 -4763081 -2511876 -175045 -122405 -1054233
37476a054233J7734P30214R99832K375282L767822K158543j917946m102664k439969
$$ -1054233 -1036499 -306285 693547 3068829 6836651 8995194 7077248 2974584 534615
37467E34615P9905M24197o93494j339032j269647p49715M20715J180479l42385
$$ 534615 614520 1038717 345223 -993809 -2263456 -3013171 -2592456 -1411977 -1754362
37458a754362l086128l138879M71046L556318K863159Q94124J326393K812942
$$ -1754362 -4840490 -7979369 -7508323 -3952005 -1088846 -194722 1131671 3944613
37450C944613J698046j276958j925870M90351K082463N21186j686021j504154
$$ 3944613 5642659 4365701 2439831 2930182 5012645 5533831 3847810 2343656
37442B343656J44466J52587k271421m598096l905485j14742L472813L253345m02424
$$ 2343656 2488122 2640709 369288 -4228808 -8134293 -8249035 -4776222 -1522877 -1925301
37433a925301k918886r09937L316992M724898K122225r37240j512838m45095L23255
$$ -1925301 -4844187 -5754124 -2437132 2287766 4409991 3472751 1959913 1514818 1838073
37424A838073N25989M02070n78225k044639j994037K15989J975832Q76974j395301
$$ 1838073 2364062 2766132 2187907 143268 -1850769 -1634780 341052 1218026 -177275
37415a77275j348066J023778K314883J067465j69148P23820J788409J25532l086867
$$ -177275 -1525341 -501563 1813320 2880785 2711637 3435457 5223866 5349398 2262531
37406B262531l742492o75803K525337K458186K33913q91446l66728j90677p73457
$$ 2262531 -1479961 -2155764 369573 2827759 3061672 2170226 1803498 1612821 839364
37397H39364j79748J955325K837505O40227k114848j820402J056619K872468K028008
$$ 839364 659616 2614941 5452446 6092673 3977825 2157423 3214042 6086510 8114518
37388H114518K70531j000675k400309l802308l186356l5847K678395K238256P2090
$$ 8114518 8385049 7384374 4984065 1181757 -2004599 -2040446 637949 2876205 2948295
37379B948295n13954R67006K421593K986667L464225L370929J033343k699091
$$ 2948295 2434341 3401347 5822940 8809607 12273832 15644761 16678104 13979013
37371A3979013m099219j608202J310258O33544k661305m115309j981139P92228
$$ 13979013 9879794 8271592 9581850 10215394 7554089 3438780 1457641 2249869
37363B249869Q88126j304801k799935j802454N88962J863625O93412j684882k609145
$$ 2249869 3137995 1833194 -966741 -2769195 -2180233 -316608 376804 -1308078 -3917223
37354c917223r04750J567296J997868L4430j952286j988323n80721P29880J557119
$$ -3917223 -4821973 -3254677 -1256809 -1222379 -3174665 -5162988 -5743709 -5013829 -3456710
37345c456710K389642L003257K470553O32729j379728k278524j819993q15401
$$ -3456710 -1067068 1936189 4406742 5039471 3659743 1381219 -438774 -1254175
37337a254175j92249n9068K71168J127957J641580P85563q67606j565236p69776
$$ -1254175 -1446424 -1505492 -1234324 -106367 1535213 2320776 1453170 -112066 -881842
37328h81842K09856N34150J152990K637701L366000J844384m23428r33170l08115
$$ -881842 -671986 -137836 1015154 3652855 7018855 8863239 8439811 7506641 7198526
37319G198526j392396m211100n229046k709855M11249R48434j07259k30052J06614
$$ 7198526 5806130 1595030 -3634016 -6343871 -5932622 -4984188 -5091447 -5321499 -5214885
37310e214885q55600j645501P72213N127958O220704K239513k318377k933848
$$ -5214885 -6070485 -7715986 -6943773 -1815815 4404889 6644402 4326025 1392177
37302A392177p02465Q47619J316887K300009L070570J582642j315380k676889
$$ 1392177 689712 1537331 2854218 5154227 8224797 9807439 8492059 5815170
37294E815170k072920j641018j691496l62301J891274J867125q72733k297359
$$ 5815170 3742250 2101232 409736 47435 1938709 3805834 2933101 635742
37286F35742m1489K608294J905770n82194j109759J41982L46395o36980p56027
$$ 635742 594253 3202547 5108317 4526123 3416364 3558346 3904741 3267761 2511734
37277B511734k59831j077051k468549j956201k51266m68574k335503k200082N21565
$$ 2511734 2251903 1174852 -1293697 -3249898 -3501164 -3969738 -6305241 -8505323 -7983758
37268g983758K091352R58246K50726J704932K363185K63421j568668n36483O64069
$$ -7983758 -5892406 -4934160 -4683434 -2978502 -615317 -351896 -1920564 -2457047 -1792978
37259a792978j019074l194656k112515P72940J591737O83201R35177J750202N06286
$$ -1792978 -2812052 -6006708 -8119223 -7346283 -5754546 -5071345 -4136168 -2385966 -1879680
37250a879680j568658j022261J285489J351749p43507j044610P75213P13127j742917
$$ -1879680 -3448338 -4470599 -3185110 -1833361 -2576868 -3621478 -2846265 -2133138 -3876055
37241c876055j785011K419722N714864L620847r29191k317854K02K077302J159086
$$ -3876055 -5661066 -3241344 2473520 6094367 5165176 2847322 2847524 4924826 6083912
37232F083912k062179m829393m294963m42833K369135K50619l624030k335445
$$ 6083912 4021733 -807660 -5102623 -5545456 -3176321 -2925702 -6549732 -8885177
37224h885177L975942P109436L098039j605555o87729K207170P05311l089744
$$ -8885177 -4909235 2200201 5298240 3692685 3004956 5212126 5917437 2827693
37216B827693k796268P57255J174315k186260l303085O8962L010585J823828r13382
$$ 2827693 31425 788680 1962995 -223265 -3526350 -3457388 -446803 1377025 463643
37207D63643j563399j59928J835948L635655L547672N0768m230391m428499p00104
$$ 463643 -1099756 -1259684 576264 4211919 7759591 7810359 3579968 -848531 -1548635
37198a548635J414230m51929j953006M38479L660970L391923O43756j055713j383056
$$ -1548635 -134405 -586334 -2539340 -2100861 1560109 4952032 5595788 4540075 3157019
37189C157019j787737j357442J254373L833356L093928m858j559069o70208k31448
$$ 3157019 1369282 11840 1266213 5099569 8193497 8188639 6629570 5959362 5727914
37180E727914j842785l448508k706111r0737K217613K801102J742179P9714j110682
$$ 5727914 3885129 436621 -2269490 -2360227 -142614 2658488 4400667 4480381 3369699
37171C369699j659924k024836j789812J68367L038388L453362l34864m920926
$$ 3369699 1709775 -315061 -2104873 -1936506 1101882 4555244 4220380 -700546
37163g00546n140141o98030L276854K773875l88622j608470M54878K699941J961551
$$ -700546 -5840687 -6538717 -3261863 -487988 -876610 -2485080 -2030202 669739 2631290
37154B631290j089793l086703k223670k22806J86198j300069k618964k189537
$$ 2631290 1541497 -1545206 -3768876 -3991682 -3805484 -5105553 -7724517 -9914054
37146i914054l46902J811118L444855L737259K331028N14380L47422J824060K471529
$$ -9914054 -10260956 -8449838 -5004983 -1267724 1063304 1577684 1925106 3749166 6220695
37137F220695Q08259j367708j623534m97833m64520j932060k492656n37100K142769
$$ 6220695 7028954 5661246 4037712 3539879 3075359 1143299 -1349357 -1886457 256312
37128B56312K514327K27834k010414k069327j038200j167375k146471j590717
$$ 256312 2770639 2998473 988059 -1081268 -2119468 -3286843 -5433314 -7024031
37120g024031O71903J530229o64765k781420j090511K935466M474183K240515
$$ -7024031 -6352128 -4821899 -5486664 -8268084 -9358595 -6423129 -1948946 291569
37112B91569k55605n17939l21246j883550l935552l588811k19251M026227O310485
$$ 291569 35964 -481975 -803221 -2686771 -6622323 -10211134 -10430385 -6404158 -93673
37103i3673N078286J501791q84048Q9828K082413J372233j325586j804955P89193
$$ -93673 4984613 6486404 5602356 5692184 7774597 9146830 7821244 6016289 6805482
37094F805482K502501J037278r49330r73828o07591j531197k027358p42189M982
$$ 6805482 9307983 10345261 9395931 8422103 7814512 6283315 4255957 3513768 3518750
37085C518750j597926l023762j775663n1758n91447j310369P54267L195851J835640
$$ 3518750 1920824 -1102938 -2878601 -2930359 -3521806 -4832175 -4077908 -882057 953583
37076I53583j685330k180953O23348K254169J347329Q61043J453194K05727l058538
$$ 953583 -731747 -2912700 -2289352 -35183 1312146 2173189 3626383 3832110 773572
37067G73572m340400k067022L35996M19048J69385J344949K196424J375899P03619
$$ 773572 -3566828 -5633850 -5297854 -4878806 -4709421 -3364472 -1168048 207851 911470
37058I11470J308323J026557j478805l606972k724258m8337J947248K911169L006209
$$ 911470 2219793 3246350 1767545 -1839427 -4563685 -4612022 -2664774 246395 3252604
37049C252604J278289j715315k962841j493913n00371k031423l194214j237381
$$ 3252604 4530893 2815578 -147263 -1641176 -2141547 -4172970 -7367184 -8604565
37041h604565J186822L35624k074561j756335R02577J926245P45886N11831J847870
$$ -8604565 -7417743 -7082119 -9156680 -10913015 -10010438 -8084193 -7338307 -6826476 -4978606
37032d978606J887616J15980j51014K296067L841896J681696j614023k107322
$$ -4978606 -3090990 -2975010 -3126024 -829957 3011939 4693635 3079612 972290
37024I72290l05258J82596j882113m201914m480101k619671L79668L535039N497826
$$ 972290 667032 849628 -1032485 -5234399 -9714500 -12334171 -11954503 -8419464 -2921638
37015b921638M756344J294398k565480l920063k057820Q79526K207117J413053
$$ -2921638 1834706 3129104 563624 -3356439 -5414259 -4534733 -2327616 -914563
37007i14563K14281J37978P99870Q37261j09792r54787n19260J053977K296547
$$ -914563 -700282 -562304 237566 1074827 965035 10248 -509012 544965 2841512
36998B841512J876927J26971j255879j252590n56504o4010M94014J221944P27605
$$ 2841512 4718439 4845410 3589531 2336941 1780437 1716427 2210441 3432385 4159990
36989D159990j728644l756608k413235J078928K506708Q71246k41122J395100
$$ 4159990 2431346 -1325262 -3738497 -2659569 -152861 718385 477263 1872363
36981A872363L167682K236071N7134p44062j059401l069331n359457m419326k51362
$$ 1872363 5040045 7276116 7333250 6589188 5529787 2460456 -2899001 -7318327 -7569689
36972g569689L180606L098714P25194j038558n43247J727208L367806J888855
$$ -7569689 -4389083 -1290369 -565175 -1603733 -2146980 -419772 2948034 4836889
36964D836889j903883l733205j192129K532949L037659P76663p94328j095745
$$ 4836889 2933006 -800199 -1992328 540621 3578280 4354943 3560615 2464870
36956B464870j778307j776031J182901M532826K849145k998439n232089l62713
$$ 2464870 686563 -1089468 93433 4626259 7475404 4476965 -755124 -1117837
36948a117837N094881M088439j062571l305919j276087P79532P92445N04684N75117
$$ -1117837 3977044 8065483 7002912 3696993 2420906 3200438 3992883 4497567 5072684
36939E072684k33787j255718m43969J130748J74012k887561l720788j004461J310716
$$ 5072684 4838897 3583179 3139210 4269958 4443970 1556409 -2164379 -3168840 -1858124
36930a858124O11294k40137J599077L528532J768527j975824k942743p70195M04202
$$ -1858124 -1246830 -1486967 112110 3640642 5409169 3433345 490602 -279593 124609
36921A24609j073416k043802q5654K697247L276373J962063Q45154K83771o56888
$$ 124609 -948807 -2992609 -3078263 -381016 2895357 4857420 5702574 5986345 5329457
36912E329457j803730k251587k227852k542722k753722j650047Q02615L425184
$$ 5329457 3525727 1274140 -953712 -3496434 -6250156 -7900203 -7097588 -3672404
36904c672404N229777N560534L676666n2604l174467l368626j391433l846l07650
$$ -3672404 1557373 7117907 10794573 10741969 7567502 4198876 2807443 2803597 2495947
36895B495947j121672j593624j960050j740188M0145K294585K366045J09936j204472
$$ 2495947 1374275 -219349 -2179399 -3919587 -3879442 -1584857 781188 891124 -313348
36886c13348M79843L004358L405408J966395O85802j98397j530261k618300k076832
$$ -313348 166495 3170853 6576261 8542656 9228458 9030061 7499800 4881500 2804668
36877B804668m61392L35547k06402j028921j279595o13817J211434L198292K867772
$$ 2804668 2343276 2678823 2472421 1443500 163905 -449912 761522 3959814 6827586
36868F827586o24379m344590m911753k734492m62332J181186K825889L267381
$$ 6827586 6203207 1858617 -3053136 -5787628 -6249960 -5068774 -2242885 1024496
36860A024496R87462j885326j606001J204162K141994P8018j189958L78982J677005
$$ 1024496 2011958 126632 -1479369 -275207 1866787 1944805 754847 1133829 2810834
36851B810834J12203j880004j274839M17295L34984n01871N12763K229604J363054
$$ 2810834 2923037 1043033 -231806 185489 520473 18602 531365 2760969 4124023
36842D124023j575026k463073K14273L152873L024141N27738j449260j609808
$$ 4124023 2548997 85924 300197 3453070 6477211 7004949 5555689 3945881
36834C945881r95336j082133j898105j823347L19463K791845K202288j642757
$$ 3945881 2950545 1868412 -29693 -1853040 -1533577 1258268 3460556 1817799
36826A817799m270419k180394J945565K838020J02788j807909o44980R38224M92084
$$ 1817799 -2452620 -4633014 -2687449 150571 253359 -1554550 -2199530 -1261306 -769222
36817g69222n85960l75288J07948o54422j465546n20239J152219J232910k03208
$$ -769222 -1355182 -1730470 -1622522 -2276944 -3742490 -4262729 -3110510 -1877600 -2080808
36808b080808j268069j438214j343715l16761K539219N120052L858547o87587
$$ -2080808 -3348877 -4787091 -6130806 -6447567 -3908348 1211704 5070251 4382664
36800D382664l264593p39866L406123L871049N26648k439609k827150k215120
$$ 4382664 1118071 378205 3784328 7655377 8182025 5742416 2915266 700146
36792G00146j865187o75777J746619L144758J701557r68057j934556p73133M90123
$$ 700146 -1165041 -1840818 -94199 3050559 4752116 3784059 1849503 1076370 1566493
36783A566493L00542j064813k260471j817889O40863L068249K436019r93078k799630
$$ 1566493 1867035 802222 -1458249 -3276138 -2635275 432974 2868993 1875915 -923715
36774i23715j74852L361618K438946k205054m516077j861671J531634J207220
$$ -923715 -1098567 2263051 4701997 2496943 -2019134 -3880805 -2349171 -1141951
36766a141951j546473k738543j443069M42197J855563K794891K380308q3890k684208
$$ -1141951 -2688424 -5426967 -6870036 -6427839 -4572276 -1777385 602923 519033 -2165175
36757b165175k370920R57049L857799L242398l22512l348047k805764R15864M058413
$$ -2165175 -4536095 -3579046 278753 3521151 3198639 -149408 -2955172 -2039308 2019105
36748B019105L284784l52684k645194j701066N3972K02569k52598K27526M06986
$$ 2019105 5303889 4951205 2306011 604945 658917 861486 608888 836414 1243400
36739A243400r85148j679018Q35956M030827L142275j232899l433750j327524
$$ 1243400 258252 -1420766 -584810 3446017 6588292 5355393 1921643 594119
36731E94119N37780j485440m099786k339245K366514M086844J087626j931410
$$ 594119 1131899 -353541 -4453327 -6792572 -4426058 -339214 748412 -1182998
36723a182998q62546K205651K377355j141878m085730k825914J091064L214570
$$ -1182998 -2045544 160107 2537462 1395584 -2690146 -5516060 -4424996 -1210426
36715a210426J825939o07426j558442j660870k414986k727434m87301L253459
$$ -1210426 615513 8087 -1550355 -3211225 -5626211 -8353645 -8840946 -5587487
36707e587487M836541L035392N98724j87275o09462k434626m214356l317307j11907
$$ -5587487 -750946 2284446 2883170 2695895 2086433 -348193 -4562549 -7879856 -7991763
36698g991763K696202M057469M958252N009777J985127l971831q340815o879717
$$ -7991763 -5295561 -1238092 3720160 8729937 10715064 6743233 -1597582 -8477299
36690h477299j173397K863369J918531j383041k592673q57098J267296J987967
$$ -8477299 -9650696 -6787327 -4868796 -6251837 -8844510 -9701608 -8434312 -6446345
36682f446345J947527J999536J710641Q28389L05079O43053P73147j9128n25698
$$ -6446345 -4498818 -2499282 -788641 39748 344827 987880 1761027 1741899 1216201
36673A216201K67185Q92267m13305k235199j616735J066544K022251m79716l447759
$$ 1216201 1483386 2375653 1962348 -272851 -1889586 -823042 1199209 719493 -2728266
36664b728266l365968o26196J967127L061464L036602K037560J66639j213605
$$ -2728266 -6094234 -6720430 -4753303 -1691839 1344763 3382323 3548962 2335357
36656B335357o66096J141381K298468K345100K216088J801539j29882l145496
$$ 2335357 1669261 2810642 5109110 7454210 9670298 11471837 11341955 8196459
36648H196459m470659k305430J595286L920529L402549J219002j270317l492260
$$ 8196459 3725800 1420370 3015656 6936185 10338734 11557736 10287419 6795159
36640F795159m646176l661818r88777Q79271K9269k228027k736764n57642J756351
$$ 6795159 2148983 -1512835 -2501612 -1622341 -1593072 -3821099 -6557863 -7115505 -5359154
36631e359154J575443l66607j215844O7850J714975K070414J723734J883802K058234
$$ -5359154 -3783711 -4150318 -5366162 -5298312 -3583337 -1512923 210811 2094613 4152847
36622D152847R03891j233691k388572j766012q70925j055284j346084k26840J370157
$$ 4152847 5056738 3823047 1434475 -331537 -1202462 -2257746 -3603830 -3830670 -2460513
36613b460513J104452p72053j105876J309315L166650J352192j818973j685830
$$ -2460513 -1356061 -2128114 -3233990 -1924675 1241975 2594167 775194 -910636
36605i10636J342735J876064k219778o086335m712191J04795K949799K280516
$$ -910636 432099 2308163 88385 -5997950 -10710141 -10605346 -7655547 -5375031
36597e375031Q16061J28724q19399k107219j866582M09661K655658L255157K849933
$$ -5375031 -4558970 -4430246 -5249645 -7356864 -9223446 -8813785 -6158127 -2902970 -53037
36588e3037K351115J391019k98717j782090k107047j339454k0739J237922J692337
$$ -53037 2298078 3689097 3390380 1608290 -498757 -1838211 -1858950 -621028 1071309
36579A071309J285471J107819J639163J509757q5180j152462J59121J822840P54775
$$ 1071309 2356780 3464599 5103762 6613519 6528339 5375877 5534998 7357838 8112613
36570H112613j832317k328432j137393j800510l831877k806105J213187K316100
$$ 8112613 6280296 3951864 2814471 1013961 -2817916 -5624021 -4410834 -2094734
36562b094734j317907l142101J379085O446708M414467k285735n144919k263057
$$ -2094734 -3412641 -6554742 -5175657 1271051 5685518 3399783 -1745136 -4008193
36554d008193P96502J109969J375864K832649K669187j5163j877440r67711M23083
$$ -4008193 -3211691 -2101722 -725858 2106791 4775978 4760815 2883375 1915664 2338747
36545B338747M53668N60291J598578J598867l28711j801498j228391m70216j130938
$$ 2338747 2792415 3352706 4951284 6550151 6221440 4419942 3191551 2721335 1590397
36536A590397j675522p03350K59183q2111l9183J655685K664878O95252k121987
$$ 1590397 -85125 -788475 -529292 -611403 -650586 1005099 3669977 4365229 2243242
36527B243242k230959k40116L06774j342161k386843j126710R20250J774672J220797
$$ 2243242 12283 -227833 78941 -1263220 -3650063 -4776773 -3856523 -2081851 -861054
36518h61054j00192j630538k456761j693302J46526J367793J012552k30966r71166
$$ -861054 -961246 -2591784 -5048545 -6741847 -6595321 -5227528 -4214976 -4445942 -5417108
36509e417108l16663J457433K840967K400682P43322K2991P57039Q45924q91472
$$ -5417108 -5733771 -4276338 -1435371 965311 1708633 1731624 2488663 3334587 2443115
36500B443115k249604j030375Q80194J12451k490062k688144M35351K601316P01871
$$ 2443115 193511 -836864 43330 155781 -2334281 -5022425 -4587074 -1985758 -1283887
36491a283887k460453k397949O25085K581985J697980J05538j51877M42363R46121
$$ -1283887 -3744340 -6142289 -5517204 -2935219 -1237239 -1131701 -1283578 -841215 104906
36482A04906J568351K001821P12429k185007l446426p38697L199523L581463K48041
$$ 104906 1673257 3675078 4387507 2202500 -1243926 -1982623 1216900 4798363 5046404
36473E046404k145836j026664P32793j8785j702663j159889P90654P85006j441797
$$ 5046404 2900568 1873904 2606697 2587912 885249 -274640 516014 1301020 -140777
36464a40777k817228j961612o14168K75250K059502M805076N616355K588436j975665
$$ -140777 -2958005 -4919617 -5533785 -5258535 -3199033 1606043 7222398 9810834 7835169
36455G835169m332044l556875j410606L81814J054896M35290p50723j249806r91379
$$ 7835169 3503125 -53750 -1464356 -1082542 -27646 407644 -343079 -1592885 -2584264
36446b584264j107491j532594n90464J904405L430844K326926L97467j907O63408
$$ -2584264 -3691755 -5224349 -5814813 -3910408 -479564 1847362 2244829 2242922 2906330
36437B906330R03183J141196K026416J843382r06197l803909l287443l55389N70966
$$ 2906330 3809513 4950709 6977125 8820507 7914310 4110401 822958 467569 1038535
36428A038535j539276k770324m14879L022184L644958J136064j913488l433504
$$ 1038535 -500741 -3271065 -3685944 -663760 2981198 4117262 2203774 -1229730
36420a229730k917911q94218R69917P56286j136842j685347Q88961M115430L991427
$$ -1229730 -4147641 -5041859 -4071942 -3315656 -4452498 -6137845 -5248884 -1133454 2857973
36411B857973J25130l553390l288657M34558L656967L262035J68880j942949j020012
$$ 2857973 2983103 -570287 -3858944 -3424386 232581 3494616 3663496 1720547 700535
36402G00535J035188J097300j026056k707744k348763j104566m59523j18190O44667
$$ 700535 1735723 2833023 1806967 -900777 -3249540 -4354106 -4813629 -4931819 -4287152
36393d287152J208985P73070K70475J276907L186805L239090J34397l486125l669681
$$ -4287152 -3078167 -2305097 -2034622 -757715 2429090 5668180 5802577 2316452 -1353229
36384a353229k60012K269161K73209m073720n481656k640330M95539R62367N76750
$$ -1353229 -1613241 655920 929129 -3144591 -8626247 -11266577 -10771038 -9808671 -9231921
36375i231921J550996K158792L77324j246835P40534M081444L470917p60174k578977
$$ -9231921 -7680925 -5522133 -5144809 -6391644 -5651110 -1569666 1901251 1141077 -1437900
36366a437900L99862L382545K206967p52268j516014o02579m28111n03361N65669
$$ -1437900 -1038038 2344507 4551474 3799206 2283192 1680613 1252502 749141 1314810
36357A314810J301026j26495j917531j348490M57958N51455p42303r26080j31299
$$ 1314810 2615836 2489341 571810 -776680 -318722 232733 -509570 -1435650 -1566949
36348a566949m23417j287957l60786J725438J732220p43094k411151j445488L43340
$$ -1566949 -1990366 -3278323 -3639109 -1913671 -181451 -924545 -3335696 -4781184 -4437844
36339d437844J180597J518218J722794J078837P0805L65779J613942J556747J04333
$$ -4437844 -3257247 -1739029 -16235 1062602 1133407 1499186 3113128 4669875 4774208
36330D774208l40443M39905l35593k973628l510454p7179L135826J965091j154141
$$ 4774208 4433765 4873670 4538077 1564449 -1946005 -2023184 1112642 3077733 1923592
36321A923592j146721J640684K284277q62507l886036l145322L66491L277159
$$ 1923592 776871 2417555 4701832 3839325 -46711 -3192033 -2825542 451617
36313D51617L613840J518128j520252l261454k254754M39577K194198J796668
$$ 451617 4065457 5583585 4063333 801879 -1452875 -1013298 1180900 2977568
36305B977568M74578q4610L70083Q57099M07447r56470k021086j492621L56380
$$ 2977568 3452146 3367536 3737619 4594718 5002165 4045695 2024609 531988 888368
36296H88368J855597K010168J269113K3571j806765l120936k063909N93262J287306
$$ 888368 2743965 4754133 6023246 6046817 4240052 1119116 -944793 -351531 935775
36287I35775j058104k566721k70136K490373Q70054l387257m015245L19579M175308
$$ 935775 -122329 -2689050 -2959186 -468813 401241 -2986016 -7001261 -6681682 -2506374
36278b506374L558944P90487m38379k04740k04040l06208O5527J07462l98366
$$ -2506374 1052570 1843057 1404678 1199938 995898 689690 755217 862679 464313
36269D64313J6501J465942J390981j327552l723596k911489l17535J121933J450771
$$ 464313 480814 1946756 3337737 2010185 -1713411 -4624900 -4942435 -3820502 -2369731
36260b369731K099312K162745J79477k026377j404184J290660K404395Q60897
$$ -2369731 -270419 1892326 2071803 45426 -1358758 -68098 2336297 3197194
36252C197194r38107j401999j237974o52609J084525K709707J367003k790201
$$ 3197194 2259087 857088 -380886 -1033495 51030 2760737 4127740 1337539
36244A337539n632721m262968n12247K240091L125845K956503J865213R5392o84851
$$ 1337539 -4295182 -8558150 -9070397 -6830306 -3704461 -747958 1117255 1212647 527796
36235E27796O39634K339653J741558j030897l023894k113604N74587K053633O40010
$$ 527796 1167430 3507083 5248641 4217744 1193850 -919754 -345167 1708466 2348476
36226B348476k307593l733894k281046L9378N35857l47211J34190K290538K724713
$$ 2348476 40883 -3693011 -5974057 -5934679 -5398822 -5746033 -5611843 -3321305 -596592
36217e96592q15562n471027o408589k797237J590291L281806K497129J492986
$$ -596592 -1412154 -6883181 -13291770 -16089007 -14498716 -11216910 -8719781 -7226795
36209g226795J378113J490456J003849J07791m43121m37344l89576n61825m25399
$$ -7226795 -5848682 -4358226 -3354377 -3246586 -3689707 -4127051 -4516627 -5078452 -5503851
36200e503851L14507P27725k54082k024503k772382j703416L63217K407402L755727
$$ -5503851 -5189344 -4461619 -4715701 -6740204 -9512586 -11216002 -10852785 -8445383 -4689656
36191d689656L456722J113184j476743j732747P8071R40457l57900j423465m11170
$$ -4689656 -1232934 -119750 -1596493 -3329240 -3251169 -2310712 -2668612 -4092077 -4503247
36182d503247Q73498L40684n18023O69398K507481J717939j259578k572528r17762
$$ -4503247 -3629749 -3289065 -3807088 -3137690 -630209 1087730 -171848 -2744376 -3662138
36173c662138O82794J0936r90000J94197K549592L454052K719238J967512J079824
$$ -3662138 -2979344 -2968408 -3958408 -3764211 -1214619 2239433 4958671 6926183 8006007
36164H006007j671450n719414p197738l510094K571083N605878M091970K032741
$$ 8006007 6334557 615143 -6582595 -10092689 -7521606 -1915728 2176242 4208983
36156D208983K925973M548885K424004k848425n687166l479350l31852o76975
$$ 4208983 7134956 11683841 14107845 11259420 5572254 2092904 1761052 1084077
36148A084077k736353j994906J371866L141404J959859P60446J131220R80494
$$ 1084077 -1652276 -3647182 -2275316 866088 2825947 3586393 4717613 5698107
36140E698107q85405k101406q86981O29600M15j362306p38615J124159J191681
$$ 5698107 4812702 2711296 1824315 2453915 2454330 1092024 353409 1477568 2669249
36131B669249q88825k261682j214393O74312J210002L43645m58328k43871O28560
$$ 2669249 1780424 -481258 -1695651 -1021339 188663 532308 73980 -169891 458669
36122D58669R41530k30520k106796k315482M03867L900565M544236J609005j779686
$$ 458669 1400199 1169679 -937117 -3252599 -2848732 1051833 5596069 7205074 5425388
36113E425388k545163j016588M64005Q34878O73467K01349r76793k146555j640148
$$ 5425388 2880225 1863637 2327642 3162520 3835987 4037336 3060543 913988 -726160
36104g26160L97010J283005n31118k588576j598223J455937K477009N19031p30579
$$ -726160 -329150 953855 422737 -2165839 -3764062 -2308125 168884 687915 -42664
36095d2664J009907K798002J397969j116177o57712K021842K508806J5359j512053
$$ -42664 967243 3765245 5163214 4047037 3389325 5411167 7919973 7935332 6423279
36086F423279j81952P68979j388861m234073m004504j132675J019946R91665M3816
$$ 6423279 6241327 7010306 5621445 1387372 -2617132 -3749807 -2729861 -1738196 -1694380
36077a694380m60829j51839Q06417J422318L30332j896687k504083l90365J677801
$$ -1694380 -2155209 -2307048 -1500631 -78313 252019 -1644668 -4148751 -4539116 -2861315
36068b861315R10581j239914j343327R32170K940492L191638K343228Q22707j378180
$$ -2861315 -1950734 -3190648 -4533975 -3601805 -661313 2530325 4873553 5696260 4318080
36059D318080k848467j816698Q06960K237522J808447J362420J445779K78448
$$ 4318080 1469613 -347085 459875 2697397 4505844 5868264 7314043 7592491
36051G592491k528328m191728k431678J127741K998542J963771k21619j288612
$$ 7592491 5064163 872435 -1559243 -431502 2567040 4530811 4309192 3020580
36043C020580m93867J149651J972642J364089L67987k0751m16577j510994j896483
$$ 3020580 2526713 3676364 5649006 7013095 7381082 7360331 6943754 5432760 3536277
36034C536277K02441L382957M134082J815606m37275p41242j227861l850317o231697
$$ 3536277 3738718 7121675 11255757 13071363 12634088 11892846 10664985 6814668 582971
36025E82971m689884R8275L511499K749333k02882j608132k49574J877674K194353
$$ 582971 -4106913 -4008638 -497139 2252194 2049312 441180 191606 2069280 4263633
36016D263633L43403j483284j090685J012011K193390J018594j129371k153828
$$ 4263633 4607036 3123752 2033067 3045078 5238468 6257062 5127691 2973863
36008B973863j832398j547570k208251l156152k833113m81175K395054K924182
$$ 2973863 1141465 -406105 -2614356 -5770508 -8603621 -9084796 -6689742 -3765560
36000c765560L98719j968943q43992K402625L498489J581220O202K94884l37200
$$ -3765560 -3366841 -5335784 -6179776 -3777151 -278662 1302558 1308760 1603644 1266444
35991A266444l385320n293497k816269J218371J879659l95415j035262J202136
$$ 1266444 -2118876 -7412373 -10228642 -9010271 -7130612 -7526027 -8561289 -7359153
35983g359153K866940J796741p5873o35297l75014o8151R53859K600421K877344
$$ -7359153 -4492213 -2695472 -2771345 -3406642 -3781656 -3849807 -2895948 -295527 2581817
35974B581817P48068j878449k601794j439569p9073M06594J03827l03464K4494
$$ 2581817 3329885 1451436 -1150358 -2589927 -2669000 -2262406 -2158579 -2462043 -2437549
35965b437549J120891J523403l1757k246032k432641j82319K139956K718870J915596
$$ -2437549 -1316658 206745 174988 -2071044 -4503685 -4686004 -2546048 172822 2088418
35956B088418M31774j531842k831644j972952J8576K76141j291584j320583J503301
$$ 2088418 2520192 988350 -1843294 -3816246 -3797670 -3521529 -4813113 -6133696 -4630395
35947d630395L749644K444491l21471j073448l33616o09471j349028j78789K249955
$$ -4630395 -880751 1563740 1242269 168821 -164795 -774266 -2123294 -2302083 -52128
35938e2128K985319J684911P08502N58170p18525l287075m544599l172596q24906
$$ -52128 2933191 4618102 5326604 5884774 5166249 1879174 -2665425 -5838021 -6662927
35929f662927J003393K528875L305632J814020j248953k643813j290481j25670
$$ -6662927 -5659534 -3130659 174973 1988993 740040 -1903773 -3194254 -3319924
35921c319924j221700k207841l15035K686701K956626K46965k265049k790085
$$ -3319924 -4541624 -6749465 -7064500 -4377799 -1421173 -1174208 -3439257 -6229342
35913f229342k388506k064175j343778L6397J291343J818139J738110J219918
$$ -6229342 -8617848 -10682023 -12025801 -11989404 -10698061 -8879922 -7141812 -5921894
35905e921894N44868M36562J007170J107095K08618j84718R45620J471932j045551
$$ -5921894 -5377026 -4940464 -3933294 -2826199 -2617581 -2802299 -1856679 -384747 -1430298
35896a430298m538695m102679J013374N561689M820288J04271l860049m442495
$$ -1430298 -5968993 -10071672 -9058298 -3496609 1323679 1427950 -2432099 -6874594
35888f874594k055405J854931N064691M698808K89572m114248l849220N38780
$$ -6874594 -8929999 -7075068 -2010377 2688431 2978003 -1136245 -4985465 -4446685
35880d446685L929911L077517j45163k298194k495772j809322q15633L74224R60803
$$ -4446685 -516774 2560743 2415580 117386 -2378386 -4187708 -5003341 -4629117 -3668314
35871c668314K78370p61249o42249N41742J219460O78711l7887J18104P18179
$$ -3668314 -3389944 -4151193 -4793442 -4251700 -3032240 -2353529 -2391416 -2273312 -1555133
35862a555133P65138K01548l48620p26706j054569p49417Q56717K667258K195949
$$ -1555133 -789995 -588447 -937067 -1663773 -2718342 -3467759 -2611042 56216 2252165
35853B252165j043898l771857k541962J320640K821193n0283l278100k295872
$$ 2252165 1208267 -2563590 -5105552 -3784912 -963719 -1014002 -4292102 -6587974
35845f587974J499246K777847R4404k043013J4984L520981L328456n72196l091922
$$ -6587974 -5088728 -2310881 -2216477 -4259490 -4244506 -723525 2604931 2032735 -1059187
35836a059187j346441J562826J354196j492352k906013r66813K097623L466371
$$ -1059187 -2405628 -842802 511394 -980958 -3886971 -4853784 -2756161 710210
35828G10210K950868J950225R88153k75513j475489j583614n45201K91553j62162
$$ 710210 3661078 5611303 6599456 6323943 4848454 3264840 2719639 3011192 2849030
35819B849030j318681j704773q11724M39146J000764Q29400M17686k41264j458364
$$ 2849030 1530349 -174424 -986148 -547002 453762 1283162 1700848 1459584 1220
35810A220k727331k746554j021108J254527K548507K607175J932382M13714k073776
$$ 1220 -2726111 -5472665 -6493773 -5239246 -2690739 -83564 1848818 2262532 188756
35801A88756m051260l350447k04993K254595J691081m97130j190850M45551K398430
$$ 188756 -3862504 -7212951 -7417944 -5163349 -3472268 -3969398 -5160248 -4714697 -2316267
35792b316267K654533J218393m44762q19377N67764K455144K594207K04663k746303
$$ -2316267 338266 1556659 1111897 292520 860284 3315428 5909635 6114298 3367995
35783C367995l752378k642897j052433J12180R33970R78982j55160j040502K67464
$$ 3367995 -384383 -3027280 -4079713 -3967533 -3033563 -2054581 -2209741 -3250243 -2982779
35774b982779K841281L416003J053982j313071j215838j4619j75212j395578j746573
$$ -2982779 -141498 3274505 4328487 3015416 1799578 1784959 1609747 214169 -1532404
35765a532404j055274o25356n70126Q3483J063143R17407n27655j631671j157054
$$ -1532404 -2587678 -3213034 -3783160 -3699677 -2636534 -1719127 -2246782 -3878453 -5035507
35756e035507L20951J455140J575123R88078N48789Q38813J336975R02795n46954
$$ -5035507 -4714556 -3259416 -1684293 -696215 -147426 691387 2028362 2931157 2384203
35747B384203j795818k236868k584048k851191j544078J516465L496366K082812
$$ 2384203 588385 -1648483 -4232531 -7083722 -8627800 -7111335 -3614969 -1532157
35739a532157p93681j649880p26661j123520l089096l110496M21220M145151M186570
$$ -1532157 -2325838 -3975718 -4702379 -5825899 -8914995 -12025491 -11604271 -7459120 -3272550
35730c272550J169169j283875j274328K26322J742883K628655K384337N32522
$$ -3272550 -2103381 -3387256 -4661584 -4435262 -2692379 -63724 2320613 2853135
35722B853135k249097l821409k409105J025169K971366J121543k237236k477539
$$ 2853135 604038 -3217371 -5626476 -4601307 -1629941 -508398 -2745634 -5223173
35714e223173J113501L811617J948298j679026j988462Q64460K311714O30462
$$ -5223173 -4109672 -298055 1650243 -28783 -2017245 -1152785 1158929 1789391
35706A789391j346338j718911j815184k133205q92845J642119K139627p5712q93016
$$ 1789391 443053 -1275858 -3091042 -5224247 -6117092 -4474973 -2335346 -2411058 -3304074
35697c304074J786384L627000N77878l860957l544572P69378K826113O63981j149968
$$ -3304074 -1517690 2109310 2687188 -1173769 -4718341 -3948963 -1122850 -458869 -1608837
35688a608837N17887K797797K039303p68841k293353j591704j68776P05183P25849
$$ -1608837 -1090950 1706847 3746150 2977309 683956 -907748 -1076524 -371341 354508
35679C54508m7586r99997j137346m52151j73076r48148j739473j155832Q43153
$$ 354508 306922 -693075 -1830421 -2282572 -2455648 -3403796 -5143269 -6299101 -5455948
35670e455948K876048L196257J118116j731467k304646K53147K680561J430166
$$ -5455948 -2579900 616357 1734473 3006 -2301640 -2048493 632068 2062234
35662B062234k129569l153600j46538K771776J659587j936270l503317j479103
$$ 2062234 -67335 -3220935 -3367473 -595697 1063890 -872380 -4375697 -5854800
35654e854800J660192L135544K494794R08702l31936m95595K36565R03783P99400
$$ -5854800 -4194608 -1059064 1435730 2344432 2012496 1516901 1753466 2657249 3456649
35645C456649J38855p09613j932795l382194l727646j856247J105288K600441
$$ 3456649 3595504 2885891 953096 -2429098 -6156744 -8012991 -6907703 -4307262
35637d307262J787369O38788J212894K847096L188342J425143q97852k189718
$$ -4307262 -2519893 -1881105 -668211 2178885 5367227 6792370 5894518 3704800
35629C704800k412305j993387q05668P02276Q57413j043632k912121k219333M65494
$$ 3704800 1292495 -700892 -1506560 -804284 53129 -990503 -3902624 -6121957 -5656463
35620e656463K346211K284064J516816R34535L52812L43825J699038K872042J362051
$$ -5656463 -3310252 -1026188 490628 1425163 1777975 2121800 3820838 6692880 8054931
$$ [...]
##END NTUPLES=NMR SPECTRUM
##END=
