##TITLE=31Pdec_IBBPA2401X
 CDCl3, 64 sc
 25.1.2023
##JCAMPDX= 6.0         $$ Bruker NMR JCAMP-DX V2.0
##DATA TYPE= NMR SPECTRUM
##DATA CLASS= NTUPLES
##ORIGIN= UXNMR, Bruker Analytische Messtechnik GmbH
##OWNER= root
$$ XWIN-NMR		Version 3.5
$$ Wed Jan 25 14:29:32 2023 Russian Standard Time (UT+4h)  she@DPX200
##.OBSERVE FREQUENCY= 81.013821
##.OBSERVE NUCLEUS= ^31P
##.ACQUISITION MODE= SIMULTANEOUS
##.ACQUISITION SCHEME= undefined
##.AVERAGES= 64
##.DIGITISER RES= 16
##SPECTROMETER/DATA SYSTEM= spect
##.PULSE SEQUENCE= zgpg30
##.SOLVENT NAME= CDCl3
##.SHIFT REFERENCE= (INTERNAL, CDCl3, 0, 248.564)
##AUDIT TRAIL= $$ (NUMBER, WHEN, WHO, WHERE, WHAT)
$$ ##TITLE= Audit trail, XWIN-NMR		Version 3.5
$$ ##JCAMPDX= 5.01
$$ ##ORIGIN= Bruker BioSpin GmbH
$$ ##OWNER= she
$$ F:/spectra/data/she/nmr/P31/1/pdata/1/auditp.txt
$$ ##AUDIT TRAIL=  $$ (NUMBER, WHEN, WHO, WHERE, WHAT)
(   1,<2023-01-25 14:28:49.32 +0400>,<she>,<DPX200>,
      <continue with go, POWCHK disabled, PULCHK disabled
       configuration hash MD5:
       00 E9 B6 7A A2 85 ED C7 34 08 36 98 17 FE 4E 26
       data hash MD5: 32K
       38 FA D0 16 ED 12 4C 86 3A C3 83 FB 14 78 44 31>)
(   2,<2023-01-25 14:28:50.96 +0400>,<she>,<DPX200>,
      <Start of raw data processing
       efp BC_mod = 2 LB = 1 FT_mod = 6 PKNL = 1 PHC0 = -11022.56 PHC1 = 203.6578 SI = 64K 
       data hash MD5: 64K
       3D 2C 9C 8B E3 9B 6D 7B E2 45 0C 85 3E 99 4E 42>)
(   3,<2023-01-25 14:29:03.60 +0400>,<she>,<DPX200>,
      <pk PHC0 = -4.10202 PHC1 = 2.6 
       data hash MD5: 64K
       4A D7 21 C3 04 6B 33 BE 58 8C 38 24 CF 46 B8 49>)
(   4,<2023-01-25 14:29:09.07 +0400>,<she>,<DPX200>,
      <abs ABSG = 5 
       data hash MD5: 64K
       42 3A E5 96 D8 4A A5 F6 CA 83 68 5D 01 BE 93 7C>)
$$ ##END=
$$ 
$$ hash MD5
$$ 77 2C C6 58 CA 28 FC B3 FB DE A2 0A 92 F7 DC 00
##$RELAX= 
##$RELAX= 
##$RELAX= 
##$RELAX= 
##$RELAX= 
##$RELAX= 
##$RELAX= 
##$RELAX= 
##$RELAX= 
$$ Bruker specific parameters
$$ --------------------------
##$DU= <F:/spectra>
##$EXPNO= 1
##$NAME= <P31>
##$PROCNO= 1
##$TYPE= <nmr>
##$USER= <she>
##$AMP= (0..31)
100 100 100 100 100 100 100 100 100 100 100 100 100 100 100 100 100 100 
100 100 100 100 100 100 100 100 100 100 100 100 100 100 
##$AQSEQ= 0
##$AQ_mod= 1
##$AUNM= <au_zg>
##$AUTOPOS= <>
##$BF1= 81.014009
##$BF2= 200.13
##$BF3= 200.13
##$BF4= 200.13
##$BF5= 200.13
##$BF6= 200.13
##$BF7= 200.13
##$BF8= 200.13
##$BYTORDA= 1
##$CFDGTYP= 0
##$CFRGTYP= 5
##$CHEMSTR= <none>
##$CNST= (0..31)
1 1 145 1 1 1 1 1 1 1 1 1 1 1 1 1 1 1 1 1 1 1 1 1 1 1 1 1 1 1 1 1 
##$CPDPRG= <waltz16>
##$CPDPRG1= <>
##$CPDPRG2= <waltz16>
##$CPDPRG3= <>
##$CPDPRG4= <mlev>
##$CPDPRG5= <mlev>
##$CPDPRG6= <mlev>
##$CPDPRG7= <mlev>
##$CPDPRG8= <mlev>
##$CPDPRGB= <>
##$CPDPRGT= <>
##$D= (0..31)
0 1 0 0 0 0 0 0 0 0 0 0.03 2e-05 3e-06 0 0 0 0 0 0 0 0 0 0 0 0 0 0 0 0 
0 0 
##$DATE= 1674642452
##$DBL= (0..7)
120 120 120 11 120 120 24 19 
##$DBP= (0..7)
150 150 150 150 150 150 150 150 
##$DBP07= 0
##$DBPNAM0= <>
##$DBPNAM1= <>
$$ [...]
##$SUBNAM3= <"">
##$SUBNAM4= <"">
##$SUBNAM5= <"">
##$SUBNAM6= <"">
##$SUBNAM7= <"">
##$SUBNAM8= <"">
##$SUBNAM9= <"">
##$SW= 501.771253377433
##$SWIBOX= (0..15)
0 1 3 0 0 0 0 0 0 0 0 0 0 0 0 0 
##$SW_h= 40650.406504065
##$TD= 32768
##$TD0= 1
##$TE= 0
##$TE2= 300
##$TE3= 300
##$TEG= 300
##$TL= (0..7)
0 120 53 12 22 120 120 120 
##$TP= (0..7)
150 150 150 150 150 150 150 150 
##$TP07= 0
##$TPNAME0= <>
##$TPNAME1= <>
##$TPNAME2= <>
##$TPNAME3= <>
##$TPNAME4= <>
##$TPNAME5= <>
##$TPNAME6= <>
##$TPNAME7= <>
##$TPOAL= (0..7)
0.5 0.5 0.5 0.5 0.5 0.5 0.5 0.5 
##$TPOFFS= (0..7)
0 0 0 0 0 0 0 0 
##$TUNHIN= 0
##$TUNHOUT= 0
##$TUNXOUT= 0
##$USERA1= <user>
##$USERA2= <user>
##$USERA3= <user>
##$USERA4= <user>
##$USERA5= <user>
##$V9= 5
##$VALIST= <valist>
##$VCLIST= <CCCCCCCCCCCCCCC>
##$VD= 0
##$VDLIST= <DDDDDDDDDDDDDDD>
##$VPLIST= <PPPPPPPPPPPPPPP>
##$VTLIST= <TTTTTTTTTTTTTTT>
##$WBST= 1024
##$WBSW= 4
##$XGAIN= (0..3)
0 0 0 0 
##$XL= 0
##$YL= 0
##$YMAX_a= 3578
##$YMIN_a= -7502
##$ZGOPTNS= <>
##$ZL1= 120
##$ZL2= 120
##$ZL3= 120
##$ZL4= 120
##$ABSF1= 248.5645
##$ABSF2= -253.2056
##$ABSG= 5
##$ABSL= 3
##$ALPHA= 0
##$AQORDER= 0
##$ASSFAC= 0
##$ASSFACI= 0
##$ASSFACX= 0
##$ASSWID= 0
##$AUNMP= <proc_1d>
##$AZFE= 0.1
##$AZFW= 0.5
##$BCFW= 0
##$BC_mod= 2
##$BYTORDP= 0
##$COROFFS= 0
##$CY= -3
##$DATMOD= 1
##$DC= 0
##$DFILT= <>
##$DTYPP= 0
##$F1P= 0
##$F2P= 0
##$FCOR= 1
##$FTSIZE= 65536
##$FT_mod= 6
##$GAMMA= 0
##$GB= 0
##$INTBC= 1
##$INTSCL= 6.047779e-11
##$ISEN= 30
##$LB= 1
##$LEV0= 0
##$LPBIN= 0
##$MAXI= 10000
##$MC2= 0
##$MEAN= 0
##$ME_mod= 0
##$MI= 50
##$NCOEF= 0
##$NC_proc= -9
##$NLEV= 6
##$NOISF1= 182.463
##$NOISF2= 159.3651
##$NSP= 0
##$NTH_PI= 0
##$NZP= 0
##$OFFSET= 248.5645
##$PC= 4
##$PHC0= -11026.66
##$PHC1= 206.2578
##$PH_mod= 1
##$PKNL= yes
##$PPARMOD= 0
##$PSCAL= 0
##$PSIGN= 0
##$REVERSE= no
##$SF= 81.0140089999694
##$SI= 65536
##$SIGF1= 159.3651
##$SIGF2= -187.1042
##$SINO= 113.3802
##$SIOLD= 16384
##$SREGLST= <1H.CDCl3>
##$SSB= 0
##$STSI= 65536
##$STSR= 0
##$SW_p= 40650.406504065
##$SYMM= 0
##$S_DEV= 0
##$TDeff= 32768
##$TDoff= 0
##$TI= <>
##$TILT= no
##$TM1= 0
##$TM2= 0
##$TOPLEV= 0
##$USERP1= <user>
##$USERP2= <user>
##$USERP3= <user>
##$USERP4= <user>
##$USERP5= <user>
##$WDW= 1
##$XDIM= 65536
##$YMAX_p= 433977507
##$YMIN_p= -119006585
$$ End of Bruker specific parameters
$$ ---------------------------------
##NTUPLES= NMR SPECTRUM
##VAR_NAME=  FREQUENCY,     SPECTRUM/REAL,   SPECTRUM/IMAG
##SYMBOL=    X,             R,               I
##VAR_TYPE=  INDEPENDENT,   DEPENDENT,       DEPENDENT
##VAR_FORM=  AFFN,          ASDF,            ASDF
##VAR_DIM=   65536,         65536,           65536
##UNITS=     HZ,            ARBITRARY UNITS, ARBITRARY UNITS
##FACTOR=    0.620285442955139, 1,           1
##FIRST=     20137.2065510682, 0,            0
##LAST=      -20513.1999529968, 0,           0
##MIN=       -20513.1999529968, -119006585,  0
##MAX=       20137.2065510682, 433977507,    0
$$ Real data points
##PAGE= N=1
##DATA TABLE= (X++(R..R)), XYDATA
$$ [...]
41607 8566369 -5840972 -11318529 -2674005 11637778 20274865 19555932 14948440 15244011
41599 15244011 23727698 33490427 33752206 21512516 3785464 -11316630 -20221599 -20434094
41591 -20434094 -9733927 6987587 17330289 14669576 7290982 7183031 13195868 13906050
41583 13906050 6233103 1592828 10094605 26039008 35377809 33406581 27718758 24993613
41575 24993613 23119892 18705621 14714047 14919958 16420323 15235919 15133265 21167412
41567 21167412 26958717 20717391 4754233 -4501192 56094 6892781 6870566 7972136
41559 7972136 16926417 21323114 8474808 -9096407 -9540284 3202930 4981607 -9033216
41551 -9033216 -16779257 -6451325 4259586 -2588674 -18318264 -24749112 -20880797 -16665756
41543 -16665756 -14121564 -10422805 -8151320 -7657138 -704777 13253753 16834057 -1522842
41535 -1522842 -24581487 -27135289 -11138877 1199955 2480032 4713169 12136730 13883304
41527 13883304 5488106 -4083707 -10112243 -16762414 -20930689 -12431580 4419488 10370297
41519 10370297 51518 -8882182 -4727172 579830 -4489010 -8841319 1693197 17491085
41511 17491085 18027127 3058612 -7893261 -3051215 10546767 21428850 25468850 23209154
41503 23209154 15865233 5513352 -5831368 -15962692 -19435601 -11840599 -975839
41496 -975839 -3437222 -22213305 -37809231 -32223195 -12742010 236626 646023 -2451716
41488 -2451716 -4723634 -9845685 -14902179 -9531171 7388210 23113335 27183965 22861364
41480 22861364 19392878 20642160 24125912 25537081 22690352 18855334 20641318 28127887
41472 28127887 30965546 20825398 3506159 -9058452 -13993730 -15322356 -12022587 -869240
41464 -869240 11859860 15479450 11499473 12003540 20633882 28128613 28244543 24443055
41456 24443055 17863386 3447983 -15722457 -24150140 -13712130 2718637 8061603
41449 8061603 3626418 3782815 13285511 21704847 19341263 8777326 -1097327 -5405594
41441 -5405594 -4630329 -579163 4413154 5850857 -110672 -9571521 -10511382 3979948
41433 3979948 22824165 26300185 11908667 1527511 14638017 41823741 55891150
41426 55891150 44778515 21487143 3906323 -2243116 -116774 5949591 11461674 14036438
41418 14036438 16849995 22706771 25880995 19480844 9198483 7515014 14913230 20671338
41410 20671338 22215344 26924703 32379131 24442877 2539625 -12417409 -7359937 2766607
41402 2766607 -927029 -12405523 -14406849 -8864661 -11873085 -24799394 -32366996 -27971079
41394 -27971079 -20801820 -16453959 -9231088 2156969 8301868 5076233 1431681 3673420
41386 3673420 5003438 -275467 -4266738 814330 5737324 -3972220 -23131806 -28977816
41378 -28977816 -10541371 15791497 25887318 15353333 339685 -4662883 -1419435
41371 -1419435 -296273 -5557788 -12811673 -17483555 -20049660 -22587757 -24578532 -24331972
41363 -24331972 -22063340 -19286319 -16839102 -15511567 -16483076 -17846123 -12569777 4164475
41355 4164475 24155762 29203544 11174348 -14062259 -21071760 -4035220 16682779
41348 16682779 20307539 8931814 -1991011 -7303900 -13316381 -20089400 -18814624 -8335916
41340 -8335916 772008 3251104 6568535 15281635 21813151 20800040 18795309 19851369
41332 19851369 15962982 4434447 -437985 10250405 20341307 12357059 -1402389
41325 -1402389 3261992 22412838 30556407 22554367 17412283 20063887 13778870 -2075290
41317 -2075290 -1955504 22292249 39784216 25432289 -54489 -2724265 12335548 12876140
41309 12876140 -8099231 -23994192 -16429242 2228553 11997992 9893465 5111595 4338400
41301 4338400 8222449 13772652 16439948 14155963 8872247 2079169 -5439973 -7216594
41293 -7216594 4073527 19478566 16208150 -11346592 -37214457 -35511142 -13496358
41286 -13496358 4398976 12367804 20722143 27929959 22208068 7916015 4184838 15274944
41278 15274944 25236372 25358870 24946878 29410528 28566832 15194933 -1997552 -12491399
41270 -12491399 -16561226 -16754936 -11016172 -1461463 3517166 3144272 7402533 19303818
41262 19303818 27117227 22448654 13904409 13601889 20355299 24979001 23019634 14036537
41254 14036537 -2583489 -21986144 -31504603 -23214529 -4479280 10179550 13423402
41247 13423402 7650143 -498344 -3854292 1499711 12418252 22305187 28088918 28009558
41239 28009558 16636558 -6412450 -25651327 -23209596 -3772486 10240512 10182608 9232432
41231 9232432 14882884 15164133 2537488 -8910121 -5056693 6106822 10019505 8803630
41223 8803630 11926876 16505274 15393775 14183307 20784475 26689343 18455400 1369475
41215 1369475 -7915106 -6841241 -4929300 -1125091 14050632 34353303 38747440 20766173
41207 20766173 -2296237 -14471362 -17528134 -16762639 -8730175 7218429 19748010 18929581
41199 18929581 9221704 1041647 -1968178 -1421189 460033 -1356782 -11003535 -20354112
41191 -20354112 -13536484 9684568 27318013 21793413 2258411 -10628557 -11759287
41184 -11759287 -10759185 -13390371 -18492865 -26653310 -36422950 -36802816 -19803811 2388828
41176 2388828 9722653 2724563 706595 10287388 15619168 6277359 -4723477 -2728051
41168 -2728051 4959972 2893501 -7024795 -11425520 -9034141 -9599824 -12667073 -6382851
41160 -6382851 10823071 24028096 22289633 12107824 4676612 967095 -3938357 -10830165
41152 -10830165 -17060848 -19824723 -14319599 2548542 21823954 26336464 12430445 -1696217
41144 -1696217 1485085 16394642 24514427 19144068 8161825 -1613171 -9374223 -13276884
41136 -13276884 -12003272 -12358310 -22990165 -40034441 -49511223 -44442891 -30293330 -14450988
41128 -14450988 -926499 5362761 1398404 -5294337 -2285258 10847738 21244413 20197761
41120 20197761 11590616 1663738 -7733623 -13121601 -9343155 -195918 2691328 -2992478
41112 -2992478 -5438000 3285213 15725142 21746018 21151593 16583651 6030037 -8477351
41104 -8477351 -16174193 -12221603 -7006667 -10129246 -15499975 -14513745 -13242371 -20793369
41096 -20793369 -28895819 -21374885 -102288 16292605 18871984 17085312 19889556 23966639
41088 23966639 24612712 24612733 26502046 26743375 23303317 20091742 18503718 12628891 -1053349
41079 -1053349 -15354831 -19796735 -12784775 -2376875 2231089 -2201453 -10923960 -14651969
41071 -14651969 -8760705 -49845 109264 -9427688 -16939204 -12844753 -2767685 -779870
41063 -779870 -10936397 -20113429 -12133302 11469444 29004365 21508868 -4091410 -22342357
41055 -22342357 -20067432 -9553162 -7172274 -11226965 -10694640 -5129322 -1690115 145904
41047 145904 4602892 5323839 -6210679 -19374927 -12186788 15592057 36817494 32523828
41039 32523828 15456798 7273307 8718304 7417369 2278746 1886126 5815305 5349247
41031 5349247 83447 -1659311 1577807 1922433 -3921676 -9866330 -10419798 -5073776
41023 -5073776 7231803 26199886 41398596 38361263 18311408 748424 -76534 8009804
41015 8009804 8964236 818005 -5170181 -2136085 5567769 11230304 13122731 12764260
41007 12764260 11714398 10904561 10051133 8601037 9272427 16882833 29599973 36061454
40999 36061454 28193204 13554218 6180733 6906478 3607247 -7448886 -12433110 861185
40991 861185 23337285 34245235 26873697 14809559 12620258 18884806 21612768 14592819
40983 14592819 3049504 -5067811 -8434641 -11163998 -14775005 -15293714 -9497417 -399274
40975 -399274 7340368 14941605 26299976 37705219 38598787 25839447 10728053 6849847
40967 6849847 15545162 27883231 35737397 35174732 24417685 6807557 -7351070 -10478724
40959 -10478724 -7778848 -9858225 -16882207 -18658569 -9846174 3988665 15824506 23118425
40951 23118425 22788206 11003193 -6813887 -14397111 -847514 25025328 41614751
40944 41614751 34134091 6440132 -22188808 -31077503 -15231546 8805677 19256606
40937 19256606 12906116 6302282 11745079 21180782 19274474 4705957 -9325671 -11638923
40929 -11638923 -3529434 4861011 4070138 -6568428 -17579324 -18857682 -11152752 -3022581
40921 -3022581 3071438 12336226 23772910 27069586 19330065 12616610 15309132 17337454
40913 17337454 6956548 -6995285 -5717647 11541093 26290373 25977609 15350260
40906 15350260 3277906 -6014232 -6961990 5405432 21918015 23048837 5466539 -8103126
40898 -8103126 2309401 24885081 30454862 11127400 -11035451 -14606882 -3781844
40891 -3781844 3145540 -508807 -5529019 -2862388 6811835 18889683 30028660 34607448
40883 34607448 25482236 5492418 -8214664 -1080680 19871662 32919366 26936015
40876 26936015 11191671 -126383 -3310776 -2599017 -1712195 -2676917 -6023056 -8003017
40868 -8003017 -3854300 3467622 5319979 536672 -2731235 -1319101 -1638455 -4979748
40860 -4979748 -1761003 10781931 18690934 11605605 1135546 3651446 14391595 16179700
40852 16179700 7048507 390293 1479044 3003232 2848122 7288628 14797870 14546885
40844 14546885 4669236 -4168785 -7397712 -12625472 -21924034 -24282256 -13549936 348102
40836 348102 6846120 8698558 11733617 13171439 10421266 10014463 15877907 18340568
40828 18340568 7689729 -8932896 -17472231 -17749249 -19963022 -24074266 -18560991 -1246441
40820 -1246441 12742211 9941148 -3835326 -12156815 -8907906 -2974618 -3488963 -7509752
40812 -7509752 -5690516 3409839 10516977 8228778 1198891 -646692 4191609 7793576
40804 7793576 4182396 -4711040 -14574985 -23510181 -29143761 -26601838 -13310763 6421591
40796 6421591 23679562 30945217 26809931 17032929 9375531 5211188 -82568 -5652490
40788 -5652490 -2008926 12481970 20398033 5449425 -20326751 -28092985 -12040985 2544114
40780 2544114 -1875001 -8732209 4990854 30694852 39178362 22661965 3833458 2138508
40772 2138508 10453581 12358112 7684001 8911216 19723695 29813452 30426900 25433392
40764 25433392 23658423 26495014 28514930 27246663 25752076 25248175 21511212 11755202
40756 11755202 594738 -4822007 -2712169 3289271 8319823 7453771 -2264139 -16004947
40748 -16004947 -22098167 -14737006 -1678326 6347890 8622094 10109211 10639723 7861453
40740 7861453 5557928 8263768 11924405 10781282 8706919 11647319 14422733 9699229
40732 9699229 4770765 11654358 24081943 24718108 14165598 10276501 16569656 15630086
40724 15630086 441337 -11862181 -8131777 1295774 4167505 5932860 12173867 11967183
40716 11967183 -1764280 -12918060 -5372811 8433393 5635247 -10556351 -16811847
40709 -16811847 -6075997 5904754 8451547 8103031 11253838 13880717 12794238 12069201
40701 12069201 13760693 13782175 10575245 8824509 12353171 20280925 30156844 38662528
40693 38662528 41375950 38414674 37033608 41966761 47520218 45976647 38403821 30190589
40685 30190589 22389461 14688558 9547200 6671729 2798936 2864195 16985297 37652307
40677 37652307 39119274 14964027 -3835610 9501532 36635289 43284333 33299102
40670 33299102 37620703 58156197 63404774 41343585 17064184 8964420 4361456 -6898246
40662 -6898246 -9173314 7752960 23381760 17495342 3741861 5664192 16680423 12444979
40654 12444979 -7428045 -18113291 -7184531 10202600 15798571 10005706 4920020
40647 4920020 7941723 16901819 24895603 27510330 27412084 29793920 32626075 28207147
40639 28207147 16924769 10274035 14746257 21487084 18785583 7196141 -4405777 -10520185
40631 -10520185 -10525162 -5769334 -896906 -827459 -2187579 3321086 13712187 17202272 12746077
40622 12746077 14694697 28164298 36123884 24851925 8029725 8004675 23221704 32772001
40614 32772001 26939713 15478814 9248996 9967001 16332851 25957282 32161277 30586512
40606 30586512 26736685 26757189 26134249 19687905 15877717 25370894 40640285 44797013
40598 44797013 37669325 34054564 37001699 33525408 19796763 9947380 12476789 16145121
40590 16145121 9747881 938676 2919391 13300804 19208455 16941549 14876869 19466056
40582 19466056 27066115 29660346 24389534 17239352 17277995 25382837 31561091 28139841
40574 28139841 20712298 17534754 14051502 1863347 -10997092 -7665966 8827795 15489768
40566 15489768 4223348 -4425695 6434157 24240273 29656801 27226726 32389900 41287606
40558 41287606 37836061 23547185 15692551 18172923 17628368 9392637 4725691 8267395
40550 8267395 9847410 5608387 7026196 19205305 28726685 25366622 19519693 23718797
40542 23718797 31285286 30014789 25119988 29220799 37261891 32014001 12156826 -3970111
40534 -3970111 -3666619 7244085 18924359 29632196 38965083 42218105 37705344 30533600
40526 30533600 25067084 22054441 24772027 36700382 50127375 50172949 36627661 29570128
40518 29570128 43669435 66212199 71678270 52634409 26290808 13473879 18975333
40511 18975333 30965332 34196890 24560309 12279875 8246472 9609633 7238749 4867160
40503 4867160 15505501 36313204 45730345 34811127 23301589 30510362 47199365
40496 47199365 55104007 58805691 73159124 89259475 82405882 52381759 27732891
40489 27732891 25785802 33743799 36877493 41166943 55258825 69950750 71845213 64203826
40481 64203826 59396629 59750548 58283648 51447042 41244177 30793979 24900364 27857198
40473 27857198 35052753 35789474 29980670 30904923 44219859 56535361 54710083 44941487
40465 44941487 40780335 42419022 41651208 39520849 44220761 55772037 65818142 69725985
40457 69725985 67925662 59156803 44381702 34834453 43707824 69197635 95235173 109942712
40449 109942712 116294240 124549390 140282277 160080100 175694957 184359977 196121046
40442 196121046 223683153 260658036 279069279 257420238 205357591 152458173 118677014
40435 118677014 104064592 100135073 99255635 95811066 88440132 80887115 75772279 71248389
40427 71248389 67110308 66461325 67206636 62638022 55460747 56325846 60705554 47459365
40419 47459365 15719457 1111711 29356076 70763225 74186540 37542839 8541298
40412 8541298 16378821 39945784 51131899 53397742 60367354 65971508 59107450 47978031
40404 47978031 47076043 52917576 52246131 44825381 41187293 44828297 50465509 53947619
40396 53947619 53543579 48820454 46796194 59160950 83885078 100700658 95767981 79893019
40388 79893019 71063155 71127404 73070349 78405089 89735315 95952194 84433513 62396697
40380 62396697 48098310 45148856 43050772 39189473 41248196 49213334 54025534 55201067
40372 55201067 61660129 72376436 74226522 64430947 58360983 67006208 80827526 85285353
40364 85285353 80664400 76471085 75702844 75369266 75768836 78643824 80067035 74316701
40356 74316701 62867783 52638006 47114942 45062445 46141809 51901695 61780525 72725605
40348 72725605 82352860 88924794 89622602 83941541 79296113 87958684 114293367 146496489
40340 146496489 165550824 164971919 159934266 173180226 211188501 256926026 286479058
40333 286479058 288798856 268062205 233880172 196295185 166524366 152578227 151640084
40326 151640084 152788306 150113424 148898685 156158160 168750021 174648927 164947811 142334554
40318 142334554 117877688 100372993 89072929 77319825 62802792 51242153 48207313
40311 48207313 50775948 51457677 48207475 45264314 44715552 43163666 38435656 34556135
40303 34556135 36216121 40538650 38477057 25675580 10429577 8117278 25702221 53306101
40295 53306101 74802516 85632945 93744202 102213065 100880730 82078157 56437666
40288 56437666 41821584 40440090 39045223 30745219 23577824 24733187 28639364 27319445
40280 27319445 23490533 25506967 35164251 47465223 57818222 63101222 59936261 48856091
40272 48856091 37418471 33128405 35555079 40331672 46970230 55837482 60865410 54552308
40264 54552308 40166429 30718141 34046504 45278856 55141370 58650563 53799710 40272092
40256 40272092 24837849 20945137 34731052 54709632 63117450 56125956 45599897
40249 45599897 41679580 42372893 42416525 43353933 48502281 53951057 52670430 44962651 37262777
40240 37262777 31853071 25960875 21718075 28053340 48201748 71763477 84995012 85174760
40232 85174760 79767040 75041135 71555007 68562757 66076583 62171193 53323184 39076072
40224 39076072 24240772 16242567 20447906 34647814 46585590 43090934 26638353
40217 26638353 16232974 23671636 35417876 30612908 12970028 7764541 25333788
40210 25333788 45548823 46647415 33702032 25775883 27323057 28607696 26666991 27892667
40202 27892667 32403335 32874369 29826564 32509512 41272068 43550664 33198348 21016835
40194 21016835 18491661 22287247 23997799 25080323 30127284 32646804 21997240 2419132
40186 2419132 -8484888 -2683962 7463117 5974308 -6684657 -16129868 -12502729 -683547
40178 -683547 7091887 4921243 -1899618 -4754409 -2272755 -197933 -842056 2049177
40170 2049177 13845879 28568802 34700298 30237802 24844422 26223520 31355152 33965437
40162 33965437 34257272 36324710 40229101 42291219 41186995 38794133 36003205 32079483
40154 32079483 27595016 23479662 17060806 4394100 -10924743 -15998217 -1534580 24144419
40146 24144419 39879671 33536629 15731500 7570701 16639191 30866157 36701069 36546245
40138 36546245 43023699 59484355 73171239 69447176 49481512 30873919 29582872
40131 29582872 41505304 45506675 28876441 6266725 3791874 24195165 41156260
40124 41156260 34214670 14836808 5284152 5371684 449911 -6781569 639371 19448266
40116 19448266 23421102 3781742 -13751832 -6874162 11587667 18911379 18204118 23716660
40108 23716660 27281564 10846628 -15650120 -22070922 -4218800 8727405 -923053
40101 -923053 -15842366 -16242387 -9390113 -9215084 -8094543 8437625 32288845 41451866
40093 41451866 32414893 23639255 27477811 35437897 34043513 22603459 10510695 4902461
40085 4902461 5430401 6876197 3748881 -5719512 -17853289 -25136193 -20410095 -3329076
40077 -3329076 14894112 18971513 8570995 3619878 18989421 39209014 35766929 8479268
40069 8479268 -11783091 -6849888 4649603 -1384780 -19744459 -29607039 -26268843 -19007276
40061 -19007276 -9961482 3087912 11583266 5564307 -7401680 -12688645 -12376900 -17713811
40053 -17713811 -23492716 -14359097 5219939 13137911 4396844 -1515177 5836592 11272147
40045 11272147 1400239 -12867493 -14690668 -5282215 3838163 8473090 9151153 3792364
40037 3792364 -4657286 -4942604 5883892 13103668 3540992 -15447013 -27318303 -27006933
40029 -27006933 -19397788 -7815828 3452937 5141877 -4578599 -11863197 -4984914 7413713
40021 7413713 9743694 3353600 1617320 7690564 13698657 17537821 23628633 29580589
40013 29580589 28621600 24013562 24903087 28245393 21392006 4035207 -8617336 -7586490
40005 -7586490 216926 7709076 17163575 27809607 29143527 16561043 2387774 797777
39997 797777 9578611 16142505 15081007 10607914 6536279 3137762 1898135 5719373
39989 5719373 14036938 22072607 25493676 24382185 23169837 26235066 31624286 31126839
39981 31126839 20752832 8656736 5909127 10735637 10155570 -2305202 -18689414 -27424065
39973 -27424065 -24137110 -11113779 4781546 12441672 5386660 -6968414 -7884201 3400025
39965 3400025 9407976 962296 -8134905 -2984562 8557650 8024546 -6282326 -19346585
39957 -19346585 -22020715 -18697606 -14466832 -8680577 -2229470 186707 -3105886 -9881714
39949 -9881714 -19322978 -29503135 -31879614 -20004055 -3240539 1418058 -6385546 -7328248
39941 -7328248 11401467 38763676 55591062 56957257 50072302 39202135 24485366
39934 24485366 10773564 5605059 8716568 12343002 12544252 13307884 18353140 24585324
39926 24585324 25588671 18244019 5286513 -5755940 -6566964 5005731 21000113 29261720
39918 29261720 24882247 14801547 10726477 17609093 27965951 27725663 10863580 -10849159
39910 -10849159 -17340501 -2432101 18273229 26049955 20142424 13458015 12767669 13949335
39902 13949335 14279657 16290762 17950172 12455810 2747137 3106125 17869210 30516161
39894 30516161 25769324 12543588 10100728 19129470 24953709 25590436 34718805 53635193
39886 53635193 62241675 48629468 29873370 28517080 41606223 50364127 51464675 58965662
39878 58965662 78195402 96633305 103077717 100703133 96984788 93113541 88048545 82520766
39870 82520766 74543411 60396384 43651119 33052968 27743732 16500058 -2498097
39863 -2498097 -14090045 -7773500 5006640 8030879 4936673 10481470 23167653 25367335
39855 25367335 11093372 -3868458 -4853881 2927001 6669135 5954625 9712049 19155619
39847 19155619 24456589 17885297 3658742 -6072511 -2197509 13431367 29002448 33612762
39839 33612762 28799297 26121023 31292682 35650074 28333803 13010634 4734147 10386064
39831 10386064 19855773 19743197 9783495 7845 -4650225 -8689107 -14462788 -15223418
39823 -15223418 -6017626 4393132 2678811 -8890533 -12464831 1454713 20139672
39816 20139672 25929628 18988034 12690934 12868429 14809416 17485457 24931747 31968869
39808 31968869 24814967 2834467 -14133193 -10440586 4033927 9037344 1962433 -3046783
39800 -3046783 1439970 8774361 13088672 16985401 21969399 23314106 18598733 11825878
39792 11825878 5261944 -3820991 -14192702 -17530792 -9797551 2088820 10909526 18936795
39784 18936795 29839642 37491284 32141303 14500814 -4304671 -14857844 -15049713 -6313469
39776 -6313469 7904183 20365335 23497675 16164274 4144140 -5028708 -5670213 3189711
39768 3189711 14069051 15189651 4896309 -2834506 4631415 20555005 27553295 20514162
39760 20514162 9021464 -273231 -9144230 -15544613 -12145715 -1596548 2064868 -5507804
39752 -5507804 -10599229 -3199113 6682658 6335195 1213699 3370661 9374024 7709747
39744 7709747 1591843 4828175 16910949 21166522 9708021 -6213727 -14169891 -14088304
39736 -14088304 -9944882 -2275494 5827975 8577237 9047585 17969078 35004494 44948722
39728 44948722 40154027 32389472 32147192 30406711 15077356 -6065093 -15324121 -9918081
39720 -9918081 -525665 8509756 20040258 29379923 27275793 16983345 11109069 10786739
39712 10786739 5418133 -4682594 -4069138 13369434 32931694 40500870 39525585 36462486
39704 36462486 25285229 1479195 -20811023 -23501067 -9885569 1178526 2297016
39697 2297016 2865800 9357424 16095409 17064741 13627814 8269411 2014099 -628390
39689 -628390 4109758 8862656 2072729 -12212574 -15905893 -2992276 11006229 12957425
39681 12957425 9613956 10051523 6578231 -9709939 -26307858 -23175177 -3083919 12741407
39673 12741407 16241918 18165433 22370492 18379057 5132478 -1268568 5124801 5928006
39665 5928006 -12539159 -33194859 -30689127 -7912031 10486265 13001490 8896827 5967225
39657 5967225 2561554 1310163 9613994 22366170 22428925 4925059 -13631652 -17037303
39649 -17037303 -7478080 4038946 12665999 18007093 18780743 17004583 18375109 22164543
39641 22164543 19754863 8423588 -3423652 -9599463 -13138832 -14852524 -8999719 1878633
39633 1878633 3152166 -9666125 -19744550 -13918412 -4343375 -7740035 -16219108 -10560061
39625 -10560061 6899719 17159635 17250578 21808800 31855331 28973541 7784428 -9542288
39617 -9542288 -3522448 15825134 25490409 18699214 4541521 -9747265 -21521755 -25254034
39609 -25254034 -16483939 -843362 10450367 12491931 8268783 2187719 -2150257 -1696624
39601 -1696624 2798076 6491871 7479538 9845913 15923282 20747958 18819340 11700510
39593 11700510 4863598 1826289 4441516 12171990 16977800 7258636 -16170865 -35361285
39585 -35361285 -35172290 -22353954 -15284804 -19057122 -21957621 -15708343 -7893668 -10571998
39577 -10571998 -23961195 -36617801 -38345155 -28445717 -12468856 4360304 17882604
39570 17882604 22625881 15786665 5295040 5882899 20531610 32527649 25844822 8177761
39562 8177761 700400 8068550 14649562 10649924 3506438 -1213354 -10645896 -26704756
39554 -26704756 -35954545 -31598350 -28895880 -40271280 -49119724 -31703038 3211078 22295474
39546 22295474 13775137 651532 3525424 13461119 12644708 3646468 2619686 13830953
39538 13830953 26110230 30626058 30260603 31769142 37062110 43737038 49465829 54247604
39530 54247604 60220874 69588870 81596444 91273943 91445659 76914973 48875155 16216387
39522 16216387 -9335642 -20604340 -16964017 -1718725 17168527 26092417 16234625
39515 16234625 -2332349 -8269299 3369188 12929901 5013615 -6813038 669242 25140007
39507 25140007 41763529 37934653 25416600 16661311 8528625 -3715569 -12705269 -10332378
39499 -10332378 -2187553 621103 -1775765 808753 12785574 25121133 24370299 7439496
39491 7439496 -12891583 -18934043 -6531592 11007878 20803417 25703418 34227041 42702656
39483 42702656 40650428 30121345 24293797 26973091 28718116 25081098 23100345 25899319
39475 25899319 26529216 22897949 23201012 28670171 26516028 10798027 -4011319 -3662889
39467 -3662889 3920222 2730169 -5169857 -5256188 3725970 8583777 5312788 5853993 16835204
39458 16835204 26206306 19642323 1423911 -10623270 -7845772 -17701 -155677 -6016573
39450 -6016573 -3588438 11109630 22830104 17038718 2274808 -292576 12477473 21353236
39442 21353236 14371363 4224233 6988955 18264064 24103550 24248511 27530955 31110237
39434 31110237 23065207 4541231 -8011969 -5786175 1767665 4556777 7144165 17426018
39426 17426018 28852664 25781469 5124548 -16460494 -20083845 -4819690 13488689
39419 13488689 21472656 20697710 19541089 19268804 15055972 7465867 3656679 6608409
39411 6608409 11426426 14050960 15773088 17326858 17349296 19490321 31224271 50643817
39403 50643817 63389326 58652267 40923240 21569576 7367671 1247465 3448385
39396 3448385 6519572 1092751 -7301286 -1366720 20129039 34938198 30361238 25150897
39388 25150897 39347988 59004168 56587226 35233550 23395943 30121755 35629988
39381 35629988 27540269 17264406 13891620 8879449 -2240149 -6664216 2867713 11435709
39373 11435709 3771914 -12381438 -19813452 -16180854 -10404824 -5894663 -2148049 -4052749
39365 -4052749 -14606725 -24335427 -21180799 -6727436 7889007 16959169 20812695 17311286
39357 17311286 4610725 -10699580 -18524132 -16639542 -10090608 -3132131 1296963 -507413
39349 -507413 -7541175 -11921862 -10248113 -10591938 -18896693 -26136659 -21403713 -10973188
39341 -10973188 -8972211 -13345799 -8761437 6787285 16438635 9819404 -2299533 -6023689
39333 -6023689 -3053044 -1842900 -1694130 2456343 7241149 5275764 -1910952 -6585961
39325 -6585961 -7899324 -11477103 -17045385 -17648200 -12719762 -11285990 -17994230 -25247021
39317 -25247021 -25370387 -22393416 -23024662 -22422422 -11115848 6025855 11492494 -517145
39309 -517145 -13332916 -9233874 7118348 16983080 13803967 8939420 12134127 18497324
39301 18497324 18893247 14036147 11331542 12442191 10930425 1649244 -11773105 -19831843
39293 -19831843 -16429697 -5182138 3600954 2706283 -5862986 -14838315 -19375832 -19290089
39285 -19290089 -16873889 -15598056 -17994446 -21258866 -18439195 -8323290 260987 25553
39277 25553 -3755283 -2153906 1892875 -1945463 -13831700 -23446164 -27098722 -31128327
39269 -31128327 -35578031 -29656258 -11058485 2963501 -5013728 -29520660 -48204450
39262 -48204450 -46191614 -27530227 -7609565 -694832 -9924755 -23702080 -26481976 -16798308
39254 -16798308 -7863239 -7559326 -8855056 -5733661 -4995279 -11517027 -15081487 -7481468
39246 -7481468 -1791360 -14480112 -34471383 -32871926 -4261355 23129170 24158941 5315702
39238 5315702 -11888390 -19675966 -23754860 -25975575 -21865957 -11103584 341387 6867080
39230 6867080 5888212 -2429118 -12145151 -12898498 -1463978 11630380 14335298 8798533
39222 8798533 6837077 12120582 16702617 15771988 15358745 20518003 24142122 15667140
39214 15667140 -3249340 -20356759 -28807433 -32512957 -33903942 -26138069 -4626339 20076522
39206 20076522 31188009 26307086 19547095 21398948 25551832 20799300 8972954 2935460
39198 2935460 8917086 17970970 16567023 2148188 -14104405 -19630741 -14117501 -8410558
39190 -8410558 -9498307 -11623829 -6739777 1585823 3573706 -499025 -896495 4880260
39182 4880260 8784267 8024025 10291588 17779890 20371933 13651310 9753162 17819011
39174 17819011 26062243 19196509 4369216 1607808 13735983 24031541 21905629 13861331
39166 13861331 8687920 7215262 7997995 9421472 5699850 -5565078 -12664006 -2614254
39158 -2614254 15284249 17367828 85578 -13319234 -7240959 5281529 6928687 2539425
39150 2539425 5330724 11624178 8467222 -2516051 -7788077 -3989956 -268293 -241979
39142 -241979 2285005 8141166 7667998 -4087131 -17251628 -18885050 -9451855 -1799090
39134 -1799090 -5536582 -16289912 -21188617 -13612368 -247749 7621115 6665634 1502564
39126 1502564 -4260727 -9481708 -9968850 -1696303 9408581 11399947 2927810 -4514777
39118 -4514777 -4485871 -3961355 -8430672 -11627432 -8811847 -7786553 -14874310 -20688274 -14061209
39109 -14061209 -1946597 75546 -8244528 -13082522 -8818424 -3649841 -3464959 -4396007
39101 -4396007 -2871381 -697668 2097592 8933351 18912189 26052233 27433996 24674041
39093 24674041 18505750 10455156 7423852 14078681 23058816 24581114 22870786 28310969
39085 28310969 35466011 28090309 8463079 660141 15780945 33026075 28994266 10282394
39077 10282394 274275 4999751 10780683 8860074 2971238 -5323130 -19813665 -35579701
39069 -35579701 -38586112 -25995056 -13548010 -13801745 -17660629 -9239091 7942144 14317355
39061 14317355 3144965 -8841783 -5785684 4521720 4350793 -4687181 -2668532 17860894
39053 17860894 38921518 41948103 30914898 19081366 5676210 -16711504 -39458728
39046 -39458728 -44026986 -30457169 -19780305 -23745569 -30290247 -26500265 -19023947 -20067045
39038 -20067045 -26423706 -26392064 -19030110 -13132253 -11994237 -10642581 -5481407 1755472
39030 1755472 6917600 4536965 -8941830 -27543488 -38288859 -37411901 -35398767 -38722149
39022 -38722149 -38135062 -26723150 -17662732 -26496165 -43452262 -43685088 -22475673 -214586
39014 -214586 8427815 10430586 15356687 19500387 17432123 13462099 11475324 6361996
39006 6361996 -4097761 -10772174 -8060971 -6124665 -14388570 -21915230 -11196142 12824367
38998 12824367 25485089 15563390 -312640 -2106770 7948294 13551324 9209412 4761393
38990 4761393 7986170 14369455 16646108 15794045 16895149 19184395 17073812 9277323
38982 9277323 494599 -6085544 -12036256 -18235268 -21996307 -22216431 -22144448 -23744000 -24203286
38973 -24203286 -21808343 -20288651 -22612810 -25001770 -22288988 -15218570 -7747195 -2069888
38965 -2069888 -1227433 -9694142 -24046140 -30530108 -22039534 -10749847 -11532119 -18869862
38957 -18869862 -15532317 -199947 11221627 10876333 6751328 3528220 -4211177 -14303100
38949 -14303100 -13211392 340799 7436263 -2093113 -11052768 -2437101 10687499 5103878
38941 5103878 -14084137 -20647502 -8597676 27155 -8051206 -16962530 -8479572 9386827
38933 9386827 15753198 8041475 3533974 12665864 24884449 25137023 15383288 11063304
38925 11063304 18108536 23555448 15142130 2857719 8097957 31983510 49470777 41240746
38917 41240746 18152861 3402318 1556324 -32208 -6278685 -8165810 -463361 9510937
38909 9510937 13510160 11495433 6484509 -325957 -6530038 -8222896 -5007082 418870
38901 418870 7696329 17748706 27422018 31939315 31109210 26400854 15431297 -1657023
38893 -1657023 -14338401 -12131654 -822122 4412861 991819 191789 6329275 10314834
38885 10314834 7075058 3551124 3193979 -2367140 -16686532 -26207894 -16827891 4904118
38877 4904118 18240578 11804366 -6962405 -21920196 -21990687 -9333978 1332351 -3510547
38869 -3510547 -19349769 -26910757 -15953738 2453134 12834515 15024286 17941378 21431563
38861 21431563 17086731 5267099 -710246 8621416 24577433 28854381 15680644 501576
38853 501576 2146453 18308160 27298779 17099460 2030816 1755238 13842593 21411747
38845 21411747 20453205 21125340 25294151 23171101 13246120 5863058 4219316 1383306
38837 1383306 -826148 7922908 22288961 21985729 5680272 -1967123 9426918 15959459
38829 15959459 -571390 -18828397 -10994500 11285060 15239653 -3090847 -19269549
38822 -19269549 -21479082 -19159137 -15742994 -4463387 8985494 8880559 -3199050 -10088439
38814 -10088439 -10320023 -20335364 -40614928 -47174991 -26545997 4290725 23534245
38807 23534245 29384970 29037649 23301749 14582625 12323440 17271938 15435511 294788
38799 294788 -12909411 -8108961 8367434 18616310 17606490 14183003 14354866 14555454
38791 14555454 8350199 -6019773 -21670661 -26536852 -18044333 -11422604 -20203387 -31140215
38783 -31140215 -18230699 16412078 38877973 28800081 5598947 -3481409 210222
38776 210222 292379 -3540474 -1206501 3004472 -4179617 -19407293 -23741847 -9707209
38768 -9707209 8569972 14139426 5444812 -5168509 -4720481 6823440 13099319 -1399750
38760 -1399750 -27220910 -35604638 -15727559 8484549 11016620 -1819053 -7080806 -2253495
38752 -2253495 -3665486 -14679113 -19892915 -11392353 422498 6072907 9380628 15145615
38744 15145615 19238992 17919749 16030782 19268829 25929186 31072467 32716741 30613820
38736 30613820 24496526 16635825 12153835 14186369 19994034 22199380 14837598 1714010
38728 1714010 -2728667 11334662 33108670 41320772 31450590 18250456 8397132 -8563438
38720 -8563438 -32387268 -39239488 -16335506 10938317 12689033 -441474 3280660 22919168
38712 22919168 26346285 3713607 -16570847 -12236741 4345023 13809850 18137665 25802799
38704 25802799 31330362 27301763 20210131 18351563 16689095 7129073 -7152831 -18327545
38696 -18327545 -24096772 -23184034 -13085773 245599 4352029 -871775 -1773607 4648907
38688 4648907 4067124 -7765521 -12881538 -1375547 7939498 -2781970 -19680502 -20266865
38680 -20266865 -10514213 -11031997 -18974651 -15021566 -1373039 -90345 -14121978 -21623034
38672 -21623034 -13643692 -7436385 -13046990 -14843126 -950013 12855816 7318767 -10093766
38664 -10093766 -18397519 -12946428 -2958390 9679514 27851730 41651183 35472194 13167621
38656 13167621 -2755542 -1270342 3668849 -3605437 -17477828 -21776723 -14108805 -6708652
38648 -6708652 -6752794 -8385549 -5598937 -2291686 -4147638 -7965699 -6717289 -1330515
38640 -1330515 815874 -1922433 -3004959 1265865 6079362 6912515 7041577 10882812
38632 10882812 15153470 13276844 5536794 -1296050 -2537349 1510027 9156599 18154070
38624 18154070 24155209 23527317 17004276 7091606 -5039283 -15401249 -15062452 -902352
38616 -902352 14647657 15469821 3132012 -4600943 1855095 12647738 15531063 12147598
38608 12147598 9693119 6744640 -1600902 -11054798 -12567690 -6618864 -2270651 -2792810
38600 -2792810 -2250102 2635622 6353442 3311484 -4073602 -9238010 -8651528 -2902647
38592 -2902647 5016938 10425853 9458477 2288578 -8395479 -20595305 -30656939 -31448035
38584 -31448035 -21345563 -12671228 -19232018 -34888454 -38722641 -25502736 -14614479
38577 -14614479 -19532393 -25712894 -15309027 579223 -2611817 -23250266 -35434636
38570 -35434636 -29071087 -20829612 -20379016 -13394402 9170918 29256917 27652757 13081153
38562 13081153 5052602 3295366 -2853922 -7293404 3565154 20687443 19711448 -1054831
38554 -1054831 -15638567 -8145905 7678603 13938985 11765000 8186951 -437016 -16728066
38546 -16728066 -28370170 -22280631 -4501783 7126729 3913273 -9875194 -26143407
38539 -26143407 -35291756 -27518022 -4562485 14941412 13696300 -4163485 -21018825
38532 -21018825 -28742601 -32168572 -33979065 -30270905 -21141646 -13034257 -8208365 -2372305
38524 -2372305 4398358 4692735 -3046330 -6946977 4504548 25097491 35549675 25940253
38516 25940253 7315396 -2270496 1070540 6146149 5456967 4822555 9205632 9396101
38508 9396101 -4239142 -20511713 -17676637 3887375 17671029 6714469 -13842040
38501 -13842040 -21275516 -16548993 -14568847 -15503911 -7020518 10271965 21100435 19735473
38493 19735473 16886293 18789635 16817160 5053243 -6261726 -4648027 7230449 17508172
38485 17508172 21126015 21060988 19225147 15308771 11818052 12138929 14339014 13323296
38477 13323296 9290576 8317997 12701209 15169985 6801538 -10472753 -23607413 -22748747
38469 -22748747 -12861875 -7139728 -10446903 -15049267 -13248839 -7371426 -3667108 -2281157
38461 -2281157 729231 4646437 3547689 -5642962 -17888960 -23214614 -15328251 808756
38453 808756 11512471 9191365 2724352 5692118 16380986 20537145 13229818 3488063
38445 3488063 -4100678 -14021944 -21182155 -10211814 14517308 21737204 -3588045 -30599401
38437 -30599401 -22512630 9992249 26520234 16699809 6674223 10540808 13403180 6899925
38429 6899925 5272465 15315976 22472350 20137196 22739868 34322009 34146218 13379890
38421 13379890 -2354908 8298916 26280975 23361351 8679903 11524628 32194462
38414 32194462 44245205 38066903 29089870 24936430 15987731 1496864 -3433529 5952246
38406 5952246 14393546 11217689 4706115 3865978 3877290 -1328858 -7441387 -9833821 -12250272
38397 -12250272 -17082008 -18625680 -13993008 -10074136 -11713917 -12640307 -6336006 2508832
38389 2508832 6002766 5956430 9980705 18204847 21404323 12333417 -4445134 -14993181
38381 -14993181 -9914288 2918788 4670409 -10471249 -24391581 -17625358 3374767
38374 3374767 15246211 10242452 2932859 4317649 7652395 5047406 907113 127971
38366 127971 -2454594 -10465618 -16267258 -13993060 -11358962 -16168213 -20287334 -10818354
38358 -10818354 8984463 23491062 25729110 22396979 20175944 18594596 16086774 13453655
38350 13453655 10965319 9321060 12253269 20850833 27477555 23976251 14469631 10689742
38342 10689742 14985106 17766977 12817997 4909856 -938644 -7801606 -18415747 -26383515
38334 -26383515 -24092744 -14889730 -8745872 -7540729 -3315680 7453899 15816974 11725463
38326 11725463 -1314810 -9956083 -8302025 -4504849 -8014034 -16113685 -17727877 -7185649
38318 -7185649 10557221 26063930 32104585 26574961 14508181 5908523 5786138 7525481
38310 7525481 2594188 -4860534 -2563008 9845217 16480510 6606253 -8797592 -10555853
38302 -10555853 4155925 20041691 23804620 16872017 7693512 -319774 -8882511 -17151857
38294 -17151857 -19815637 -14386844 -7549039 -9725074 -21899979 -32166418 -29442218 -16890298
38286 -16890298 -5848695 -351899 3230217 3750330 -4755519 -18965950 -25492554 -19782948
38278 -19782948 -13710777 -16796126 -21826935 -19453732 -15561810 -19740442 -25091064 -17038817
38270 -17038817 1546476 12058762 7537256 1321164 4297262 9225598 5647216 -2267273
38262 -2267273 -3440138 2582721 6371311 2362466 -7107811 -18170120 -26746630 -25046820
38254 -25046820 -6657437 21745082 40570630 34922242 10370760 -12483441 -18807304
38247 -18807304 -12326597 -7631581 -13200695 -24200841 -30110584 -26399242 -18664357 -16702968
38239 -16702968 -23728893 -30746181 -25000617 -6809066 6932010 2387471 -12430255 -18208840
38231 -18208840 -11041975 -5684633 -11341913 -19035599 -18302675 -11811570 -4626605 6936483
38223 6936483 23358374 31504823 22121340 8095226 7255316 13857377 7343595 -13610486
38215 -13610486 -27198628 -20527752 -5804938 857416 -547993 -2628703 -4358215 -6810487
38207 -6810487 -6539715 -2350089 -403272 -5508290 -14231981 -21003825 -23236069 -17903941
38199 -17903941 -3667112 10247402 9739055 -4073097 -12858167 -5910401 5565045 6946678
38191 6946678 -168556 -7226523 -14895219 -26336523 -34207271 -29829190 -19706032 -18719863
38183 -18719863 -29683051 -41024040 -42232426 -32177536 -15620966 -418028 5866377
38176 5866377 5029618 8905643 22560055 33577487 28503643 13065081 3486166 3464300
38168 3464300 3916860 1669626 3068648 9666133 14160293 11890933 5644537 -925323
38160 -925323 -4849271 -838506 12008578 22468685 18422038 4553897 -3582927 -1876448
38152 -1876448 -625378 -5903319 -12304828 -14988336 -14730532 -9806097 2531526 14810927
38144 14810927 15153063 7142254 7649524 20571329 29743714 24530922 15451868 15134365
38136 15134365 19340666 17970175 11398177 4591037 -2570262 -7925504 -2730493 12943447
38128 12943447 22964310 17078365 8128323 11854757 21059155 18647761 7523250 6136286
38120 6136286 18448628 29330525 29251582 23893301 17703234 7200008 -4758089 -5994180
38112 -5994180 5863074 16071379 13856319 8723737 15304755 30971938 39634455 32651174
38104 32651174 16369233 1729913 -5446626 -4729384 1759753 10866778 19477172 24735168
38096 24735168 23891379 16668212 7987376 4509708 6873535 8484209 3767997 -4696156
38088 -4696156 -8579855 -1806503 13734553 28536830 32539846 24512711 13201965 6712717
38080 6712717 3748625 -593430 -4735477 -3904280 -686190 -2488440 -8461719 -9117846
38072 -9117846 -1214060 6945198 9091819 10031093 14803730 18015397 13345147 7081892
38064 7081892 10635989 22086408 26846391 18377303 8416767 11410153 24757681 31021787
38056 31021787 18233112 -6754736 -25737850 -27055592 -14600922 -999754 4865399
38049 4865399 2705595 -3216148 -8414576 -8699736 -1406963 10787978 19951455 20485269
38041 20485269 15821970 14334147 18572704 21849741 16949564 5462355 -4718311 -9957773
38033 -9957773 -14219552 -20088106 -21375842 -10716298 6964623 16076204 8047957 -8377492
38025 -8377492 -18347765 -17322923 -11301679 -5392467 387610 5697843 7456964 3523443
38017 3523443 -5403428 -16483322 -23512876 -18814920 -3390279 8311675 3842102 -8375630
38009 -8375630 -7607679 10322600 26041485 23776274 12203027 8303864 11577690 8755736
38001 8755736 -1688674 -5970706 3140047 14192174 12171026 -2067044 -13001630 -7787867
37993 -7787867 10309895 24129975 18768013 -2023086 -18337195 -17311477 -9191351 -11908389
37985 -11908389 -23748292 -24966826 -7731034 10821601 12790055 3632660 389959 5776669
37977 5776669 9118763 7321628 7403549 8614559 200552 -17553942 -26544416 -15801902
37969 -15801902 -378647 -916573 -12832005 -13006182 5573309 23620154 23339488 10933337
37961 10933337 3483632 5395839 9000165 11069790 15921186 23672499 26083956 16565260
37953 16565260 -1438152 -17696209 -23298129 -15739048 -181057 13560892 18097643
37946 18097643 13268315 3588063 -6255965 -11580911 -8193145 2266277 10934827 11690400
37938 11690400 9915662 14912542 26064542 34276407 35570122 34209810 32306629 26365527
37930 26365527 16836762 11593673 14814710 19878338 19124100 14760356 14034145 18276058
37922 18276058 23006073 25686710 27428147 28664979 27787725 23316245 15048135 4951423
37914 4951423 -1691283 282080 9154417 16941494 18942827 18184797 18295806 17935186 15603676
37905 15603676 13417268 11480555 5238077 -5738789 -13138560 -11413312 -7595204 -11034613
37897 -11034613 -18884301 -21326813 -16270409 -8375785 1575079 13565941 18299712 5759479
37889 5759479 -16084006 -26658055 -19796272 -10480286 -10102547 -10829168 -2890821 7723074
37881 7723074 11468155 12883855 20317589 26476331 17387954 -2325947 -11543281 -2409421
37873 -2409421 8428822 5217863 -3735929 674580 20095419 36519479 36446324 26021844
37865 26021844 19439445 20651466 22564223 19924754 15364943 12427903 9341796 3609643
37857 3609643 -1276675 945119 10572912 20803714 24784542 20260763 9063151 -2697182
37849 -2697182 -5592439 4336585 17432081 19433803 10404600 5195605 11256562 16728554
37841 16728554 8321271 -8575576 -18500132 -17476355 -13297603 -8870952 507858 13957971
37833 13957971 22400447 21258835 15144350 8048465 -1057686 -11085408 -17365522 -19153034
37825 -19153034 -18770646 -12974170 2208278 17149601 15551040 376326 -5215331 8091116
37817 8091116 19555441 10643124 -4325957 -723406 16482987 20956902 6603260 -6015645
37809 -6015645 -4843186 -1665176 -6548335 -10848290 -6232426 -525338 -1337600 -520465
37801 -520465 9913338 19588563 14175886 -947625 -7987805 -2646035 2214296 -3514821
37793 -3514821 -16430915 -28010265 -32946770 -28854872 -16355347 -731056 11281043
37786 11281043 15587362 10090351 -3534142 -13950645 -6788716 14359996 24943991
37779 24943991 10697145 -8401717 -3400522 21692445 35674797 26194119 15150497
37772 15150497 21948736 34829128 32730302 18150582 10164147 14770046 20293614 18643165
37764 18643165 15499081 18085180 23737164 23898482 13939062 -2398650 -15346819 -16935462
37756 -16935462 -8962579 -539508 4454204 12272655 27218910 40349060 37990613 19096111
37748 19096111 -3130330 -16048174 -17659901 -12292590 -3266292 7219547 15010267 15202507
37740 15202507 7387693 -1365511 -1428449 8672822 17984887 14503010 791965 -8087590
37732 -8087590 -4021463 4075557 3854854 -3913210 -9313773 -8397325 -5523417 -3200064
37724 -3200064 1358978 9113100 15917113 18105525 16303159 12613440 8603800 6873249
37716 6873249 9758110 14879279 16267052 11911240 6329148 3215991 -561138 -9483440
37708 -9483440 -20197752 -23361230 -15669638 -5378298 -2230327 -4701211 -2785471 6719098
37700 6719098 14344018 10818507 442809 -4327051 1285149 10288141 14211268 11212792
37692 11212792 4521309 -893046 244587 9540172 21409252 28001789 27502002 23647968
37684 23647968 19779296 19254812 27216266 41979793 48213312 32139570 3126223 -14319552
37676 -14319552 -11674884 -4044988 -3586041 -3532669 3072999 6512004 -4387297 -23391670
37668 -23391670 -36642281 -39958505 -33857240 -14205803 16227302 37975379 34934761
37661 34934761 17004293 6088100 6874812 8579303 7656131 8580869 7711501 -1934589
37653 -1934589 -12447381 -8798040 6205250 15501756 15674509 19415123 29508648 33852864
37645 33852864 29843252 29703900 35188414 30959003 12626476 -1801334 -878227 1642679
37637 1642679 -7746557 -18156625 -13806688 -1334353 2236711 -3157651 -4530066 1525113
37629 1525113 7389562 8783369 5716558 -3646635 -16055101 -18370960 -4721436 9577650
37621 9577650 7374252 -4370833 -5633671 5326595 11016095 3168012 -6847458 -8376847
37613 -8376847 -6281622 -10252639 -20189241 -27118639 -23010336 -8521689 5790024 9386852
37605 9386852 5734700 8045179 16678376 14762668 -3683423 -18005843 -10664307 2803894
37597 2803894 -2775146 -21285546 -26939912 -18814135 -19496403 -30103692 -24217588 4302180
37589 4302180 23659629 12197229 -6854072 -2220166 19044205 28994044 22755270 15550964
37581 15550964 10383973 600826 -3475768 16223353 49712116 63211516 45497393
37574 45497393 23585562 22743741 34731174 39055432 34483390 30806186 25032935 8567254
37566 8567254 -9113149 -6814378 16858809 36688149 32039198 11759151 -732549
37559 -732549 2183255 8137949 6840894 3902533 9484547 21734374 28691175 23766367
37551 23766367 12457486 3111464 -3116352 -9650472 -15559110 -14750809 -4527477 9089070
37543 9089070 17191555 17612174 16048021 17820543 21670847 23545737 23605013 24963288 26305343
37534 26305343 21986291 12047689 6273757 12688109 25817961 33183779 31105562 26169301
37526 26169301 22010028 14534738 2936315 -4043702 939462 13111880 22340241 25398229
37518 25398229 24680343 20002002 11153667 5782236 13568878 31152171 42534096 38248663
37510 38248663 26340290 19861171 21124561 25023733 31145442 42331432 53953318 55910590
37502 55910590 47150756 38649027 37686939 37418030 28612457 15063851 8205250 10128084
37494 10128084 12263755 10346389 10092987 15479395 21404850 23636648 27565865 38511626
37486 38511626 48670177 44004699 23571623 3679018 741026 14948307 32417791
37479 32417791 39662433 34561785 25952683 23987885 30114532 36836804 37438884 33123911
37471 33123911 29054587 27065096 25134302 20451423 10130423 -6312739 -21531113 -23821637
37463 -23821637 -11851205 1203677 6279571 12967718 33059929 56723586 62600616
37456 62600616 49252969 36923434 35589036 31825585 15396900 -654130 -102503 11712343
37448 11712343 19589067 23132605 31125129 38771888 31007453 7809094 -11185017 -10522616
37440 -10522616 5109155 21312353 29427934 28815777 23307952 18917932 18570453 17938002
37432 17938002 12406093 6536521 8490409 17030767 24023964 28096306 33659820 36949693
37424 36949693 27931141 9525672 245979 10583011 28791821 38004393 36615491 33055877
37416 33055877 30674956 28388126 28243748 31322315 31986997 26191227 20268186 22234964
37408 22234964 29790692 35944711 40189872 44051400 42582382 32479159 22322318 21031173
37400 21031173 22000241 14492671 5553868 11391878 29359989 39996896 37826180 36762912
37392 36762912 40521025 34023122 15383754 9405599 29412413 48975300 38608139
37385 38608139 13373680 11645012 35913531 50483133 38267169 23903253 29864415
37378 29864415 41788703 37090319 23600820 24724074 40985508 51817674 48678397
37371 48678397 43147080 43507709 43693814 38427514 32940588 32594990 35369583 39564548
37363 39564548 47881389 58167587 60397100 51050142 43004615 51059092 70820275 81987407
37355 81987407 73630625 57612889 51958082 56892366 56355672 42633523 29041059 32234457
37347 32234457 49822227 65479467 71625759 74417824 77317187 74214797 62687110 50795128
37339 50795128 44306944 39212265 34353014 38629606 55099219 69978093 70978817 66605404
37331 66605404 72218042 85543052 92823739 92540552 94950852 102953237 112131325 125819494
37323 125819494 149718257 174091260 183894683 186539132 205227468 241847943 272638598
37316 272638598 287306387 304351680 335031282 360345847 363996076 363984283 385327111
37309 385327111 418608956 433977507 425978777 416802951 419729583 424677271 419352783 403053840
37301 403053840 378693108 349777442 325827251 313510958 302164129 274875784 234159526
37294 234159526 200049549 182551128 172851925 162007992 149996876 134414431 109358908
37287 109358908 80345054 63003841 61450731 63777375 63243212 66064411 72188256 67917451
37279 67917451 48404801 30654964 31223476 44299597 54404838 58812640 64140454 70441799
37271 70441799 71909888 66970235 57988524 47959410 44708490 57916901 82679070 97006463
37263 97006463 86990296 64812244 50809500 48237293 48131279 47754333 48481660 44788016
37255 44788016 33061037 24905341 33728364 52169191 60230205 53228175 44841667 44290233
37247 44290233 47734859 51873084 58366425 62792995 56147807 41669580 35338587 44072275
37239 44072275 55474153 54100702 37734661 14835678 -3287989 -6041993 8017279
37232 8017279 23212533 19776126 -1312792 -18356829 -16868542 -4657556 3988971 4412062
37224 4412062 -2797748 -16177142 -26003654 -18521637 2666207 14586434 5585023 -7090976
37216 -7090976 -4051369 7152773 7838420 417949 2324310 14594542 20367291 14333139
37208 14333139 11397622 20701747 29352995 21420103 1063715 -12999177 -9911727 3178397
37200 3178397 10365088 3322599 -10019517 -14339868 -6549300 -613422 -6625565 -13260611
37192 -13260611 -3262128 19705944 35787653 37698537 36214425 36123286 27873724 10495682
37184 10495682 2403201 15192812 32001130 29181151 9548109 -3627907 389017
37177 389017 10706994 16275015 18688329 21278450 20741394 15329485 10026850 7407940
37169 7407940 2422719 -7396033 -14449359 -11230864 -2036178 3425472 3910827 5518552
37161 5518552 9009897 8083302 1675530 -1293347 5325710 14235893 14553319 8474506
37153 8474506 8284179 16625589 20496573 10166341 -4763385 -7289484 4359060 16673770
37145 16673770 20814014 20533670 19828193 16117727 10588862 12416221 23187265 27257750
37137 27257750 10468041 -17362829 -32268490 -26067089 -12974742 -6341093 -3338024
37130 -3338024 2612789 7585303 4921184 -1317518 -1681263 3832464 6287670 1939114
37122 1939114 -3142864 -3587954 -2015684 -2636649 -3593042 -537995 5644016 10024384 11186713
37113 11186713 12243988 13849737 11877761 5307982 1521995 7443239 17784543 20301730
37105 20301730 13501570 9966633 17560763 26248643 22370748 9423182 2609229 5884529
37097 5884529 8769717 7273288 12209668 28900084 42142384 35085419 15532735 7795737
37089 7795737 19685480 32247514 26079641 6184311 -6560367 -1313158 13470593
37082 13470593 23129380 21337167 11559957 349911 -7148989 -7252500 1760930 15908881
37074 15908881 24141051 16976668 -541011 -10207854 -1281821 14509653 17608442 7672162
37066 7672162 3203470 12275318 18982630 8721083 -6142383 -2524534 18052583 30428159
37058 30428159 23259037 15270339 24758396 39859676 36053443 13971916 -110640 9276712
37050 9276712 28293223 37134819 36066823 37042825 40517333 36219268 23539489 15722717
37042 15722717 20558441 28622047 27043565 16740274 8390819 7171388 10449274 17334053
37034 17334053 30094175 45082699 51532042 43907745 29687804 20342972 18857131 20419848
37026 20419848 21316914 21768677 22791425 25625972 31985535 39389871 39027921 25979722
37018 25979722 10560229 10108868 26806506 41792960 36397486 13580898 -6822034
37011 -6822034 -9687866 3518753 20180100 28078316 24312027 17726711 20067031 30885733
37003 30885733 35473050 22890319 944667 -14007426 -17155687 -15594070 -12956480 -6633201
36995 -6633201 661544 1036303 -3689862 -1009560 12329244 22304071 18187826 9244507
36987 9244507 9356702 15232400 14625540 8965681 10266968 18149091 18599051 8390215
36979 8390215 3176419 13603959 28060294 30387103 23440424 20862504 22363831 13775919
36971 13775919 -8431688 -27833493 -28925145 -16818042 -8259608 -9924138 -14843170 -16757903
36963 -16757903 -17278152 -17585217 -13066969 -2248029 5686043 1082396 -11032828 -15281127
36955 -15281127 -6327900 3690454 1819424 -8990490 -15639482 -11881460 -2515840 5922525
36947 5922525 11093102 12936014 12844082 14450554 19154910 21348145 14635731 2709220
36939 2709220 -3473235 -758974 1552960 -4735258 -15421589 -20763041 -18197293 -13047023
36931 -13047023 -10536354 -12099050 -16452708 -19602536 -16592134 -7972355 -1814605 -4024348
36923 -4024348 -8933080 -5723602 6719493 17924401 19429050 13763179 7305203 252504
36915 252504 -10696745 -22621801 -26128192 -16354929 -164880 10442030 10266458 3906684
36907 3906684 -1543084 -3108256 -1041056 4678338 14024503 24527673 31648988 31637727
36899 31637727 23775579 11307441 414546 -4501857 -5548475 -8113563 -11954339 -10888888
36891 -10888888 -4329917 -2167719 -11264211 -22817157 -23084850 -13490125 -8383220 -13056916
36883 -13056916 -16563927 -9745204 1408504 6825437 7065666 8605052 11368781 9998854
36875 9998854 3733292 -2459179 -4172142 158175 9595833 18480787 18831688 10987871
36867 10987871 6596782 13502627 22507473 18398068 953661 -15026349 -19288191 -15685835
36859 -15685835 -11913612 -9586236 -7024439 -3527919 2706264 14171335 27771561 34658271
36851 34658271 30481603 21425818 16148870 15517976 14614867 11949096 11204293 13909188
36843 13909188 15207023 10190929 2780771 3375073 15028719 26156037 23399889 9850988
36835 9850988 1305943 3335292 3583093 -7485519 -20290353 -21578339 -16081699 -17295191
36827 -17295191 -22979030 -18652685 -4594659 503973 -11873794 -25283877 -21477410 -4643621
36819 -4643621 8335177 10862227 8017251 3583716 -1510669 -3170180 1455686 6703288
36811 6703288 5699425 1669454 1822282 3215708 -3525986 -17229025 -24604067 -17638359
36803 -17638359 -3179693 7338485 9952682 7751350 5537100 7104536 11651624 11847757
36795 11847757 2339991 -9361895 -9320375 3656774 15147015 15150509 10405301 10263781
36787 10263781 10941538 4329455 -5389349 -6811660 1058860 9163632 14734683 24024257
36779 24024257 37501297 45428508 42824201 37762471 38409116 41051947 38421328 31956244
36771 31956244 27153890 22884818 14554937 3475442 -5867914 -14099186 -23338781 -28878932
36763 -28878932 -24859420 -15872035 -11753505 -12192273 -8722073 -1707159 -1043146 -7258756
36755 -7258756 -7098939 5467797 17805061 17410317 9743096 6156137 5471361 1311453
36747 1311453 -1900580 3166227 9317978 3467596 -10062135 -13568113 -4196455 386146
36739 386146 -10663859 -25507237 -29376640 -25326974 -23975398 -24139803 -17392717 -5161930
36731 -5161930 2286480 1596111 -346795 991323 1183200 -4678783 -13041361 -15068372
36723 -15068372 -6957582 4569293 7747977 -1592162 -13204629 -12108914 3574912 18754522
36715 18754522 18032292 2643091 -12421145 -15357532 -8350988 -3001582 -7123761 -15659663
36707 -15659663 -15752131 -3022797 10784253 12764506 7949785 12292809 26880391 33663576
36699 33663576 22122125 5609762 913143 4214245 1569014 -6468835 -8086883 -2543207
36691 -2543207 -583230 -3979477 -3643117 -350026 -7756589 -27292501 -38099603 -24925983
36683 -24925983 -2640817 2694263 -11311987 -23856560 -21905690 -13804314 -11312226 -13378251
36675 -13378251 -12892719 -7935737 583017 13878274 30132360 40191708 36208201 21553975
36667 21553975 6307677 -3792945 -8147160 -5498804 3821450 11712164 8394467 -3664444
36659 -3664444 -10757870 -6163695 886724 -479183 -7196553 -8629733 -2914069 2403957
36651 2403957 3319218 3163028 3337630 -454658 -9821556 -18883702 -22229688 -22363009 -24243031
36642 -24243031 -26034559 -21236889 -9551405 -597331 -4013902 -17175501 -25764916 -18504988
36634 -18504988 -81989 13762978 13971782 6797414 3648777 7923293 15313289 21365311
36626 21365311 22998254 17404694 6506979 -1509535 -2747660 -5337462 -17063118 -29358082
36618 -29358082 -26527912 -9918078 1322783 -3786673 -14629592 -16170161 -7169657 4789323
36610 4789323 14581065 18270566 11853351 438883 -1727050 8897678 15075990 1719337
36602 1719337 -19072340 -21971233 -3792182 11948539 7374039 -7849476 -12909247 -3219506
36594 -3219506 7216382 5648155 -5239345 -13119697 -11588935 -7050102 -9819604 -21095013
36586 -21095013 -32495549 -37190960 -35420978 -28704827 -16751918 -3329389 3172236 707965
36578 707965 -1985019 1851530 6637368 3705223 -5933702 -15634714 -22823156 -26009055
36570 -26009055 -19577900 -2381978 14501286 19862003 16705194 13353788 7693021 -4719906
36562 -4719906 -13406543 -3491476 17912631 25886773 10969623 -10364022 -22618374 -29007433
36554 -29007433 -34411767 -30549979 -12437187 5393735 6235205 -4395352 -7818011 470958
36546 470958 8223195 7866029 5044809 5380502 6194468 4780295 4811270 10245161 19610813
36537 19610813 29147493 35582417 33906160 19599497 -2962188 -20328019 -23417095 -16940231
36529 -16940231 -10135290 -2349369 13950992 36754512 50708046 44185814 23740701
36522 23740701 5595612 -2536361 -3932227 -1304675 6355653 14992933 14903945 4144028
36514 4144028 -5731673 -3677322 7123752 15406332 15889408 10947486 3990105 -1449938
36506 -1449938 -807996 5615885 9794766 6242212 725878 1058626 4329233 2730582
36498 2730582 -2403393 -3253787 831488 3530202 3486491 4992901 8010016 8388800 6967714
36489 6967714 7709499 8570499 6006291 6065096 16452481 28818707 26204972 9946492
36481 9946492 610087 6774490 11972108 2745622 -8029512 -1049052 19015575 30573112
36473 30573112 25928055 18638544 21896414 32788252 39083460 32535143 14403995 -5570460
36465 -5570460 -15033328 -9031300 4746611 13238559 10324297 1009030 -4696255 -1101730
36457 -1101730 8138665 14710839 16874113 21805648 31845333 34983892 20071282 -2711797
36449 -2711797 -11288046 -1055780 11032051 13530899 13614757 17100734 14249788 -2045186
36441 -2045186 -18656256 -18331715 -4248835 5919821 4273416 -1983913 -5188995 -5217169
36433 -5217169 -4357401 -3090401 -1003576 2058166 3996852 -138938 -10204976 -13922826
36425 -13922826 42253 21280631 25623008 7544886 -13192813 -23059508 -31629609
36418 -31629609 -46284190 -53153802 -40952623 -23309207 -15673142 -8016174 14462856
36411 14462856 38921819 41573164 25543003 12847924 7615495 -1562771 -9561409 -137911
36403 -137911 17962224 16858085 -3915131 -12905169 1323527 9645695 -9419318 -33831841
36395 -33831841 -33830102 -17012676 -10724962 -19406474 -27470085 -30329990 -34412268 -35256947
36387 -35256947 -22755220 -4090123 3115627 -795885 1386865 13629128 19773386 11063157
36379 11063157 389391 1288691 9508941 15087609 18617959 23884661 25565496 18073007
36371 18073007 9536964 12139317 21257553 19372210 2809704 -9838795 -3381270 11539364
36363 11539364 13464442 63861 -11873881 -13670313 -14687112 -21490652 -24555414 -16407045
36355 -16407045 -9047805 -17567091 -34666816 -38820501 -24626521 -8258273 -2220162 -553834
36347 -553834 6806981 18487903 26780896 28112065 22334507 10326952 -1191316 79499
36339 79499 18820450 42429570 50880322 36101481 9404621 -9652321 -11445285 -3923757
36331 -3923757 -703484 -2648993 1462565 14155369 21367671 14133586 5754416 12198919
36323 12198919 25254635 25208011 14324544 13986408 28666562 37388118 26636449 9052778
36315 9052778 384684 -1351978 -2386827 1631711 12632949 18590528 10541315 -1803802
36307 -1803802 -5729103 -4229860 -4639617 -1477812 12406054 28185288 32440661 28136885
36299 28136885 27005778 28284362 23029006 13833429 11224512 13314531 7677287 -6516868
36291 -6516868 -15184067 -10322842 -357854 3110690 -2201447 -11289844 -16749987 -12153657
36283 -12153657 169803 7153646 951109 -7232633 -1818458 13012700 19612332 14873619
36275 14873619 13784687 23593129 32759924 31064848 24513459 22537773 23838947 23364266
36267 23364266 22144523 21903448 19518380 14666299 14071390 20216822 23960134 16862364
36259 16862364 4427180 -1053096 3970545 12599009 16825789 12930510 2192036 -8443107
36251 -8443107 -10675390 -4146955 3221014 7125342 11891106 19104625 19956666 7059908
36243 7059908 -12427020 -24346126 -23864916 -16282116 -6297841 3758927 7858005 -741973
36235 -741973 -19295544 -35984258 -41887354 -37312984 -26969776 -15385884 -7197857 -5358958
36227 -5358958 -7529902 -8667681 -7008232 -2965742 5610334 19403073 29984486 26301994
36219 26301994 11036258 705758 5039455 15441369 20044656 20813251 26185283 34290122
36211 34290122 36093313 31646320 29981838 32932973 31556021 20947760 7150210 -4169905
36203 -4169905 -14216730 -20827771 -14098391 8103396 30047958 35507090 28328071 23140663
36195 23140663 21406600 12263193 -4786349 -15205582 -11211688 -3419939 -3573215 -7691272
36187 -7691272 -5891146 52857 156903 -7770870 -16325710 -20741030 -23277063 -25168526
36179 -25168526 -23025499 -16221478 -11006228 -12079941 -14170963 -8630478 2577264 7243340
36171 7243340 480041 -5819029 450056 11002151 6864369 -11484070 -20683651 -8382149
36163 -8382149 6143619 -718165 -22562559 -34741231 -30845524 -25083424 -23493424 -17958686
36155 -17958686 -9220023 -9790855 -18131188 -15056967 4080820 17721570 12485334 6153483
36147 6153483 17453982 33318056 30252972 13342773 7020422 15344202 18426532 6240911
36139 6240911 -8626889 -14310957 -14750998 -16333174 -16287369 -10823916 -2791731 3604482
36131 3604482 6761932 4826107 -2029579 -6717882 -2721965 4149315 2197773 -8599791
36123 -8599791 -16595865 -15439353 -9322610 -1693571 8270501 16429543 13763985 -331094
36115 -331094 -14573566 -18800639 -12779351 -1664577 8321255 9850359 593271 -9441739
36107 -9441739 -6255599 11103928 29813458 38758634 36274157 25299044 11755684 5102739
36099 5102739 8169523 8919748 -4187132 -21600064 -23547990 -9750490 40481 -4258927
36091 -4258927 -12186527 -14327054 -14768688 -16646067 -14909288 -10825153 -14637080 -25178560
36083 -25178560 -25860896 -11154942 2000594 1253419 -2013858 4571739 11396427 5534975
36075 5534975 -3757859 -355113 9593335 7101776 -7861824 -16497977 -10674861 -2588658
36067 -2588658 -4586697 -15241968 -26343214 -31218190 -26782508 -17968540 -16891963 -26761162
36059 -26761162 -32287852 -19413293 1639381 9372124 2259403 -1906218 4009734 7758650
36051 7758650 1619945 -4557019 -1041914 6951806 9942702 6700751 -939213 -13461623
36043 -13461623 -26527445 -30257969 -23865448 -20032475 -25839588 -30287534 -21951917 -9266284
36035 -9266284 -8864208 -19695838 -24677628 -16995758 -9099349 -11485586 -16072261 -9813006
36027 -9813006 3683395 7947096 -3205850 -17336078 -20706506 -15039617 -10942251 -10791165
36019 -10791165 -7218783 2886430 11977025 12066461 5210473 519456 4801857 18152231
36011 18152231 34158196 42238792 34858466 15781156 -2505448 -11476730 -12352646 -8890896
36003 -8890896 -2236332 4443314 5285885 982820 204572 5628465 7901084 1783333
35995 1783333 -1890308 7384222 19996150 18546517 4845372 -2977684 912440 2819946
35987 2819946 -5764709 -13949316 -10148478 -698173 1073163 -6020251 -14214794 -21239980
35979 -21239980 -29139847 -33413853 -26361661 -10715944 1322809 4446775 5680232 9492117
35971 9492117 6705262 -13166874 -42654345 -59031426 -47862750 -17783720 10237932
35964 10237932 22638627 19167978 6169008 -7866856 -13208602 -5067919 9707225
35957 9707225 18929640 18935529 15410009 10750266 948100 -12123790 -16930344 -8013346
35949 -8013346 3853844 6132907 1375056 -328697 1159396 -1687759 -8193388 -8748681
35941 -8748681 131511 10352158 12936714 6650060 -3834643 -11568477 -10588778 -2548056
35933 -2548056 2278951 -1999400 -6631524 -191659 13311114 19908981 16100733 10272181
35925 10272181 5443997 -3811833 -16082151 -20885722 -15768229 -10476767 -9135384 -4254828
35917 -4254828 4575546 3776119 -10468725 -18067734 -2001507 22574410 26530035 7240020
35909 7240020 -10658897 -13156575 -12930071 -22111366 -29464984 -18207296 5836045 19775269
35901 19775269 13157753 -1684483 -9317662 -9637053 -11472712 -16049416 -16434285 -11776419
35893 -11776419 -11853643 -22418869 -33066721 -28893071 -11941644 -502996 -4939688 -14315786
35885 -14315786 -12735919 27605 13053222 21957825 29477827 32073570 21450475 2171354
35877 2171354 -6709941 4272011 20086172 20963532 9024480 2125566 5985259 8242362
35869 8242362 787723 -8262358 -10880949 -12563816 -18571735 -19065624 -3911799 14912769
35861 14912769 14782187 -4264992 -16596130 -6593172 9981395 10520776 -2520389 -9046753
35853 -9046753 -2234506 4620201 326839 -9901214 -15361414 -14300490 -12310196 -12703619
35845 -12703619 -13453386 -11169965 -5545653 -517103 -427869 -3868762 -4003964 2389992 9843586
35836 9843586 12216235 11763963 14289910 18650115 18544679 12900617 6474211 540183
35828 540183 -8696208 -20870616 -28408023 -26441177 -20265430 -18353839 -21105125 -21208896
35820 -21208896 -14706489 -7685031 -9067599 -17775526 -22019855 -14475063 -3036216 531427
35812 531427 -1918979 -214823 3997663 -1028980 -12889371 -12402687 5023501 15048585
35804 15048585 -1845254 -28553146 -34783125 -20093793 -8690057 -8983420 -6064579 6777553
35796 6777553 16422929 14420265 9637061 10106334 12818114 17075390 27050512 35246685
35788 35246685 26039755 3710905 -6542534 3952666 13298538 5886331 -2756147 2650639
35780 2650639 6467683 -9793092 -28718340 -19207032 13809694 35180950 30807196 21108200
35772 21108200 21994070 23022757 12368421 -2346497 -9850853 -11514941 -9814275 1801394
35764 1801394 23638126 38610159 32120999 14153091 6737370 14680508 22359714 17302693
35756 17302693 4110830 -6712676 -13375661 -20901704 -30209785 -35338998 -30981965 -18861235
35748 -18861235 -5445909 4298305 9056026 9026408 4872603 -1482478 -7655039 -12167138
35740 -12167138 -13163971 -8180437 883397 5610229 405871 -8133952 -9113770 -3005162
35732 -3005162 -146143 -5006183 -13267334 -23502702 -37146088 -45808217 -36350456 -13762912
35724 -13762912 -544512 -4862547 -8257890 3484591 17280409 16704145 9410411 9224545
35716 9224545 8141087 -7259127 -24196642 -18682080 4259268 15736172 6937959 -1718762
35708 -1718762 2012737 4671432 -5289860 -17766528 -19776804 -13823175 -7640228 -3049652
35700 -3049652 -2829562 -11344815 -21408408 -18274542 -3118272 6190050 3607358 2907275
35692 2907275 9998707 11517629 2131145 -2009822 7411977 12696203 752142 -11292091
35684 -11292091 -4786497 6693895 -113605 -18146251 -22491001 -11551780 -5418389 -10323640
35676 -10323640 -14618560 -16068592 -23421675 -31794760 -25850390 -9620337 -4897353 -15601635
35668 -15601635 -21625991 -14709673 -11705865 -20900247 -23033764 -3350285 20265418 21753057
35660 21753057 2858531 -15122825 -22127413 -22237720 -16849003 -5514361 3069331 -51800
35652 -51800 -8136624 -8379815 -3723462 -7822241 -20166883 -24365333 -13504894 -1033432
35644 -1033432 -1038886 -10876042 -20216017 -26433267 -32014312 -33828081 -25333543 -8363237
35636 -8363237 4594358 2327344 -13245416 -29021769 -34280447 -30400639 -25459537 -22066777
35628 -22066777 -16597751 -9821196 -8573861 -12480954 -9144335 7917441 24444456 21980407
35620 21980407 5304788 -2237696 8360352 19541687 13872393 -1466883 -8061546
35613 -8061546 -3987709 -3503781 -12776825 -20706688 -16636684 -5576514 1175683 3429366
35605 3429366 10710629 25091325 34933534 30169366 17632778 13213731 20554356 26814603
35597 26814603 21830031 11787459 7225513 6036957 -480663 -9926415 -11213474 -4142757
35589 -4142757 -2070618 -11077405 -19211868 -13209990 4231720 20821892 28819083 25596459
35581 25596459 10452965 -9297061 -18405150 -11646381 -3868323 -9492911 -19999249 -17673248
35573 -17673248 -5386357 -2762925 -14069831 -21118592 -12430833 147988 2428394 -1342092
35565 -1342092 184432 6853435 11955313 14986810 17116275 13082883 592605 -9668843
35557 -9668843 -7009150 1652828 729055 -10873986 -18647546 -12933431 1329714 14249791
35549 14249791 19446019 14278106 2917823 -2167348 5892668 14024011 3331905 -21248299
35541 -21248299 -32382225 -17790627 125233 -5595587 -28749139 -38367811 -19518575
35534 -19518575 9871979 23034621 12202856 -10633944 -29694852 -35196731 -24166418
35527 -24166418 -935190 23158419 36542384 36602341 30451542 25856568 23629402 20262295
35519 20262295 15221788 11757357 10990761 9383329 3678213 -4475657 -10621986 -11991570
35511 -11991570 -8463355 -1590453 5528620 9793908 11301722 12818225 15169205 16477545
35503 16477545 16692377 17777451 17807775 11877190 2923252 3929351 21703600 43876889
35495 43876889 50956922 38561124 20072197 10041838 12429959 21796354 27269444 18161384
35487 18161384 -4536677 -23877905 -23714658 -8152559 5118115 7564457 3521436 -5468256
35479 -5468256 -22616996 -40561136 -42791856 -27732945 -15100340 -18324427 -25483469 -20408667
35471 -20408667 -9370272 -9643107 -19841574 -20583428 -3119706 18744166 27332234 19557697
35463 19557697 4179906 -9001325 -13307598 -6432602 7463124 20373346 27312808
35456 27312808 28473544 25624423 20210619 13748535 5919965 -5715240 -19013914 -23163917
35448 -23163917 -9574527 13047150 23253074 10385348 -12239856 -22456974 -14119779
35441 -14119779 -1673301 -707787 -9215700 -11835727 -1057406 12006955 12479150 3155236
35433 3155236 1753052 15351212 27922071 21094115 555982 -9586056 2175353
35426 2175353 20256021 22576216 8009433 -4094184 681255 14666332 19440544 9318849
35418 9318849 -3612394 -7913210 -7677820 -13094955 -22527789 -24215584 -14068572 -1140630
35410 -1140630 5872199 7670336 7354950 4418532 66637 -586125 3375956 6692633
35402 6692633 7850522 10435971 10177513 -4852112 -31571590 -44679491 -28076989 -1875992
35394 -1875992 1698124 -17861925 -31554274 -24445572 -13558655 -17768521 -31033192 -36053932
35386 -36053932 -29326496 -20488932 -16328333 -15899666 -15372014 -10330384 885687 10641900
35378 10641900 6156001 -13316347 -30628133 -30044086 -16955090 -9830644 -15875362 -23335753
35370 -23335753 -17905763 -162295 15862007 19102407 13895541 13805697 22661799 26956075
35362 26956075 12907943 -12827554 -28888458 -25078465 -12695633 -7528113 -12336696
35355 -12336696 -19451066 -21519196 -15160716 -1840899 10632110 14692547 13768513 17574368
35347 17574368 24639772 22152754 8103016 -1317407 4076655 11585154 6887689 -1048885
35339 -1048885 5002053 20022841 23445246 12541451 6132503 13577535 22563569 23725389
35331 23725389 25621674 33920127 35205328 18609496 -554118 602869 17589308 23515051
35323 23515051 8448059 -6197793 1450170 24259993 37768211 31150544 14896665
35316 14896665 2853996 -1329313 123379 6411848 15840055 21637716 17002069 4402550
35308 4402550 -4889894 -3279971 3590021 3795858 -4943620 -12042636 -9506871 -4400220
35300 -4400220 -8558768 -19943121 -25579100 -23399293 -27237726 -43091546 -53489075 -39391149
35292 -39391149 -9687725 8287285 4957214 -3144735 -2936476 -2728754 -11941170 -20845106
35284 -20845106 -15574619 -1222175 6686010 5707686 4319254 1821343 -10328908 -27705667
35276 -27705667 -32417496 -18137358 -503680 3751758 -4174814 -13064660 -16918363 -14795125
35268 -14795125 -5713094 6951701 12919550 5731212 -7953342 -15978589 -13894512 -6164263
35260 -6164263 1078231 4029402 2363114 276334 2788343 9313764 15485566 20627481
35252 20627481 25487499 23847289 8869001 -10882312 -16955942 -7301325 -665032 -7147426
35244 -7147426 -12726013 -5584313 1119244 -8291080 -23008548 -23101483 -13726472 -14269425
35236 -14269425 -20850379 -11399365 12046343 19216775 -1925485 -24947499 -25517123 -15124909
35228 -15124909 -14550934 -16823476 -2397506 24169181 40449178 41114020 40173616 41450629
35220 41450629 33171258 14576330 2815999 4304716 563906 -22983225 -49844495
35213 -49844495 -52295275 -30331380 -12271857 -17227793 -33173666 -37587663 -27612966 -19314291
35205 -19314291 -22345737 -27535784 -22599690 -11547139 -9885530 -22356406 -34688670 -31821128
35197 -31821128 -17893851 -9915923 -13674430 -16194875 -6085652 7456256 5860029 -11570275
35189 -11570275 -23622935 -14561734 4178152 9077168 -3958399 -15782606 -12493774
35182 -12493774 -4738301 -10935126 -30151103 -43091580 -37156229 -19922385 -7210005
35175 -7210005 -6633835 -15162417 -25151202 -28751042 -22096243 -9876521 -2356363 -4166325
35167 -4166325 -8729133 -6725267 2652182 11940086 14643206 11133744 6644343 5920667
35159 5920667 9361637 13031844 12646785 7433797 -551341 -9119937 -15594512 -16250398
35151 -16250398 -10777679 -5624257 -6746907 -9750046 -4953553 6597103 11009029 -292470
35143 -292470 -17773484 -25221547 -18345714 -5519071 5288887 12498611 16110758 14781642
35135 14781642 9003667 2923126 1536633 6924161 15790102 19976849 12769726 -3355516
35127 -3355516 -18285394 -24507165 -21612254 -11024979 5288264 18451663 15806553 -2361435
35119 -2361435 -18169036 -17225836 -6573231 -1653543 -3846461 -4289065 -2898704 -6547089
35111 -6547089 -11723860 -7932519 869850 -2271376 -19274860 -29433271 -19736219 -5854707
35103 -5854707 -8218122 -19895686 -16840769 5543788 24686462 21211473 2606125 -9023965
35095 -9023965 -3616062 9432035 16177440 13414565 7899124 4718142 2284636 369778
35087 369778 6117725 23843033 42186308 42947334 24135499 3219876 -5705041 -6102008
35079 -6102008 -5255590 -409599 10646785 17264100 9514125 -3256673 -3804905 6613452
35071 6613452 9539959 -3151641 -18405655 -21540825 -13478620 -3992121 1217296 1317879
35063 1317879 -3195230 -9461274 -13181807 -13258214 -10850744 -5001793 3222040 4846124
35055 4846124 -6806618 -20754021 -18248462 -1014394 6625438 -8792184 -29454086
35048 -29454086 -30293521 -10937796 9122131 17249096 15710182 10665351 7422822 11621282
35040 11621282 21796045 24839662 11670820 -6525568 -11121560 -1819501 4697881 -111051
35032 -111051 -7907180 -9657704 -5549147 2487770 13179283 18468347 9079473 -8232768
35024 -8232768 -14047058 -2391139 11557865 16302124 19603058 28838783 32902868 20172816
35016 20172816 1951867 -1550557 8143829 10380711 -3746075 -20578975 -24529656 -14337413
35008 -14337413 3003591 20400870 29555956 24831814 13300155 10107897 18625393 24889534
35000 24889534 17044142 638775 -12138348 -19539253 -27480538 -35662355 -36704972 -27969722
34992 -27969722 -16648201 -11717949 -14458713 -17863040 -14354800 -4174221 4938362 8107345
34984 8107345 10037243 15834250 18625067 6937911 -15040533 -27196396 -19039329 -4302189
34976 -4302189 -1414998 -9035057 -12424107 -6976115 -1444698 -714281 429207 5059399
34968 5059399 7890584 5323137 2398011 4661879 9582542 10814329 6578659 -29400
34960 -29400 -6049647 -11272069 -17460573 -25100159 -29053396 -20418150 1960730 24564240
34952 24564240 31724931 24068118 15682379 13589250 11548384 6234640 5725296 14357135
34944 14357135 21062359 14196406 -127256 -6995304 -4605800 -3963274 -9287186 -12567718
34936 -12567718 -8704207 -3379683 -1943568 -1055239 3005221 6215057 3646764 -1782324
34928 -1782324 -3979682 -2303687 851672 6639535 16249536 23750981 21520316 12846998
34920 12846998 9937087 16082222 18153529 3826339 -19188228 -30617138 -22935508 -9125464
34912 -9125464 -2986083 -2184613 2300272 9055447 10169204 6952984 7267318 8030952 -3327844
34903 -3327844 -25334844 -36432739 -22846385 456640 10363391 7075899 8189802 17777335
34895 17777335 21107854 10041983 -5028293 -13030217 -16101223 -19252899 -20112014 -16917476
34887 -16917476 -14847275 -16026953 -14102942 -7236740 -5016076 -11829817 -14676067 -1586481
34879 -1586481 16609388 19508691 7215240 -205690 7368982 17520765 16021233 5927537
34871 5927537 -499392 1157735 5477507 6006838 740135 -7331159 -12520425 -12631325
34863 -12631325 -12567420 -16872866 -20722211 -16311261 -6835425 -3692048 -8997380 -12169865
34855 -12169865 -6631302 1710702 6983049 11977486 17249970 14025817 -992580 -13621272
34847 -13621272 -8880697 5851872 8495176 -8483940 -28801904 -33098118 -18968216
34840 -18968216 1062996 13055568 11339913 1662967 -3696574 895910 6751767 2436570
34832 2436570 -8869007 -12381168 -1823782 13364965 22647851 26063434 27589128 26849900
34824 26849900 23721023 22875146 25982202 25697936 15624898 1350531 -6959751 -8980144
34816 -8980144 -11769515 -15549688 -13012668 -3569768 2522740 -1428063 -8493167 -8589585
34808 -8589585 -2910742 -728175 -5489093 -11775360 -14913991 -16162126 -17195829 -16082960
34800 -16082960 -12008342 -8931778 -9844840 -10651375 -5379973 3674508 6808429 -967116
34792 -967116 -13113033 -18689162 -12840388 1109330 15455545 21381850 13687741 -2251867
34784 -2251867 -11596755 -4759700 10181332 16033488 6837866 -7062788 -14278832 -14281052
34776 -14281052 -11342358 -5228859 5444092 15983745 19341349 15176031 9910357 9363389
34768 9363389 14879421 23131413 25223561 11214438 -16608689 -38770928 -36957717 -16230952
34760 -16230952 1192349 4253518 3450066 10614224 21483946 25475356 21399332 13406976
34752 13406976 743435 -15655263 -23219878 -10165563 13901261 25150428 15145268
34745 15145268 -781548 -8127604 -10659945 -15076031 -13376981 3927935 25678045 29480691
34737 29480691 12223887 -5267024 -7209202 -1416606 -1789634 -6151400 -4596602 -991572
34729 -991572 -8726050 -25733515 -30723978 -11345817 16065870 25538454 13029984 -2714964
34721 -2714964 -6921544 -3243367 -1083673 -1718477 -2386810 -3849271 -6488693 -6694073 -4461405
34712 -4461405 -6562331 -13223420 -10750982 8779327 27576818 21095572 -4071435 -12980402
34704 -12980402 10197871 37913141 36229251 9741089 -9514116 -7387956 676569
34697 676569 -66348 -4992566 -6645677 -10158005 -21177240 -31809398 -31293989 -22695757
34689 -22695757 -16993449 -15430019 -9611185 2250113 10262132 6559111 -3760814 -9734118
34681 -9734118 -8018125 -4576307 -4754376 -6460388 -4558358 1252532 6556332 9089594
34673 9089594 10593114 10744247 5356927 -4981694 -10331946 -3373689 7680014 8143081
34665 8143081 -2267412 -8817774 -3366007 5723692 9695714 12419828 18590209 20907683
34657 20907683 12361181 2717465 6318708 17533172 16413089 -256124 -11734039 -3499691
34649 -3499691 11342820 11584036 -3522914 -18581824 -26103387 -30663289 -33457560 -29285339
34641 -29285339 -19723200 -14392481 -15097300 -11785787 -217547 8740271 6116647 58633
34633 58633 2414944 8864471 6709506 -3062800 -7582886 -4117200 -3584975 -10259135 -14318266
34624 -14318266 -9611556 -3419366 -1296999 2918461 12596474 18442317 14996479 12636169
34616 12636169 18223252 17928925 -1113688 -23892417 -26121410 -11965616 -6519190 -14383890
34608 -14383890 -15413025 -3608005 1321406 -9641346 -17120335 -7203962 4302270 719664
34600 719664 -7380088 -6248951 -8460897 -29526580 -52685827 -49792852 -26425365 -12781361
34592 -12781361 -15723463 -14207432 -1287026 4752560 -3353021 -8379836 -2724351 -4988332
34584 -4988332 -26048223 -45369086 -41484281 -24467258 -16032927 -14913744 -6143138 7692061
34576 7692061 9823034 -1605558 -10280746 -6830361 742223 2841442 356633 -1095532
34568 -1095532 955433 4859360 5653894 -880519 -10323013 -12115634 -5590341 -3433228
34560 -3433228 -10227429 -10106139 9278947 31415460 29713608 6034134 -10896048 -4786591
34552 -4786591 10799823 16788701 11527838 4177526 1388119 6781507 19885146 29985522
34544 29985522 24160845 6365113 -5270033 -5030346 -7511389 -21497345 -33306008 -28512453
34536 -28512453 -14815867 -7021554 -1439054 15057510 37050558 42438169 22933468
34529 22933468 -3721306 -15704815 -9642945 1825943 5378160 -2792846 -14168877
34522 -14168877 -13783214 3669993 23732438 27416986 16495181 11357765 20465761 25885593
34514 25885593 8791833 -21137907 -35428483 -21611174 4658240 21667069 23371795
34507 23371795 16009622 4602860 -8739703 -19192749 -21349403 -16330703 -10693390 -8242068
34499 -8242068 -7412051 -6301627 -5558812 -6143098 -8453059 -13282469 -18845466 -17997305 -5718035
34490 -5718035 10263443 15373477 7492836 365020 2347528 3005428 -8675176 -22158575
34482 -22158575 -16861008 7737585 29033229 29550813 15361422 3711230 3635766 12287148
34474 12287148 20602100 19221340 7535111 -1283219 5915733 22242368 26772773 13002909
34466 13002909 -2866723 -6932637 -5531912 -9961684 -18011851 -21978248 -22585014 -22973594
34458 -22973594 -20224310 -14812311 -16408677 -26959541 -30988986 -18674369 -5110527 -6871385
34450 -6871385 -12436458 -1146721 18018158 16778760 -6172499 -20636867 -10641116 4947462
34442 4947462 6340442 11426 -753846 1801521 2390937 6617092 16098719 18332644
34434 18332644 8338393 2798778 14136388 27126865 22464758 9141779 9217758 20615213
34426 20615213 20770561 2723539 -16366749 -22042495 -17331274 -10200498 -4369835 -3707380
34418 -3707380 -9961150 -15794079 -14299991 -13153917 -23342210 -37111933 -36454057 -22203512
34410 -22203512 -13291117 -15470493 -13440770 569830 12988532 13169970 10913775 16945777
34402 16945777 23303560 17978471 5557484 -1488108 -1424735 339154 3622288 8735972
34394 8735972 8272802 -2293998 -12897350 -11501223 -2509494 872202 -2708560 -3837826
34386 -3837826 11660 2782704 3803208 8281121 13209562 7835252 -7444753 -15660022
34378 -15660022 -4562659 15173034 21616401 7057375 -15781409 -31058137 -35491058
34371 -35491058 -34562793 -29974379 -19225741 -6853790 -5115255 -16421269 -23867485 -12004583
34363 -12004583 7794494 9442588 -10113534 -24294969 -14539290 4410379 9636332
34356 9636332 4010612 6601459 20063198 28732774 25080411 18413270 17014605 18161461
34348 18161461 17635311 15039062 8231816 -3855814 -11528824 -2246471 18396220 28332215
34340 28332215 17544436 1526818 -1465644 5523162 7192028 109542 -4398703 1891463
34332 1891463 13249723 17445689 8903066 -6087800 -15578632 -14212519 -8746158 -8681898
34324 -8681898 -13612185 -15553552 -11871498 -7612365 -5269726 -1506871 4865896 11336229
34316 11336229 19595579 33589668 46401926 42458444 20598105 2883906 8808637
34309 8808637 28936096 36776892 22032825 -38236 -9805815 -2419170 13704050 27232669
34301 27232669 30903599 25501560 18985501 17384222 17078663 10711384 -1151267 -10494202
34293 -10494202 -12936630 -11887633 -11857436 -13583245 -15708144 -15710100 -9866691 1324563 8499337
34284 8499337 2284448 -12248077 -18484351 -8423155 8116189 18170285 20700120 20568954
34276 20568954 16166588 3991105 -9148413 -11424693 -3701133 -70547 -7446484 -15549838
34268 -15549838 -13306734 -5340305 -2755736 -5009000 -3079950 3269760 4922574 -109389
34260 -109389 -3106122 -542046 -630629 -8139793 -14658831 -12414865 -7074332 -6107750 -3906802
34251 -3906802 7856658 21755140 22302210 9647258 237345 3325614 10875816 12839107
34243 12839107 8900962 1359153 -10738870 -24702205 -32475541 -31786647 -29383425 -28208127
34235 -28208127 -22286248 -10600839 -3964537 -8373121 -12008955 -1288899 17308000 24785945
34227 24785945 15384798 2254946 -1837950 1534342 3639139 1581879 629925 6811989
34219 6811989 18429592 24514392 14815400 -6960868 -24514701 -26304390 -16379450 -5473843
34211 -5473843 1038526 1934353 -3909819 -12765882 -15406058 -10093540 -8387359 -17811267
34203 -17811267 -27016216 -21484097 -7178733 -2347652 -9381573 -12515961 -3869379 5637522
34195 5637522 5351780 -451620 -2969750 -908882 4345828 13558612 22214162 19396173
34187 19396173 3049971 -12783875 -15389437 -10337131 -11144898 -18417584 -20689727 -13092207
34179 -13092207 -4281173 -3901864 -10748693 -15880233 -13947553 -9508684 -11729214 -21742274
34171 -21742274 -28058282 -20537386 -6835122 -4332436 -14677109 -20420270 -12974105 -7863954
34163 -7863954 -18962943 -32096040 -25184574 -6167116 -4971442 -27443623 -43972575
34156 -43972575 -33170872 -13001545 -11800978 -26793563 -33173532 -22780064 -9625545
34149 -9625545 -2161643 4855209 9689915 -26394 -21653663 -30251071 -11726798 13208948
34141 13208948 16112447 319665 -6567237 6572388 22191534 22560550 11197001 1211820
34133 1211820 -1850464 1558494 10924864 21534589 23812292 14915069 4010005 -195329
34125 -195329 247399 501873 2245814 6688607 6470586 -4488809 -17931414 -19221416
34117 -19221416 -6754275 5690006 5553533 -6601541 -21058817 -28509230 -26113009 -19108924
34109 -19108924 -16011771 -19381035 -23806863 -24838572 -24027207 -21768226 -13549357 121822
34101 121822 8865398 6731070 2718859 5303334 5235273 -9981307 -30334153 -31783366
34093 -31783366 -10163921 12665070 19660628 16746436 13931175 7392270 -7382383 -19407213
34085 -19407213 -15146944 12950 7628127 488437 -9932547 -9361469 3370330 15763840
34077 15763840 13455649 -4496253 -20676818 -16739841 1521431 7095474 -13349570
34070 -13349570 -38716225 -39608068 -16680248 2654504 1740447 -8450535 -11424080 -6936297
34062 -6936297 -2326786 4802484 21262327 40572176 45319694 30754219 15305550 18609367
34054 18609367 34180695 35982253 13639023 -11461420 -13752072 2410290 10090449
34047 10090449 -3026775 -21047766 -24931138 -15188029 -3464551 4507494 8315483 6508288
34039 6508288 1171328 -315791 2140598 -2892586 -18407943 -25901861 -9050139 17647591
34031 17647591 24460005 7898543 -5194370 2237133 14897490 11916271 -2183542
34024 -2183542 -8171233 -2096917 2231672 -3348022 -10118736 -6512969 5765134 13562974
34016 13562974 7132610 -8624524 -18066926 -11736190 1587530 4669871 -6341843 -17370610
34008 -17370610 -16206257 -8078701 -5314919 -9207372 -11585042 -9842548 -9697843 -13682589
34000 -13682589 -16368534 -12974818 -5746074 527841 3699525 2619820 -4366392 -15418507
33992 -15418507 -22993792 -20119105 -8691266 1093022 836228 -7049071 -12079209 -8550020
33984 -8550020 -3013261 -4497192 -9346251 -4665556 11229935 23025706 20296263 13894119
33976 13894119 17614886 23304884 13874619 -3553793 -2874411 18140397 27038649 3927965
33968 3927965 -23479666 -16125892 20202477 43699474 35034427 16543665 10986083 11429421
33960 11429421 4028220 -4502200 -1254775 7595705 6404956 -4212178 -9767975 -5127322
33952 -5127322 770933 1084588 -1705684 -3527400 -2188140 5197457 17281250 23102908
33944 23102908 13489051 -3272328 -9338157 -1021703 7642023 6342915 771304 -335258
33936 -335258 1409353 -70017 -5033617 -10247635 -14622361 -16082251 -8726643 9473644
33928 9473644 29270654 37216495 29990405 17561538 11454388 12432722 11985629 5796198
33920 5796198 1314479 6495244 14283808 9942441 -4315531 -7290139 9798496 25820768
33912 25820768 19858942 4886493 8064663 26617942 32644649 20245364 15232089 30199936
33904 30199936 41936515 30240862 11550251 10777349 21282216 19644211 4751436
33897 4751436 -6127671 -9638311 -14972579 -15682821 5691733 41996933 59019880 38490139
33889 38490139 2239632 -16965933 -11283558 5520783 20467747 26888849 19648831
33882 19648831 -75109 -20182013 -28304021 -24372102 -17006419 -12467885 -12269902 -15639616
33874 -15639616 -18549524 -15697816 -8489953 -5240370 -8768430 -10942017 -5481207 1644831
33866 1644831 2723399 1691612 5897800 9645792 -153154 -21949979 -36375069 -29519012
33858 -29519012 -9504911 6004292 10624595 9845634 7245675 1093874 -6451516 -7544810
33850 -7544810 149100 8005636 7741690 2987663 3078285 8821383 12325590 9952133 6831048
33841 6831048 6292749 2605500 -10253018 -27085436 -35077486 -28139850 -13389870 -2785380
33833 -2785380 -791619 -1663225 1656080 8070392 10689163 8133985 7482771 12723059
33825 12723059 17289027 15169727 12557300 17234920 21829455 13139211 -3924952 -10473802
33817 -10473802 -4286085 -5533935 -23263108 -36868276 -26526469 -5033827 1035694
33810 1035694 -9900272 -17213029 -13063840 -10595441 -16950124 -20267761 -10189124 4756008
33802 4756008 8683287 -2549654 -19907719 -32007427 -33468161 -27282101 -20669156 -16395924
33794 -16395924 -11402301 -6618363 -9375247 -19023946 -21283426 -8911879 3240602 58075
33786 58075 -7826989 -1010175 14310338 14771706 -1655388 -14285776 -16952001 -25356242
33778 -25356242 -41162114 -41305331 -17275017 4227618 -481779 -17504750 -20869267 -11568859
33770 -11568859 -6742507 -7222771 -2777352 2368680 -3447460 -13792983 -11259515 3344405
33762 3344405 12291332 9929116 8495837 14344484 18307719 12326239 -924356 -16796466
33754 -16796466 -32107763 -39488372 -33479120 -22393253 -18972164 -20056944 -12323844 2509707
33746 2509707 7961997 545982 -3494322 4708753 12596438 8374590 -758853 -3994623
33738 -3994623 -4583385 -8985438 -12167720 -8431168 -5568833 -12380021 -20810480 -17298485
33730 -17298485 -6065517 -3578597 -11922951 -15079328 -4206315 8475586 7415493 -5412691
33722 -5412691 -15214101 -13528557 -5151454 1301615 3375190 4584506 7401983 8708132
33714 8708132 3249954 -8862571 -20876618 -27182856 -29319391 -30982169 -30103583 -21623998
33706 -21623998 -7496112 2355689 1276554 -6211576 -10279139 -6188909 3600629 13894581
33698 13894581 19305412 15548369 4284351 -4134240 480625 14698886 23030056 16536179
33690 16536179 3982280 -1421230 -804215 -5403328 -15813636 -17989700 -3922852 14194270
33682 14194270 18419623 7180815 -5526991 -8839443 -4078889 2572132 7068369 6580815
33674 6580815 -315827 -9912818 -15245773 -13640894 -8007900 -280952 10097890 19453285
33666 19453285 19115646 6549307 -7900996 -11768443 -5309942 534893 -372816 -2781050
33658 -2781050 -283146 3963938 1213369 -10761659 -23905186 -28226768 -21447995 -10394689
33650 -10394689 -4706015 -8705229 -17298261 -20447187 -14146993 -5661430 -3991223 -7164290
33642 -7164290 -6304378 -1798568 -4135962 -14558011 -18164287 -6757444 3898887 -3361563
33634 -3361563 -16220011 -7468474 21732594 39265528 28544375 11656733 12779125
33627 12779125 22420840 18870871 6093488 3340089 8513290 1474954 -19215428 -31187354
33619 -31187354 -23160383 -9754801 -4201301 1021392 15146224 29982727 34114816 31913283
33611 31913283 33537125 36467530 31621916 20447273 11991592 8007109 4225769 3166887
33603 3166887 11802778 25747584 28338660 11301969 -10612411 -12979624 10551472 38311505
33595 38311505 42257354 19387517 -3962029 -3102046 15951153 27283910 20210616 9419572
33587 9419572 9471985 15394504 15892247 11951932 10596902 9716013 2337493 -9176226 -15330121
33578 -15330121 -13393882 -9146052 -6748353 -5807655 -6586088 -9273943 -9307300 -2033496 8169118
33569 8169118 11130399 3597345 -7672439 -15379014 -18228340 -18351337 -18049899 -19163930
33561 -19163930 -20972131 -19579564 -13593595 -7850160 -6090532 -3189605 8029421 24580671
33553 24580671 36080140 38411986 36079066 31455931 21403818 6800187 -3110392 -444511
33545 -444511 11898657 23322501 24912150 15578320 2985837 -2280754 1869750 5295746
33537 5295746 -597625 -8163785 -2062634 18078909 34429526 32903391 18524968 4977137
33529 4977137 -2039052 -5497600 -8563460 -11733911 -13913298 -12351568 -5893906 -14983
33521 -14983 -2032793 -9587051 -12278585 -7186869 -2573134 -2536921 -694547 3834197 -1835327
33512 -1835327 -24236438 -46857643 -49640485 -37261200 -30510285 -34845098 -37144288 -31997590
33504 -31997590 -29296291 -31155443 -22664521 2688866 24809516 20295636 -5000572 -22259484
33496 -22259484 -14976960 5164262 17076548 13466887 2441714 -5870807 -8577397 -8034327
33488 -8034327 -5118190 2134229 12247301 17049953 10838453 871151 104998 8823122
33480 8823122 13364549 6032517 -4747788 -9762248 -12742904 -19446051 -23982205 -19241085
33472 -19241085 -12622556 -15664275 -23124281 -19445146 -4019283 7704543 9097337 9955313
33464 9955313 15151703 14406560 2169965 -8855824 -6375468 2455415 4388326 1898193
33456 1898193 6308792 16316010 19231183 10425011 -2235093 -11515849 -16305029 -15946182
33448 -15946182 -11102629 -8865393 -15159399 -23207970 -21668937 -13285497 -12247206 -22832060
33440 -22832060 -34518320 -39592877 -40913489 -39518321 -30453606 -16131303 -7773839 -6255150
33432 -6255150 1935738 19667731 27624022 12771743 -7408353 -9041150 1666000 -516557
33424 -516557 -19180265 -32458751 -29202243 -22956961 -24190292 -22974556 -11014972 -286010
33416 -286010 -3517813 -11476432 -7883877 3661428 6743452 -278879 -3162634 3558610
33408 3558610 9306569 7022134 3266725 3337810 904950 -8963470 -17762374 -14885981
33400 -14885981 -3524982 4793040 6258785 5446889 3618717 -2939963 -13441095 -20882995
33392 -20882995 -21182739 -16582439 -8819669 3377288 17630860 26259821 25316698 19373286
33384 19373286 13453973 6368283 -3015789 -9173335 -6858850 -374093 1923698 -262040
33376 -262040 -292673 3888588 7293349 6317993 2252604 -2852663 -6053692 -774420 15284826
33367 15284826 29184866 22364836 -4540628 -28360363 -31274499 -20820601 -14054375
33360 -14054375 -13699880 -12166192 -9074033 -8778376 -6635070 4632295 17166542 14832671
33352 14832671 -574627 -8113925 1553276 11100631 2349665 -16574470 -23209716 -10853926
33344 -10853926 7259138 18724772 23062333 23398580 19832079 13792948 9796199 8681975
33336 8681975 5064862 -4342143 -13696341 -13771317 -3788462 6047397 5552706 -3408255 -9395291
33327 -9395291 -6811537 -3782967 -9786487 -20293639 -23180170 -18465390 -18919817 -28058559
33319 -28058559 -31034313 -15941350 6736936 17732759 14480879 9694456 9039637 5170999
33311 5170999 -5561726 -14005030 -10574756 1897720 12175088 11972187 1087899 -13341638
33303 -13341638 -21071291 -17636312 -10611120 -12184423 -24607644 -37862704 -42023224 -36511759
33295 -36511759 -27015069 -19369819 -17058302 -18458370 -15874501 -3981665 9902247 11637109
33287 11637109 -1335956 -14991990 -16086448 -8220570 -5656727 -15414867 -30264091 -37428807
33279 -37428807 -31340267 -18839931 -12347473 -16746748 -24960703 -28706689 -28808974 -29266610
33271 -29266610 -26938487 -16914136 -3885127 4084959 10358775 23666354 38106824
33264 38106824 36682287 18199613 2906495 4398583 12881438 15563581 16441851 22748474
33256 22748474 27439382 21898002 13987518 15617294 21681404 19644781 12599312 13450727
33248 13450727 20996472 21395533 11445180 1728772 -3125864 -9408732 -18455719 -22942448
33240 -22942448 -21436485 -20803685 -21713036 -17704117 -11377787 -14149815 -24809034 -25963021
33232 -25963021 -10285404 5525998 3926220 -9041444 -14030213 -3279859 15608057
33225 15608057 32446677 40420082 35981598 23010290 12625197 11119791 12726069 10394616
33217 10394616 6996485 8185590 10599015 6388870 -4507611 -14808736 -19734880 -19866493
33209 -19866493 -17341402 -15138432 -16706922 -20632658 -19402717 -9290749 2391336 6402230
33201 6402230 4838385 8278086 20728810 33294927 33643588 19058813 -47767 -9287417
33193 -9287417 -4628865 3295504 2634648 -4160822 -4937850 3525124 10941816 8650656
33185 8650656 -489768 -9740154 -15875294 -15585660 -5425321 9335991 16092380 11313894
33177 11313894 5956641 8405491 12404291 9311772 2065250 -1687992 -1219820 702931
33169 702931 3585330 3959262 -4682495 -18183425 -20478368 -6559667 6864484 6596535
33161 6596535 4044069 13798623 25320817 18922945 333123 -6498677 3149176 10568998
33153 10568998 6879770 4418042 9896672 10761370 -1219675 -12718124 -8574809 5318182
33145 5318182 11803535 5500153 -4917623 -10550796 -9328937 -3914565 900249 1726664
33137 1726664 435541 1212710 4292511 8022640 14467609 24278374 28875148 19616919
33129 19616919 3702237 -2314408 4382142 9813135 5075983 -2918435 -6181521 -7159855
33121 -7159855 -10016113 -12536676 -12337041 -10684727 -6322451 3578871 13908095 15896062
33113 15896062 13065690 17705739 28437645 29323220 17078504 9401601 16550785 24302169
33105 24302169 18299299 6558646 1565878 -2104444 -12130740 -15931799 1708438 28318342
33097 28318342 36485553 22590152 8990923 8845656 11952431 8085736 2717897 2819046
33089 2819046 4434480 2309698 -1663213 -6362181 -15347661 -26037763 -26673664 -12226786
33081 -12226786 6116759 15387640 16645251 18299122 21001879 18818856 10827770 1822422
33073 1822422 -6597099 -16630765 -25873411 -26945600 -18671811 -10718498 -11324963 -14831758
33065 -14831758 -9374248 4121908 10168782 -548578 -17384083 -23784552 -17975103 -9858975
33057 -9858975 -3351453 4504437 9383826 934062 -19074896 -34804598 -37766756 -36283234
33049 -36283234 -37346494 -34156514 -21615973 -10035297 -9883486 -13999127 -9874556 -1185264
33041 -1185264 -1495102 -12146825 -21381406 -22039958 -17079896 -10791928 -6554906 -9278133
33033 -9278133 -17979423 -20756267 -10177043 1671633 -1607566 -15311691 -20288762 -11741385
33025 -11741385 -3122863 -2485210 -4140719 -5110643 -10354253 -17746703 -16723998 -7822896
33017 -7822896 -5644725 -14981594 -21472883 -15342327 -7624947 -10820679 -18119931 -15798903
33009 -15798903 -4701332 4804139 10230907 15603566 19633322 17941939 11842293 4595042
33001 4595042 -4809204 -14453097 -14477686 -1316288 11313085 10157608 4080329 10713951
32993 10713951 26058964 27683259 9167692 -9018268 -9676326 -2060621 -3856018 -14178851
32985 -14178851 -19328634 -16438535 -14355228 -13626784 -2918619 19839701 36467132 29221828
32977 29221828 5414352 -10454969 -7147855 2726332 4793510 2940146 8469729 18782375
32969 18782375 21175210 14941029 14094377 24827994 34104345 28130749 11043349 -4503639
32961 -4503639 -16006030 -27869269 -36065098 -31332052 -16445344 -5600554 -4079887 -1899424
$$ [...]
##END NTUPLES=NMR SPECTRUM
##END=
