##TITLE=31Pdec_IBBPA2401A
 D2O, 64 sc
 25.1.2023
##JCAMPDX= 6.0         $$ Bruker NMR JCAMP-DX V2.0
##DATA TYPE= NMR SPECTRUM
##DATA CLASS= NTUPLES
##ORIGIN= UXNMR, Bruker Analytische Messtechnik GmbH
##OWNER= root
$$ XWIN-NMR		Version 3.5
$$ Wed Jan 25 16:09:33 2023 Russian Standard Time (UT+4h)  she@DPX200
##.OBSERVE FREQUENCY= 81.013821
##.OBSERVE NUCLEUS= ^31P
##.ACQUISITION MODE= SIMULTANEOUS
##.ACQUISITION SCHEME= undefined
##.AVERAGES= 64
##.DIGITISER RES= 16
##SPECTROMETER/DATA SYSTEM= spect
##.PULSE SEQUENCE= zgpg30
##.SOLVENT NAME= D2O
##.SHIFT REFERENCE= (INTERNAL, D2O, 0, 248.564)
##AUDIT TRAIL= $$ (NUMBER, WHEN, WHO, WHERE, WHAT)
$$ ##TITLE= Audit trail, XWIN-NMR		Version 3.5
$$ ##JCAMPDX= 5.01
$$ ##ORIGIN= Bruker BioSpin GmbH
$$ ##OWNER= she
$$ F:/spectra/data/she/nmr/P31/1/pdata/1/auditp.txt
$$ ##AUDIT TRAIL=  $$ (NUMBER, WHEN, WHO, WHERE, WHAT)
(   1,<2023-01-25 16:08:38.18 +0400>,<she>,<DPX200>,
      <continue with go, POWCHK disabled, PULCHK disabled
       configuration hash MD5:
       00 E9 B6 7A A2 85 ED C7 34 08 36 98 17 FE 4E 26
       data hash MD5: 32K
       E8 03 0B 07 FD 31 29 8C 09 DD A3 E9 09 B6 CF 6C>)
(   2,<2023-01-25 16:08:40.39 +0400>,<she>,<DPX200>,
      <Start of raw data processing
       efp BC_mod = 2 LB = 1 FT_mod = 6 PKNL = 1 PHC0 = -11053.23 PHC1 = 222.2578 SI = 64K 
       data hash MD5: 64K
       4C D8 3B 04 36 DC 7B F9 5E C8 AD D6 22 FA 71 8B>)
(   3,<2023-01-25 16:08:54.42 +0400>,<she>,<DPX200>,
      <pk PHC0 = 1.345147 PHC1 = 0 
       data hash MD5: 64K
       0B FC FC 29 8F 53 D1 7F FD 96 42 E3 94 43 F2 A8>)
(   4,<2023-01-25 16:08:58.15 +0400>,<she>,<DPX200>,
      <abs ABSG = 5 
       data hash MD5: 64K
       12 A4 A1 D1 E4 BF DE 3F 38 17 2A D8 26 56 95 A8>)
$$ ##END=
$$ 
$$ hash MD5
$$ AF 0D AC F1 84 98 30 1C 85 34 88 35 72 FC 04 C3
##$RELAX= 
##$RELAX= 
##$RELAX= 
##$RELAX= 
##$RELAX= 
##$RELAX= 
##$RELAX= 
##$RELAX= 
##$RELAX= 
$$ Bruker specific parameters
$$ --------------------------
##$DU= <F:/spectra>
##$EXPNO= 1
##$NAME= <P31>
##$PROCNO= 1
##$TYPE= <nmr>
##$USER= <she>
##$AMP= (0..31)
100 100 100 100 100 100 100 100 100 100 100 100 100 100 100 100 100 100 
100 100 100 100 100 100 100 100 100 100 100 100 100 100 
##$AQSEQ= 0
##$AQ_mod= 1
##$AUNM= <au_zg>
##$AUTOPOS= <>
##$BF1= 81.014009
##$BF2= 200.13
##$BF3= 200.13
##$BF4= 200.13
##$BF5= 200.13
##$BF6= 200.13
##$BF7= 200.13
##$BF8= 200.13
##$BYTORDA= 1
##$CFDGTYP= 0
##$CFRGTYP= 5
##$CHEMSTR= <none>
##$CNST= (0..31)
1 1 145 1 1 1 1 1 1 1 1 1 1 1 1 1 1 1 1 1 1 1 1 1 1 1 1 1 1 1 1 1 
##$CPDPRG= <waltz16>
##$CPDPRG1= <>
##$CPDPRG2= <waltz16>
##$CPDPRG3= <>
##$CPDPRG4= <mlev>
##$CPDPRG5= <mlev>
##$CPDPRG6= <mlev>
##$CPDPRG7= <mlev>
##$CPDPRG8= <mlev>
##$CPDPRGB= <>
##$CPDPRGT= <>
##$D= (0..31)
0 1 0 0 0 0 0 0 0 0 0 0.03 2e-05 3e-06 0 0 0 0 0 0 0 0 0 0 0 0 0 0 0 0 
0 0 
##$DATE= 1674648417
##$DBL= (0..7)
120 120 120 11 120 120 24 19 
##$DBP= (0..7)
150 150 150 150 150 150 150 150 
##$DBP07= 0
##$DBPNAM0= <>
##$DBPNAM1= <>
$$ [...]
##$SUBNAM3= <"">
##$SUBNAM4= <"">
##$SUBNAM5= <"">
##$SUBNAM6= <"">
##$SUBNAM7= <"">
##$SUBNAM8= <"">
##$SUBNAM9= <"">
##$SW= 501.771253377433
##$SWIBOX= (0..15)
0 1 3 0 0 0 0 0 0 0 0 0 0 0 0 0 
##$SW_h= 40650.406504065
##$TD= 32768
##$TD0= 1
##$TE= 0
##$TE2= 300
##$TE3= 300
##$TEG= 300
##$TL= (0..7)
0 120 53 12 22 120 120 120 
##$TP= (0..7)
150 150 150 150 150 150 150 150 
##$TP07= 0
##$TPNAME0= <>
##$TPNAME1= <>
##$TPNAME2= <>
##$TPNAME3= <>
##$TPNAME4= <>
##$TPNAME5= <>
##$TPNAME6= <>
##$TPNAME7= <>
##$TPOAL= (0..7)
0.5 0.5 0.5 0.5 0.5 0.5 0.5 0.5 
##$TPOFFS= (0..7)
0 0 0 0 0 0 0 0 
##$TUNHIN= 0
##$TUNHOUT= 0
##$TUNXOUT= 0
##$USERA1= <user>
##$USERA2= <user>
##$USERA3= <user>
##$USERA4= <user>
##$USERA5= <user>
##$V9= 5
##$VALIST= <valist>
##$VCLIST= <CCCCCCCCCCCCCCC>
##$VD= 0
##$VDLIST= <DDDDDDDDDDDDDDD>
##$VPLIST= <PPPPPPPPPPPPPPP>
##$VTLIST= <TTTTTTTTTTTTTTT>
##$WBST= 1024
##$WBSW= 4
##$XGAIN= (0..3)
0 0 0 0 
##$XL= 0
##$YL= 0
##$YMAX_a= 6826
##$YMIN_a= -10494
##$ZGOPTNS= <>
##$ZL1= 120
##$ZL2= 120
##$ZL3= 120
##$ZL4= 120
##$ABSF1= 248.5645
##$ABSF2= -253.2056
##$ABSG= 5
##$ABSL= 3
##$ALPHA= 0
##$AQORDER= 0
##$ASSFAC= 0
##$ASSFACI= 0
##$ASSFACX= 0
##$ASSWID= 0
##$AUNMP= <proc_1d>
##$AZFE= 0.1
##$AZFW= 0.5
##$BCFW= 0
##$BC_mod= 2
##$BYTORDP= 0
##$COROFFS= 0
##$CY= -3
##$DATMOD= 1
##$DC= 0
##$DFILT= <>
##$DTYPP= 0
##$F1P= 0
##$F2P= 0
##$FCOR= 1
##$FTSIZE= 65536
##$FT_mod= 6
##$GAMMA= 0
##$GB= 0
##$INTBC= 1
##$INTSCL= 6.047779e-11
##$ISEN= 30
##$LB= 1
##$LEV0= 0
##$LPBIN= 0
##$MAXI= 10000
##$MC2= 0
##$MEAN= 0
##$ME_mod= 0
##$MI= 50
##$NCOEF= 0
##$NC_proc= -7
##$NLEV= 6
##$NOISF1= 182.463
##$NOISF2= 159.3651
##$NSP= 0
##$NTH_PI= 0
##$NZP= 0
##$OFFSET= 248.5645
##$PC= 4
##$PHC0= -11051.89
##$PHC1= 222.2578
##$PH_mod= 1
##$PKNL= yes
##$PPARMOD= 0
##$PSCAL= 0
##$PSIGN= 0
##$REVERSE= no
##$SF= 81.0140089999694
##$SI= 65536
##$SIGF1= 159.3651
##$SIGF2= -187.1042
##$SINO= 113.3802
##$SIOLD= 16384
##$SREGLST= <1H.CDCl3>
##$SSB= 0
##$STSI= 65536
##$STSR= 0
##$SW_p= 40650.406504065
##$SYMM= 0
##$S_DEV= 0
##$TDeff= 32768
##$TDoff= 0
##$TI= <>
##$TILT= no
##$TM1= 0
##$TM2= 0
##$TOPLEV= 0
##$USERP1= <user>
##$USERP2= <user>
##$USERP3= <user>
##$USERP4= <user>
##$USERP5= <user>
##$WDW= 1
##$XDIM= 65536
##$YMAX_p= 382765257
##$YMIN_p= -66259847
$$ End of Bruker specific parameters
$$ ---------------------------------
##NTUPLES= NMR SPECTRUM
##VAR_NAME=  FREQUENCY,     SPECTRUM/REAL,   SPECTRUM/IMAG
##SYMBOL=    X,             R,               I
##VAR_TYPE=  INDEPENDENT,   DEPENDENT,       DEPENDENT
##VAR_FORM=  AFFN,          ASDF,            ASDF
##VAR_DIM=   65536,         65536,           65536
##UNITS=     HZ,            ARBITRARY UNITS, ARBITRARY UNITS
##FACTOR=    0.620285442955139, 1,           1
##FIRST=     20137.2065510682, 0,            0
##LAST=      -20513.1999529968, 0,           0
##MIN=       -20513.1999529968, -66259847,   0
##MAX=       20137.2065510682, 382765257,    0
$$ Real data points
##PAGE= N=1
##DATA TABLE= (X++(R..R)), XYDATA
$$ [...]
$$ plain form
39129 -1436468 -2689344 -811375 1910668 1704193 -746247 -1249292 1387489 4198902
39121 4198902 5652062 7680065 10954907 12733861 11554148 10135356 11005710 12449497
39113 12449497 11508586 8456699 5788494 4864643 5624786 7593019 9440057 9678447 9173374
39104 9173374 10424357 13114632 13624628 10664201 7728981 7602790 8188242 6826638 5061641
39095 5061641 5379573 6558223 6448442 6336302 7882528 8497140 5112776 437396 -479462
39086 -479462 1250821 -499033 -7133422 -12559271 -11252629 -4264732 3951262 10156061
39078 10156061 12453401 10269764 6188388 4259704 4834416 4401458 1812254 701121
39070 701121 3691115 7960881 9314423 7677578 5772419 4847611 4552181 5017530 6306916
$$ packed form
39129a436468j252876J877969K722043k06475k450440n03045K636781K811413
39121D198902J453160K028003L274842J778954j179713j418792Q70354J443787
39113A2449497r40911l051887k668205r23851P60143J968233J847038K38390n05073
39104I173374J250983K690275N09996k960427k935220j26191N85452j361604j764997
39095E061641L17932J178650j09781j12140J546226O14612l384364m675380r16858
39086d79462J730283j749854o634389n425849J306642O987897Q215994O204799
39078A0156061K297340k183637m081376j928684N74712m32958k589204j111133
39070G01121K989994M269766J353542j636845j905159r24808k95430M65349J289386
$$ plain form
39061 6306916 7313819 7541138 8489369 11118683 13521818 13448360 11717562 10678404 10489352
39052 10489352 9570817 8028089 7961464 10336063 13538822 15301066 14792099 12856632 11118463
39043 11118463 10530335 10159888 8221297 4951992 3067577 4237250 6670699 7757691
39035 7757691 7452500 6951164 5664199 2515632 -612702 -170542 4086587 8431939 10173953
39026 10173953 10501964 11165045 11072318 8370926 4147940 1616483 2248319 4591635 6628047
39017 6628047 7708966 8145121 8167551 7687363 6591101 5242230 4683418 5483737 6061919
39008 6061919 3665308 -1773428 -6260381 -6207031 -3063900 -852516 16338 2770917 7927520
38999 7927520 11190544 9556628 5740420 3722880 3281911 2601908 3162906 6954748 10836522
$$ packed form
39061F306916J006903K27319R48231K629314K403135p3458j730798j039158j89052
39052A0489352r18535j542728o6625K374599L202759J762244n08967j935467j738169
39043A1118463n88128l70447j938591l269305j884415J169673K433449J086992
39035G757691l05191n01336j286965l148567l128334M42160M257129M345352J742014
39026A0173953L28011O63081r2727k701392m222986k531457O31836K343316K036412
39017F628047J080919M36155K2430m80188j096262j348871n58812Q00319N78182
39008F061919k396611n438736m486953N3350L143131K211384Q68854K754579N156603
38999G927520L263024j633916l816208k017540m40969o80003N60998L791842L881774
$$ plain form
38990 10836522 9683584 4714166 2530521 5124599 7145069 5141721 3135352 5203486
38982 5203486 8214153 7298641 4287632 4455382 7520308 8363687 5541706 2859183 2483363
38973 2483363 2329836 1333377 2038672 5799642 9442922 9315715 6117847 3637720 4330170
38964 4330170 7360870 9694570 8767398 5543305 4423973 7952569 12570198 12987882
38956 12987882 10171272 10535509 16560084 22863138 23628769 19975618 17150329 17485469
38948 17485469 19373035 21190831 22908160 24429582 24819937 23444692 20943224 19023762
38940 19023762 19054410 20090281 19097607 14774912 10204344 9342282 11785764 13877346 13855391
38931 13855391 12185547 8080908 944310 -5111889 -4452561 1375587 4554618 2466846
$$ packed form
38990A0836522j152938m969418k183645K594078K020470k003348k006369K068134
38982E203486L010667r15512l011009J67750L064926Q43379k821981k682523l75820
38973B483363j53527r96459P05295L760970L643280j27207l197868k480127O92450
38964D330170L030700K333700r27172l224093j119332L528596M617629M17684
38956A2987882k816610L64237O024575O303054P65631l653151k825289L35140
38948A7485469J887566J817796J717329J521422L90355j375245k501468j919462
38940A9023762L0648J035871r92674m322695m570568q62062K443482K091582k1955
38931A3855391j669844m104639p136598o056199O59328N828148L179031k087772
$$ plain form
38923 2466846 1344807 5370622 9471287 8054718 4220999 3572497 4413680 2032640
38915 2032640 -1413329 -143833 4413816 5071874 686912 -2095616 51166 2166829
38907 2166829 -429798 -5176012 -7005324 -4927165 -821711 4028026 8089227 8735492
38899 8735492 5409253 1444375 510790 2928505 6632939 9647699 10684440 9567449
38891 9567449 7851085 6923398 5462266 1536751 -2966341 -3790440 -722848 1443809
38883 1443809 -351807 -3476725 -4066408 -2082899 -25098 521604 -644257 -2638498
38875 -2638498 -2952720 466870 5416584 6974593 4134723 1337521 1937676 4173103
38867 4173103 5511947 6459836 7239994 5386178 673985 -1706238 2111395 7940327
$$ packed form
38923B466846j122039M025815M100665j416569l833719o48502Q41183k381040
38915B032640l445969J269496M557649O58058m384962k782528K146782K115663
38907B166829k596627m746214j829312K078159M105454M849737M061201O46265
38899H735492l326239l964878r33585K417715L704434L014760J036741j116991
38891I567449j716364r27687j461132l925515m503092q24099L067592K166657
38883A443809j795616l124918n89683J983509K057801N46702j165861j994241
38875b638498l14222L419590M949714J558009k839870k797202O00155K235427
38867D173103J338844R47889P80158j853816m712193k380223L817633N828932
$$ plain form
38859 7940327 8936709 5362121 3248060 4818130 6315974 5174177 3481491 3242095
38851 3242095 3204556 2170154 1335729 1338076 442681 -2120440 -3907711 -2728699 -152931
38842 -152931 798920 -150126 -884973 -374142 255594 -302363 -1878717 -2917861 -1626303
38833 -1626303 2123332 5493598 4780623 42826 -3852364 -2728127 1469087 3276425
38825 3276425 1273471 -211114 2170105 5695268 5888157 3605162 3800699 7639705
38817 7639705 10062074 6695954 -80118 -4376699 -3822224 -734863 2004708 3275883
38809 3275883 2884125 1388806 552496 1599560 3304406 3841588 3679037 4136980 4225468
38800 4225468 2385398 663983 2843778 8024212 10485722 7393562 2693433 1322422
$$ packed form
38859G940327R96382l574588k114061J570070J497844j141797j692686k39396
38851C242095l7539j034402q34425K347q95395k563121j787271J179012K575768
38842a52931R51851r49046p34847N10831O29736n57957j576354j039144J291558
38833a626303L749635L370266p12975m737797l895190J124237M197214J807338
38825C276425k002954j484585K381219L525163J92889k282995J95537L839006
38817G639705K422369l366120o776072m296581N54475L087361K739571J271175
38809C275883l91758j495319q36310J047064J704846N37182j62551M57943Q8488
38800D225468j840070j721415K179795N180434K461510l092160m700129j371011
$$ plain form
38792 1322422 3001343 4181678 3267815 1345148 -56832 278669 2752180 5478015
38784 5478015 5507443 2992943 1515122 2748702 3932784 2559419 137727 -1119517
38776 -1119517 -1735051 -2164426 -395529 3867574 6288379 3799003 293717 1238923 5175487
38767 5175487 6292063 3540586 1023776 343669 -1054450 -3897310 -5529754 -5120930
38759 -5120930 -4935151 -5434342 -4383626 -1954656 -1335705 -2693300 -1994501 1878821 4148324
38750 4148324 1382173 -2938657 -3716341 -1231916 870672 1282795 944314 91749 -862619
38741 -862619 14054 2900499 3868887 -244307 -6446079 -9055227 -7058631 -3930067 -1452999
38732 -1452999 1525764 4525758 4608674 1307520 -1640774 -1325595 578020 919315 -568734
$$ packed form
38792A322422J678921J180335r13863j922667j401980L35501K473511K725835
38784E478015K9428k514500j477821J233580J184082j373365k421692j257244
38776a119517o15534m29375J768897M263103K420805k489376l505286R45206L936564
38767E175487J116576k751477k516810o80107j398119k842860j632444M08824
38759e120930J85779m99191J050716K428970O18951j357595O98799L873322K269503
38750D148324k766151m320830p77684K484425K102588M12123l38481q52565r54368
38741h62619Q76673K886445R68388m113194o201772k609148J996596L128564K477068
38732a452999K978763K999994Q2916l301154k948294L15179J903615L41295j488049
$$ plain form
38723 -568734 -1985645 -2243206 -1169952 1673114 5790728 8389452 6866447 2490384
38715 2490384 -715170 -925556 -103091 -226943 -611774 -353172 -734277 -2553517 -3159232
38706 -3159232 84508 4357026 3876498 -1698712 -5840545 -3761254 1742725 5462678
38698 5462678 6543421 6477795 4301863 -1098193 -6527206 -7956173 -6901635 -7671455 -9422305
38689 -9422305 -7424762 -2078900 514700 -1498362 -2305174 1924482 6451954 5609683
38681 5609683 1684894 597210 2618361 3400914 1702350 23647 -1109350 -3583574
38673 -3583574 -6593187 -6599495 -3337381 -1137712 -2498374 -4153199 -1924631 3214055 6601052
38664 6601052 5973413 3607196 2641210 3206697 3052329 1223161 -231209 1144362 4798108
$$ packed form
38723e68734j416911k57561J073254K843066M117614K598724j523005m376063
38715B490384l205554k10386Q22465j23852l84831K58602l81105j819240o05715
38706c159232L243740M272518m80528n575210m141833K079291N503979L719953
38698E462678J080743o5626k175932n400056n429013j428967J054538p69820j750850
38689i422305J997543N345862K593600k013062q06812M229656M527472q42271
38681E609683l924789j087684K021151P82553j698564j678703j132997k474224
38673c583574l009613o308L262114K199669j360662j654825K228568N138686L386997
38664F601052o27639k366217r65986N65487j54368j829168j454370J375571L653746
$$ plain form
38655 4798108 7777912 8435943 7748918 6885697 5713587 4487473 4667481 6530479 7875001
38646 7875001 6827946 4363912 2421131 1195721 112424 -241529 681698 1716384
38638 1716384 1739546 1748298 2880204 3767230 2574874 566246 620272 2794298 4362049
38629 4362049 4050196 3249583 2810950 1597221 -880511 -2812037 -2418321 -427098 932197
38620 932197 577700 -431965 -58169 2639301 6119177 7494044 5733542 2974557 1658112
38611 1658112 1351840 -81332 -2940225 -5123528 -4831145 -2308892 900757 3177213
38603 3177213 3603462 2676787 1840567 1445949 108443 -2816139 -5389099 -5317424 -2919412
38594 -2919412 -175953 2029829 3870677 5016140 5308109 5880606 7205175 7075282 3325422
$$ packed form
38655D798108K979804O58031o87025q63221j172110j226114J80008J862998J344522
38646G875001j047055k464034j942781j225410j083297l53953R23227J034686
38638A716384K3162Q752J131906Q87026j192356k008628N4026K174026J567751
38629D362049l11853q00613m38633j213729k477732j931526L93716J991223J359295
38620I32197l54497j009665L73796K697470L479876J374867j760502k758985j316445
38611A658112l06272j433172k858893k183303K92383K522253L209649K276456
38603C177213M26249r26675q36220l94618j337506k924582k572960P1675K398012
38594b919412K743459K205782J840848J145463K91969N72497J324569j29893l749860
$$ plain form
38585 3325422 -2132016 -4950278 -3831462 -1645018 -1184464 -2515489 -4528109 -6254305
38577 -6254305 -6268753 -3582981 16031 863535 -2343558 -6943249 -9562481 -9308181 -7301235
38568 -7301235 -4849885 -2790080 -1280297 268557 2119141 3206765 2413417 509626
38560 509626 -547847 60061 1563865 2767302 2465976 -77738 -3547046 -4964917 -3471584
38551 -3471584 -1798778 -1814941 -1231098 1929166 4342346 1720400 -3659065 -5353015 -2040267
38542 -2040267 1255909 1353258 584345 1310060 2241465 1987786 1549507 1478090 748519 -184085
38532 -184085 481825 1690147 316187 -2806462 -3208971 -538118 316458 -2032724 -2623394
38523 -2623394 592280 2006976 -2113976 -6340792 -4777287 -943503 -1397064 -4555038
$$ packed form
38585C325422n457438k818262J118816K186444M60554j331025k012620j726196
38577f254305j4448K685772L599012Q47504l207093m599691k619232K54300K006946
38568g301235K451350K059805J509783J548854J850584J087624p93348j903791
38560E09626j057473O07908J503804J203437l01326k543714l469308j417871J493333
38551c471584J672806j6163N83843L160264K413180k621946n379465j693950L312748
38542b040267L296176R7349p68913P25715R31405k53679m38279p1417p29571r32604
38532a84085O65910J208322j373960l122649m02509K670853Q54576k349182n90670
38523b623394L215674J414696m120952m226816J563505L833784m53561l157974
$$ plain form
38515 -4555038 -4413450 -1698390 -2141704 -5695658 -6534684 -3093174 465467 2731414 6411411
38506 6411411 10349522 8860429 1490581 -4289753 -3491041 16843 1168270 1409316
38498 1409316 4161870 7860136 8763520 7074227 5431819 4034127 1547976 -1319095
38490 -1319095 -2969057 -3745231 -4381421 -3767360 -1523176 -475223 -2786461 -5569755 -4504461
38481 -4504461 -512848 1437099 -391351 -2535826 -1748773 1283254 4141371 5399166
38473 5399166 4475588 1649201 -968739 -1064168 483953 354503 -2290671 -4426294 -3914782
38464 -3914782 -2636563 -2796738 -2838561 -85788 4362722 6861765 6498625 5681753 5660455
38455 5660455 5033527 3249025 1922567 1257392 -1272940 -6281175 -9721832 -8128095
$$ packed form
38515d555038J41588K715060m43314l553954q39026L441510L558641K265947L679997
38506F411411L938111j489093p369848n780334P98712L507884J151427K41046
38498A409316K752554L698266R03384j689293j642408j397692k486151k867071
38490a319095j649962p76174o36190O14061K244184J047953k311238k783294J065294
38481d504461L991613J949947j828450k144475P87053L032027K858117J257795
38473E399166r23578k826387k617940r5429J548121j29450k645174k135623N11512
38464c914782J278219j60175m1823K752773M448510K499043l63140q16872k1298
38455E660455o26928j784502j326458o65175k530332n008235l440657J593737
$$ plain form
38447 -8128095 -4041141 -2157325 -2007488 504056 5100703 6532114 3004182 -416912
38439 -416912 518119 2914392 1799760 -2148669 -4273849 -2890749 -286131 1604663
38431 1604663 2491237 1948490 301128 313459 3969951 8242276 8229294 4186906 1073999
38422 1073999 1022433 983939 -1192710 -3107623 -2277852 -217429 548799 331862 517601
38413 517601 761717 639781 1566946 4137921 5705821 3808200 438099 -280310 2445191
38404 2445191 6002175 8778033 11168362 12464531 10481392 5416294 1203410 1113564
38396 1113564 3597737 4332252 1646044 -1742666 -2433011 -467623 1124758 429929 -1084389
38387 -1084389 -1092776 21813 -72513 -1736494 -2530614 -886014 1678201 3276740 4399824
$$ packed form
38447h128095M086954J883816J49837K511544M596647J431411l527932l421094
38439d16912R35031K396273j114632l948429k125180J383100K604618J890794
38431A604663Q86574n42747j647362J2331L656492M272325j2982m042388l112907
38422A073999n1566l8494k176649j914913Q29771K060423P66228k16937J85739
38413E17601K44116j21936R27165K570975J567900j897621l370101p18409K725501
38404B445191L556984K775858K390329J296169j983139n065098m212884q9846
38396A113564K484173P34515k686208l388710o90345J965388J592381o94829j514318
38387a084389q387J114589r4326j663981p94120J644600K564215J598539J123084
$$ plain form
38378 4399824 5890935 6059223 2806011 -2099031 -4001067 -1028263 3695602 6200317
38370 6200317 5812722 4154692 2174213 -1891 -1613228 -1782093 -1103119 -1004218 -1537161
38361 -1537161 -1309140 134939 1341245 1095698 304713 521115 1433461 1438770 421583
38352 421583 27615 708233 516962 -1763314 -3992980 -3420163 -1142242 -1128344 -4737228
38343 -4737228 -8838402 -10110707 -8713706 -6443110 -3756223 -785257 678297 -933334
38335 -933334 -4088505 -5877725 -5966246 -6035430 -5810814 -3175757 1344004 4025680 3451613
38326 3451613 2932893 4778755 5491580 864970 -6200526 -8222226 -3444205 1423584
38318 1423584 386694 -4178399 -5816306 -2739197 1175156 2165974 -149782 -4272010
$$ packed form
38378D399824J491111J68288l253212m905042j902036K972804M723865K504715
38370F200317l87595j658030j980479k176104j611337j68865O78974R8901n32943
38361a537161K28021J444079J206306k45547p90985K16402R12346N309j017187
38352D21583l93968O80618j91271k280276k229666N72817K277921J3898l608884
38343d737228m101174j272305J397001K270596K686887K970966J463554j611631
38335i33334l155171j789220q8521o9184K24616K635057M519761K681676n74067
38326C451613n18720J845862P12825m626610p065496k021700M778021M867789
38318A423584j036890m565093j637907L077109L914353R90818k315756m122228
$$ plain form
38310 -4272010 -8203400 -9562392 -7211901 -3033338 44515 1586478 3051253 4295026
38302 4295026 3729409 1934830 1673291 3445834 4242782 2077484 -1178259 -3161356 -4398001
38293 -4398001 -6144958 -7281050 -5937341 -2558193 958627 3710586 5327468 4695864
38285 4695864 1469859 -2422171 -4852664 -5781692 -5752943 -4106516 -949839 1297532 1201896
38276 1201896 1028673 2828792 4030269 1217159 -3365837 -4113536 -167831 3889576
38268 3889576 5328033 5876134 6508787 5440607 3111332 3531735 7621243 10129428 7083230
38259 7083230 2200735 1360324 3885602 4443180 1624479 -713682 -121302 1385292 1604908
38250 1604908 1357834 1887363 2187102 974234 -653664 -677901 660111 1076317 -400321
$$ packed form
38310d272010l931390j358992K350491M178563L077853J541963J464775J243773
38302D295026n65617j794579k61539J772543P96948k165298l255743j983097j236645
38293d398001j746957j136092J343709L379148L516820K751959J616882o31604
38285D695864l226005l892030k430493r29028K8749J646427L156677K247371r5636
38276A201896j73223J800119J201477k813110m582996p47699L945705M057407
38268C889576J438457N48101O32653j068180k329275M20403M089508K508185l046198
38259G083230m882495q40411K525278N57578k818701k338161N92380J506594K19616
38250A604908k47074N29529K99739j212868j627898k4237J338012M16206j476638
$$ plain form
38241 -400321 -1886496 -1281047 555717 853060 -881164 -1744260 347397 3242403 3546592
38232 3546592 1594219 426478 567245 -529528 -3560983 -5676584 -4918710 -2979148
38224 -2979148 -1844888 -867576 672543 1029875 -1169085 -3702712 -3285435 -83325 2504119
38215 2504119 1491789 -3637195 -10648219 -14853245 -12227320 -4430782 1670855 1902754
38207 1902754 -318321 377887 3786579 6004111 6178417 6538644 7122697 5531217 1744632
38198 1744632 -1238202 -1896395 -1622752 -1442259 -699966 856240 2824062 5637507 8958760
38189 8958760 9443686 4487877 -2241473 -4116368 -720534 1711719 13795 -1743223
38181 -1743223 -66982 2052475 1018133 -771390 611694 3257236 2178749 -2692955
$$ packed form
38241d00321j486175O05449J836764K97343j734224q63096K091657K895006L04189
38232C546592j952373j167741J40767j096773l031455k115601P57874J939562
38224b979148J134260R77312J540119L57332k198960k533627M17277L202110K587444
38215B504119j012330n128984p011024m205026K625925P796538O101637K31899
38207A902754k221075O96208L408692K217532J74306L60227N84053j591480l786585
38198A744632k982834o58193K73643J80493P42293J556206J967822K813445L321253
38189H958760M84926m955809o729350j874895L395834K432253j697924j757018
38181a743223J676241K119457j034342j789523J383084K645542j078487m871704
$$ plain form
38173 -2692955 -6568634 -6710702 -4634321 -2248425 -269156 -881 -2301490 -4739958
38165 -4739958 -3827333 -222463 2223682 2612453 3597164 5313241 4098681 -634746 -3492909
38156 -3492909 -729832 3525146 3399147 354012 431492 4296992 6437750 4287755 1765568
38147 1765568 1953507 2176292 -152046 -1744259 1423005 6360998 6277450 415964 -4789937
38138 -4789937 -4689754 -1703486 -437061 -1722813 -3495931 -4297398 -3670905 -1511541 1071272
38129 1071272 2303115 2470069 3613389 5342092 4321114 -116824 -3636311 -3199333
38121 -3199333 -1930213 -3490756 -5077647 -1775414 4332908 6215489 2688944 198004
38113 198004 2362875 4367508 1117371 -4356362 -5303085 -652334 4758433 7414146
$$ packed form
38173b692955l875679j42068K076381K385896J979269K68275k300609k438468
38165d739958R12625L604870K446145L88771R84711J716077j214560m733427k858163
38156c492909K763077M254978j25999l045135P7480L865500K140758k149995k522187
38147A765568J87939K22785k328338j592213L167264M937993q3548n861486n205901
38138d789937J00183K986268J266425j285752j773118q01467O26493K159364K582813
38129A071272J231843J66954J143320J728703j020978m437938l519487M36978
38121c199333J269120j560543j586891L302233O108322J882581l526545k490940
38113A98004K164871K004633l250137n473733r46723M650751N410767K655713
$$ plain form
38105 7414146 8025483 7888355 6509340 3628115 778459 -494835 -651892 -1472945 -3810185
38096 -3810185 -6353053 -6703713 -4087948 -836562 -79321 -1796046 -2606313 -137806 3814942
38087 3814942 5500603 3432476 -679454 -4245011 -5824249 -5397421 -3711541 -1440630
38079 -1440630 1137835 3387020 3782950 1344205 -2611265 -5542468 -6445830 -6136996 -5211769
38070 -5211769 -3770728 -2849320 -3439852 -3979736 -1925275 1555862 1990865 -1870819 -5522194
38061 -5522194 -4976787 -2251364 -1537263 -2791352 -2949859 -1496427 -589907 -553461 675140
38052 675140 3465138 5293285 4447860 2577399 2642796 5532055 8897608 8830865 3761950
38043 3761950 -2503363 -3711621 1184617 5812340 4501637 -63892 -1351525 1060099
$$ packed form
38105G414146O11337j37128j379015k881225k849656j273294j57057q21053k337240
38096c810185k542868l50660K615765L251386P57241j716725q10267K468507L952748
38087C814942J685661k068127m111930l565557j579238M26828J685880K270911
38079a440630K578465K249185L95930k438745l955470k931203r03362L08834R25227
38070e211769J441041R21408n90532n39884K054461L481137M35003l861684l651375
38061e522194N45407K725423P14101j254089j58507J453432R06520L6446J228601
38052F75140K789998J828147q45425j870461O5397K889259L365553o6743n068915
38043C761950o265313j208258M896238M627723j310703m565529j287633K411624
$$ plain form
38035 1060099 1517895 -2225374 -5450899 -3846778 471645 2788905 1970635 117618
38027 117618 -1298859 -2353041 -3413540 -4861396 -6700941 -7442137 -5243042 -1055797
38019 -1055797 1626491 1198814 -321874 -1068889 -1886434 -3391697 -3492674 -446714 3863303
38010 3863303 6349504 6567907 5739257 3992248 1465193 311378 2187444 4858444
38002 4858444 4703932 1997557 420541 1597822 3372005 3661493 2881721 1935466 774339
37993 774339 38754 1446157 4894382 7178904 5523191 1265836 -1629348 -1107362 1339628
37984 1339628 3243928 3922245 4139184 3948361 2322532 -531303 -1878544 480522 4180933
37975 4180933 4141504 -512690 -4230541 -2002711 3899153 7402843 7029406 6566161 7944975
$$ packed form
38035A060099M57796l743269l225525J604121M318423K317260q18270j853017
38027A17618j416477j054182j060499j447856j839545p41196K199095M187245
38019a055797K682288m27677j520688p47015q17545j505263j00977L045960M310017
38010C863303K486201K18403q28650j747009k527055j153815J876066K671000
38002D858444j54512k706375j577016J177281J774183K89488p79772r46255j161127
37993G74339p35585J407403L448225K284522j655713m257355k895184N21986K446990
37984A339628J904300O78317K16939j90823j625829k853835j347241K359066L700411
37975D180933l9429m654194l717851K227830N901864L503690l73437m63245J378814
$$ plain form
37966 7944975 8196887 4719172 -324911 -2984915 -2190915 516032 3609273 5897728
37958 5897728 6115407 4279631 2220338 1293082 919156 457509 542686 1163817 693967
37949 693967 -1249555 -2276065 -924625 424388 -627605 -1923567 44276 3756826
37941 3756826 4125178 148545 -3521015 -3538490 -1982839 -1674250 -1405480 1113904 4438943
37932 4438943 5171624 3128685 1289395 1018545 506829 -1416635 -2475648 301362 5948715
37923 5948715 9416107 6702577 -428579 -5877147 -5588408 -1394579 2319482 4234756
37915 4234756 6170989 8484219 8847846 6464099 4303408 5046470 7047115 6879238 4463449
37906 4463449 3003768 4530262 7965325 11402492 14092415 15965171 16986068 17457544
$$ packed form
37966G944975K51912l477715n044083k660004P94000K706947L093241K288455
37958E897728K17679j835776k059293r27256l73926m61647Q5177O21131m69850
37949F93967j943522j026510J351440J349013j051993j295962J967843L712550
37941C756826L68352l976633l669560j7475J555651L08589K68770K519384L325039
37932D438943P32681k042939j839290k70850n11716j923464j059013K777010N647353
37923E948715L467392k713530p131156n448568K88739M193829L714061J915274
37915D234756J936233K313230L63627k383747k160691P43062K000645j67877k415789
37906D463449j459681J526494L435063L437167K689923J872756J020897M71476
$$ plain form
37898 17457544 17836358 18136856 18426601 19622224 22700003 27436160 32910844 38518010
37890 38518010 43155355 44510252 41457202 36766236 34814468 36154811 36644616 32833389
37882 32833389 26244985 21088120 19184305 18544285 16192087 11357455 6205126 3775882
37874 3775882 4767289 6467906 5688332 2416984 -615432 -1482699 -348370 2426621 6843455
37865 6843455 11325959 12773200 10031592 5679377 3199820 3829893 6832045 10645451
37857 10645451 12598631 10043473 3887789 -974862 -1017648 1814747 3511204 3432684 3367469
37848 3367469 3004564 426475 -3413410 -4828750 -2650322 122424 951165 894662 1619656
37839 1619656 2103299 550340 -2178526 -3255494 -1200335 2871815 6517386 7515009
$$ packed form
37898A7457544L78814L00498K89745J195623L077779M736157N474684N607166
37890C8518010M637345J354897l053050m690966j951768J340343M89805l811227
37882C2833389o588404n156865j903815o40020k352198m834632n152329k429244
37874C775882R91407J700617p79574l271348l032416q67267J134329K774991M416834
37865F843455M482504J447241k741608m352215k479557O30073L002152L813406
37857A0645451J953180k555158o155684m862651m2786K832395J696457p8520o5215
37848C367469l62905k578089l839885j415340K178428K772746Q28741n6503P24994
37839A619656M83643j552959k728866j076968K055159M072150L645571R97623
$$ plain form
37831 7515009 5231480 1543909 -500096 133784 1523321 1671342 938869 595897 509697
37822 509697 -82779 -647664 -95571 1189900 1876116 1889920 2361049 3407443 3574767
37813 3574767 1741278 -1603069 -5072544 -7229114 -6742071 -3184930 1846137 5563527
37805 5563527 6523697 5542867 3925020 2097001 591466 812639 3253980 5785579 5626857
37796 5626857 3036068 1233601 2027092 3242020 2001700 -671252 -930325 2226363
37788 2226363 4963782 3694901 214347 -577921 2837991 7015477 8404038 7136092
37780 7136092 5195200 3406378 1993092 2108414 4331288 6619999 6246649 3597132
37772 3597132 1971440 3463921 6793501 9391715 9876265 8092934 4601793 1127031
$$ packed form
37831G515009k283529l687571k044005O33880J389537J48021p32473l42972q6200
37822E09697n92476n64885N52093J285471O86216J3804M71129J046394J67324
37813C574767j833489l344347l469475k156570M87043L557141N031067L717390
37805E563527R60170r80830j617847j828019j505535K21173K441341K531599j58722
37796E626857k590789j802467P93491J214928j240320k672952k59073L156688
37788B226363K737419j268881l480554p92268L415912M177486J388561j267946
37780G136092j940892j788822j413286J15322K222874K288711l73350k649517
37772C597132j625692J492481L329580K598214M84550j783331l491141l474762
$$ plain form
37764 1127031 103519 2415726 6093630 8085327 7120495 4669670 3588855 5691772
37756 5691772 9763806 12155631 10574824 7083453 5666154 6993654 8012671 7089966
37748 7089966 6415107 7719732 8820712 7368171 5521179 6945940 10550671 11631219
37740 11631219 9068436 6919843 7895827 9446786 8358353 5680197 4254831 4030339
37732 4030339 3158980 2058421 2823766 5108118 5777434 3161862 -574703 -2072472 -451714
37723 -451714 2200684 3300960 2526294 2220834 4374428 7191145 6567183 1934497 -1817863
37714 -1817863 -503510 3462257 4574019 2011171 -264699 -445070 -925756 -2612563
37706 -2612563 -2203868 2298758 7354169 8558438 6780055 6122770 7788979 9513397
$$ packed form
37764A127031j023512K312207L677904J991697r64832k450825j080815K102917
37756E691772M072034K391825j580807l491371j417299J327500J019017r22705
37748G089966o74859J304625J100980j452541j846992J424761L604731J080548
37740A1631219k562783k148593R75984J550959j088433k678156j425366k24492
37732D030339q71359j100559P65345K284352O69316k615572l736565j497769J620758
37723d51714K652398J100276p74666l05460K153594K816717o23962m632686l752360
37714a817863J314353L965767J111762k562848k275870j80371m80686j686807
37706b612563M08695M502626N055411J204269j778383o57285J666209J724418
$$ plain form
37698 9513397 9716321 8768117 7057098 5080395 4650205 6600473 7952436 5195254 218294
37689 218294 -1255732 2226507 5736804 5563824 4569555 7096378 12136216 15320022 15197466
37680 15197466 13583118 11530927 9343532 9498155 14635891 22261851 26034212 23822807
37672 23822807 20655109 21722470 26026463 29640776 32141089 36154667 42534530 49903056
37664 49903056 57959434 67289453 76070453 80844995 81265475 80602678 80382983 77880308
37656 77880308 70830722 61626804 54130554 48542842 42527090 35953629 31132096 28823201
37648 28823201 27268036 25509473 24812107 25782474 26362993 24240449 19994922 16485031
37640 16485031 15598418 16409310 16352355 13949221 10463307 8559056 9175556 10700350 11761949
$$ packed form
37698I513397K02924r48204j711019j976703m30190J950268J351963k757182m976960
37689B18294j474026L482239L510297j72980r94269K526823N039838L183806j22556
37680A5197466j614348k052191k187395J54623N137736P625960L772361k211405
37672B3822807l167698J067361M303993L614313K500313M013578O379863P368526
37664D9903056Q056378R330019Q781000M774542M20480o62797k19695k502675
37656G7880308p049586r203918p496250n587712o015752o573461m821533k308895
37648B8823201j555165j758563o97366R70367N80519k122544m245527l509891
37640A6485031q86613Q10892n6955k403134l485914j904251O16500J524794J061599
$$ plain form
37631 11761949 13147896 15479024 16903844 15713132 13664345 13252787 12919377 9500204
37623 9500204 4923088 4633744 8178082 7887199 507873 -5926681 -2716344 6482328
37615 6482328 10661658 7121893 3831334 5956622 8334766 4551658 -2975672 -6927540
37607 -6927540 -5138087 -1666847 138647 961098 2294695 3681871 4076582 3845718 4238837
37598 4238837 5418087 5647172 3037704 -1417060 -3602715 -826656 4120335 5986743
37590 5986743 3839306 1626246 1805865 2442673 1912652 2126444 4463769 6469745 6044387
37581 6044387 5354564 6480724 6595341 2748496 -1220572 1029566 8283164 12642138
37573 12642138 10621316 6777444 5020325 3015080 -1794273 -6376060 -6496412 -2804224
$$ packed form
37631A1761949J385947K331128J424820j190712k048787m11558l33410l419173
37623I500204m577116k89344L544338k90883p379326o434554L210337R198672
37615F482328M179330l539765l290559K125288K378144l783108p527330l951868
37607f927540J789453L471240J805494Q22451J333597J387176L94711k30864L93119
37598D238837J179250K29085k609468m454764k185655K776059M946991J866408
37590E986743k147437k213060J79619O36808n30021K13792K337325K005976m25358
37581F044387o89823J126160J14617l846845l969068K250138P253598M358974
37573A2642138k020822l843872j757119k005245m809353m581787j20352L692188
$$ plain form
37565 -2804224 1314800 4421152 5995456 4498918 629748 -987854 1913421 4492339
37557 4492339 1697216 -3035153 -2501628 2797226 5420412 2896695 965589 3355295
37549 3355295 5955058 4630120 2254442 3108918 5373383 4743724 1915271 754604
37541 754604 1354307 478732 -2299975 -3981508 -3081203 -732212 2634389 7221727 10710535
37532 10710535 9884786 5926294 3605894 4228144 3814176 -95776 -4178464 -4430018 -1935331
37523 -1935331 -374214 -354273 465178 3135749 6160025 7599095 6488381 3272524 425588
37514 425588 999897 4660079 6934723 4660195 356516 -1545389 -1089679 -1856686 -4651328
37505 -4651328 -6248526 -4772289 -2586571 -2502771 -3987002 -4825120 -4435671 -3743463 -3199926
$$ packed form
37565b804224M119024L106352J574304j496538l869170j617602K901275K578918
37557D492339k795123m732369N33525N298854K623186k523717j931106K389706
37549C355295K599763j324938k375678Q54476K264465o29659k828453j160667
37541G54604N99703q75575k778707j681533R00305K348991L366601M587338L488808
37532A0710535q25749l958492k320400O22250m13968l909952m082688k51554K494687
37523a935331J561117J9941Q19451K670571L024276J439070j110714l215857k846936
37514D25588N74309L660182K274644k274528m303679j901905M55710p67007k794642
37505d651328j597198J476237K185718Q3800j484231q38118L89449O92208N43537
$$ plain form
37496 -3199926 -2621613 -2231410 -2590815 -3797501 -5261638 -5858133 -4420064 -1180187 1341701
37487 1341701 511969 -2954667 -5384432 -4697751 -2828395 -2498659 -3354068 -3134955 -1486337
37478 -1486337 -324427 -682957 -1335236 -1120443 -1043456 -2856656 -6146576 -8043417 -6274435
37469 -6274435 -2048538 906838 534481 -1000493 79463 4221371 7532528 6222434
37461 6222434 1017215 -3678902 -4331482 -1150281 2948310 5082497 4198703 1233315
37453 1233315 -1899741 -3675469 -3630320 -2030103 541552 3063153 4267900 3742744 2569352
37444 2569352 2049816 1821953 193884 -3182367 -5797183 -4562896 405012 5327878
37436 5327878 6580637 4151954 641577 -2077529 -3654912 -3582905 -1366995 1244069
$$ packed form
37496c199926N78313L90203l59405j206686j464137n96495J438069L239877K521888
37487A341701q29732l466636k429765O86681J869356L29736q55409K19113J648618
37478a486337J161910l58530o52279K14793P6987j813200l289920j896841J768982
37469f274435M225897K955376l72357j534974J079956M141908L311157j310094
37461F222434n205219m696117o52580L181201M098591K134187q83794k965388
37453A233315l133056j775728M5149J600217K571655K521601J204747n25156j173392
37444B569352n19536k27863j628069l376251k614816J234287M967908M922866
37436E327878J252759k428683l510377k719106j577383P2007K215910K611064
$$ plain form
37428 1244069 1064207 -1931275 -3391294 -380740 3933495 4777806 3146275 4134709 8505806
37419 8505806 11209971 9390503 6593100 6424615 6903761 5113595 3270002 4678913
37411 4678913 6523246 3302329 -3461062 -5878312 -1135351 4123881 3426786 -1173723
37403 -1173723 -4075840 -4384654 -4057423 -1788878 4595423 11471992 12173114 6693568 2231256
37394 2231256 2573295 3221541 62440 -3151609 -1174872 3263592 3009101 -2455240 -6226180
37385 -6226180 -4301893 -496297 511141 -343643 248859 2357660 3713697 3419563 1862737
37376 1862737 -758968 -3323207 -3656490 -2071027 -2227885 -5382977 -6875514 -2636267
37368 -2636267 3521568 4675407 1252080 242221 3955580 6448341 3274437 -1441111
$$ packed form
37428A244069j79862k995482j460019L010554M314235Q44311j631531R88434M371097
37419H505806K704165j819468k797403j68485M79146j790166j843593J408911
37411D678913J844333l220917o763391k417250M742961N259232o97095m600509
37403a173723k902117l08814L27231K268545O384301O876569P01122n479546m462312
37394B231256L42039O48246l159101l214049J976737M438464k54491n464341l770940
37385f226180J924287L805596J007438q54784N92502K108801J356037k94134j556826
37376A862737k621705k564239l33283J585463j56858l155092j492537M239247
37368b636267O157835J153839l423327j009859L713359K492761l173904m715548
$$ plain form
37360 -1441111 -1569110 2094396 4242444 3326220 2344310 2770220 2433450 -321958 -3846213
37351 -3846213 -5437697 -4260863 -1300885 2192747 5526681 8332604 9867201 9080706
37343 9080706 6253505 3894730 4020159 4789145 2631407 -1910630 -3841486 -514671
37335 -514671 4622022 7031837 6468766 4876536 2438347 -778387 -2190587 216038
37327 216038 4283555 6890034 8457340 10307662 10325349 6489634 2499059 3629119 8083131
37318 8083131 9057832 5264426 2529628 4049126 6050703 5268868 4006148 4502482 4440782
37309 4440782 2320302 1925049 6268198 11228841 10785124 5810883 2380688 3139140 5147401
37300 5147401 5117523 2539767 -1615185 -5715281 -7652891 -7030344 -6068445 -6070747 -5180549
$$ packed form
37360a441111j27999L663506K148048r16224r81910M25910l36770k755408l524255
37351c846213j591484J176834K959978L493632L333934K805923J534597p86495
37343I080706k827201k358775J25429P68986k157738m542037j930856L326815
37335e14671N136693K409815n63071j592230k438189l216734j412200K406625
37327B16038M067517K606479J567306J850322J7687l835715l990575J130060M454012
37318H083131R74701l793406k734798J519498K001577p81835j262720M96334o1700
37309D440782k120480l95253M343149M960643m43717m974241l430195P58452K008261
37300E147401k9878k577756m154952m100096j937610O22547R61899k302Q90198
$$ plain form
37291 -5180549 -2408458 -844357 -2800882 -4704209 -2124536 2284549 2031248 -3106320
37283 -3106320 -6745271 -5735453 -3731222 -3718505 -3416125 -682353 2054488 2096837 803847
37274 803847 375816 216583 -305643 707241 3879024 5684776 3437752 185173 273171
37265 273171 2541860 2757940 1007253 1354600 4737496 7367272 6757276 4862061 4067265
37256 4067265 3929144 3450990 3255568 3603605 3040940 1121993 191620 2137719 5058974
37247 5058974 5541781 3175446 606190 -158714 638752 2112891 3644914 4068484 2236699
37238 2236699 -683116 -1345418 1806124 5887513 6720124 4083811 1824246 2640052 4963541
37229 4963541 6001935 5768913 5997851 6368510 4673408 775429 -2237592 -1875437 618487
$$ packed form
37291e180549K772091J564101j956525j903327K579673M409085k53301n137568
37283c106320l638951J009818K004231J2717L02380K733772K736841M2349j292990
37274H03847m28031j59233n22226J012884L171783J805752k247024l252579Q7998
37265B73171K268689K16080j750687L47347L382896K629776o09996j895215p94796
37256D067265j38121m78154j95422L48037n62665j918947r30373J946099K921255
37247E058974M82807k366335k569256p64904P97466J474139J532023M23570j831785
37238B236699k919815o62302L151542M081389Q32611k636313k259565Q15806K323489
37229D963541J038394k33022K28938L70659j695102l897979l013021L62155K493924
$$ plain form
37220 618487 2161598 1533263 6763 -714861 -134118 753965 195706 -2368152 -4772232
37211 -4772232 -4133302 -975110 769840 -883438 -3001430 -2242836 -46190 -114127 -2272981
37202 -2272981 -2806034 -552372 1424625 1070135 477258 1962263 3989576 3537932 683368
37193 683368 -1682284 -1743174 -267665 1231306 1984308 1687569 225706 -1906730 -3601877
37184 -3601877 -3963999 -3178085 -2536817 -3074513 -3648583 -1269838 5205492 12291401 14847153
37175 14847153 11906145 7462970 5233643 5076988 5263994 5450256 5776353 5428208 4118135
37166 4118135 3074911 2659961 1080330 -2300740 -4566082 -3059601 207527 1267977
37158 1267977 -97729 -1003365 -742609 -1254006 -2558288 -2136470 362832 1829539 510195
$$ packed form
37220F18487J543111o28335j526500p21624N80743Q88083n58259k563858k404080
37211d772232O38930L158192J744950j653278k117992P58594K196646o7937k158854
37202b272981n33053K253662J976997l54490n92877J485005K027313m51644k854564
37193F83368k365652o0890J475509J498971P53002k96739j461863k132436j695147
37184c601877l62122P85914O41268n37696n74070K378745O475330P085909K555752
37175A4847153k941008m443175k229327j56655J87006J86262L26097l48145j310073
37166D118135j043224m14950j579631l381070k265342J506481L267128J060450
37158A267977j365706r05636K60756n11397j304282M21818K499302J466707j319344
$$ plain form
37149 510195 -1415933 -1732214 -1339629 -1536185 -1304107 163572 946239 -652158 -2714700
37140 -2714700 -2337108 -119251 999433 282891 -463841 -418865 -548812 -966096 -283462
37131 -283462 1867028 3784673 3779426 1840346 -934253 -3125932 -3256821 -947951 1903682
37122 1903682 2533525 287933 -2731113 -3945835 -2375879 976972 3551151 2784827
37114 2784827 -1015868 -3992790 -2903768 646962 2541755 2092714 2338254 4199908
37106 4199908 4289371 348680 -4455904 -5520626 -2881843 -258310 564063 1158073 2742674
37097 2742674 4122032 3878005 2392425 850890 -225124 -628739 222615 2658970 5754700
37088 5754700 7444282 5860876 1074720 -4284015 -7032574 -6771147 -6282283 -7673973
$$ packed form
37149E10195j926128l16281L92585j96556K32078J467679P82667j598397k062542
37140b714700L77592K217857J118684p16542p46732M4976j29947m17284O82634
37131b83462K150490J917645n247j939080k774599k191679j30889K308870K851633
37122A903682O29843k245592l019046j214722J569956L352851K574179p66324
37114B784827l800695k976922J089022L550730J894793m49041K45540J861654
37106D199908Q9463l940691m804584j064722K638783K623533Q22373N94010J584601
37097B742674J379358k44027j485580j541535j076014m03615Q51354K436355L095730
37088E754700J689582j583406m786156n358735k748559K61427M88864j391690
$$ plain form
37080 -7673973 -9408073 -8883082 -6797334 -6205421 -7459083 -7299672 -4096236 -1091413 -2133205
37071 -2133205 -6060672 -8183809 -6619814 -4331857 -4591950 -6841715 -8102186 -6789266
37063 -6789266 -3813338 -985713 324339 -389076 -2356967 -3758109 -3374915 -1894372
37055 -1894372 -767633 -189321 669242 1769435 2080142 1407527 716494 261424 -793893
37046 -793893 -2149211 -1851487 499489 2052857 509398 -2050296 -2168257 -679911 -1527476
37037 -1527476 -5054168 -6857969 -4557617 -1382390 -488121 356062 4448310 9409014
37029 9409014 9821552 5560538 2466836 4313067 8473156 10739433 10468561 8995084
37021 8995084 6349036 2348339 -1222339 -2271096 -1071816 650597 2063575 2984792
$$ packed form
37080g673973j734100N24991K085748N91913j253662J59411L203436L004823j041792
37071b133205l927467k123137J563995K287957k60093k249765j260471J312920
37063f789266K975928K827625J310052p13415j967891j401142L83194J480543
37055a894372J126739N78312Q58563J100193L10707o72615o91033m55070j055317
37046g93893j355318K97724K350976J553368j543459k559694j17961J488346q47565
37037a527476l526692j803801K300352L175227Q94269Q44183M092248M960704
37029I409014M12538m261014l093702J846231M160089K266277k70872j473477
37021H995084k646048m000697l570678j048757J199280J722413J412978R21217
$$ plain form
37013 2984792 2853853 1936268 2066812 3949323 5158915 3485173 929413 1009514 2885505
37004 2885505 2332918 -995497 -1792630 3124489 8875163 8103609 776880 -5487505 -4769881
36995 -4769881 751492 4633739 3825671 735986 -913585 -193298 1085510 1113810 -8262
36986 -8262 -851350 -637947 -253052 -1010488 -2591853 -2955334 -849147 2030736 2417476
36977 2417476 -695889 -4442554 -5081594 -2200745 984216 1397951 -839288 -3265605
36969 -3265605 -3847049 -2311799 248552 2132592 2110068 886190 980214 3846043 7387154
36960 7387154 7865008 4490411 639140 -139759 1963182 4086498 4613527 4476982 4837998
36951 4837998 5115725 4079516 1979222 450706 450545 1370842 2520504 4258856 6534250
$$ packed form
37013B984792j30939r17585J30544J882511J209592j673742k555760Q0101J875991
37004B885505n52587l328415p97133M917119N750674p71554p326729o264385P17624
36995d769881N521373L882247q08068l089685j649571P20287J278808K8300j122072
36986h262q43088K13403L84895p57436j581365l63481K106187K879883L86740
36977B417476l113365l746665o39040K880849L184961M13735k237239k426317
36969c265605n81444J535250K560351J884040k2524j223878R4024K865829L541111
36960G387154M77854l374597l851271p78899K102941K123316N27029j36545L61016
36951D837998K77727j036209k100294j528516j61R20297J149662J738352K275394
$$ plain form
36942 6534250 7347689 4853652 921191 -54229 3012630 5852146 4752336 2109145
36934 2109145 2660386 5733694 5836361 1186013 -3060132 -2110776 1723101 2697110 -483206
36925 -483206 -3910851 -4302748 -2292532 -225900 649276 548723 549642 1786069 3976716
36916 3976716 5014318 3232310 -345218 -3069826 -3216382 -496233 4432390 9169787
36908 9169787 9891012 5191701 -1169000 -4055101 -2928427 -1320011 -1000063 -205100 2093270
36899 2093270 3860741 3327699 1754098 1169272 1480434 1361558 377387 -847850 -1038479
36890 -1038479 1559546 7169038 12209245 12029217 7038729 2946073 3252599 4982497
36882 4982497 4381702 3242438 5516800 10148595 12122387 9743942 6361164 4795987
$$ packed form
36942F534250Q13439k494037l932461r75420L066859K839516j099810k643191
36934B109145N51241L073308J02667m650348m246145R49356L833877R74009l180316
36925d83206l427645l91897K010216K066632Q75176j00553R19J236427K190647
36916C976716J037602j782008l577528k724608j46556K720149M928623M737397
36908I169787P21225m699311o360701k886101J126674J608416L19948P94963K298370
36899B093270J767471n33042j573601n84826L11162j18876r84171j225237j90629
36890a038479K598025N609492N040207j80028m990488m092656L06526J729898
36882D982497o00795j139264K274362M631795J973792k378445l382778j565177
$$ plain form
36874 4795987 4136188 2813521 1368603 906253 1494836 3199337 6273825 9275659 9421290
36865 9421290 6221255 2737640 1826076 2951373 4095996 4869966 5864342 6543829 6068328
36856 6068328 5288682 5709937 6911647 7047826 5757872 4603438 4505960 4761045 5048309
36847 5048309 6261638 8201336 8466611 5616147 2008706 1045464 2469825 3383156 3639065
36838 3639065 6354001 11811003 14897806 11781961 6166515 4654527 7629442 9584319
36830 9584319 7962977 6363324 7890947 10294313 10151061 8009444 6494727 6351275
36822 6351275 7195475 9423687 12329845 12806812 9236615 4702407 3122219 4005371 4250039
36813 4250039 3273458 2793271 3109713 3337228 3996710 5636622 6248222 4115851 1948597
$$ packed form
36874D795987o59799j322667j444918m62350N88583J704501L074488L001834J45631
36865I421290l200035l483615r11564J125297J144623P73970R94376O79487m75501
36856F068328p79646M21255J201710J36179j289954j154434r7478K55085K87264
36847E048309J213329J939698K65275k850464l607441r63242J424361R13331K55909
36838C639065K714936N457002L086803l115845n615446j511988K974915J954877
36830I584319j621342j599653J527623K403366j43252k141617j514717j43452
36822F351275Q44200K228212K906158M76967l570197m534208j580188Q83152K44668
36813D250039r76581m80187L16442K27515O59482J639912O11600k132371k167254
$$ plain form
36804 1948597 3618695 7724044 9356157 7778561 6958528 8291824 8536113 6177818
36796 6177818 4304818 5058396 6209806 5828953 5922356 8520509 11901323 13509921 13319140
36787 13319140 11915064 8834718 5320103 4957590 8654187 12526764 13713152 14512725
36779 14512725 17474322 20364897 20075173 17869183 16307522 14483759 11323078 10198267
36771 10198267 14243513 19640804 20154046 16739883 15806647 18710184 20264305 18146230
36763 18146230 16370851 17392793 17660599 14579530 12186868 15219626 21417115 24525038
36755 24525038 22708577 19764841 19200212 20691088 22055417 22051099 21072215 20566705 21677209
36746 21677209 23824453 25431213 26460924 28749184 33035126 37331671 39450758 39793994
$$ packed form
36804A948597J670098M105349J632113j577596q20033J333296K44289k358295
36796F177818j873000P53578J151410l80853R3403K598153L380814J608598j90781
36787A3319140j404076l080346l514615l62513L696597L872577J186388P99573
36779A4512725K961597K890575k89724k205990j561661j823763l160681j124811
36771A0198267M045246N397291N13242l414163r33236K903537J554121k118075
36763A8146230j775379J021942K67806l081069k392662L032758O197489L107923
36755B4525038j816461k943736n64629J490876J364329m318r78884n05510J110504
36746B1677209K147244J606760J029711K288260M285942M296545K119087L43236
$$ plain form
36738 39793994 40493933 43034818 47729277 54179247 61149521 67315423 73195687 80840768
36730 80840768 90401103 98837351 104056988 108977491 118881345 135024587 153183103 168844658
36722 168844658 181727010 194036703 205782574 213863405 215954920 213773901 211327163
36715 211327163 210513607 209890245 207854482 205375578 204579369 205839616 207666638 208868004
36707 208868004 209627849 210828599 213027221 215344255 214888168 208943799 198820331 189374043
36699 189374043 182783141 175142331 162142534 145869166 131932746 121617389 112038920
36692 112038920 103251442 98820592 98198853 95017864 86192389 77288774 74405406 75078975
36684 75078975 72685322 66790218 62804559 62479708 61127807 55379776 48588775 46122334
$$ packed form
36738C9793994O99939K540885M694459O449970O970274O165902N880264P645081
36730H0840768R560335Q436248N219637M920503R903854J6143242J8158516J5661555
36722A68844658J2882352J2309693J1745871Q080831K091515k181019k446738
36715B11327163q13556o23362k035763k478904p96209J260247J827022J201366
36707B08868004P59845J200750K198622K317034m56087n944369j0123468r446288
36699A89374043o590902p640810j2999797j6273368j3936420j0315357r578469
36692A12038920q787478m430850o21739l180989q825475q903615k883368O73569
36684G5078975k393653n895104l985659l24851j351901n748031o791001k466441
$$ plain form
36676 46122334 48596754 52191297 53422644 51333767 46544186 40566832 35570168 32897254
36668 32897254 31665371 30019498 27832322 26897814 27983291 29062871 27939788 25872876
36660 25872876 26312931 29612381 31541016 28844103 24168611 22672756 25105499 27700019
36652 27700019 28376922 29067614 31283842 33318920 33522824 33101425 33658356 34749201 35867868
36643 35867868 38018242 41005772 42051103 39963008 38054065 39611215 42857823 44142511
36635 44142511 43863489 44601720 44985407 41085548 34029936 30594412 34298884 40345463
36627 40345463 42118205 39443138 37332725 38718126 41645461 42835391 41426349 39165962
36619 39165962 38468946 40390529 43642476 45694747 45304360 43556882 42118105 41260669
$$ packed form
36676D6122334K474420L594543J231347k088877m789581n977354m996664k672914
36668C2897254j231883j645873k187176r34508J085477J079580j123083k066912
36660B5872876M40055L299450J928635k696913m675492j495855K432743K594520
36652B7700019O76903O90692K216228K035078K03904m21399N56931J090845J118667
36643C5867868K150374K987530J045331k088095j908943J557150L246608J284688
36635D4142511k79022P38231L83687l899859p055612l435524L704472O046579
36627D0345463J772742k675067k110413J385401K927335J189930j409042k260387
36619C9165962o97016J921583L251947K052271l90387j747478j438777q57436
$$ plain form
36611 41260669 40212112 38653534 36967858 35478478 34419111 34531709 36679195 40370706
36603 40370706 43250471 42974286 39822129 36758195 36331396 38085343 39856448 40970924
36595 40970924 42656571 45499036 48394408 50534278 52683579 55577852 58492102 60395040
36587 60395040 61355718 62071448 63271681 66057124 71059946 76704952 80596364 83534553
36579 83534553 89355433 99221098 109153176 115639101 120675478 128116839 137926600 148101912
36571 148101912 159857530 175893395 194851968 212718326 229274064 247940341 268996796
36564 268996796 288334090 304179968 319990385 338435362 356714952 370430966 378690488
36557 378690488 382765257 382559601 377043572 366113494 350131132 329781134 307795123
$$ packed form
36611D1260669j048557j558578j685676j489380j059367J12598K147486L691511
36603D0370706K879765k76185l152157l063934m26799J753947J771105J114476
36595D0970924J685647K842465K895372K139870K149301K894273K914250J902938
36587F0395040R60678P15730J200233K785443N002822N645006L891412K938189
36579H3534553N820880R865665R932078O485925N036377P441361R809761J0175312
36571A48101912J1755618J6035865J8958573J7866358J6555738J8666277K1056455
36564B68996796J9337294J5845878J5810417J8444977J8279590J3716014Q259522
36557C78690488M074769k05656n516029j0930078j5982362k0349998k1986011
$$ plain form
36550 307795123 287973732 270615776 251787085 229332903 206774341 188628162 174519816
36543 174519816 161021952 147217789 135191504 126411043 120449194 116066220 111200048
36536 111200048 103521694 93586685 85681877 82570005 80969103 75531055 66027246 57032101
36528 57032101 51301810 47185127 42465504 37347838 33271129 31449813 32613166 35631520
36520 35631520 36829001 33726363 29130766 27987161 30247882 30994529 28231400 25836653
36512 25836653 26777943 27912384 25021596 19664845 16810507 17686142 19229289 19483200
36504 19483200 19214319 18492986 16143839 13437779 14130125 18854504 22976201 22716701 20521019
36495 20521019 20906051 23212222 22882572 18996618 15622552 15094714 14774334 12419641 10237732
$$ packed form
36550C07795123j9821391j7357956j8828691k2454182k2558562j8146179j4108346
36543A74519816j3497864j3804163j2026285q780461n961849m382974m866172
36536A11200048p678354r935009p904808l111872j600902n438048r503809q995145
36528E7032101n730291m116683m719623n117666m076709j821316J163353L018354
36520C5631520J197481l102638m595597j143605K260721P46647k763129k394747
36512B5836653R41290J134441k890788n356751k854338Q75635J543147K53911
36504A9483200k68881p21333k349147k706060O92346M724379M121697k59500k195682
36495B0521019L85032K306171l29650l885954l374066n27838l20380k354693k181909
$$ plain form
36486 10237732 10336725 10133698 6935152 4137684 6972310 13349149 15436735 10999182
36478 10999182 6810929 8406945 12177669 11707135 7554851 5521320 7627301 10038353
36470 10038353 9273969 6232386 3911686 4228844 7126153 10357322 10551975 6905827
36462 6905827 3121647 3073317 5445317 5794414 3094827 391465 -768207 -2024036 -3447319
36453 -3447319 -1755955 4263848 10231647 11349354 8682497 6980195 7967487 9343270
36445 9343270 9563443 9849963 10999266 11452464 10066017 8515696 8813047 9635629 7559659
36436 7559659 2068702 -2667012 -2100473 3682834 10445465 14552962 15835775 16167705
36428 16167705 17065916 18951396 20924489 20542035 15714349 8174459 3367411 4842877
$$ packed form
36486A0237732R8993k03027l198546k797468K834626O376839K087586m437553
36478A0999182m188253J596016L770724m70534m152284k033531K105981K411052
36470A0038353p64384l041583k320700L17158K897309L231169J94653l646148
36462F905827l784180m8330K372000L49097k699587k703362j159672j255829j423283
36453c447319J691364O019803N967799J117707k666857j702302R87292J375783
36445I343270K20173K86520J149303M53198j386447j550321K97351Q22582k075970
36436G559659n490957m735714N66539N783307O762631M107497J282813L31930
36428A6167705Q98211J885480J973093l82454m827686p539890m807048J475466
$$ plain form
36420 4842877 9656315 11384706 7367295 1197308 -1800574 102037 4330326 7187762
36412 7187762 7280486 6442134 7423573 10635421 13885122 15362361 15294054 14133036 11389600
36403 11389600 7715351 5789640 6890869 8715485 9247977 10497245 14797969 19405129
36395 19405129 19421883 15147033 11544680 10525323 8901396 4756044 693134 -901647
36387 -901647 -1089507 -756911 1665290 6123243 8764359 7148546 4179804 3589507 4748321
36378 4748321 5262364 5366786 5945744 5360369 2490178 1411 -27964 -777500 -5393076
36369 -5393076 -9513213 -5959845 3930257 10728611 9333848 4328856 1413034 199739
36361 199739 -1397412 -1739435 865122 3480210 2691965 456274 713457 2320081 868177
$$ packed form
36420D842877M813438J728391m017411o169987k997882J902611M228289K857436
36412G187762R2724q38352R81439L211848L249701J477239o8307j161018k743436
36403A1389600l674249j925711J101229J824616N32492J249268M300724M607160
36395A9405129J6754m274850l602353j019357j623927m145352m062910j594781
36387i01647j87860L32596K422201M457953K641116j615813k968742n90297J158814
36378D748321N14043J04422N78958n85375k870191k488767k9375p49536m615576
36369e393076m120137L553368R890102O798354j394763n004992k915822j213295
36361A99739j597151l42023K604557K615088p88245k235691K57183J606624j451904
$$ plain form
36352 868177 -3223693 -4052921 1201949 7578648 8566869 4099949 -419729 -1456340 -823102
36343 -823102 -1922016 -4838637 -6501686 -4881800 -1459867 907490 1405368 1374194 1708636
36334 1708636 1930686 1978573 3000624 5394659 7530998 7739391 6510171 5339221 4257700
36325 4257700 2140253 -955170 -3398550 -4031102 -3349791 -2421310 -1563343 -407084 1313067
36316 1313067 3208870 4275859 3859729 2945758 3713377 6906945 10242857 10580351 7421442
36307 7421442 3288299 955502 1280434 3263025 4942056 4567327 2313373 623796
36299 623796 1393791 3125615 2751369 162311 -1422061 -100670 2145654 2704431 1895786
36290 1895786 1562403 1959435 2200735 2519270 3786318 5448822 5989314 5033232 3270351
$$ packed form
36352H68177m091870q29228N254870O376699R88221m466920m519678j036611O33238
36343h23102j098914k916621j663049J619886L421933K367357M97878l1174L34442
36334A708636K22050M7887J022051K394035K136339K08393j229220j170950j081521
36325D257700k117447l095423k443380o32552O81311R28481Q57967J156259J720151
36316A313067J895803J066989m16130r13971P67619L193568L335912L37494l158909
36307G421442m133143k332797L24932J982591J679031l74729k253954j689577
36299F23796P69995J731824l74246k589058j584372J321391K246324N58777q08645
36290A895786l33383L97032K41300L18535J267048J662504N40492r56082j762881
$$ plain form
36281 3270351 897396 -1859645 -3170018 -1010855 3514386 6394688 5121956 1534044
36273 1534044 -472157 826335 3478983 4060273 1372804 -1827785 -1734375 1392203 2927433
36264 2927433 237595 -3095965 -2431537 674900 822657 -2666622 -4822115 -2923450
36256 -2923450 215058 2191531 4446521 7115355 6296977 840512 -3066013 300656
36248 300656 7323724 9929051 6799797 3467337 2906617 2781338 1702036 1534258 2481241
36239 2481241 1898180 -181039 327774 5024200 9665191 9957248 6850241 3527800 796160
36230 796160 -1636573 -2476266 -717118 1917724 3135524 3035876 2937596 3092174 3294149
36221 3294149 3749333 3712161 1457891 -2738956 -5860761 -5963973 -4381237 -2763081 -858036
$$ packed form
36281C270351k372955k757041j310373K159163M525241K880302j272732l587912
36273A534044k006201J298492K652648N81290k687469l200589R3410L126578J535230
36264B927433k689838l333560O64428L106437J47757l489279k155493J898665
36256b923450L138508J976473K254990K668834q18378n456465l906525L366669
36248C00656P023068K605327l129254l332460n60720j25279j079302j67778R46983
36239B481241n83061k079219N08813M696426M640991K92057l107007l322441k731640
36230G96160k432733q39693J759148K634842J217800r9648r8280J54578K01975
36221C294149M55184l7172k254270m196847l121805j03212J582736J618156J905045
$$ plain form
36212 -858036 1133809 1409328 21145 39080 2582887 4260274 2756125 1249422 3158737
36203 3158737 5931679 5088491 1790985 835600 2795519 3747739 1943011 -550107 -2341044
36194 -2341044 -3721452 -3515226 -190467 3791838 3987515 791410 -888678 666593
36186 666593 2093727 1730073 2307154 4799200 5491048 2459008 -174281 1563440 5264976
36177 5264976 6245525 4283901 2114761 513804 -639776 572186 4866578 7860152
36169 7860152 5021252 -602248 -1228775 5048315 11714440 12850324 10015158 8278805
36161 8278805 9210812 10435815 9819519 7650649 5702767 5484662 6622930 6597215 3422878
36152 3422878 -1310076 -4019675 -3941671 -3758010 -4668155 -4062539 -281835 3197803 1979636
$$ packed form
36212h58036J991845K75519j388183J7935K543807J677387j504149j506703J909315
36203C158737K772942q43188l297506r55385J959919R52220j804728k493118j790937
36194b341044j380408K06226L324759L982305J95677l196105j680088J555271
36186F66593J427134l63654N77081K492046O91848l032040k633289J737721L701536
36177E264976R80549j961624k169140j600957j153580J211962M294392K993574
36169G860152k838900n623500o26527O277090O666125J135884k835166j736353
36161H278805R32007J225003o16296k168870j947882k18105J138268k5715l174337
36152C422878m732954k709599P8004J83661r10145O05616L780704L479638j218167
$$ plain form
36143 1979636 -2301109 -3449259 618744 4618947 3050516 -2470524 -5805428 -4325696
36135 -4325696 -998904 924753 1673157 2480226 2546467 766868 -1473273 -1950705 -1041964
36126 -1041964 -731893 -698282 1346050 4919395 5907629 2373220 -1720102 -1646055 1227532
36117 1227532 1542500 -2012955 -5215845 -5370066 -5141011 -6978412 -7947011 -4414143 785638
36108 785638 1335420 -2996385 -5289515 -1183983 5273084 7926690 6401948 4333060
36100 4333060 3310567 2837234 3558286 5596568 5516095 482298 -5294169 -4222963 3840105
36091 3840105 10056854 7738292 151834 -4995664 -4293792 756337 7314217 11860994
36083 11860994 11037910 5652444 985157 -78632 -936632 -4962595 -9227939 -9016219
$$ packed form
36143A979636m280745j148150M068003M000203j568431n521040l334904J479732
36135d325696L326792J923657P48404Q07069O6241j779599k240141m77432R08741
36126a041964L10071L3611K044332L573345R88234l534409m093322P4047K873587
36117A227532L14968l555455l202890j54221K29055j837401r68599L532868N199781
36108G85638N49782m331805k293130M105532O457067K653606j524742k068888
36100D333060j022493m73333P21052K038282q0473n033797n776467J071206Q063068
36091C840105O216749k318562p586458n147498P01872N050129O557880M546777
36083A1860994q23084n385466m667287j063789q58000m025963m265344K11720
$$ plain form
36075 -9016219 -5107172 -1365258 1887757 6250362 9479675 7884089 3115646 214993
36067 214993 -222259 -1606906 -3956181 -3927223 -2024642 -2211692 -3583200 -400334 7506462
36058 7506462 12301418 9569179 4894562 4575790 6385286 5059797 1397318 -404057
36050 -404057 -357759 -1285000 -2579837 -1273401 2378738 5253721 5814861 4221388 86901
36041 86901 -5718671 -9197578 -7528227 -3328307 -535794 1460627 4755836 6649314
36033 6649314 2765997 -4680034 -8305856 -5629154 -1853547 -1495468 -2701774 -1988362
36025 -1988362 -4310 405918 -1117176 -2502230 -2330862 -952741 466113 990840 825049
36016 825049 1364456 3366737 5459868 5804110 4537767 2923240 1054517 -1370566 -2907368
$$ packed form
36075i016219L909047L741914L253015M362605L229313j595586m768443k900653
36067B14993m37252j384647k349275K8958J902581j87050j371508L182866P906796
36058G506462M794956k732239m674617l18772J809496j325489l662479j801375
36050d04057M6298r27241j294837J306436L652139K874983N61140j593473m134487
36041H6901n805572l478907J669351M199920K792513J996421L295209J893478
36033F649314l883317p446031l625822K676702L775607L58079j206306P13412
36025a988362J984052M10228j523094j385054J71368J378121J418854N24727j65791
36016H25049N39407K002281K093131L44242j266343j614527j868723k425083j536802
$$ plain form
36007 -2907368 -1778419 836410 1618370 -506071 -2877483 -2246567 2036166 7606014
35999 7606014 10545140 8311187 2868722 -478402 725436 2934984 2045199 -445171
35991 -445171 -386065 2000910 2879550 1636496 1790515 4758017 7421880 6961713 4156330
35982 4156330 854969 -2110743 -3430970 -1519094 2222354 3644233 1139971 -2004874
35974 -2004874 -2143346 244926 2117447 1979109 1141355 2138338 6147137 10631301 10430371
35965 10430371 3686003 -4282637 -6416815 -2641623 715768 -100669 -2409565 -2632737
35957 -2632737 -973016 824637 2251503 2981316 2574933 2327961 3766428 4760081 1750720
35948 1750720 -3284610 -3642556 2364599 8131407 8130955 5036970 3747301 3699151 2083861
$$ packed form
36007b907368J128949K614829P81960k124441k371412O30916M282733N569848
35999G606014K939126k233953n442465l347124J203838K209548q89785k490370
35991d45171N9106K386975Q78640j243054J54019K967502K663863m60167k805383
35982D156330l301361k965712j320227J911876L741448J421879k504262l144845
35974b004874j38472K388272J872521j38338q37754R96983M008799M484164k00930
35965A0430371o744368p968640k134178L775192L357391q16437k308896k23172
35957b632737J659721J797653J426866P29813m06383k46972J438467R93653l009361
35948A750720n035330l57946O007155N766808m52l093985j289669m8150j615290
$$ plain form
35939 2083861 174883 712016 2273663 1996814 1384370 3635178 7029395 6873978 3172785
35930 3172785 734601 1679414 3001912 2228467 816170 491426 -22047 -2624793 -6579765
35921 -6579765 -9396824 -9746369 -8416994 -6921768 -5564293 -3021764 1467546 5846663
35913 5846663 7120357 5655533 4863216 5847069 5764681 3019483 182544 -775124 -2110195
35904 -2110195 -5535521 -7596755 -4567916 841332 2766785 167513 -3423493 -6172824
35896 -6172824 -8487449 -8756523 -4686547 1345127 4072836 2926759 2529446 5049957
35888 5049957 7430715 7239276 5872873 4337104 1235813 -2572058 -2411650 3521200
35880 3521200 9791650 9994090 4833446 419166 384088 2974633 4729497 4033878 1455566
$$ packed form
35939B083861j908978N37133J561647k76849o12444K250808L394217j55417l701193
35930C172785k438184R44813J322498p73445j412297l24744n13473k602746l954972
35921f579765k817059l49545J329375J495226J357475K542529M489310M379117
35913E846663J273694j464824p92317R83853q2388k745198k836939r57668j335071
35904b110195l425326k061234L028839N409248J925453k599272l591006k749331
35896f172824k314625k69074M069976O031674K727709j146077l97313K520511
35888E049957K380758j91439j366403j535769l101291l807871J60408N932850
35880C521200O270450K02440n160644m414280l5078K590545J754864o95619k578312
$$ plain form
35871 1455566 -1167996 -1920672 -344849 2271845 4535372 6127540 7070802 6982009 5635466
35862 5635466 3380236 704296 -1791268 -3150731 -2964095 -2268233 -2246107 -2383798 -1353768
35853 -1353768 731439 2480577 3100339 2690161 1593584 899871 1998438 3787019 2634909
35844 2634909 -2157458 -5685827 -4202914 -1613901 -3634024 -7833440 -6808604 -528851
35836 -528851 2693923 -1115918 -5887630 -5277426 -909982 2754390 4928914 5512534 2260469
35827 2260469 -3591841 -4962464 1316345 7560479 5325780 -1834718 -3765684 1185562
35819 1185562 5185769 3773926 1103015 1837641 5379441 9535597 13393190 14938838
35811 14938838 11804886 6171434 3378861 4013530 3161628 -603777 -2153694 900133
$$ packed form
35871A455566k623562p52676J575823K616694K263527J592168R43262q8793j346543
35862E635466k255230k675940k495564j359463J86636O95862K2126j37691J030030
35853a353768K085207J749138O19762m10178j096577o93713J098567J788581j152110
35844B634909m792367l528369J482913K589013k020123m199416J024836O279753
35836e28851L222774l809841m771712O10204M367444L664372K174524N83620l252065
35827B260469n852310j370623O278809O244134k234699p160498j930966M951246
35819A185562M000207j411843k670911P34626L541800M156156L857593J545648
35811A4938838l133952n633452k792573O34669q51902l765405j549917L053827
$$ plain form
35803 900133 2535473 -2502967 -9125936 -8548028 -1383862 3531000 2490680 1379627
35795 1379627 5112521 9354973 7027436 -1103263 -7486401 -7791729 -4949499 -3067501
35787 -3067501 -2000408 -199925 647208 -2091116 -6504026 -7486019 -4161365 -1848197
35779 -1848197 -4582746 -9089707 -9359855 -4873625 -483397 642735 -14365 -149858 462954
35770 462954 1582040 3604196 5796972 6234554 4904754 4308813 5355539 5227844 1637918
35761 1637918 -2896556 -4029032 -1777581 -558409 -2891705 -5934026 -5596739 -2179421
35753 -2179421 180867 -941563 -3410150 -3772531 -1503920 1554393 4587084 7881671
35745 7881671 9758842 6982643 -63334 -5531474 -4325835 1596380 6054283 6270791
$$ packed form
35803I00133J635340n038440o622969N77908P164166M914862j040320j111053
35795A379627L732894M242452k327537q130699o383138l05328K842230J881998
35787c067501J067093J800483Q47133k738324m412910r81993L324654K313168
35779a848197k734549m506961k70148M486230M390228J126132o57100j35493O12812
35770D62954J119086K022156K192776M37582j329800n95941J046726j27695l589926
35761A637918m534474j132476K251451J219172k333296l042321L37287L417318
35753b179421K360288j122430k468587l62381K268611L058313L032691L294587
35745G881671J877171k776199p045977n468140J205639N922215M457903K16508
$$ plain form
35737 6270791 4314261 2186045 -164940 -1903053 -888248 2447779 4546205 3836336
35729 3836336 3173472 5161057 8045456 8698819 7167947 5690549 5325081 6085606 8350274
35720 8350274 11352949 12117323 8899738 4190918 1307041 -429738 -3644300 -7425611
35712 -7425611 -8134738 -5324451 -2547646 -1783975 -1206761 363406 908715 -709492 -1674977
35703 -1674977 700733 4261196 4717808 1636588 -1549085 -2767326 -3245088 -4034321 -3689151
35694 -3689151 -758322 3412959 6055958 6154757 4831564 3174351 1196061 -1002068
35686 -1002068 -2404202 -2179309 -893074 254795 1053355 2159090 3433640 3667966 2549348
35677 2549348 1787042 3076007 5470850 6140241 3761815 7030 -2629939 -3406520 -3131346
$$ packed form
35737F270791j956530k128216k350985j738113J014805L336027K098426p09869
35729C836336o62864J987585K884399O53363j530872j477398l65468P60525K264668
35720H350274L002675P64374l217585m708820k883877j736779l214562l781311
35712g425611p09127K810287K776805P63671N77214J570167N45309j618207r65485
35703a674977K375710L560463M56612l081220l185673j218241m77762p89233L45170
35694c689151K930829M171281K642999R8799j323193j657213j978290k198129
35686a002068j402134K24893J286235J147869P98560J105735J274550K34326j118618
35677B549348p62306J288965K394843O69391k378426l754785k636969p76581K75174
$$ plain form
35668 -3131346 -2307314 -661285 1520002 2698658 1633870 -619306 -1400694 264018
35660 264018 2086849 1554235 -271435 -240737 1662582 1645677 -2031599 -5657261 -5338587
35651 -5338587 -3159683 -4033235 -7773705 -9150177 -6001119 -2356715 -1866498 -2662763 -1653305
35642 -1653305 -183559 -1454819 -4607859 -5563166 -2859584 835952 2655418 2087411
35634 2087411 55379 -1803397 -1384655 1524040 3504147 1166661 -3622383 -5520937
35626 -5520937 -2947137 114055 438312 -187525 898441 2273299 810297 -3028898
35618 -3028898 -5591489 -4869351 -2197649 506149 2740177 4385380 4533924 2207122
35610 2207122 -2261457 -6769292 -8534271 -6508359 -2874682 -916008 -1148110 -1307515
$$ packed form
35668c131346Q24032J646029K181287J178656j064788k253176p81388J664712
35660B64018J822831n32614j825670L0698J903319j6905l677276l625662L18674
35651e338587K178904q73552l740470j376472L149058L644404M90217p96265J009458
35642a653305J469746j271260l153040r55307K703582L695536J819466n68007
35634B087411k032032j858776M18742K908695J980107k337486m789044j898554
35626e520937K573800L061192L24257o25837J085966J374858j463002l839195
35618c028898k562591P22138K671702K703798K234028J645203J48544k326802
35610B207122m468579m507835j764979K025912L633677J958674k32102j59405
$$ plain form
35602 -1307515 -566243 -1043158 -3582926 -4990079 -2486070 1244318 1307377 -2239887 -4637436
35593 -4637436 -3586090 -1821131 -1764232 -1907467 -469493 1034336 620014 -620639 -867126
35584 -867126 -1172895 -3259536 -5374887 -4268072 -566881 1833751 1847544 2576824 5601636
35575 5601636 7958200 7046994 4966076 4602646 4254975 686858 -3969188 -3782559 2024533
35566 2024533 7019453 6704475 4908592 7032786 10710570 9100440 1983155 -3023436
35558 -3023436 -1408830 2090957 1396219 -1816975 -1840088 1265572 1615526 -3089047 -7678361
35549 -7678361 -6911719 -2660634 -603312 -2120001 -3137532 -640546 2994635 3631765
35541 3631765 1411958 659286 3716758 7203207 6154796 748350 -3535478 -2580635
$$ packed form
35602a307515P41272m76915k539768j407153K504009L730388O3059l547264k397549
35593d637436J051346J764959N6899j43235J437974J503829m14322j240653k46487
35584h67126l05769k086641k115351J106815L701191K400632J3793P29280L024812
35575E601636K356564r11206k080918l63430l47671l568117m656046J86629N807092
35566B024533M994920l14978j795883K124194L677784j610130p117285n006591
35558c023436J614606L499787o94738l213194k3113L105660L49954m704573m589314
35549g678361P66642M251085K057322j516689j017531K496986L635181O37130
35541C631765k219807p52672L057472L486449j048411n406446m283828R54843
$$ plain form
35533 -2580635 1778699 4615526 3353224 -737091 -4530820 -5139724 -1983517 1456738
35525 1456738 2652 -6797868 -12616953 -11649484 -6107295 -2703204 -3199298 -3347757 -905416
35516 -905416 954306 -159504 -1435459 142794 2306362 1079237 -2622127 -4247128
35508 -4247128 -2405379 -455662 -1191723 -3163724 -3318143 -1203437 865293 1041052 195960
35499 195960 582272 2564190 3798915 2617386 1049852 2255207 5444279 6463157
35491 6463157 4001764 1821025 3031850 5256599 4306950 495327 -2002034 -1024429
35483 -1024429 1323716 2025761 419013 -1947060 -3109062 -2292088 -536207 653259
35475 653259 1366432 2552071 3267909 1497782 -1499811 -1403953 2448197 4428476 222205
$$ packed form
35533b580635M359334K836827j262302m090315l793729o08904L156207L440255
35525A456738j454086o800520n819085R67469N542189L404091m96094j48459K442341
35516i05416J859722j113810j275955J578253K163568j227125l701364j625001
35508d247128J841749J949717p36061j972001j54419K114706K068730J75759q45092
35499A95960L86312J981918J234725j181529j567534J205355L189072J018878
35491F463157k461393k180739J210825K224749r49649l811623k497361R77605
35483a024429K348145P02045j606748k366073j162002Q16974J755881J189466
35475F53259P13173J185639P15838j770127k997593R5858L852150J980279m206271
$$ plain form
35466 222205 -6277645 -8069134 -4329351 311170 3430246 5905168 6792350 3756230
35458 3756230 -1200457 -2732818 -99982 1530479 -729796 -3513636 -3477079 -2137296
35450 -2137296 -1627601 -662151 1755079 2991248 1099498 -1162926 -632781 1050829 531877
35441 531877 -1696168 -2827673 -2468118 -1835007 -440492 2265226 3798268 1489344 -2937141
35432 -2937141 -5716302 -6660734 -8172190 -9782256 -8450317 -4120986 -493224 258737
35424 258737 -243004 -61189 810400 2194316 4405404 6579783 7315480 7306021 8275977
35415 8275977 9196768 7151989 2463595 -852623 -762322 406803 634541 1351052 3628582
35406 3628582 4692945 1478083 -4385554 -8166369 -7629515 -4840758 -3067532 -3513624
$$ packed form
35466B22205o499850j791489L739783M640521L119076K474922Q87182l036120
35458C756230m956687j532361K632836J630461k260275k783840L6557J339783
35450b137296N09695R65450K417230J236169j891750k262424N30145J683610n18952
35441E31877k228045j131505L59555O33111J394515K705718J533042k308924m426485
35432b937141k779161r44432j511456j610066J331939M329331L627762P51961
35424B58737n01741J81815Q71589J383916K211088K174379P35697r459R69956
35415H275977R20791k044779m688394l316218R0301J169125K27738P16511K277530
35406C628582J064363l214862n863637l780815N36854K788757J773226m46092
$$ plain form
35398 -3513624 -4746568 -4553813 -2771333 -1917210 -3550553 -4797840 -1514043 5089985
35390 5089985 8819656 6690516 2830330 2001805 3021841 1982455 -1046344 -2794526
35382 -2794526 -2536739 -2757727 -4608294 -6435416 -7000074 -7074307 -7319915 -7030765 -5678590
35373 -5678590 -3965064 -2768289 -2114363 -1264871 824396 4361174 7199822 5995917
35365 5995917 562205 -4418307 -4367578 -463308 2168233 1051119 -1695313 -3616877
35357 -3616877 -4948660 -6687576 -8184465 -8051521 -6315770 -4821370 -5749852 -9325744
35349 -9325744 -12557141 -11626324 -6673368 -2414335 -2204089 -3639568 -2802256 -595212 -771556
35340 -771556 -3183405 -4022948 -2455101 -1661496 -2472803 -1353658 3210769 7192000 6864635
$$ packed form
35398c513624j232944J92755J782480Q54123j633343j247287L283797O604028
35390E089985L729671k129140l860186q28525J020036j039386l028799j748182
35382b794526K57787k20988j850567j827122n64658p4233k45608K89150J352175
35373e678590J713526J196775O53926Q49492K089267L536778K838648j203905
35365E995917n433712m980512N0729L904270K631541j117114k746432j921564
35357c616877j331783j738916j496889J32944J735751J494400r28482l575892
35349i325744l231397R30817M952956M259033K10246j435479Q37312K207044j76344
35340g71556k411849q39543J567847P93605q11307J119145M564427L981231l27365
$$ plain form
35331 6864635 4213199 3279218 4558508 6419973 8787247 11353313 10919317 5322128
35323 5322128 -1569676 -3562015 -217052 3135781 3244220 2334108 3051074 4297512 3913993
35314 3913993 2269168 950347 54520 -1120779 -2184099 -2349984 -2080337 -2426932 -3322126
35305 -3322126 -3816911 -3654316 -3554007 -4089614 -5012571 -5576191 -5099142 -3521885 -1854884
35296 -1854884 -1630198 -3186402 -4792541 -4501342 -3016259 -3478003 -7451408 -12106248 -13128569
35287 -13128569 -10113750 -6777095 -5362422 -3819835 -518422 1246698 -2489870 -9069928
35279 -9069928 -11250420 -7106800 -3035113 -4750019 -9490338 -10568122 -6649882 -2447956
35271 -2447956 -1720016 -3435097 -4493222 -3195073 -1151 2899817 2968836 134522 -2335555
$$ packed form
35331F864635k651436r33981J279290J861465K367274K566066m33996n597189
35323E322128o891804j992339L344963L352833J08439r10112P16966J246438l83519
35314C913993j644825j318821q95827j175299j063320j65885K69647l46595q95194
35305c322126m94785J62595J00309n35607r22957n63620M77049J577257J667001
35296a854884K24686j556204j606139K91199J485083m61744l973405m654840j022321
35287a3128569L014819L336655J414673J542587L301413J765120l736568o580058
35279i069928k180492M143620M071687j714906m740319j077784L918240M201926
35271b447956P27940j715081j058125J298149L193922K900968O9019k834314k470077
$$ plain form
35262 -2335555 -1641709 794727 1582087 287406 -712771 -605642 -1034661 -2464203 -2868215
35253 -2868215 -985191 1677895 3191571 3479515 3246260 2537178 1473640 833969 870525
35244 870525 910829 905250 1758941 3126270 2668898 -719090 -4168573 -3639477 608168
35235 608168 3517394 1231105 -3926498 -6332179 -4340615 -2069819 -3011978 -4673462
35227 -4673462 -2472049 2763012 5370915 2922260 -631051 -1186937 189830 486600
35219 486600 -325844 -598886 -274838 351494 2376682 5334637 5351141 514964 -4371192
35210 -4371192 -3485406 1140678 1907434 -3687615 -9967252 -11035636 -7072941 -1886174
35202 -1886174 1552239 2033438 223779 -1129445 -61940 1289791 -653737 -5238800
$$ packed form
35262b335555O93846K436436P87360j294681j000177J07129m29019j429542m04012
35253b868215J883024K663086J513676K87944k33255p09082j063538o39671L6556
35244H70525M0304n579Q53691J367329m57372l387988l449483N29096M247645
35235F08168K909226k286289n157603k405681J991564K270796r42159j661484
35227d673462K201413N235061K607903k448655l553311n55886J376767K96770
35219D86600q12444k73042L24048O26332K025188K957955J6504m836177m886156
35210d371192Q85786M626084P66756n595049o279637j068384L962695N186767
35202a886174L438413M81199j809659j353224J067505J351731j943528m585063
$$ plain form
35194 -5238800 -8271882 -8040478 -6409908 -4210318 -559701 2811013 2004822 -2729623
35186 -2729623 -5959645 -4265398 -362470 1570511 674130 -1869826 -4792657 -6074305
35178 -6074305 -4393218 -2256682 -3362169 -6260686 -5830929 -1713687 889894 49854
35170 49854 -260868 1500757 1096128 -3020304 -5461284 -2885808 -121193 -1747254 -4250195
35161 -4250195 -2947820 -531562 -1426003 -3007011 -449570 3768307 3262286 -2231947
35153 -2231947 -7499942 -9958837 -10471715 -8859310 -5233768 -3028111 -4334906 -5497021
35145 -5497021 -3659603 -3190078 -7867316 -11719661 -7509805 -157945 -106793 -5956479 -6582374
35136 -6582374 24027 3607064 -687725 -4692726 -1734040 2956346 2502684 -737411
$$ packed form
35194e238800l033082K31404J630570K199590L650617L370714q06191m734445
35186b729623l230022J694247L902928J932981q96381k543956k922831j281648
35178f074305J681087K136536j105487k898517M29757M117242K603581q40040
35170D9854l10722J761625m04629m116432k440980K575476K764615j626061k502941
35161d250195J302375K416258q94441j581008K557441M217877n06021n494233
35153b231947n267995k458895n12878J612405L625542K205657j306795j162115
35145e497021J837418M69525m677238l852345M209856P351860N1152n849686o25895
35136f582374O606401L583037m294789m005001K958686M690386m53662l240095
$$ plain form
35128 -737411 -1533570 -1156790 -3253041 -6316873 -6768587 -4922877 -2647132 561145 4703566
35119 4703566 6961394 6307049 5891451 7149769 6523278 1940915 -2609287 -3250641 -2000943
35110 -2000943 -2092105 -2506622 -1718133 -1883467 -4315183 -5431400 -2452019 1113678 895099
35101 895099 -1463151 -2095302 -1636238 -2679456 -4193454 -4135804 -4358283 -7198048 -10060203
35092 -10060203 -9029412 -5404901 -3357864 -3478649 -3631236 -3645353 -4241964 -4064357 -2681991
35083 -2681991 -3351317 -7492373 -9971376 -6083164 7551 681085 -3901757 -7180485
35075 -7180485 -6760818 -6097520 -6872174 -7123017 -6457969 -6221494 -4929666 -304994 4671513
35066 4671513 4711538 791559 -1431059 -1341227 -3530241 -8096522 -9615404 -7348727 -7511043
$$ packed form
35128g37411p96159L76780k096251l063832m51714J845710K275745L208277M142421
35119D703566K257828o54345m15598J258318o26491m582363m550202o41354J249698
35110b000943r1162m14517P88489j65334k431716j116217K979381L565697k18579
35101H95099k358250o32151M59064j043218j513998N7650k22479k839765k862155
35092a0060203J030791L624511K047037j20785j52587j4117n96611J77607J382366
35083b681991o69326m141056k479003L888212O090715O73534m582842l278728
35075g180485M19667O63298p74654k50843O65048K36475J291828M624672M976507
35066D671513M0025l919979k222618Q9832k189014m566281j518882K266677j62316
$$ plain form
35057 -7511043 -12221490 -14618161 -9535105 -1873213 926702 -1079117 -3114697 -3558671
35049 -3558671 -3656335 -3229781 -1750690 -784081 -1208467 -881960 1276055 2113601 -1024475
35040 -1024475 -5548566 -7503343 -7136426 -6644772 -5542558 -2742396 -382728 -681586 -1325779
35031 -1325779 870722 3618143 2002137 -3406930 -6990756 -6504046 -5484077 -6390806
35023 -6390806 -6684147 -3978421 -871729 -1439943 -5309718 -8140053 -6990666 -3184435
35015 -3184435 -183278 256233 -133650 1874394 6764017 10723167 9819010 5217819 1999602
35006 1999602 2636795 4313902 3796615 2189980 2355770 3425329 1440007 -4457407 -9646731
34997 -9646731 -9343820 -4287434 673614 2270691 1010965 -1313518 -3562926 -4599597
$$ packed form
35057g511043m710447k396671N083056P661892K799915k005819k035580m43974
35049c558671r7664M26554J479091R66609m24386L26507K158015Q37546l138076
35040a024475m524091j954777L66917M91654J102214K800162K359668k98858o44193
35031a325779K196501K747421j616006n409067l583826M86710J019969r06729
35023f390806k93341K705726L106692n68214l869775k830335J149387L806231
35015c184435L001157M39511l89883K008044M889623L959150r04157m601191l218217
35006A999602O37193J677107n17287j606635J65790J069559j985322n897414n189324
34997i646731L02911N056386M961048J597077j259726k324483k249408j036671
$$ plain form
34989 -4599597 -3431640 -1111257 -354338 -1831204 -2684865 -488308 3026240 4491913
34981 4491913 3917297 4332298 6675366 7792679 4392843 -2655772 -8802336 -9795082 -5169980
34972 -5169980 1222851 4267475 2223653 -1718999 -3264425 -1781419 -153356 -617246
34964 -617246 -2369273 -3098966 -1600610 1035320 2141463 180831 -2624298 -2072747 2306895
34955 2306895 5554250 3589427 -956060 -2431731 126997 2938699 3825307 3926649
34947 3926649 3398562 465454 -4244049 -6952887 -6013188 -4114271 -3520590 -2841716 -661903
34938 -661903 1110355 232931 -2156915 -3381236 -2734419 -1118965 738499 1801132 597939
34929 597939 -2458425 -4622411 -4449088 -3790136 -4511431 -5651495 -5839578 -6065132 -7610651
$$ packed form
34989d599597J167957K320383P56919j476866q53661K196557L514548J465673
34981D491913n74616M15001K343068J117313l399836p048615o146564r92746M625102
34972e169980O392831L044624k043822l942652j545426J483006J628063m63890
34964f17246j752027p29693J498356K635930J106143j960632k805129N51551M379642
34955B306895L247355j964823m545487j475671K558728K811702Q86608J01342
34947C926649n28087k933108m709503k708838R39699J898917N93681O78874K179813
34938f61903J772258q77424k389846j224321O46817J615454J857464J062633j203193
34929E97939l056364k163986J73323O58952p21295j140064j88083k25554j545519
$$ plain form
34920 -7610651 -9336431 -9510851 -8563903 -7768911 -6971926 -5722945 -4680830 -3812473 -1536742
34911 -1536742 1915862 2859691 -1043917 -6550909 -8724981 -7119531 -4675952 -2497655
34903 -2497655 207410 2464786 2241505 196117 -1244810 -2008624 -3675048 -5283248
34895 -5283248 -4226532 -1275415 -217642 -1928858 -3072553 -1598569 567198 1358786
34887 1358786 919644 -1063579 -5650216 -10188221 -8567836 364393 8654012 8101250
34879 8101250 575477 -5186956 -5003057 -2231818 -400857 1249248 3778659 5211945
34871 5211945 3851749 1534886 685871 412727 -1552104 -4517095 -5423745 -3245753 -222853
34862 -222853 1327414 1259964 346876 -1232222 -3294976 -4956831 -5521986 -5336647 -5188378
$$ packed form
34920g610651j725780j74420R46948P94992P96985J248981J042115Q68357K275731
34911a536742L452604R43829l903608n506992k174072J605450K443579K178297
34903b497655K705065K257376k23281k045388j440927p63814j666424j608200
34895e283248J056716K951117J057773j711216j143695J473984K165767P91588
34887A358786m39142j983223m586637m538005J620385Q932229Q289619n52762
34879H101250p525773n762433J83899K771239J830961J650105K529411J433286
34871E211945j360196k316863q49015k73144j964831k964991r06650K177992L022900
34862b22853J550267o7450r13088j579098k062754j661855n65155J85339J48269
$$ plain form
34853 -5188378 -5471025 -6118603 -6530994 -5597052 -3044259 -799808 -1335172 -4335082 -6959498
34844 -6959498 -7958127 -9068755 -11203793 -12186383 -10540844 -8792295 -9713810 -11372931 -9798775
34835 -9798775 -5218778 -1466876 -4949 984826 1853815 766469 -1677036 -2034323 374353
34826 374353 2114575 1607284 1627499 3500211 3830161 457643 -2975771 -2708041 -1003439
34817 -1003439 -1680743 -3128301 -1585204 1387436 1252962 -1259808 -1120565 2116687 3318225
34808 3318225 679915 -1093442 948318 2535208 -993598 -6789626 -8259365 -4337967
34800 -4337967 -365590 -349731 -2175118 -1354395 2717282 5821437 4044027 -1097238 -3978093
34791 -3978093 -1767817 1889547 1982445 -920648 -2158696 -345877 1155445 411393 -222631
$$ packed form
34853e188378k82647o47578m12391R33942K552793K244451n35364k999910k624416
34844f959498r98629j110628k135038r82590J645539J748549r21515j659121J574156
34835i798775M579997L751902J461927R89775Q68989j087346k443505l57287K408676
34826C74353J740222n07291K0215J872712L29950l372518l433414K67730J704602
34817a003439o77304j447558J543097K972640j34474k512770J39243L237252J201538
34808C318225k638310j773357K041760J586890l528806n796028j469739L921398
34800d337967L972377J5859j825387Q20723M071677L104155j777410n141265k880855
34791c978093K210276L657364R2898k903093j238048J812819J501322p44052o34024
$$ plain form
34782 -222631 799773 727007 -2748120 -6720489 -6894599 -3905375 -1949583 -2578149 -3670687
34773 -3670687 -3762703 -3601458 -3507204 -2723173 -1852093 -2762680 -5231519 -6545145 -5538305
34764 -5538305 -4274586 -4243336 -3703436 -1189221 727971 -1380211 -6006767 -7924022 -5389314
34755 -5389314 -2462403 -2845236 -4902772 -5382128 -5141471 -7158809 -10353966 -10205182 -5816799
34746 -5816799 -1709292 -897353 -525707 2581631 5720456 4096641 -1305004 -4541591
34738 -4541591 -2886954 273820 1077807 -353392 -2075209 -3226026 -3142468 -750961 3017111
34729 3017111 4579406 1704996 -3347605 -6345467 -5410847 -1726230 2383796 4848233
34721 4848233 5026197 4688169 6183400 8837447 9441133 7222142 5282517 5464888 5302065
$$ packed form
34782b22631J022404p2766l475127l972369j74110K989224J955792o28566j092538
34773c670687r2016J61245R4254P84031Q71080r10587k468839j313626J006840
34764e538305J263719L1250N39900K514215J917192k108182m626556j917255K534708
34755e389314K926911l82833k057536m79356K40657k017338l195157J48784M388383
34746e816799M107507Q11939L71646L107338L138825j623815n401645l236587
34738d541591J654637L160774Q03987j431199j721817j150817Q3558K391507L768072
34729C017111J562295k874410n052601k997862R34620L684617M110026K464437
34721D848233J77964l38028J495231K654047O03686k218991j939625J82371j62823
$$ plain form
34712 5302065 2796711 746158 2342086 5242769 4820522 1517139 -127893 1245113
34704 1245113 2754517 2989201 3164114 2396319 -1968678 -7863966 -8669529 -2838893 2385292
34695 2385292 937855 -3443598 -3580967 392786 2641771 1064605 -1307693 -2751347
34687 -2751347 -4218829 -4680822 -1387471 4402951 7451966 5654755 2409920 690691
34679 690691 -411249 -1667902 -1257254 1227136 2735328 1492629 -160477 -308320 -742209
34670 -742209 -2711063 -3687274 -2159487 -1579334 -4960608 -9065995 -9067208 -6062627 -4513082
34661 -4513082 -4659358 -3417480 -1054585 -714172 -2187913 -2318611 -1199036 -1766140 -3251131
34652 -3251131 -1635256 2533212 3491727 -664756 -4542908 -3752171 -946908 -391552 -1619839
$$ packed form
34712E302065k505354k050553J595928K900683m22247l303383j645032J373006
34704A245113J509404K34684J74913p67795m364997n895288q05563N830636N224185
34695B385292j447437m381453j37369L973753K248985j577166k372298j443654
34687b751347j467482m61993L293351N790422L049015j797211l244835j719229
34679F90691j101940j256653M10648K484390J508192j242699j653106j47843m33889
34670g42209j968854r76211J527787N80153l381274m105387j213L004581J549545
34661d513082j46276J241878K362895L40413j473741j30698J119575n67104j484991
34652c251131J615875M168468R58515m156483l878152P90737K805263N55356j228287
$$ plain form
34643 -1619839 -2125819 -2003058 -2245439 -2125716 -1514699 -2224458 -4144798 -4030418 -1211365
34634 -1211365 -118275 -3404197 -7008235 -6563359 -4500717 -5424038 -7973912 -7384565 -3786360
34625 -3786360 -1855982 -3431503 -5980848 -7665273 -8828523 -8765710 -5662094 -14055
34617 -14055 5332245 8350506 8452689 5431551 855836 -1436824 199715 2299625 1410865
34608 1410865 -569179 -450525 81159 -2090862 -4813205 -4022446 -1628336 -2746955 -6429373
34599 -6429373 -6909295 -3581695 -1692406 -2771991 -2662922 -310930 -101956 -3052569 -3805852
34590 -3805852 135577 3611514 2305845 -671812 -1088296 -267413 -760669 -982849 880679
34581 880679 2527728 1738222 201621 -1058685 -4666339 -10453281 -11839574 -4896149
$$ packed form
34643a619839n05980J22761k42381J19723O11017p09759j920340J14380K819053
34634a211365J093090l285922l604038M44876K062642r23321k549874N89347L598205
34625c786360J930378j575521k549345j684425j163250O2813L103616N648039
34617a4055N346300L018261J02183l021138m575715k292660J636539K099910q88760
34608A410865j980044J18654N31684k172021k722343P90759K394110j118619l682418
34599f429373m79922L327600J889289j079585J09069K351992K08974k950613p53283
34590c805852L941429L475937j305669k977657m16484Q20883m93256k22180J863528
34581H80679J647049p89506j536601j260306l607654n786942j386293O943425
$$ plain form
34573 -4896149 3889497 5728570 1367598 -2101540 -2519449 -3098774 -4348896 -3620950 -1426818
34564 -1426818 -808784 -1103324 815788 3738195 3525657 1012372 1292443 4654099 5432491
34555 5432491 1351215 -2717543 -2479528 316383 2557863 4286669 5710125 4861875
34547 4861875 1563443 -601801 493653 2192910 1992761 1877654 4165528 6553056
34539 6553056 5386886 1269861 -2491151 -4795070 -6200714 -5546195 -1645457 2733422
34531 2733422 3274835 570168 -149585 3331576 6856517 6297979 4022530 5487433 10893580
34522 10893580 14172081 10923345 4175116 140360 324385 941653 -597896 -2441548
34514 -2441548 -2527006 -2359753 -3769735 -4563725 -1434687 3817049 5248568 546007 -5739288
$$ packed form
34573d896149Q785646J839073m360972l469138m17909n79325j250122P27946K194132
34564a426818O18034k94540J919112K922407k12538k513285K80071L361656P78392
34555E432491m081276m068758K38015K795911K241480J728806J423456q48250
34547D861875l298432k165244J095454J699257k00149j15107K287874K387528
34539F553056j166170m117025l761012k303919j405644O54519L900738M378879
34531B733422N41413k704667p19753L481161L524941n58538k275449J464903N406147
34522A0893580L278501l248736o748229m034756J84025O17268j539549j843652
34514b441548q5458J67253j409982p93990L129038N251736J431519m702561o285295
$$ plain form
34505 -5739288 -8076569 -6122262 -3170991 -989659 1102981 3275683 4075220 2455448
34497 2455448 -669199 -3233558 -3658983 -1863837 593993 1612784 606619 -625427
34489 -625427 151818 2824583 4928313 4644650 2949173 2160630 3062519 4533210 5630232
34480 5630232 6442429 6609943 4905011 1449548 -1404799 -2210712 -2773666 -4825246 -5918904
34471 -5918904 -2468371 3625587 5916537 1952576 -3360165 -4681838 -2455792 184424
34463 184424 2557182 4892126 5195054 2236558 -613326 808104 5196598 7650802
34455 7650802 6694326 5029875 3997600 1954736 -1552322 -4187114 -4352779 -3256981
34447 -3256981 -2856099 -4178454 -7430078 -11085440 -11697155 -7966439 -4098457 -5039946 -9022826
$$ packed form
34505e739288k337281J954307K951271K181332K092640K172702P99537j619772
34497B455448l124647k564359m25425J795146K457830J018791j006165j232046
34489f25427P77245K672765K103730k83663j695477p88543R01889J470691J097022
34480E630232Q12197J67514j704932l455463k854347q05913n62954k051580j093658
34471e918904L450533O093958K290950l963961n312741j321673K226046K640216
34463A84424K372758K334944L02928k958496k849884J421430M388494K454204
34455G650802r56476j664451j032275k042864l507058k634792j65665J095798
34447c256981M00882j322355l251624l655362o11715L730716L867982r41489l982880
$$ plain form
34438 -9022826 -9577915 -4898684 58010 1652743 2328169 5263639 9014580 10250133
34430 10250133 8278410 4493997 480169 -1529628 231463 3653644 4086020 932124
34422 932124 -1057648 813637 2940527 1509972 -1463626 -1897876 256923 2518577
34414 2518577 4092203 4718811 2722032 -1592046 -3942611 -2049506 -201465 -2673404
34406 -2673404 -6042767 -4491212 -14370 275978 -4181181 -6472508 -3412260 80691
34398 80691 -366180 -2695893 -4054720 -5750150 -8581314 -8821497 -3928153 1699190 1899925
34389 1899925 -2763376 -6389277 -5965294 -3914785 -3300886 -4255402 -5062482 -4176450 -1504312
34380 -1504312 473775 -1870396 -8543564 -14172570 -13854894 -9356599 -6185361 -5737873
$$ packed form
34438i022826n55089M679231M956694J594733O75426K935470L750941J235553
34430A0250133j971723l784413m013828k009797J761091L422181M32376l153896
34422I32124j989772J871285K126890j430555k973598m34250K154799K261654
34414B518577J573626O26608j996779m314078k350565J893105J848041k471939
34406b673404l369363J551555M476842K90348m457159k291327L060248L492951
34398H0691m46871k329713j358827j695430k831164k40183M893344N627343K00735
34389A899925m663301l625901M23983K050509O13899r54516q07080Q86032K672138
34380a504312J978087k344171o673168n629006L17676M498295L171238M47488
$$ plain form
34372 -5737873 -4514087 -834239 2295736 2197331 340240 -900677 -1934262 -3727381
34364 -3727381 -4593038 -2538265 761844 1765105 240798 -537507 1134444 3108681
34356 3108681 2985680 1416641 377568 107236 -478693 -1681478 -3151515 -5096971 -7325064
34347 -7325064 -7766677 -4454216 889469 3822354 2785653 1351809 2927417 5254326
34339 5254326 3444642 -2240715 -5709760 -3446889 70356 -1449229 -6888977 -9188094
34331 -9188094 -5597204 -1506824 -2258171 -5560452 -5801799 -2826908 -1271748 -2292294
34323 -2292294 -1704722 2516025 6135859 5016763 1607543 1139469 3976339 6123144
34315 6123144 5795586 4775541 3644845 581009 -4076017 -6543731 -5119734 -3352492
$$ packed form
34372e737873J223786L679848L129975r8405j857091j240917j033585j793119
34364c727381q65657K054773L300109J003261j524307p78305J671951J974237
34356C108681j23001j569039j039073k70332n85929j202785j470037j945456k228093
34347g325064m41613L312461N343685K932885j036701j433844J575608K326909
34339E254326j809684n685357l469045K262871L517245j519585n439748k299117
34331i188094L590890M090380p51347l302281k41347K974891J555160j020546
34323b292294N87572M220747L619834j119096l409220m68074K836870K146805
34315F123144l27558j020045j130696l063836m657026k467714J423997J767242
$$ plain form
34307 -3352492 -4695776 -6848136 -5258658 -603110 1699734 -501002 -2835760 -987787
34299 -987787 2756163 2736587 -1862722 -5842088 -5470126 -3627635 -5069233 -8720487 -8435478
34290 -8435478 -1523976 6890210 9719746 5848839 90536 -3144615 -3489992 -2678791
34282 -2678791 -1817217 -1147830 -662232 -206929 59337 -710049 -2871458 -4982892 -5079031
34273 -5079031 -3143640 -938677 399862 1056728 1127203 386616 -522745 -466540 589409
34264 589409 2025494 4175298 7222616 8948179 6730657 2130572 56451 2213328
34256 2213328 4684091 3780626 1138489 543512 2403726 4388890 5603810 6932339
34248 6932339 8388827 9033239 8848063 8294825 6740479 3668114 777845 486586 2672879
$$ packed form
34307c352492j343284k152360J589478M655548K302844k200736k334758J847973
34299i87787L743950j9576m599309l979366L71962J842491j441598l651254K85009
34290h435478O911502Q414186K829536l870907n758303l235151l45377Q11201
34282b678791Q61574O69387M85598M55303K66266p69386k161409k111434r6139
34273e079031J935391K204963J338539O56866P0475p40587r09361N6205J055949
34264E89409J436085K149804L047318J725563k217522m600085k074121K156877
34256B213328K470763r03465k642137n94977J860214J985164J214920J328529
34248F932339J456488O44412j85176n53238j554346l072365k890269k91259K186293
$$ plain form
34239 2672879 4932657 5601681 4626425 2210868 -1098288 -3525389 -3720692 -3069829 -3988113
34230 -3988113 -6075145 -6507535 -4424878 -2277024 -2023788 -2293464 -576358 3330377 7265033
34221 7265033 9113774 8503644 6816224 5864275 5875104 4950572 1602990 -2500630 -3951483
34212 -3951483 -1814406 1285905 2633095 2209110 1346193 380884 -1004507 -2250180 -2272978
34203 -2272978 -1010316 490532 1441056 1952896 2238589 1868509 314540 -1984329 -3761377
34194 -3761377 -4435588 -4853905 -5797980 -6436358 -5652163 -4451716 -4947271 -6805913 -7330560
34185 -7330560 -6008177 -5972079 -8792656 -10627003 -7030616 92874 4312352 2893350
34177 2893350 -597390 -2040502 -1371155 -517831 -170749 -333559 -1493036 -3296305 -3931642
$$ packed form
34239B672879K259778O69024r75256k415557l309156k427101j95303O50863r18284
34230c988113k087032m32390K082657K147854K53236k69676J717106L906735L934656
34221G265033J848741o10130j687420r51949J0829r24532l347582m103620j450853
34212c951483K137077L100311J347190m23985q62917r65309j385391j245673k2798
34203b272978J262662J500848R50524N11840K85693l70080j553969k298869j777048
34194c761377o74211m18317r44075o38378P84195J200447m95555j858642n24647
34185g330560J322383L6098k820577j834347L596387P123490M219478j419002
34177B893350l490740j443112O69347Q53324L47082j62810j159477j803269o35337
$$ plain form
34168 -3931642 -2606500 -1161346 -1556290 -2937017 -2793990 -233588 3235555 5579906
34160 5579906 5851001 4430077 2539100 1241922 589543 173939 334262 1639075 3116141
34151 3116141 2638319 -179413 -2860834 -2958948 -1141167 -234575 -1683628 -4018140 -4874215
34142 -4874215 -3871428 -2976618 -3845446 -5354072 -4943698 -2429982 -573897 -964041 -1653798
34133 -1653798 -929351 -1050976 -4762217 -9624900 -10311080 -6334951 -2865116 -2997910 -3872702
34124 -3872702 -2407575 -487163 -1199695 -3195942 -2627134 1133522 5004465 6214017
34116 6214017 4199971 -103694 -4228392 -4774059 -973945 3154362 2895369 -1468815
34108 -1468815 -5335481 -5452314 -2607178 624612 2315630 1728779 -261215 -1386602
$$ packed form
34168c931642J325142J445154l94944j380727J43027K560402L469143K344351
34160E579906K71095j420924j890977j297178o52379m15604J60323J304813J477066
34151C116141m77822k817732k681421r8114J817781R06592j449053k334512q56075
34142d874215J002787Q94810q68828j508626M10374K513716J856085l90144o89757
34133a653798P24447j21625l711241m862683o86180L976129L469835j32794q74792
34124c872702J465127J920412p12532j996247N68808L760656L870943J209552
34116F214017k014046m303665m124698n45667L800114M128307k58993m364184
34108a468815l866666j16833K845136L231790J691018n86851j989994j125387
$$ plain form
34100 -1386602 -381263 1320086 1832126 1601915 1868698 1783286 -70934 -2399041 -2774825
34091 -2774825 -1814325 -2181678 -3807799 -4096202 -2991697 -3332584 -5133578 -4271886 809624
34082 809624 5387396 4827946 1270997 -42726 1442446 2053680 693225 289762 2377963
34073 2377963 4610272 4802827 3889253 3235563 2111135 90331 -480180 2569762 6955488
34064 6955488 7619369 2836681 -3566332 -6647062 -5325994 -2254339 -247338 -79749
34056 -79749 -934489 -1635747 -1519195 -892468 -548441 -412927 622773 2589941 3013994
34047 3013994 -521412 -6392791 -9638813 -7560090 -2861965 148384 857471 1682409
34039 1682409 3141640 2571722 -1594354 -6630854 -8302674 -5811909 -2337702 -830920
$$ packed form
34100a386602J005339J701349N12040k30211K66783q5412j854220k328107l75784
34091b774825R60500l67353j626121k88403J104505l40887j800994Q61692N081510
34082H09624M577772n59450l556949j313723J485172O11234j360455m03463K088201
34073B377963K232309J92555r13574o53690j124428k020804n70511L049942M385726
34064F955488O63881m782688o403013l080730J321068L071655K007001J67589
34056g9749q54740p01258J16552O26727L44027J35514J035700J967168M24053
34047C013994l535406n871379l246022K078723M698125L010349P09087Q24938
34039A682409J459231n69918m166076n036500j671820K490765L474207J506782
$$ plain form
34031 -830920 -655111 942355 4666088 7614425 6488200 1837017 -2056815 -1835929 1392245
34022 1392245 3744624 2734675 -1140328 -5752329 -8633521 -7803250 -3644514 23519
34014 23519 -877379 -5617867 -8795891 -6813921 -2490832 -1390269 -4692445 -7937864 -6722302
34005 -6722302 -1740979 2386277 2103462 -1950064 -6099650 -7246700 -5421703 -2992205
33997 -2992205 -1585486 -460709 1636819 3870629 3925106 1145613 -2372211 -4371508
33989 -4371508 -4873720 -5076320 -4894429 -3241559 -486136 1104065 -112464 -3413741 -7043756
33980 -7043756 -9958772 -11410959 -10362212 -7069311 -4181204 -3928804 -4608236 -2481941
$$ packed form
34031h30920J75809J597466L723733K948337j126225m651183l893832K20886L228174
34022A392245K352379j009949l875003m612001k881192Q30271M158736L668033
34014B3519r00898m740488l178024J981970M323089J100563l302176l245419J215562
34005f722302M981323M127256k82815m053526m149586j147050J824997K429498
33997b992205J406719J124777K097528K233810N4477k779493l517824j999297
33989d371508n02212k02600J81891J652870K755423J590201j216529l301277l630015
33980g043756k915016j452187J048747L292901K888107K52400o79432K126295
$$ [...]
##END NTUPLES=NMR SPECTRUM
##END=
