##TITLE=31Pdec_IABPA2804-1
 CDCl3, 24 sc
 28.04.2021
##JCAMPDX= 6.0         $$ Bruker NMR JCAMP-DX V2.0
##DATA TYPE= NMR SPECTRUM
##DATA CLASS= NTUPLES
##ORIGIN= UXNMR, Bruker Analytische Messtechnik GmbH
##OWNER= root
$$ XWIN-NMR		Version 3.5
$$ Wed Apr 28 11:47:34 2021 Russian Standard Time (UT+4h)  she@DPX200
##.OBSERVE FREQUENCY= 81.013821
##.OBSERVE NUCLEUS= ^31P
##.ACQUISITION MODE= SIMULTANEOUS
##.ACQUISITION SCHEME= undefined
##.AVERAGES= 24
##.DIGITISER RES= 16
##SPECTROMETER/DATA SYSTEM= spect
##.PULSE SEQUENCE= zgpg30
##.SOLVENT NAME= CDCl3
##.SHIFT REFERENCE= (INTERNAL, CDCl3, 0, 248.564)
##AUDIT TRAIL= $$ (NUMBER, WHEN, WHO, WHERE, WHAT)
$$ ##TITLE= Audit trail, XWIN-NMR		Version 3.5
$$ ##JCAMPDX= 5.01
$$ ##ORIGIN= Bruker BioSpin GmbH
$$ ##OWNER= she
$$ F:/spectra/data/she/nmr/P31/1/pdata/1/auditp.txt
$$ ##AUDIT TRAIL=  $$ (NUMBER, WHEN, WHO, WHERE, WHAT)
(   1,<2021-04-28 11:46:08.17 +0400>,<she>,<DPX200>,
      <created by zg, POWCHK disabled, PULCHK disabled
       configuration hash MD5:
       00 E9 B6 7A A2 85 ED C7 34 08 36 98 17 FE 4E 26
       data hash MD5: 32K
       73 F1 12 B8 D4 B2 D3 76 07 28 BA 41 5C 82 DD 65>)
(   2,<2021-04-28 11:46:13.09 +0400>,<she>,<DPX200>,
      <Start of raw data processing
       efp BC_mod = 2 LB = 1 FT_mod = 6 PKNL = 1 PHC0 = -5980.032 PHC1 = 329.8018 SI = 64K 
       data hash MD5: 64K
       4F E3 49 F2 FD 92 59 FC A5 97 C6 86 86 A1 1E 20>)
(   3,<2021-04-28 11:46:52.78 +0400>,<she>,<DPX200>,
      <pk PHC0 = 58.84661 PHC1 = -73.40001 
       data hash MD5: 64K
       42 5C DD 2B 46 1F 40 D1 A1 DA E5 E0 48 6C 8A 6D>)
(   4,<2021-04-28 11:46:55.64 +0400>,<she>,<DPX200>,
      <abs ABSG = 5 
       data hash MD5: 64K
       5E 5F 43 CD 3D EB F9 35 81 AA AE D7 AD 37 2A C2>)
$$ ##END=
$$ 
$$ hash MD5
$$ 70 40 51 1E 8C 76 60 B9 2A 73 1C E9 18 4F 94 8F
##$RELAX= 
##$RELAX= 
##$RELAX= 
##$RELAX= 
##$RELAX= 
##$RELAX= 
##$RELAX= 
##$RELAX= 
$$ Bruker specific parameters
$$ --------------------------
##$DU= <F:/spectra>
##$EXPNO= 1
##$NAME= <P31>
##$PROCNO= 1
##$TYPE= <nmr>
##$USER= <she>
##$AMP= (0..31)
100 100 100 100 100 100 100 100 100 100 100 100 100 100 100 100 100 100 
100 100 100 100 100 100 100 100 100 100 100 100 100 100 
##$AQSEQ= 0
##$AQ_mod= 1
##$AUNM= <au_zg>
##$AUTOPOS= <>
##$BF1= 81.014009
##$BF2= 200.13
##$BF3= 200.13
##$BF4= 200.13
##$BF5= 200.13
##$BF6= 200.13
##$BF7= 200.13
##$BF8= 200.13
##$BYTORDA= 1
##$CFDGTYP= 0
##$CFRGTYP= 5
##$CHEMSTR= <none>
##$CNST= (0..31)
1 1 145 1 1 1 1 1 1 1 1 1 1 1 1 1 1 1 1 1 1 1 1 1 1 1 1 1 1 1 1 1 
##$CPDPRG= <waltz16>
##$CPDPRG1= <>
##$CPDPRG2= <waltz16>
##$CPDPRG3= <>
##$CPDPRG4= <mlev>
##$CPDPRG5= <mlev>
##$CPDPRG6= <mlev>
##$CPDPRG7= <mlev>
##$CPDPRG8= <mlev>
##$CPDPRGB= <>
##$CPDPRGT= <>
##$D= (0..31)
0 1 0 0 0 0 0 0 0 0 0 0.03 2e-05 3e-06 0 0 0 0 0 0 0 0 0 0 0 0 0 0 0 0 
0 0 
##$DATE= 1619595967
##$DBL= (0..7)
120 120 120 11 120 120 24 19 
##$DBP= (0..7)
150 150 150 150 150 150 150 150 
##$DBP07= 0
##$DBPNAM0= <>
##$DBPNAM1= <>
$$ [...]
##$SUBNAM3= <"">
##$SUBNAM4= <"">
##$SUBNAM5= <"">
##$SUBNAM6= <"">
##$SUBNAM7= <"">
##$SUBNAM8= <"">
##$SUBNAM9= <"">
##$SW= 501.771253377433
##$SWIBOX= (0..15)
0 1 3 0 0 0 0 0 0 0 0 0 0 0 0 0 
##$SW_h= 40650.406504065
##$TD= 32768
##$TD0= 1
##$TE= 0
##$TE2= 300
##$TE3= 300
##$TEG= 300
##$TL= (0..7)
0 120 53 12 22 120 120 120 
##$TP= (0..7)
150 150 150 150 150 150 150 150 
##$TP07= 0
##$TPNAME0= <>
##$TPNAME1= <>
##$TPNAME2= <>
##$TPNAME3= <>
##$TPNAME4= <>
##$TPNAME5= <>
##$TPNAME6= <>
##$TPNAME7= <>
##$TPOAL= (0..7)
0.5 0.5 0.5 0.5 0.5 0.5 0.5 0.5 
##$TPOFFS= (0..7)
0 0 0 0 0 0 0 0 
##$TUNHIN= 0
##$TUNHOUT= 0
##$TUNXOUT= 0
##$USERA1= <user>
##$USERA2= <user>
##$USERA3= <user>
##$USERA4= <user>
##$USERA5= <user>
##$V9= 5
##$VALIST= <valist>
##$VCLIST= <CCCCCCCCCCCCCCC>
##$VD= 0
##$VDLIST= <DDDDDDDDDDDDDDD>
##$VPLIST= <PPPPPPPPPPPPPPP>
##$VTLIST= <TTTTTTTTTTTTTTT>
##$WBST= 1024
##$WBSW= 4
##$XGAIN= (0..3)
0 0 0 0 
##$XL= 0
##$YL= 0
##$YMAX_a= 6570
##$YMIN_a= -8982
##$ZGOPTNS= <>
##$ZL1= 120
##$ZL2= 120
##$ZL3= 120
##$ZL4= 120
##$ABSF1= 248.5645
##$ABSF2= -253.2056
##$ABSG= 5
##$ABSL= 3
##$ALPHA= 0
##$AQORDER= 0
##$ASSFAC= 0
##$ASSFACI= 0
##$ASSFACX= 0
##$ASSWID= 0
##$AUNMP= <proc_1d>
##$AZFE= 0.1
##$AZFW= 0.5
##$BCFW= 0
##$BC_mod= 2
##$BYTORDP= 0
##$COROFFS= 0
##$CY= -3
##$DATMOD= 1
##$DC= 0
##$DFILT= <>
##$DTYPP= 0
##$F1P= 0
##$F2P= 0
##$FCOR= 1
##$FTSIZE= 65536
##$FT_mod= 6
##$GAMMA= 0
##$GB= 0
##$INTBC= 1
##$INTSCL= 5.30512e-09
##$ISEN= 30
##$LB= 1
##$LEV0= 0
##$LPBIN= 0
##$MAXI= 10000
##$MC2= 0
##$MEAN= 0
##$ME_mod= 0
##$MI= 50
##$NCOEF= 0
##$NC_proc= -6
##$NLEV= 6
##$NOISF1= 182.463
##$NOISF2= 159.3651
##$NSP= 0
##$NTH_PI= 0
##$NZP= 0
##$OFFSET= 248.5645
##$PC= 4
##$PHC0= -5921.186
##$PHC1= 256.4018
##$PH_mod= 1
##$PKNL= yes
##$PPARMOD= 0
##$PSCAL= 0
##$PSIGN= 0
##$REVERSE= no
##$SF= 81.014009
##$SI= 65536
##$SIGF1= 159.3651
##$SIGF2= -187.1042
##$SINO= 113.3802
##$SIOLD= 16384
##$SREGLST= <1H.CDCl3>
##$SSB= 0
##$STSI= 65536
##$STSR= 0
##$SW_p= 40650.406504065
##$SYMM= 0
##$S_DEV= 0
##$TDeff= 32768
##$TDoff= 0
##$TI= <>
##$TILT= no
##$TM1= 0
##$TM2= 0
##$TOPLEV= 0
##$USERP1= <user>
##$USERP2= <user>
##$USERP3= <user>
##$USERP4= <user>
##$USERP5= <user>
##$WDW= 1
##$XDIM= 65536
##$YMAX_p= 355958078
##$YMIN_p= -26368485
$$ End of Bruker specific parameters
$$ ---------------------------------
##NTUPLES= NMR SPECTRUM
##VAR_NAME=  FREQUENCY,     SPECTRUM/REAL,   SPECTRUM/IMAG
##SYMBOL=    X,             R,               I
##VAR_TYPE=  INDEPENDENT,   DEPENDENT,       DEPENDENT
##VAR_FORM=  AFFN,          ASDF,            ASDF
##VAR_DIM=   65536,         65536,           65536
##UNITS=     HZ,            ARBITRARY UNITS, ARBITRARY UNITS
##FACTOR=    0.620285442955139, 1,           1
##FIRST=     20137.2065510759, 0,            0
##LAST=      -20513.1999529892, 0,           0
##MIN=       -20513.1999529892, -26368485,   0
##MAX=       20137.2065510759, 355958078,    0
$$ Real data points
##PAGE= N=1
##DATA TABLE= (X++(R..R)), XYDATA
$$ [...]
##PAGE= N=2
##DATA TABLE= (X++(I..I)), XYDATA
$$ plain form
13118 -2877971 -2857224 -1383838 508580 1148995 949587 1053554 1238036 1101172 1373259
13109 1373259 2110537 1628564 -621650 -2084948 -390692 3052947 5073562 4780352 3346468
13100 3346468 1471873 -352350 -632739 1130501 2392240 547757 -2760218 -3357908
13092 -3357908 -341063 2641238 2151090 -1214427 -4083361 -3710828 -47339 4174006
13084 4174006 5541947 3306552 180595 -1034790 -428782 511324 1452939 2272463 1501553
13075 1501553 -1384469 -3522217 -1855501 1942348 3180698 670314 -1807642 -998100
13067 -998100 1875041 3550920 2695502 391837 -1540750 -1872309 -798491 290346 744774
13058 744774 1642180 3518865 4499969 2954765 698595 595837 1992905 1949896 280559
$$ packed form
13118b877971K0747J473386J892418O40415j99408J03967J84482j36864K72087
13109A373259P37278m81973k250214j463298J694256L443639K020615k93210j433884
13100C346468j874595j824223k80389J763240J261739j844483l307975n97690
13092c357908L016845K982301m90148l365517k868934L72533L663489M221345
13084D174006J367941k235395l125957j215385O06008R40106R41615Q19524p70910
13075A501553k886022k137748J666716L797849J238350k510384k477956Q09542
13067i98100K873141J675879q55418k303665j932587l31559J073818J088837M54428
13058G44774Q97406J876685R81104j545204k256170j02758J397068m3009j669337
$$ plain form
13049 280559 -540072 -202423 -962863 -2864885 -3128495 -1428603 -1183499 -3617415 -4881366
13040 -4881366 -1878329 2738136 4625019 3797851 3150364 3275877 2421423 247654 -1560971
13031 -1560971 -1742772 -278462 2266667 4386850 4019392 1208524 -1102808 -829470 430149
13022 430149 322650 -557273 -430923 131436 -545391 -1940536 -2354207 -2036824 -2259995
13013 -2259995 -2357262 -866935 1274339 1923054 1330642 1199624 912224 -1447804 -4582880
13004 -4582880 -4649796 -987093 2679154 3674122 3343178 3375452 2872326 1013462 -540429
12995 -540429 -223445 911402 1323239 1385073 1722879 1518154 606822 877764 3053623
12986 3053623 4352338 2349523 -816168 -1549833 -499084 -1083272 -3176630 -2860912 1025425
$$ packed form
13049B80559q20631L37649p60440j902022k63610J699892K45104k433916j263951
13040d881366L003037M616465J886883q27168o47487J25513q54454k173769j808625
13031a560971j81801J464310K545129K120183l67458k810868k311332K73338J259619
13022D30149j07499q79923J26350N62359o76827j395145m13671L17383k23171
13013b259995r7267J490327K141274O48715n92412j31018k87400k360028l135076
13004d582880o6916L662703L666247R94968l30944L2274n03126j858864j553891
12995e40429L16984J134847M11837O1834L37806k04725r11332K70942K175859
12986C053623J298715k002815l165691p33665J050749n84188k093358L15718L886337
$$ plain form
12977 1025425 4477624 4139255 1894735 1301756 2345259 2633520 1761100 1289638 1496716
12968 1496716 1243326 692328 1287231 2858065 3326007 1841756 -50589 -1072139 -1762138
12959 -1762138 -2346596 -1397260 1585398 4097350 3440281 530161 -1388119 -1206747 -799854
12950 -799854 -1535783 -2295113 -1591754 123728 1260644 1169824 673764 1011951 2489980
12941 2489980 3843348 3302848 815203 -1598296 -2482448 -2620674 -2769623 -1696803 973285
12932 973285 1939012 -1705033 -6708077 -7102265 -3442129 -2623584 -6810721 -9025363 -3740560
12923 -3740560 3900358 5356971 1010682 -1740602 -217043 1223318 -87722 -1562251
12915 -1562251 -1558407 -2329420 -4490858 -4501056 -817000 2459114 1735994 -472965 -89546
$$ packed form
12977A025425L452199l38369k244520n92979J043503K88261q72420m71462K07078
12968A496716k53390n50998N94903J570834M67942j484251j892345j021550o89999
12959a762138n84458R49336K982658K511952o57069k910120j918280J81372M06893
12950g99854p35929p59330P03359J715482J136916r0820m96060L38187J478029
12941B489980J353368n40500k487645k413499q84152j38226j48949J072820K670088
12932I73285R65727l644045n003044l94188L660136Q18545m187137k214642N284803
12923c740560P640918J456613m346289k751284J523559J440361j311040j474529
12915a562251L844p71013k161438j0198L684056L276114p23120k208959L83419
$$ plain form
12906 -89546 1929972 1933539 -112685 -1200751 -525276 142567 344011 1217729 2409559
12897 2409559 2363247 1494395 1653734 2476340 1731732 -367805 -766783 1506100 3317574
12888 3317574 2097175 -197767 -153130 1903455 2489766 110030 -2647481 -2594615 89162
12879 89162 2345763 2033794 201620 -618430 373534 1592305 1463171 344525 -411888
12870 -411888 -342267 11977 142954 -170155 -1036549 -1965318 -1857543 -580679 81996 -1555112
12860 -1555112 -4448003 -5667420 -3897317 -831091 1051633 975985 -68833 -786205 -751660
12851 -751660 -656603 -1367300 -2480069 -2553684 -1442791 -1166645 -2960772 -4648761 -3319196
12842 -3319196 -50651 929035 -1842640 -4854241 -4487007 -1595224 489802 513141 -269319
$$ packed form
12906h9546K019518L567k046224j088066O75475O67843K01444Q73718J191830
12897B409559m6312q68852J59339Q22606p44608k099537l98978K272883J811474
12888C317574j220399k294942M4637K056585N86311k379736k757511N2866K683777
12879H9162K256601l11969j832174q20050R91964J218771j29134j118646p56413
12870d11888O9621L54244J30977l13109q66394r28769J07775J276864O62675j637108
12860a555112k892891j219417J770103L066226J882724p5648j044818p17372L4545
12851g51660R5057p10697j112769p3615J110893K76146j794127j687989J329565
12842c319196L268545R79686k771675l011601L67234K891783K085026K3339p82460
$$ plain form
12833 -269319 -829360 -1268825 -1626291 -1723440 -1911123 -2424210 -2347677 -759043 1390494 2161336
12823 2161336 1339046 644863 1024719 1339814 403807 -1041267 -1438929 -683982 -126241
12814 -126241 -610983 -1583527 -2308753 -3049452 -4275226 -5142810 -3987172 -797845 1865127
12805 1865127 1646769 -454925 -1295646 125048 1493876 929452 -150971 500591 2196854
12796 2196854 2307956 358888 -1251489 -773449 739713 1449782 1214943 1097831 1606590
12787 1606590 2420890 3043659 2900206 1538592 -423070 -1184730 451251 3480459 5610689
12778 5610689 5555928 3883988 1969551 837021 804846 1423905 1665999 869324 -219911
12769 -219911 83472 2359895 4805211 4776384 1877710 -1178569 -1539550 354292 1415892
$$ packed form
12833b69319n60041m39465l57466r7149j87683n13087P6533J588634K149537P70842
12823B161336q22290o94183L79856L15095r36007j445074l97662P54947N57741
12814a26241m84742r72544p25226p40699j225774q67584J155638L189327K662972
12805A865127k18358k101694q40721J420694J368828n64424j080423O51562J696263
12796B196854J11102j949068j610377M78040J513162P10069k34839j17112N08759
12787A606590Q14300O22769j43453j361614j961662p61660J635981L029208K130230
12778E610689n4761j671940j914437j132530l2175O19059K42094p96675j089235
12769b19911L03383K276423K445316k8827k898674l056279l60981J893842J061600
$$ plain form
12760 1415892 -33990 -2348124 -3271945 -2872217 -2300659 -1204113 1165696 3054065 1553224
12751 1553224 -2691366 -5090109 -2804406 1574927 3760761 2998764 1414854 142421
12743 142421 -1016792 -1394098 -228481 843277 -586081 -3409387 -3718591 -676719 1647349
12734 1647349 71876 -3005959 -3299448 -782323 1129161 1374164 2560862 6124269
12726 6124269 9272506 8325292 3362189 -2039408 -4819157 -4858899 -3845882 -3021784 -2411551
12717 -2411551 -1667243 -1041099 -1239355 -2386030 -3565660 -3769897 -3117544 -2721221 -3364848
12708 -3364848 -4608936 -5186891 -4114184 -1567932 1113175 2500032 2363750 1678364 1242336
12699 1242336 817702 -65038 -1113360 -1704158 -1791656 -1688928 -1399047 -902680 -646496
$$ packed form
12760A415892j449882k314134r23821L99728N71558J096546K369809J888369j500841
12751A553224m244590k398743K285703M379333K185834p61997j583910j272433
12743A42421j159213l77306J165617J071758j429358k823306l09204L041872K324068
12734A647349j575473l077835k93489K517125J911484K45003J186698L563407
12726F124269L148237r47214m963103n401597k779749l9742J013017Q24098O10233
12717b411551P44308O26144j98256j146675j179630k04237O52353L96323o43627
12708c364848j244088n77955J072707K546252K681107J386857j36282o85386m36028
12699A242336m24634q82740j048322n90798q7498J02728K89881M96367K56184
$$ plain form
12690 -646496 -920078 -1218761 -1108980 -1112692 -1608192 -1592407 -135762 1564781 1728219 1302471
12680 1302471 3012549 6585032 7901611 4507907 -610022 -3015446 -2470253 -1803846
12672 -1803846 -1811396 -821022 1278934 2326652 1676882 1317666 2044408 1633977 -1246936
12663 -1246936 -3919699 -3111497 186122 2118984 1384008 400951 1118670 2311277 1912238
12654 1912238 115275 -1125672 -651195 904708 2070378 1710045 -294112 -2810974
12646 -2810974 -4137046 -3456484 -1566388 100382 906976 1124410 967029 295774 -505912
12637 -505912 -107358 2393664 5716116 7098703 5447927 2973160 2536588 3908125 4290281
12628 4290281 2529803 745944 933429 1966137 1706046 568326 614826 1817099 1839307
$$ packed form
12690f46496k73582k98683J09781l712m95500J5785J456645J700543J63438m25748
12680A302471J710078L572483J316579l393704n117929k405424N45193O66407
12672a803846p550R90374K099956J047718o49770l59216P26742m10431k880913
12663a246936k672763Q08202L297619J932862p34976r83057P17719J192607l99039
12654A912238j796963j240947M74477J555903J165670l60333k004157k516862
12646b810974j326072O80562J890096J666770Q06594K17434j57381o71255q01686
12637e05912L98554K501022L322452J382587j650776k474767m36572J371537L82156
12628D290281j760478j783859J87485J032708k60091j137720M6500J202273K2208
$$ plain form
12619 1839307 -256162 -2431906 -2637788 -1515424 -1010530 -1637258 -2402401 -2607138 -2471362
12610 -2471362 -2272526 -1812484 -873222 113312 48376 -1727544 -3992584 -4159188 -1314497
12601 -1314497 1982619 2570103 882937 206603 1801565 3265468 2407972 268975 -1040831
12592 -1040831 -1368524 -1709288 -2080097 -1990141 -1745398 -1696461 -1320928 -328357 660372 1611141
12582 1611141 3368943 5171608 4392542 860485 -1252506 1053900 4487560 3649698
12574 3649698 -1289804 -5231098 -5373617 -3434520 -1244940 1145331 2764754 1824578
12566 1824578 -499692 -591995 2177261 4517071 4668610 4407335 4349518 2222308 -2005203
12557 -2005203 -4275732 -2802582 -1505145 -3324820 -4823335 -2348592 626811 -1437926
$$ packed form
12619A839307k095469k175744k05882J122364N04894o26728p65143k04737J35776
12610b471362J98836M60042R39262R86534o4936j775920k265040j66604K844691
12601a314497L297116N87484j687166o76334J594962J463903q57496k138997j309806
12592a040831l27693l40764l70809Q9956K44743M8937L75533R92571R88729R50769
12582A611141J757802J802665p79066l532057k112991K306406L433660q37862
12574C649698m939502l941294j42519J939097K189580K390271J619423r40176
12566A824578k324270r2303K769256K339810J51539k61275n7817k127210m227511
12557b005203k270529J473150J297437j819675j498515K474743K975403k064737
$$ plain form
12549 -1437926 -6551214 -7459575 -2395004 2959981 4233908 2944888 1429916 -949805
12541 -949805 -4408684 -6351076 -5210131 -3260743 -3036125 -3632474 -2899241 -1047560 175415
12532 175415 254306 -32383 -70618 409866 1437798 2167799 1422590 -525589 -2190587
12523 -2190587 -3252456 -4801159 -6723458 -7094473 -5114622 -2547923 -1128737 -518419
12515 -518419 7650 -112093 -1236359 -2123568 -1598775 -230524 971907 2115687 3382439
12506 3382439 3862373 2871572 1290261 349871 181030 583813 1911552 3991215 5393441
12497 5393441 5031349 3537286 2170479 1471219 1661821 2882402 4219918 4168957 2966236
12488 2966236 2623890 3634992 3829526 1927941 -112776 -287469 172742 -710454 -1758877
$$ packed form
12549a437926n113288r08361N064571N354985J273927j289020j514972k379721
12541i49805l458879j942392J140945J949388K24618n96349P33233J851681J222975
12532A75415P8891k86689l8235M80484J027932P30001p45209j948179j664998
12523b190587j061869j548703j922299l71015J979851K566699J419186O10318
12515e18419N26069j19743j124266q87209N24793J368251J202431J143780J266752
12506C382439M79934r90801j581311r40390j68841M02783J327739K079663J402226
12497E393441l62092j494063j366807o99260J90602J220581J337516n0961j202721
12488B966236l42346J011102J94534j901585k040717j74693M60211q83196j048423
$$ plain form
12479 -1758877 -376549 2845002 4473750 3019314 642841 -154678 676478 1708009
12471 1708009 2074344 1991281 2268042 3445704 4753092 4413323 1876386 -967241 -1873310
12462 -1873310 -793856 711763 1603895 1588725 315525 -1956339 -3667691 -3607492 -2656759
12453 -2656759 -2437329 -2965683 -3118773 -2556462 -1569336 79430 2389242 4035852 3898595
12444 3898595 2935651 2722925 2916197 2087994 335500 -951203 -1281609 -1131468 -594793
12435 -594793 75560 -481991 -2906784 -5159858 -4763784 -2325912 -550811 -532514 -1369639
12426 -1369639 -2451211 -3439477 -3018499 -709622 987566 -415574 -3104138 -3277558 -991262
12417 -991262 425387 271945 1067500 3046788 3093301 309793 -2041864 -1778017 -630795
$$ packed form
12479a758877J382328L221551J628748j454436k376473p97519Q31156J031531
12471A708009L66335q3063K76761J177662J307388l39769k536937k843627r06069
12462a873310J079454J505619Q92132j5170j273200k271864j711352O0199R50733
12453b656759K19430n28354j53090N62311R87126J648766K309812J646610j37257
12444C898595r62944k12726J93272q28203j752494j286703l30406J50141N36675
12435e94793O70353n57551k424793k253074L96074K437872J775101J8297q37125
12426a369639j081572r88266M20978K308877J697188j403140k688564j73420K286296
12417i91262J416649j53442P95555J979288M6513k783508k351657K63847J147222
$$ plain form
12408 -630795 -147265 874607 2830054 3527567 2310867 1726653 2611341 2037878 -878674
12399 -878674 -1990329 1080724 3782061 1280668 -3682044 -5289433 -3780207 -3724062 -5434182
12390 -5434182 -4991731 -1956786 -263405 -1083715 -1053787 1245437 2759035 1682326 588490
12381 588490 1572086 2747858 2145307 1164405 1377120 1325470 -484865 -2269066 -1762461
12372 -1762461 -61012 385336 -225505 -75982 674881 380261 -861516 -1313797 -562752
12363 -562752 163031 543984 1683771 3718772 4908507 3919797 1731701 433049 810917
12354 810917 1761260 1799590 739443 -218362 -43029 760504 813581 -240671 -1252921
12345 -1252921 -1092396 132798 1612388 2754930 3177147 2544182 983023 -762930 -1862054
$$ packed form
12408f30795M83530J021872J955447O97513j216700n84214Q84688n73463k916552
12399h78674j111655L071053K701337k501393m962712j607389J509226N6145j710120
12390e434182M42451L034945J693381q20310K9928K299224J513598j076709j093836
12381E88490R83596J175772o02551r80902K12715n1650j810335j784201N06605
12372a762461J701449M46348o10841J49523P50863k94620j241777m52281P51045
12363e62752P25783L80953J139787K035001J189735r88710k188096j298652L77868
12354H10917R50343L8330j060147r57805J75333Q03533N3077j054252j012250
12345a252921J60525J225194J479590J142542M22217o32965j561159j745953j099124
$$ plain form
12336 -1862054 -1756861 -262732 1882044 2906819 1753129 -210372 -801539 -311749 -1091776
12327 -1091776 -3492752 -4824076 -3591482 -2102868 -2689807 -3737607 -2590939 -670756
12319 -670756 -1694660 -5251182 -6386163 -2590262 2479521 4180358 2823946 1876143
12311 1876143 2400507 2432146 921817 -745572 -1304203 -1375298 -2128577 -3703549 -5351959
12302 -5351959 -5997505 -4646449 -1560892 1039920 1013968 -900113 -2051821 -1795907 -2204980
12293 -2204980 -4128346 -5100156 -3064775 -183766 -263213 -3352633 -5633339 -4592304 -1926591
12284 -1926591 -840655 -2321085 -4778886 -6044338 -5098917 -2764215 -1013541 -953183 -1741360
12275 -1741360 -2301011 -3133522 -4726715 -5201811 -2413131 1769375 2638473 -956464 -4582333
$$ packed form
12336a862054J05193J494129K144776J024775j153690j963501n91167M89790p80027
12327a091776k400976j331324J232594J488614n86939j047800J146668J920183
12319f70756j023904l556522j134981L795901N069783J700837j356412r47803
12311A876143N24364L1639j510329j667389n58631p1095p53279j574972j648410
12302e351959o45546J351056L085557K600812k5952j914081j151708K55914m09073
12293b204980j923366r71810K035381K881009p9447l089420k280706J041035K665713
12284a926591J085936j480430k457801j265452R45421K334702J750674O0358p88177
12275a741360n59651q32511j593193m75096K788680M182506Q69098l594937l625869
$$ plain form
12266 -4582333 -4280488 -1742969 -1062499 -2787524 -4257439 -4204206 -3719535 -3400149 -2620821
12257 -2620821 -1540817 -1226101 -1647165 -1726022 -1382526 -1443208 -1607266 -793345 406282
12248 406282 91595 -1641599 -2199593 -202251 2506654 3747778 3883877 4249317 4409726
12239 4409726 3042154 648234 -689939 -224281 386683 -603639 -2631267 -3507026 -2208016
12230 -2208016 -195555 458050 -318664 -901214 -730243 -1101844 -2487959 -2892302 -573187
12221 -573187 2949987 4756255 4427248 3694868 2996978 1391128 -308041 248064 2832689
12212 2832689 4019727 2070983 -490159 -959337 -285687 -527369 -1081989 -474292 77522
12203 77522 -1576964 -4266790 -4655386 -2476144 -1175858 -2743378 -4937263 -4891978 -3023501
$$ packed form
12266d582333L01845K537519O80470j725025j469915N3233M84671L19386P79328
12257b620821J080004L14716m21064p8857L43496o0682j64058Q13921J199627
12248D06282l14687j733194n57994J997342K708905J241124J36099L65440J60409
12239D409726j367572k393920j338173M65658O10964r90322k027628q75759J299010
12230b208016K012461O53605p76714n82550J70971l71601j386115m04343K319115
12221e73187L523174J806268l29007p32380o97890j605850j699169N56105K584625
12212B832689J187038j948744k561142m69178O73650k41682n54620O07697N51814
12203G7522j654486k689826l88596K179242J300286j567520k193885M5285J868477
$$ plain form
12194 -3023501 -1668781 -1589193 -1739570 -1575496 -1703911 -2272137 -2105211 -135848 2712235
12185 2712235 3809147 1530677 -2475049 -4651325 -3556936 -1500522 -1321668 -2705768
12177 -2705768 -3249326 -2283105 -1405076 -1402472 -1132756 -81701 321739 -769764 -1757573
12168 -1757573 -988110 499394 580333 -714443 -1708587 -2064277 -2866941 -3984277 -3843780
12159 -3843780 -2176517 -595829 277738 1845880 4409647 5418095 3020502 -382688
12151 -382688 -850800 1733505 3771332 3119606 1352889 510094 291733 -410868 -1356147
12142 -1356147 -1710201 -1380580 -393820 1569121 3880921 4823935 4057296 3558054 4533482
12133 4533482 5180461 3596820 1247025 860099 2144392 2698720 2416316 3445802 5748862
$$ packed form
12194c023501J354720P9588j50377J64074j28415n68226J66926J969363K848083
12185B712235J096912k278470m005726k176276J094389K056414J78854j384100
12177b705768n43558R66221Q78029K604K69716J051055M03440j091503r87809
12168a757573P69463J487504Q0939j294776r94144l55690q02664j117336J40497
12159c843780J667263J580688Q73567J568142K563767J008448k397593l403190
12151c82688m68112K584305K037827o51726j766717q42795k18361p02601r45279
12142a356147l54054L29621R86760J962941K311800R43014p66639m99242R75428
12133D533482O46979j583641k349795l86926J284293N54328k82404J029486K303060
$$ plain form
12124 5748862 6375212 4131636 1673494 1381756 2022518 1482419 357478 419072 1362253
12115 1362253 1616914 1116512 822953 431972 -1050356 -3032319 -3896553 -3469318 -2839287
12106 -2839287 -2100764 -575514 866842 270254 -2189419 -3875653 -3425032 -2491447 -2507387
12097 -2507387 -2040807 502268 3344474 3410978 1240253 725150 3487820 6316241 5622087
12088 5622087 2216641 -463836 -1303831 -1963413 -3112327 -3338489 -2244364 -1605771 -2029455
12079 -2029455 -1164690 2418243 5710877 4830128 994747 -623956 1978436 5147657
12071 5147657 5100806 2725904 1073167 716079 132697 -1009883 -1698663 -1919753 -2677541
12062 -2677541 -3847622 -4089026 -2997848 -1570211 -306881 1427835 3641518 4887524
$$ packed form
12124E748862O26350k243576k458142k91738O40762n40099j124941O1594R43181
12115A362253K54661n00402k93559l90981j482328j981963q64234M27235O30031
12106b839287P38523J525250J442356n96588k459673j686234M50621R33585j5940
12097b507387M66580K543075K842206O6504k170725n15103K762670K828421o94154
12088E622087l405446k680477q39995o59582j148914k26162J094125O38593m23684
12079b029455Q64765L582933L292634q80749l835381j618703K602392L169221
12071E147657m6851k374902j652737l57088n83382j142580o88780k21090p57788
12062b677541j170081k41404J091178J427637J263330J734716K213683J246006
$$ plain form
12054 4887524 4174899 2619438 2041380 2531762 2664961 2029327 2178458 4251411 6504434
12045 6504434 5772272 1649685 -2272974 -2507314 -3556 1270803 -377687 -2530064
12037 -2530064 -2361260 -112683 2132778 3394783 3947877 3661119 2003933 -557721 -2525581
12028 -2525581 -2814866 -1525653 521518 2371172 3300411 3173407 2296061 803937 -1231212
12019 -1231212 -3026019 -3464526 -2637270 -1866101 -1688705 -1178392 -29687 307725 -1044464
12010 -1044464 -2354830 -1421470 1142844 2659539 1942532 406644 -73234 1085115 3201743
12001 3201743 4653716 3592690 -51881 -3594385 -4225724 -2354702 -689659 -351786
11993 -351786 84567 1691069 3486768 4155071 3612097 2189900 -90732 -2610845 -3917837
$$ packed form
12054D887524p12625j555461n78058M90382J33199o35634J49131K072953K253023
12045F504434p32162m122587l922659k34340K503758J274359j648490k152377
12037b530064J68804K248577K245461J262005N53094k86758j657186k561654j967860
12028b525581k89285J289213K047171J849654R29239j27004q77346j492124k035149
12019a231212j794807m38507Q27256P71169J77396N10313J148705L37412j352189
12010a044464j310366R33360K564314J516695p17007j535888m79878J158349K116628
12001C201743J451973j061026l644571l542504o31339J871022J665043L37873
11993c51786M36353J606502J795699O68303n42974j422197k280632k520113j306992
$$ plain form
11984 -3917837 -3269091 -1358532 1003560 3643818 5904360 6334296 4577196 2326318
11976 2326318 1180963 549646 -997652 -3112392 -4009155 -3169656 -2151454 -2349798 -3135378
11967 -3135378 -2987738 -1821346 -1180968 -2135320 -3890804 -4957577 -4901143 -4081927 -2454067
11958 -2454067 -207611 836812 -1139288 -4443388 -4708633 -763210 2965069 2328577
11950 2328577 -736340 -1756318 -1005145 -2411643 -5922578 -6621785 -2705672 1008890
11942 1008890 306554 -2223185 -1977356 337150 867327 -378244 43008 2580067 3874283
11933 3874283 2599151 1381320 1795718 1716425 -453301 -2543768 -2090684 -222923 564239
11924 564239 231724 -5780 -756008 -3069900 -5222198 -4379047 -1165380 754469 -18590
$$ packed form
11984c917837O48746J910559K362092K640258K260542M29936j757100k250878
11976B326318j145355o31317j547298k114740q96763Q39499J018202j98344p85580
11967c135378J47640J166392O40378r54352j755484j066773N6434Q19216J627860
11958b454067K246456J044423j976100l304100k65245L945423L728279o36492
11950B328577l064917j019978P51173j406498l510935o99207L916113L714562
11942A008890p02336k529739K45829K314506N30177j245571M21252K537059J294216
11933C874283j275132j217831M14398p9293k169726k090467M53084J867761P87162
11924E64239l32515k37504p50228k313892k152298Q43151L213667J919849p73059
$$ plain form
11915 -18590 -877587 280035 1745781 997464 -1228257 -2177345 -1165383 -177151 -783242
11906 -783242 -2239968 -2728863 -1377061 958249 2280642 1219217 -1247195 -2610971
11898 -2610971 -2077164 -1828356 -3878994 -6896551 -7875671 -6005583 -2871702 353592 3474578
11889 3474578 5495931 5110108 3198697 2198912 2488206 2066966 510478 223707 2384061
11880 2384061 4541216 4281357 2786333 2384554 2733100 2139974 946508 688532 1155804
11871 1155804 1177570 1342138 2960937 4989514 4979299 2775230 401173 -1452693 -3706207
11862 -3706207 -5633032 -4847361 -1547850 384131 -1672308 -5293192 -6088662 -3040248
11854 -3040248 1003738 3135412 3040551 2251414 1986628 1945512 1005892 -957415 -2507798
$$ packed form
11915a8590q58997J157622J465746p48317k225721r49088J011962R88232o06091
11906g83242j456726m88895J351802K335310J322393j061425k466412j363776
11898b610971N33807K48808k050638l017557r79120J870088L133881L225294L120986
11889C474578K021353l85823j911411r99785K89294m21240j556488k86771K160354
11880B384061K157155k59859j495024m01779L48546n93126j193466k57976M67272
11871A155804K1766J64568J618799K028577j0215k204069k374057j853866k253514
11862c706207j926825P85671L299511J931981k056439l620884p95470L048414
11854c040248M043986K131674r4861p89137k64786m1116r39620j963307j550383
$$ plain form
11845 -2507798 -2445826 -1393108 -560135 218831 1808527 3950787 5782095 7270900 8170988
11836 8170988 6704969 2085252 -2546927 -3253262 -1121220 -941465 -3628553 -4524074 -959585
11827 -959585 3012851 2558567 -932623 -2748846 -2173804 -2405209 -4441015 -5577746 -4181203
11818 -4181203 -2232296 -2108644 -3462666 -4428856 -4090534 -2765937 -1200787 -312421 -760547
11809 -760547 -2089199 -2901668 -2285517 -666376 839158 1521987 1556733 1699056 2424674
11800 2424674 3281930 3422383 2711315 1680408 534058 -729384 -1245898 163657 2981433
11791 2981433 5053440 5243851 4492290 3669270 2333500 590458 -20174 878494 1062394
11782 1062394 -1016313 -3286539 -2938694 -881379 -440429 -2407448 -4356285 -4598827 -3825821
$$ packed form
11845b507798O1972J052718Q32973P78966J589696K142260J831308J488805R00088
11836H170988j466019m619717m632179p06335K132042J79755k687088q95521L564489
11827i59585L972436m54284l491190j816223N75042k31405k035806j136731J396543
11818d181203J948907J23652j354022r66190L38322J324597J565150Q88366m48126
11809g60547j328652q12469O16151J619141J505534O82829L4746J42323P25618
11800B424674Q57256J40453p11068j030907j146350j263442n16514J409555K817776
11791B981433K072007J90411p51561q23020j335770j743042o10632Q98668J83900
11782A062394k078707k270226L47845K057315M40950j967019j948837k42542P73006
$$ plain form
11773 -3825821 -2596853 -235242 2744951 3704920 1127933 -2770570 -4410404 -3052865
11765 -3052865 -1272714 -1551629 -3459396 -4386119 -2620368 629169 2503566 1696422 -262586
11756 -262586 -1190458 -779055 -163641 101411 321738 438807 -2220 -738903 -949597 -654396
11746 -654396 -826720 -1821025 -2593428 -1912519 106616 1892289 1754890 -341726 -2226977
11737 -2226977 -1538981 1285308 3110679 1990963 -292622 -871878 287222 1040507 769728
11728 769728 975713 2261597 3190529 2793027 2133503 2353392 2844989 2640004 2281431
11719 2281431 2792317 3596840 3076998 1001736 -994355 -1604014 -1402664 -1580319 -1879531
11710 -1879531 -839769 1966554 4951262 6258193 5766857 4605324 3273122 1398005
$$ packed form
11773c825821J228968K361611K980193R59969k576987l898503j639834J357539
11765c052865J780151k78915j907767r26723J765751L249537J874397q07144j959008
11756b62586r27872M11403O15414K65052K20327J17069m41027p36683k10694K95201
11746f54396j72324r94305p72403O80909K019135J785673j37399k096616j885251
11737b226977O87996K824289J825371j119716k283585n79256J159100P53285k70779
11728G69728K05985J285884R28932l97502o59524K19889M91597k04985l58573
11719B281431N10886Q04523n19842k075262j996091o09659K01350j77655k99212
11710a879531J039762K806323K984708J306931m91336j161533j332202j875117
$$ plain form
11702 1398005 -827750 -2234598 -2006284 -604241 716962 544175 -2180455 -6853317
11694 -6853317 -10500218 -10144468 -6305624 -2559820 -1244003 -1355683 -1111469 -356449 506906
11685 506906 1713950 2855024 2442865 330316 -1345300 -1195092 -525425 -606710 -380077
11676 -380077 976225 1729248 614579 -272704 998811 2095777 83383 -2609073 -1062593
11667 -1062593 3869367 5691076 1568160 -3518054 -3875742 -142520 3334856 4657869
11659 4657869 4736288 3909424 1678912 -1101443 -2533522 -2153036 -1417854 -1630790 -2364957
11650 -2364957 -2096832 -85897 2423323 3273218 2050181 789200 1118400 1974167 1816201
11641 1816201 1695034 3470992 5944391 6083843 3904049 2584939 3309941 3646465 2203146
$$ packed form
11702A398005k225755j406848K28314J402043J321203j72787k724630m672862
11694f853317l646901L55750L838844L745804J315817j11680K44214P55020Q63355
11685E06906J207044J141074m12159k112549j675616J50208O69667q1285K26633
11676c80077J356302P53023j114669q87283J271515J096966k012394k692456J546480
11667a062593M931960J821709m122916n086214l57688L733222L477376J323013
11659D657869P8419q26864k230512k780355j432079L80486P35182k12936p34167
11650b364957K68125K010935K509220Q49895j223037j260981L29200Q55767j57966
11641A816201j21167J775958K473399J39452k179794j319110P25002L36524j443319
$$ plain form
11632 2203146 1295431 2951275 5247696 5163715 2970183 1259253 1030043 1051986 335843
11623 335843 -568859 -434455 1360550 3924053 5151490 4096655 2790040 3735206 5786883
11614 5786883 5293380 1687112 -1311405 -1151131 164212 -200118 -1925361 -3299065 -3941634
11605 -3941634 -3455151 -422250 4333809 6349655 2924681 -2324401 -4029738 -2296419
11597 -2296419 -1359256 -2565721 -3282994 -2251856 -1401566 -1804317 -1888653 -824697 -250233
11588 -250233 -1152507 -1911640 -1141195 -139155 -687348 -2193006 -2871402 -2559348 -2599439
11579 -2599439 -3556944 -4489436 -4308881 -2931231 -1112411 289023 880112 884996 844095
11570 844095 1183484 1973313 2766464 2666046 1127740 -1129353 -2669311 -3007643 -2943551
$$ packed form
11632B203146r07715J655844K296421q3981k193532j710930k29210K1943p16143
11623C35843r04702J34404J795005K563503J227437j054835j306615R45166K051677
11614E786883m93503l606268k998517J60274J315343l64330j725243j373704o42569
11605c941634M86483L032901M756059K015846l424974n249082j705337J733319
11597b296419R37163j206465p17273J031138Q50290m02751q4336J063956N74464
11588b50233r02274p59133P70445J002040n48193j505658o78396L12054m0091
11579b599439r57505r32492J80555J377650J818820J401434N91089M884m0901
11570H44095L39389P89829P93151j00418j538306k257093j539958l38332O4092
$$ plain form
11561 -2943551 -3034208 -2851007 -2186991 -1721038 -1764773 -1652856 -1262497 -1722394 -3421922 -4720820
11551 -4720820 -4159516 -2716691 -2142085 -2165655 -1420170 -330147 -694130 -2496239 -3376092
11542 -3376092 -1834360 670305 1615108 425623 -1060491 -645666 2065763 5283093
11534 5283093 6622717 5114452 1715401 -1638461 -3037080 -1561180 1429433 2719250
11526 2719250 874810 -1138480 437256 4282799 5202977 1607393 -2280732 -3122665
11518 -3122665 -2958966 -4277060 -4848269 -1715677 2799535 3983387 1776849 192561
11510 192561 819579 1516539 1042241 588501 698201 584730 660917 2159714 4161095
11501 4161095 4436954 3201325 2555296 2448617 1038642 -1054348 -1121521 658522 1001419
$$ packed form
11561b943551r0657J83201O64016M65953m3735J11917L90359m59897j699528j298898
11551d720820N61304J442825N74606k3570P45485J090023l63983j802109q79853
11542c376092J541732K504665R44803j189485j486114M14825K711429L217330
11534E283093J339624j508265l399051l353862j398619J475900K990613J289817
11526B719250j844440k013290J575736L845543R20178l595584l888125q41933
11518c122665J63699j318094n71209L132592M515212J183852k206538j584288
11510A92561O27018O96960m74298m53740J09700j13471P6187J498797K001381
11501D161095K75859j235629o46029j06679j409975k092990o7173J780043L42897
$$ plain form
11492 1001419 -928366 -2130747 -1148098 -447964 -1686932 -2775785 -1930085 -870758 -1357580
11483 -1357580 -1789601 -108365 2481334 3370547 2139025 191267 -1293858 -1468764 -71737
11474 -71737 1077145 -551089 -3966074 -4885511 -1869309 1180404 812795 -1268563 -2072163
11465 -2072163 -2253296 -3523927 -4289447 -2276011 663097 864427 -1377821 -2594711 -1777169
11456 -1777169 -1081825 -1284748 -562321 1714997 3245262 1811169 -1996169 -5535946 -6297696
11447 -6297696 -3735874 -218420 844417 -808647 -1581227 743812 3238680 1935360
11439 1935360 -2414171 -5991054 -7477657 -8095255 -7541002 -4430008 -306688 1280145
11431 1280145 -4305 -971999 -181298 457263 -42839 73432 1633204 2756943 2277780
$$ packed form
11492A001419j929785j202381R82649P00134j238968j088853Q45700J059327m86822
11483a357580m32021J681236K589699Q89213j231522j947758j485125j74906J397027
11474g1737J148882j628234l414985r19437L016202L049713l67609k081358q03600
11465b072163j81133j270631p65520K013436K939108K01330k242248j216890Q17542
11456a777169O95344k02923P22427K277318J530265j434093l807338l539777p61750
11447f297696K561822L517454J062837j653064p72580K325039K494868j303320
11439A935360m349531l576883j486603o17598N54253L110994M123320J586833
11431A280145j284450r67694P90701O38561n00102J16271J559772J123739m79163
$$ plain form
11422 2277780 1632626 1730555 1061363 -1212286 -3041341 -2370764 -29939 1909222 2598801
11413 2598801 1957405 116147 -1305203 90202 3850679 6244964 5204586 3133124
11405 3133124 2788855 3080125 1591627 -1109357 -2826896 -3555007 -4588068 -5120097 -3318012
11396 -3318012 -285322 528089 -1779880 -4166432 -3946524 -2182555 -1639376 -2944870 -4076608
11387 -4076608 -3035429 -154194 2302778 2676025 1669521 927019 303878 -1713446 -4656049
11378 -4656049 -5567644 -3193021 -349615 38483 -764017 170186 2217502 2132642 -457441
11369 -457441 -2339190 -1832329 -967931 -1454500 -1844181 -598793 780897 97057 -1981543
11360 -1981543 -3125644 -2835008 -2443555 -2511425 -2345118 -1588977 -443641 1196902 3062708
$$ packed form
11422B277780o45154R7929o69192k273649j829055O70577K340825J939161O89579
11413B598801o41396j841258j421350J395405L760477K394285j040378k071462
11405C133124l44269K91270j488498k700984j717539p28111j033061n32029J802085
11396c318012L032690Q13411k307969k386552K19908J763969N43179j305494j131738
11387d076608J041179K881235K456972L73247j006504p42502o23141k017324k942603
11378d656049r11595K374623K843406L88098q02500R34203K047316q4860k590083
11369d57441j881749N06861Q64398m86569l89681J245388J379690o83840k078600
11360a981543j144101K90636L91453o7870J66307P56141J145336J640543J865806
$$ plain form
11351 3062708 3616409 1965056 210130 1329794 4550981 5540852 2144531 -2546131
11343 -2546131 -4375446 -3236548 -1974407 -1899707 -1992361 -1682405 -1704023 -2223453 -2411906
11334 -2411906 -2123712 -2024866 -1874763 -759308 711860 830113 31895 1065059 4624729
11325 4624729 7435317 6676686 4062894 3042643 3820061 4048591 3057498 2156690 1566122
11316 1566122 392110 -637785 230445 2295945 2794943 1273327 312844 1051194 1304549
11307 1304549 -436735 -2298204 -2242549 -1254356 -1088844 -1186728 -178259 1543803 3032624
11298 3032624 4574582 5882994 4687626 196269 -3843660 -3201146 731074 2641677
11290 2641677 737775 -1379109 -710437 1006252 656541 -1647309 -3338562 -2956352 -1061092
$$ packed form
11351C062708N53701j651353j754926J119664L221187R89871l396321m690662
11343b546131j829315J138898J262141P4700r2654L09956k1618n19430j88453
11334b411906K88194R8846J50103J115455J471168J18253p98218J033164L559670
11325D624729K810588p58631k613792j020251P77418K28530r91093r00808n90568
11316A566122j174012j029895Q68230K065500M98998j521616r60483P38350K53355
11307A304549j741284j861469N5655R88193J65512r7884J008469J722062J488821
11298C032624J541958J308412j195368m491357m039929O42514L932220J910603
11290B641677j903902k116884O68672J716689l49711k303850j691253L82210J895260
$$ plain form
11281 -1061092 1284927 3282479 4124200 3251677 1049644 -1116098 -1718973 -297403 1820587
11272 1820587 2598280 1685609 964765 1862202 3153181 2826651 1172881 155845 357526
11263 357526 659771 673392 1242397 2425378 3159103 3363983 4365372 6525215 8172205
11254 8172205 7666424 5177359 1899778 -1110719 -2872815 -2726573 -1296484 -86489
11246 -86489 266324 302978 334327 76900 -333237 -420234 -348011 -332085 384420 1922548
11236 1922548 1876002 -1938951 -6995997 -7975561 -3959002 -4721 6679 -1561512 -602822
11227 -602822 2448488 4123531 3425462 2365788 2375748 3331492 5215874 7825388 9400599
11218 9400599 8180130 4993195 2136139 222107 -1666663 -3340959 -3516915 -2266132
$$ packed form
11281a061092K346019J997552Q41721q72523k202033k165742o02875J421570K117990
11272A820587P77693r12671p20844Q97437J290979l26530j653770j017036K01681
11263C57526L02245J3621N69005J182981P33725K04880J001389K159843J646990
11254H172205n05781k489065l277581l010497j762096J46242J430089J209995
11246h6489L52813L6654L1349k57427m10137q6997P2223J5926P16505J538128
11236A922548m6546l814953n057046r79564M016559L954281J1400j568191R58690
11227f02822L051310J675043o98069j059674R960R55744J884382K609514J575211
11218I400599j220469l186935k857056j914032j888770j674296j75956J250783
$$ plain form
11210 -2266132 -1164640 -951429 -947006 -686855 -263592 739715 2646844 4139336 3424001
11201 3424001 1060032 -469245 -320667 -327344 -1797082 -3221837 -2364363 672887 3690748
11192 3690748 5003451 4828551 4383389 4330086 4262279 3551820 2379264 1438168 718545
11183 718545 -479433 -2025372 -2574518 -1431797 189805 720107 316123 550481 2579521
11174 2579521 6084318 9247626 9666414 6720015 3266640 2991421 5505354 6545433
11166 6545433 4045790 1016076 557451 1255741 477509 -636287 636565 3444969 4640952
11157 4640952 3960948 3721883 4183155 3552041 2202535 2337249 3246931 1582907 -2606665
11148 -2606665 -4569847 -1507977 3142611 4449303 2206252 34336 293441 2126104
$$ packed form
11210b266132J101492K13211M423K60151M23263J003307J907129J492492p15335
11201C424001k363969j529277J48578o677j469738j424755Q57474L037250L017861
11192C690748J312703j74900m45162n3303o7807p10459j172556r41096p19623
11183G18545j197978j545939n49146J142721J621602N30302m03984K34358K029040
11174B579521L504797L163308M18788k946399l453375k75219K513933J040079
11166F545433k499643l029714m58625O98290p78232j113796J272852K808404J195983
11157D640952o80004k39065M61272o31114j349506J34714R09682j664024m189572
11148b606665j963182L061870M650588J306692k243051k171916K59105J832663
$$ plain form
11140 2126104 3382263 2866161 1256443 361183 820066 1029269 -301741 -1592427 -707762
11131 -707762 1285138 1875859 1743098 3573758 6523724 6564692 3055445 138003 83437
11122 83437 75389 -2056893 -3593018 -1718726 1417175 2343607 1821471 2608044 4056072
11113 4056072 3319454 626720 -732642 659284 2663042 2885603 1318428 -402381
11105 -402381 -792217 278460 1300565 730198 -732791 -964190 145040 375288 -969492
11096 -969492 -1718782 -595406 764286 1308395 2817202 6203392 8650433 7467246 4235989
11087 4235989 2039833 928878 -643652 -2095428 -1914733 -857274 -660855 -1052733 -906692
11078 -906692 -615489 -509808 898512 3967220 5643995 3768265 1250494 1846711 4061613
$$ packed form
11140B126104J256159n16102j609718q95260M58883K09203j331010j290686Q84665
11131g07762J992900N90721j32761J830660K949966M0968l509247k917442n4566
11122H3437q048k132282j536125J874292L135901R26432n22136P86573J448028
11113D056072p36618k692734j359362J391926K003758K22561j567175j720809
11105d02381l89836J070677J022105n70367j462989k31399J109230K30248j344780
11096i69492p49290J123376J359692N44109J508807L386190K447041j183187l231257
11087D235989k196156j110955j572530j451776J80695J057459J96419l91878J46041
11078i06692K91203J05681J408320L068708J676775j875730k517771N96217K214902
$$ plain form
11069 4061613 3940605 1912277 1500967 2567626 1641863 -1314846 -2180711 624295 3714338
11060 3714338 4090423 2614166 1089056 -207495 -1022095 -622218 394731 863114 1707646
11051 1707646 4391735 6972481 5884107 1743099 -1062561 -879706 -189723 -81393 1317707
11042 1317707 3666204 3289987 -448872 -2848188 -924620 1829936 1125235 -1792412
11034 -1792412 -3154720 -2455666 -1356263 165259 2582832 4156612 3360325 2037916
11026 2037916 2561723 3671705 2765053 674009 250188 1279310 856216 -1411549 -2388100
11017 -2388100 -301206 2366937 2240230 -519085 -2549685 -1418158 1562713 2939494
11009 2939494 1332345 -931398 -1229036 -412068 -1083458 -3086435 -3888431 -3269122 -3760743
$$ packed form
11069D061613j21008k028328m11310J066659r25763k956709q65865K805006L090043
11060C714338L76085j476257j525110j296551q14600L99877J016949M68383Q44532
11051A707646K684089K580746j088374m141008k805660J82855O89983J08330J399100
11042A317707K348497l76217l738859k399316J923568K754556p04701k917647
11034a792412j362308O99054J099403J521522K417573J573780p96287j322409
11026B037916N23807J109982r06652k091044m23821J029122m23094k267765r76551
11017b388100K086894K668143j26707k759315k030600J131527K980871J376781
11009B939494j607149k263743k97638Q16968o71390k002977q01996O19309m91621
$$ plain form
11000 -3760743 -5636886 -5659103 -2697961 -526116 -2118314 -4725304 -4207585 -1333837 334762
10991 334762 572675 1912097 4148856 4093950 933067 -2014625 -1728104 1013662 3269034
10982 3269034 3135118 970550 -1079611 -833749 1484882 3205707 2729179 1721212 2222365
10973 2222365 3384027 3428141 3084188 4027020 5257984 4511481 2395480 1461171 1604071
10964 1604071 289132 -2548495 -3849649 -2472013 -1062781 -1524109 -2118123 -956995
10956 -956995 719966 1006609 477361 438093 209681 -1178299 -2276707 -1071256 1469305
10947 1469305 2472338 1332160 274630 848080 2216999 3241124 4027252 4590620 3811775
10938 3811775 1058818 -2183254 -3585972 -2517610 -500562 635938 501281 208052
$$ packed form
11000c760743j876143k2217K961142K171845j592198k606990N17719K873748J668599
10991C34762K37913J339422K236759n4906l160883k947692K86521K741766K255372
10982C269034j33916k164568k050161K45862K318631J720825m76528j007967N01153
10973B222365J161662M4114l43953R42832J230964p46503k116001r34309J42900
10964A604071j314939k837627j301154J377636J409232m61328n94014J161128
10956i56995J676961K86643n29248l9268k28412j387980j098408J205451K540561
10947A469305J003033j140178j057530N73450J368919J024125P86128N63368p78845
10938C811775k752957l242072j402718J068362K017048J136500j34657k93229
$$ plain form
10930 208052 1021588 2798390 3836425 2872163 1134449 1223878 3550675 5379337 4504371
10921 4504371 2381836 1800141 2748620 3237725 3427948 5434133 8727863 9641930 7056963
10912 7056963 4852183 5973803 7396789 4822152 -148253 -2238732 -502669 1012051
10904 1012051 346024 85313 1677306 2292244 -240904 -3297161 -3223649 -473614 1814131
10895 1814131 2200665 1351336 -78570 -1479444 -1716513 -737399 -355314 -1500754 -2369836
10886 -2369836 -1422045 -361189 -1447475 -3376440 -2974388 -163375 1946070 1774473 1136954
10877 1136954 1888876 3142758 2867647 769287 -1404328 -1810968 -377725 1069840 825550
10868 825550 -416135 -250955 2070510 4420726 4811633 3951310 3392639 2892923 1683186
$$ packed form
10930B08052Q13536J776802J038035r64262j737714Q9429K326797J828662q74966
10921D504371k122535n81695R48479M89105J90223K006185L293730R14067k584967
10912G056963k204780J121620J422986k574637m970405k090479J736063J514720
10904A012051o66027k60711J591993O14938k533148l056257P3512K750035K287745
10895A814131L86534q49329j429906j400874k37069R79114L82085j145440q69082
10886b369836R47791J060856j086286j928965M02052K811013K109445j71597o37519
10877A136954P51922J253882k75111k098360k173615m06640J433243J447565k44290
10868H25550j241685J65180K321465K350216L90907q60323n58671m99716j209737
$$ plain form
10859 1683186 897521 2104226 4208912 4550380 2880627 1650147 2063583 2276559 351988
10850 351988 -2852356 -4848511 -4447330 -2628875 -1104217 -574400 -217363 1099974 3051766
10841 3051766 4014734 3381228 2504935 2381721 1820399 -340214 -2411954 -1738319 1087782
10832 1087782 2645869 1660935 835287 2509097 4827599 4353678 1204707 -878858 448951
10823 448951 3149197 3734969 1824311 241976 1040005 3162059 4556264 4997036 5425461
10814 5425461 5559917 4152362 1416735 -735949 -1223821 -906494 -759217 -648357 -584363
10805 -584363 -1395091 -3000272 -3528015 -1611471 1452511 3215157 3012676 2169883 1870119
10796 1870119 2027986 2028791 1671933 1344068 1529391 2000220 1777495 588015 -171290 704847
$$ packed form
10859A683186p85665J206705K104686L41468j669753j230480M13436K12976j924571
10850C51988l204344j996155M01181J818455J524658N29817L57037J317337J951792
10841C051766R62968o33506q76293j23214n61322k160613k071740O73635K826101
10832A087782J558087r84934q25648J673810K318502m73921l148971k083565J327809
10823D48951K700246N85772j910658j582335P98029K122054J394205M40772M28425
10814E425461J34456j407555k735627k152684m87872L17327J47277J10860O3994
10805e84363q10728j605181n27743J916544L063982J762646k02481q42793k99764
10796A870119J57867Q05l56858l27865J85323M70829k22725j189480p59305Q76137
$$ plain form
10786 704847 1861117 963588 -1290339 -1307704 2293040 6091582 6064171 2662872 -130159
10777 -130159 285150 2820150 4633712 4052750 1882286 515427 1417691 3450411 4415288
10768 4415288 3847768 2896787 1966036 557378 -822682 -1119278 -1107117 -2554900 -4836766
10759 -4836766 -5475178 -4444683 -4356327 -5502024 -4714403 -836671 2624071 2688153 1158816
10750 1158816 944437 1468806 922319 182939 1023543 2650215 3257433 3089914 3076632
10741 3076632 2493467 854984 -36094 1083871 2226809 1345152 31489 699080 2150909
10732 2150909 1584860 -632563 -1732978 -743921 1254088 3598003 5674298 5698033 3102891
10723 3102891 681756 1233398 3575050 4806875 4672012 4537274 4104559 2645719 1624559
$$ packed form
10786G04847J156270q97529k253927j7365L600744L798542k7411l401299k793031
10777a30159M15309K535000J813562n80962k170464j366859R02264K032720R64877
10768D415288n67520r50981r30751j408658j380060k96596J2161j447783k281866
10759d836766o38412J030495Q8356j145697P87621L877732L460742O4082j529337
10750A158816k14379N24369n46487p39380Q40604J626672O07218j67519j3282
10741C076632n83165j638483q91078J119965J142938q81657j313663O67591J451829
10732B150909n66049k217423j100415R89057J998009K343915K076295K3735k595142
10723C102891k421135N51642K341652J231825j34863j34738m32715j458840j021160
$$ plain form
10714 1624559 2538436 3948147 4009439 3785274 4548741 4481546 2202689 739866 3022444
10705 3022444 5981452 4768405 798713 -511488 1420267 2226548 610905 -128723
10697 -128723 1152648 1528241 -67749 -677519 1310829 3496496 3827955 3433639 3558930
10688 3558930 3366682 2241227 1281671 1467585 2655463 4464077 5964038 5467473 3230197
10679 3230197 2591889 5178807 7350814 5542473 2386185 2321988 3906865 2898684 633977
10670 633977 1820374 5414224 5834616 2845988 1860685 3980304 4290556 1392483 75762
10661 75762 2258628 3543918 1767181 1042131 3691594 5634570 3889768 1694149 1867893
10652 1867893 1854564 -10660 6491 3935010 6702420 3874384 -552588 -440152 2912394
$$ packed form
10714A624559R13877J409711O1292k24165P63467o7195k278857j462823K282578
10705C022444K959008j213047l969692j310201J931755Q06281j615643p39628
10697a28723J281371L75593j595990o09770J988348K185667L31459l94316J25291
10688C558930j92248j125455r59556J85914J187878J808614J499961m96565k237276
10679C230197o38308K586918K172007j808341l156288o4197J584877j008181k264707
10670F33977J186397L593850M20392k988628r85303K119619L10252k898073j316721
10661G5762K182866J285290j776737p25050K649463J942976j744802k195619J73744
10652A867893j3329j865224J7151L928519K767410k828036m426972J12436L352546
$$ plain form
10643 2912394 4001895 2324934 1736523 3067461 3596264 2504886 1588347 1406578 1006555
10634 1006555 597979 943763 1136278 76998 -1038094 -460122 1206708 2243638 2506485
10625 2506485 2765821 2895283 2464407 1535825 -210280 -2960244 -4697606 -2733776 1798704
10616 1798704 4577376 4276448 3994496 5185540 5065490 2378036 755467 2955831 6032349
10607 6032349 5990662 3681628 2358867 2464265 2429095 2114746 2317670 2989944 4165387
10598 4165387 6182415 7476218 5501976 1361337 -521775 959757 1916208 443718
10590 443718 -98681 2227518 3633260 1210111 -1285329 608014 4514115 5214416 3019566
10581 3019566 2487284 4802056 6742418 6320197 5000773 4466795 4453360 4047243 3279252
$$ packed form
10643B912394J089501j676961n88411J330938N28803j091378r16539j81769m00023
10634A006555m08576L45784J92515j059280j115092N77972J666830J036930K62847
10625B506485K59336J29462m30876r28582j746105k749964j737362J963830M532480
10616A798704K778672l00928k81952J191044j20050k687454j622569K200364L076518
10607F032349m1687k309034j322761J05398l5170l14349K02924O72274J175443
10598D165387K017028J293803j974242m140639j883112J481532R56451j472490
10590D43718n42399K326199J405742k423149k495440J893343L906101P00301k194850
10581C019566n32282K314772J940362m22221j319424n33978j3435m06117p67991
$$ plain form
10572 3279252 3266378 5046154 7584189 7907282 5266221 3552155 6032334 9457133 8451599
10563 8451599 4327299 3128041 5572863 6339568 3781241 2504688 4749023 6901507
10555 6901507 6764130 6898429 8423869 8779835 7888941 9049728 11561720 10453499 5836081
10546 5836081 4081634 7201657 9900382 9727070 10524548 12844222 11384547 5792252
10538 5792252 3354577 6582156 8906067 7167326 6813094 9719150 9315633 3855615
10530 3855615 1705589 6488387 9967731 7282197 5776177 10263107 13432291 10349974
10522 10349974 8370349 12344305 14404631 9592531 6810203 12128061 16370798 12322368
10514 12322368 8659155 12858905 16553921 12829431 10866849 17157243 20522415 13665642
$$ packed form
10572C279252j2874J779776K538035L23093k641061j714066K480179L424799j005534
10563H451599m124300j199258K444822P66705k558327j276553K244335K152484
10555F901507j37377J34299J525440L55966q90894J160787K511992j108221m617418
10546E836081j754447L120023K698725j73312P97478K319674j459675n592295
10538E792252k437675L227579K323911j738741l54232K906056m03517n460018
10530C855615k150026M782798L479344k685534j506020M486930L169184l082317
10522A0349974j979625L973956K060326m812100k782328N317858M242737m048430
10514A2322368l663213M199750L695016l724490j962582O290394L365172o856773
$$ plain form
10506 13665642 9878655 18426220 24752496 17859704 14037195 26725991 37696256 29770096
10498 29770096 22178039 35987668 51406067 44243952 37102334 59485427 84568632
10491 84568632 75511620 71618399 135793655 217916869 179542290 -8708273 -193248131
10484 -193248131 -224156955 -136784647 -70961367 -74812917 -84538183 -60433088 -37561341
10477 -37561341 -42548380 -49351696 -37366629 -26803172 -32829897 -36564866 -24624341 -14797288
10469 -14797288 -20602628 -26614321 -19654976 -12820928 -18496950 -25198801 -20606316 -13484790
10461 -13484790 -14374669 -15952538 -10195666 -5941251 -12190787 -20417874 -19568758 -14340985
10453 -14340985 -13917608 -15629724 -13556318 -11445237 -14084443 -16427580 -13161955 -9300468
$$ packed form
10506A3665642l786987Q547565O326276o892792l822509J2688796J0970265p926160
10498B9770096p592057J3809629J5418399p162115p141618K2383093K5083205
10491H4568632r057012l893221O4175256Q2123214l8374579j88250563j84539858
10484a93248131l0908824Q7372308O5823280l851550r725266K4105095K2871747
10477c7561341m987039o803316J1985067J0563457o026725l734969J1940525R827053
10469a4797288n805340o011693O959345O834048n676022o701851M592485P121526
10461a3484790q89879j577869N756872M254415o249536q227087Q49116N227773
10453a4340985M23377j712116K073406K111081k639206k343137L265625L861487
$$ plain form
10445 -9300468 -10512115 -12486974 -10118753 -7882457 -10889734 -14311526 -11779208 -6656868
10437 -6656868 -5488662 -7087530 -6802099 -5239043 -4798488 -3617552 -256879 1408534
10429 1408534 -1433223 -4961295 -5281712 -4576483 -5481969 -5785437 -3893116 -3003575 -4908911
10420 -4908911 -6453720 -6647873 -9515525 -14982656 -15623482 -8675248 -2723518 -5118011
10412 -5118011 -10651293 -10747060 -6631095 -4675882 -4995751 -3904518 -2679498 -4637344 -7203207
10403 -7203207 -5601908 -1689036 -1130057 -3989025 -5528193 -4675658 -4788864 -6975128 -8643148
10394 -8643148 -8205920 -6555506 -4591252 -2887160 -2448619 -2880315 -1984401 257029 490113
10385 490113 -2432466 -4608859 -3173963 -949625 -1069526 -1425971 764891 3043199 1775429
$$ packed form
10445i300468j211647j974859K368221K236296l007277l421792K532318N122340
10437f656868J168206j598868K85431J563056M40555J180936L360673J665413
10429A408534k841757l528072l20417P05229r05486l03468J892321Q89541j905336
10420d908911j544809j94153k867652n467131o40826O948234N951730k394493
10412e118011n533282r5767M115965J955213l19869J091233J225020j957846k565863
10403g203207J601299L912872N58979k858968j539168Q52535j13206k186264j668020
10394h643148M37228J650414J964254J704092M38541m31696Q95914K241430K33084
10385D90113k922579k176393J434896K224338j19901l56445K190862K278308j267770
$$ plain form
10376 1775429 -1349735 -2468705 -2219191 -3651819 -5980505 -6109982 -4525371 -4184586 -4906642
10367 -4906642 -3980574 -1349178 517274 1079072 1731941 2149547 745373 -1780731 -3076590
10358 -3076590 -2783735 -2247639 -1392206 714780 2800209 2284365 -816444 -3580205 -3787977
10349 -3787977 -1925921 11698 176778 -1879793 -4310758 -4473140 -2361507 -881169
10341 -881169 -1741816 -3352939 -4004970 -4391823 -5247054 -5285970 -3642606 -1791361 -931009
10332 -931009 -45695 1352549 1407237 -775915 -2843312 -2790026 -2075623 -2518076 -3005252
10323 -3005252 -2289816 -2148722 -4248857 -6332272 -5269145 -2059398 -254239 -881025 -2136473
10314 -2136473 -2741474 -2638881 -1690671 -388524 -460747 -2303624 -3454563 -2051596 82177
$$ packed form
10376A775429l125164j118970K49514j432628k328686j29477J584611L40785p22056
10367d906642R26068K631396J866452N61798O52869M17606j404174k526104j295859
10358c076590K92855N36096Q55433K106986K085429n15844l100809k763761k07772
10349c787977J862056J937619J65080k056571k430965j62382K111633J480338
10341h81169q60647j611123o52031l86853q55231l8916J643364J851245Q60352
10332i31009Q85314J398244N4688k183152k067397N3286P14403m42453m87176
10323c005252P15436J41094k100135k083415J063127L209747J805159o26786j255448
10314b136473o05001J02593R48210J302147p2223j842877j150939J402967K133773
$$ plain form
10305 82177 332778 -862998 -1850944 -3093830 -5289362 -6243403 -3584478 686243 2271631
10296 2271631 572926 -943000 -92697 1588346 1965048 1156326 719104 1696519 3691960
10287 3691960 4899377 3635035 769691 -505923 1510342 4793578 6361260 5695676
10279 5695676 4028528 1958840 -488392 -2851675 -4843462 -6710254 -7940923 -7330608
10271 -7330608 -5305793 -4057900 -4250507 -3976693 -2210950 -620330 -496477 -747556 -575986
10262 -575986 -1090152 -2413194 -2530736 -1225282 -1588252 -4848554 -7277275 -5632463 -2401179
10253 -2401179 -1803627 -3471134 -4147207 -3118825 -1746965 95345 2664613 3442180 386021
10244 386021 -3288495 -2478064 2241044 4993610 2556722 -2147757 -4856439 -4633163 -2998010
$$ packed form
10305H2177K50601j195776r87946j242886k195532r54041K658925M270721J585388
10296B271631j698705j515926Q50303J681043L76702q08722m37222R77415J995441
10287C691960J207417j264342k865344j275614K016265L283236J567682o65584
10279E695676j667148k069688k447232k363283j991787j866792j230669O10315
10271g330608K024815J247893j92607K73814J765743J590620J23853k51079J71570
10262e75986n14166j323042j17542J305454l62970l260302k428721J644812L231284
10253b401179N97552j667507o76073J028382J371860J842310K569268P77567l056159
10244C86021l674516Q10431M719108K752566k436888m704479k708682K23276J635153
$$ plain form
10235 -2998010 -1325146 -172064 469342 746784 129267 -2026459 -4289113 -3612410 348135
10226 348135 3697474 3321220 1064579 267256 681545 144756 -1041212 -1288226 -1440418
10217 -1440418 -3207973 -5207151 -4683309 -2334003 -1472590 -2891579 -4179429 -3769693 -2360157
10208 -2360157 -733152 738808 961986 -575995 -2133028 -2141566 -2108476 -4017235 -6315844
10199 -6315844 -6114317 -4071370 -3157293 -3624833 -3313587 -2043772 -1392013 -803826 1508139
10190 1508139 4159237 3818945 950894 -338107 1294316 2644933 1397577 -903726
10182 -903726 -2289863 -2758933 -2236524 -130296 1943310 962417 -2589897 -4460801 -2817776
10173 -2817776 -909531 -1712482 -3623778 -3803477 -2546210 -1710529 -1410318 -816914 -186630
$$ packed form
10235b998010J672864J153082O41406K77442o17517k155726k262654O76703L960545
10226C48135L349339l76254k256641p97323M14289n36789j185968k47014j52192
10217a440418j767555j999178N23842K349306Q61413j418989j287850M09736J409536
10208b360157J627005J471960K23178j537981j557033q538L3090j908759k298609
10199f315844K01527K042947R14077m67540L11246J269815O51759N88187K311965
10190A508139K651098l40292k868051j289001J632423J350617j247356k301303
10182i03726j386137m69070N22409K106228K073606r80893l552314j870904J643025
10173b817776J908245q02951j911296j79699J257267Q35681L00211N93404O30284
$$ plain form
10164 -186630 117463 798562 1989223 2349265 1503447 1290618 2663918 3422601 1337472
10155 1337472 -2161899 -3912708 -3393433 -2622862 -2453250 -1662790 139299 1123013 -129694
10146 -129694 -2054772 -1798970 754235 2231940 -52612 -4222888 -5820745 -3305034
10138 -3305034 535686 2801597 3407046 2839729 218872 -4044858 -6439086 -4535188
10130 -4535188 -1062990 -301274 -2009450 -2824282 -2339828 -3176950 -5445795 -6023495 -3988979
10121 -3988979 -2284718 -2703582 -3283479 -2343003 -1411534 -2126029 -3399626 -3779179 -3802848
10112 -3802848 -3971029 -3145518 -1265910 -1045627 -4186005 -7870391 -7905693 -4099688 4712
10103 4712 1709417 1054940 -1014797 -3724309 -5675898 -5175743 -2119131 1463131 3200275
$$ packed form
10164a86630L04093O81099J190661L60042q45818k12829J373300P58683k085129
10155A337472l499371j750809N19275P70571J69612P90460J802089R83714j252707
10146a29694j925078K55802K553205J477705k284552m170276j597857K515711
10138c305034L840720K265911O05449n67317k620857m263730k394228J903898
10130d535188L472198P61716j708176q14832M84454q37122k268845n77700K034516
10121c988979J704261m18864n79897R40476R31469p14495j273597l79553k3669
10112c802848j68181Q25511J879608K20283l140378l684386l5302L806005M104400
10103D712J704705o54477k069737k709512j951589N00155L056612L582262J737144
$$ plain form
10094 3200275 2318769 -114430 -2390778 -3620083 -4200665 -4808409 -5238404 -4799957 -3497475
10085 -3497475 -1898146 -117934 1825950 2760503 1011341 -3189894 -7150715 -8254836
10077 -8254836 -6381771 -3511041 -1631035 -1213786 -1082219 256786 2569452 3567406 1615783
10068 1615783 -1619470 -2648026 -334918 2731696 3401751 1434678 -653449 -532992
10060 -532992 1527346 2953770 1649656 -1432259 -3159223 -1980595 214120 732153
10052 732153 -560220 -1666192 -1346569 -291648 25182 -1304345 -3797285 -5491874 -4751297
10043 -4751297 -2674954 -2072360 -3347967 -3732835 -1936172 -770627 -2737316 -5541881
10035 -5541881 -5332014 -2648363 -1484659 -3315932 -5549560 -5629296 -3687512 -1260118 56905
$$ packed form
10094C200275q81506k433199k276348j229305n80582o07744m29995M38447J302482
10085c497475J599329J780212J943884R34553j749162m201235l960821j104121
10077h254836J873065K870730J880006M17249J31567J339005K312666R97954j951623
10068A615783l235253j028556K313108L066614O70055j967073k088127J20457
10060e32992K060338J426424j304114l081915j726964J178628K194715N18033
10052G32153j292373j105972L19623J054921L16830j329527k492940j694589P40577
10043d751297K076343O02594j275607l84868J796663J165545j966689k804565
10035e541881K09867K683651J163704j831273k233628p9736J941784K427394J317023
$$ plain form
10026 56905 -1060108 -4282489 -6943083 -6830272 -4925504 -3356591 -2085063 -309301 421633
10017 421633 -2009353 -6309437 -9011178 -9045599 -7921027 -6283017 -3823827 -1794479 -1798047
10008 -1798047 -2539328 -1403418 1269769 3101590 3992656 5459404 6550726 5060005
10000 5060005 2228632 1251910 1432894 -686963 -4265930 -4338112 -160199 2787138 1277575
9991 1277575 -1017962 -364741 878286 -1126038 -5042602 -6558372 -4531186 -1422631
9983 -1422631 383366 -25375 -2467764 -5239524 -6069865 -4975852 -4093671 -3833617 -2219187
9974 -2219187 813780 2016295 -439215 -4125152 -6252407 -7179214 -7866948 -7013655 -3382391
9965 -3382391 1405897 4692778 5462177 3823956 304902 -3073045 -3802231 -2296088 -1507533
$$ packed form
10026E6905j117013l222381k660594J12811J904768J568913J271528J775762P30934
10017D21633k430986m300084k701741l4421J124572J638010K459190K029348l568
10008a798047p41281J135910K673187J831821Q91066J466748J091322j490721
10000E060005k831373r76722J80984k119857l578967p2182M177913K947337j509563
9991A277575k295537O53221J243027k004324l916564j515770K027186L108555
9983a422631J805997m08741k442389k771760q30341J094013Q82181K60054J614430
9974b219187L032967J202515k455510l685937k127255r26807o87734Q53293L631264
9965c382391M788288L286881P69399j638221l519054l377947p29186J506143P88555
$$ plain form
9956 -1507533 -2271047 -2410845 -1320178 -1255423 -2686121 -2853094 -881525 260390 -799735
9947 -799735 -1225805 400373 788189 -2109272 -4537930 -2721822 783408 1241736 -972313
9938 -972313 -1942920 -542946 1202886 2044922 1953647 534596 -1759582 -2936224 -2668785
9929 -2668785 -3397786 -5627088 -5811855 -2204680 1225223 694929 -1585817 -1969093 -1584815
9920 -1584815 -2769406 -3302981 -437402 2610128 1003962 -3265897 -4293691 -1944694
9912 -1944694 -1397788 -3763209 -4504872 -1782372 378423 -1109696 -3920011 -4584127 -2930923
9903 -2930923 -571777 1507688 2418948 1241127 -1529637 -4271254 -5925105 -5869176 -3578606
9894 -3578606 -608598 -705218 -4894115 -8793346 -8289777 -5309770 -4078186 -4686250 -5021153
$$ packed form
9956a507533p63514j39798J090667O4755j430698j66973J971569J141915j060125
9947g99735m26070J626178L87816k897461k428658J816108L505230M58328k214049
9938i72313r70607J399974J745832Q42036r1275j419051k294178j176642K67439
9929b668785p29001k229302j84767L607175L429903n30294k280746l83276L84278
9920a584815j184591n33575K865579L047530j606166m269859j027794K348997
9912a944694N46906k365421p41663K722500K160795j488119k810315o64116J653204
9903b930923K359146K079465R11260j177821k770764k741617j653851N5929K290570
9894c578606K970008r6620m188897l899231N03569K980007J231584o08064l34903
$$ plain form
9885 -5021153 -5812960 -8238849 -9850614 -9318260 -11676622 -20751910 -29219659 -26000836 -12579532
9876 -12579532 -1722171 532632 1027979 5648845 10237923 9803215 7163987 6393355
9868 6393355 5478553 1939181 -834009 504958 2493280 607439 -2861577 -3179840 -1398999
9859 -1398999 -1618252 -3250391 -2603559 109222 1498207 1065169 971724 1243944 539077
9850 539077 339304 2992566 6471666 6388463 2892875 595039 1572347 3114021 2808192
9841 2808192 1491738 340217 -1016553 -2303940 -1882020 443354 2500653 2715492 1793238
9832 1793238 783619 -246448 -958119 -521544 442302 -105350 -2520076 -4374267 -3819369
9823 -3819369 -2343972 -2449456 -3782877 -3710344 -1471558 358202 -596645 -3005675 -3511279
$$ packed form
9885e021153p91807k425889j611765N32354k358362r075288q467749L218823J3421304
9876a2579532J0857361K254803M95347M620866M589078m34708k639228p70632
9868F393355r14802l539372k773190J338967J988322j885841l469016l18263J780841
9859a398999k19253j632139O46832K712781J388985m33038r3445K72220p04867
9850E39077j99773K653262L479100q3203l495588k297836R77308J541674l05829
9841B808192j316454j151521j356770j287387M21920K325374K057299K14839r22254
9832A793238j009619j030067p11671M36575R63846n47652k414726j854191N54898
9823c819369J475397j05484j333421P2533K238786J829760r54847k409030n05604
$$ plain form
9814 -3511279 -1367007 626707 242565 -1236234 -1591673 -1236960 -1793298 -2402905 -639487
9805 -639487 3106785 5363731 4362539 2269513 1554073 1660064 792283 -1015714 -2306365
9796 -2306365 -2348688 -1602701 -1002788 -1425979 -2786987 -3520063 -2438885 -916117 -1127049
9787 -1127049 -2390573 -2069410 -161096 405278 -1304866 -2643159 -1890941 -639953 -76055
9778 -76055 1181453 3317163 3428653 435063 -1886135 -521719 1455224 -354977 -4212010
9769 -4212010 -4572259 -474788 3315440 3127504 71574 -3070539 -4819929 -4583077 -2603617
9760 -2603617 -829847 -1173519 -2712711 -2966250 -1647261 -583885 -349368 126220 812832
9751 812832 475963 -616127 -815195 -163765 -483463 -1982826 -2562139 -1180207 577255
$$ packed form
9814c511279K144272J993714l84142j478799l55439L54713n56338o09607J763418
9805f39487L746272K256946j001192k093026p15440J05991q67781j807997j290651
9796b306365m2323P45987N99913m23191j361008p33076J081178J522768k10932
9787a127049j263524L21163J908314N66374j710144j338293P52218J250988N63898
9778g6055J257508K135710J11490k993590k321198J364416J976943j810201l857033
9769d212010l60249M097471L790228j87936l055930l142113j749390K36852J979460
9760b603617J773770l43672j539192k53539J318989J063376K34517M75588O86612
9751H12832l36869j092090j99068O51430l19698j499363n79313J381932J757462
$$ plain form
9742 577255 1030627 322474 -784099 -1945153 -2588202 -2198053 -1553789 -1731107 -1896261
9733 -1896261 -405438 1965376 2663192 1475872 990299 2262571 3094195 1741651 -546572
9724 -546572 -2031976 -2732423 -2690359 -891882 2161424 3568792 2071470 494484 1518319
9715 1518319 3338907 2670156 111075 -1150400 -694343 -897015 -2050364 -1656850 755343
9706 755343 2011641 109334 -2509810 -2670043 -1003326 -308677 -1149750 -1762898 -1261200
9697 -1261200 -263493 1058551 2834698 3562270 1265275 -2769822 -4238672 -1239258 2905386
9688 2905386 4115734 2769592 2007349 2514425 2200665 405670 -953303 -758179 -244800
9679 -244800 -421534 -618951 -593276 -1432066 -3088758 -3688971 -2944009 -3458698 -6334347 -8229625
$$ packed form
9742E77255M53372p08153j106573j161054o43049L90149O44264j77318j65154
9733a896261J490823K370814O97816j187320m85573J272272Q31624j352544k288223
9724e46572j485404p00447M2064J798477L053306J407368j497322j576986J023835
9715A518319J820588o68751k559081j261475M56057k02672j153349L93514K412193
9706G55343J256298j902307k619144j60233J666717O94649q41073o13148N01698
9697a261200R97707J322044J776147P27572k296995m035097j468850K999414M144644
9688B905386J210348j346142p62243N07076l13760j794995j358973J95124N13379
9679b44800j76734j97417K5675q38790j656692o00213P44962n14689k875649j895278
$$ plain form
9669 -8229625 -6007884 -2028485 -820950 -2049218 -1485263 1498398 2603502 -183724
9661 -183724 -2995006 -2168162 162626 21807 -1955267 -2235581 -726109 -797474 -3308683
9652 -3308683 -4985497 -3757899 -2036894 -2732774 -4776879 -5102870 -3278014 -1489539 -947752
9643 -947752 -1018892 -1550239 -3237544 -5247569 -5133297 -2367733 133999 -344126 -2767791
9634 -2767791 -4237565 -4054070 -3758344 -4056538 -4073391 -3290719 -2036485 -299319 1738254
9625 1738254 2301201 -172936 -3773065 -4662531 -2503475 -1200766 -3083913 -5628383 -5849787
9616 -5849787 -4723264 -4484331 -4369647 -2568606 -316856 -62518 -812173 553526 3791323
9607 3791323 5228587 3447621 1169680 648087 832035 463654 524199 1487949 1046657
$$ packed form
9669h229625K221741L979399J207535j228268N63955K983661J105104k787226
9661a83724k811282Q26844K330788j40819j977074k80314J509472p1365k511209
9652c308683j676814J227598J721005o95880k044105l25991J824856J788475N41787
9643i47752p1140n31347j687305k010025J14272K765564K501732m78125k423665
9634b767791j469774J83495K95726k98194j6853P82672J254234J737166K037573
9625A738254N62947k474137l600129q89466K159056J302709j883147k544470k21404
9616e849787J126523K38933J14684J801041K251750K54338p49655J365699L237797
9607C791323J437264j780966k277941n21593J83948l68381O0545R63750m41292
$$ plain form
9598 1046657 -2640622 -7245434 -8581203 -5718092 -1523462 1307911 2621917 3324408
9590 3324408 3489597 2630942 922129 -495300 -390470 1227177 2612351 1711302 -1525904
9581 -1525904 -4771424 -5700712 -4326188 -2594288 -2148742 -2960806 -3803146 -3550501 -2067330
9572 -2067330 -87686 1614665 2676663 2763816 1480476 -744999 -2390365 -2434554 -1717741
9563 -1717741 -1618346 -1915844 -1402498 -224339 196422 -405894 -718829 -313623 -619278 -2516068
9553 -2516068 -4595155 -5053546 -4071780 -2950902 -1793227 455612 3909994 6828611 7015578
9544 7015578 3863591 -855299 -4280550 -5049841 -4467620 -4398264 -4462111 -2769887 697165
9535 697165 3374997 3315936 1308931 -949733 -2927475 -4383660 -4361497 -2794318 -1650187
$$ packed form
9598A046657l687279m604812j335769K863111M194630K831373J314006P02491
9590C324408J65189q58655j708813j417429J04830J617647J385174r01049l237206
9581a525904l245520r29288J374524J731900M45546q12064q42340K52645J483171
9572b067330J979644J702351J061998Q7153j283340k225475j645366m4189P16813
9563a717741R9395k97498N13346J178159M20761o02316l12935M05206l05655j896790
9553b516068k079087m58391R81766J120878J157675K248839L454382K918617J86967
9544G015578l151987m718890l425251p69291N82221O9356o3847J692224L467052
9535F97165K677832n9061k007005k258664j977742j456185K2163J567179J144131
$$ plain form
9526 -1650187 -2533596 -4237508 -4639734 -4059686 -4477897 -6016024 -6655898 -5442479 -3599677
9517 -3599677 -2030206 29430 2863753 4680317 3650431 428489 -2727194 -4553272
9509 -4553272 -5191742 -4694088 -2845921 -554945 235717 -1105083 -2656433 -2185723 -72257
9500 -72257 1310757 952898 351024 833012 1404269 568725 -937848 -1095150 269948
9491 269948 1237979 650041 -597713 -1333595 -1474358 -1247962 -732822 -622946 -1723381
9482 -1723381 -3167792 -3065648 -1621039 -1369911 -3135476 -4147911 -2101139 1056049 1894917
9473 1894917 486317 -211120 1030246 2550764 2815256 1882625 7437 -2612326 -4519322
9464 -4519322 -3939265 -1593027 -410503 -1768663 -3874554 -4496840 -3513786 -2106701 -1186783
$$ packed form
9526a650187q83409j703912m02226N80048m18211j538127o39874J213419J842802
9517c599677J569471K059636K834323J816564j029886l221942l155683j826078
9509d553272o38470M97654J848167K290976P90662j340800j551350M70710K113466
9500g2257J383014l57859o01874M81988N71257q35544j506573j57302J365098
9491B69948R68031n87938j247754p35882j40763K26396N15140J09876j100435
9482a723381j444411J02144J444609K51128j765565j012435K046772L157188Q38868
9473A894917j408600o97437J241366J520518K64492r32631j875188k619763j906996
9464d519322N80057K346238J182524j358160k105891o22286R83054J407085R19918
$$ plain form
9455 -1186783 -1413482 -3132444 -5312877 -5849143 -3860733 -756021 1538525 2401591 2222021
9446 2222021 1469987 529764 -478435 -1815066 -3084218 -2571582 639054 4273691 4934411
9437 4934411 2592873 440433 31656 -278799 -1216536 -540347 2812238 5741329 5097684
9428 5097684 2439574 1518779 2745336 3414629 2260299 535695 -739096 -1520991 -1129013
9419 -1129013 1129801 3744048 4115918 2092096 71337 -440291 -120997 217189 532376
9410 532376 374665 -710036 -1442803 20894 2947422 4577505 4062209 3109696 2366724
9401 2366724 344758 -3048498 -5037552 -3658187 -380841 2388828 3909689 3875594 1621359
9392 1621359 -1466706 -1828571 1253901 3249135 271061 -4885416 -6385456 -3379304
$$ packed form
9455a186783k26699j718962k180433n36266J988410L104712K294546Q63066j79570
9446B222021p52034r40223j008199j336631j269152N12636L210636L634637O60720
9437D934411k341538k152440m08777l10455r37737O76189L352585K929091o43645
9428E097684k658110r20795J226557O69293j154330j724604j274791p81895L91978
9419a129013K258814K614247L71870k023822k020759n11628L19294L38186L15187
9410E32376j57711j084701p32767J463697K926528J630083n15296r52513p42972
9401B366724k021966l393256j989054J379365L277346K769669J520861l4095k254235
9392A621359l088065l61865L082472J995234k978074n156477j500040L006152
$$ plain form
9384 -3379304 -202883 578926 805074 2018005 2387791 103173 -3070584 -3796238 -1353572
9375 -1353572 1639941 2099502 -407399 -2930340 -1996208 1944741 4220527 1861986 -1865590
9366 -1865590 -2000568 405873 -205635 -4627600 -6693277 -2648660 2423544 1833306 -2767032
9357 -2767032 -4214437 -842849 1431770 -1427351 -5550319 -5222243 -1132294 1164814
9349 1164814 -735077 -3361284 -2792364 61818 1055963 -1623988 -5184558 -5620955 -2316792
9340 -2316792 1547570 2842775 1698831 486624 566878 1198086 1384568 1424980 2060029
9331 2060029 3002393 3259423 2600986 1801800 1337750 655831 -745868 -2046412 -1795667
9322 -1795667 60546 1668347 1310571 -506029 -1656625 -860071 1131281 2711443 3070878
$$ packed form
9384c379304L176421P81809K26148J212931L69786k284618l173757p25654K442666
9375a353572K993513M59561k506901k522941R34132L940949K275786k358541l727576
9366a865590j34978K406441o11508m421965k065677M044617N072204n90238m600338
9357b767032j447405L371588K274619k859121m122968L28076M089949K297108
9349A164814j899891k626207N68920K854182R94145k679951l560570m36397L304163
9340b316792L864362J295205j143944j212207Q0254O31208J86482M0412O35049
9331B060029R42364K57030o58437p99186m64050o81919j401699j300544K50745
9322a795667J856213J607801l57776j816600j150596P96554J991352J580162L59435
$$ plain form
9313 3070878 2556173 2041709 2217796 3030963 3610216 3169719 2095747 1576509 1994694
9304 1994694 2406119 1968688 1081773 420553 -418405 -2146720 -3913583 -3600189 -568670
9295 -568670 2820653 3502007 1333035 -558074 561135 3695146 5203717 3007241 -1068715
9286 -1068715 -3296012 -1786109 1969534 4710980 4303368 1626109 -140439 1221347
9278 1221347 4190295 4994868 2303270 -976722 -1591048 -100491 598216 -391089 -1569892
9269 -1569892 -2278059 -3387022 -4648726 -4369799 -2628770 -2004652 -3592298 -4800839 -3147622
9260 -3147622 -161171 923801 -182311 -1099545 -667955 169784 883859 2024403 3239227
9251 3239227 3071184 1367315 -26527 243168 1279814 1324344 -241730 -2712797 -4773700
$$ packed form
9313C070878n14705n14464J76087Q13167N79253m40497j073972n19238M18185
9304A994694M11425m37431q86915o61220q38958j728315j766863L13394L031519
9295e68670L389323O81354k168972j891109J119209L134011J508571k196476m075956
9286a068715k227297J509903L755643K741446m07612k677259j766548J361786
9278A221347K968948Q04573k691598l279992o14326J490557O98707r89305j178803
9269a569892p08167j108963j261704K78927J741029O24118j587646j208541J653217
9260c147622K986451J084972j106112r17234M31590Q37739P14075J140544J214824
9251C239227j68043j703869j393842K69695J036646M4530j566074k471067k060903
$$ plain form
9242 -4773700 -5068884 -3199344 -531116 1008136 1181606 1426090 2462044 3270932 2843029
9233 2843029 1610724 551634 33422 125850 901257 1809759 1905371 1297359 1112385 1366271
9223 1366271 465594 -2063637 -4030237 -3547738 -2229957 -3066743 -5725925 -6591038 -3782569
9214 -3782569 212809 1888269 809510 -982913 -2199899 -3148799 -4072992 -4478845 -4157994
9205 -4157994 -3501361 -2582619 -1133451 249450 159014 -1608644 -3163955 -2692764 -695773
9196 -695773 1152151 2567817 4263460 5337607 3517632 -1172496 -5199135 -5635861 -3842739
9187 -3842739 -2955654 -3037791 -1542943 1875445 4240063 3625260 1743663 687679 -355000
9178 -355000 -2889617 -5542929 -5540235 -2837779 -40450 1431450 2388873 3086715 2336784
$$ packed form
9242d773700k95184J869540K668228J539252J73470K44484J035954Q08888m27903
9233B843029j232305j059090n18212R2428P75407R08502R5612o08012j84974K53886
9223A366271r00677k529231j966600M82499J317781q36786k659182q65113K808469
9214c782569L995378J675460j078759j792423j216986r48900r24193m05853L20851
9205d157994O56633R18742J449168J382901r0436j767658j555311M71191J996991
9196f95773J847924J415666J695643J074147j819975m690128m026639m36726J793122
9187c842739Q87085q2137J494848L418388K364618o14803j881597j055984j042679
9178c55000k534617k653312K694K702456K797329J471900R57423O97842p49931
$$ plain form
9169 2336784 240014 -926724 -94664 595251 -860816 -2882848 -2669566 -655647 273372
9160 273372 -575314 -902612 506473 1884130 1697219 1115949 1505797 1549274 -733871
9151 -733871 -4233311 -5516036 -3211077 287883 1713191 146318 -2750261 -4470050
9143 -4470050 -3503803 -630274 1386477 348589 -2982676 -5866515 -6739955 -6203746 -5102570
9134 -5102570 -3439003 -1656695 -1197817 -2622702 -4354613 -4448921 -2752549 -354203 2086480
9125 2086480 4199515 4986031 3692148 1309642 -294479 -742592 -1286989 -2456229 -3013948
9116 -3013948 -1906548 -76777 708877 196475 -332605 -172354 -98736 -768756 -1315512
9107 -1315512 -641940 450739 2348 -2031391 -3157879 -1864505 -264095 -1376048 -4657216
$$ packed form
9169B336784k096770j166738Q32060O89915j456067k022032K13282K013919R29019
9160B73372q48686l27298J409085J377657j86911n81270L89848M3477k283145
9151g33871l499440j282725K304959L498960J425308j566873k896579j719789
9143d470050R66247K873529K016751j037888l331265k883839q73440N36209J101176
9134e102570J663567J782308M58878j424885j731911r4308J696372K398346K440683
9125B086480K113035P86516j293883k382506j604121m48113n44397j169240n57719
9116c013948J107400J829771P85654n12402n29080J60251P3618o70020n46756
9107a315512O73572J092679m48391k033739j126488J293374J600410j111953l281168
$$ plain form
9098 -4657216 -6555517 -5367448 -3154247 -2390621 -3058099 -3990192 -4838733 -5306196 -4484969
9089 -4484969 -2703575 -2156484 -3679896 -4732334 -3082852 -806645 -1375653 -3921742 -4284284
9080 -4284284 -1592499 348352 -808892 -2400741 -1375354 869015 1148433 -381441
9072 -381441 -1035500 -171356 274753 -706280 -2046204 -2909282 -3574777 -3784204 -2644739
9063 -2644739 -755929 -193551 -1496567 -2667531 -2211833 -1238281 -1218777 -1591660 -1438039
9054 -1438039 -1798503 -3796156 -5632101 -4542297 -1481331 -579981 -3231356 -5833815 -4972743
9045 -4972743 -2058387 -495297 -596292 -438696 -177188 -1679680 -4262693 -4712942 -2331515
9036 -2331515 -443279 -1357049 -2919881 -2241575 -205690 503303 -87791 131082 1356762
$$ packed form
9098d657216j898301J188069K213201P63626o67478r32093q48541m67463Q21227
9089d484969J781394N47091j523412j052438J649482K276207n69008k546089l62542
9080d284284K691785J940851j157244j591849J025387K244369K79418j529874
9072c81441o54059Q64144M46109r81033j339924q63078o65495k09427J139465
9063b644739J888810N62378j303016j170964M55698R73552J9504l72883J53621
9054a438039l60464j997653j835945J089804L060966R01350k651375k602459Q61072
9045d972743K914356J563090j00995J57596K61508j502492k583013m50249K381427
9036b331515J888236r13770j562832O78306K035885P08993n91094K18873J225680
$$ plain form
9027 1356762 1741303 860048 263535 456524 176566 -826993 -1020344 3183 360461
9018 360461 -1065759 -2637716 -2661063 -2156469 -2978208 -4636840 -5151687 -4114319 -2786703
9009 -2786703 -1762337 -624158 372766 341213 -509615 -1104159 -1550109 -2892602 -4429879
9000 -4429879 -3557283 573526 5134585 6851152 5676285 3729982 2099423 733034
8992 733034 304153 1575020 3302059 3287026 1558569 139780 -484766 -1973440 -4584381
8983 -4584381 -5956497 -4863020 -3511866 -4099511 -5381521 -5044014 -3455828 -2324011 -1366698
8974 -1366698 533032 2216558 1779116 348194 677001 2405205 2553215 705061 -363370
8965 -363370 313321 538352 -329290 227391 2815051 3789295 880498 -2575680 -2516020
$$ packed form
9027A356762L84541q81255n96513J92989k79958j003559j93351J023527L57278
9018C60461j426220j571957k3347N04594q21739j658632n14847J037368J327616
9009b786703J024366J138179R96924l1553q50828n94544m45950j342493j537277
9000d429879Q72596M130809M561059J716567j174867j946303j630559j366389
8992G33034m28881J270867J727039j5033j728457j418789o24546j488674k610941
8983d584381j372116J093477J351154n87645j282010L37507J588186J131817R57313
8974a366698J899730J683526m37442j430922L28807J728204J48010j848154j068431
8965c63370O76691K25031q67642N56681K587660R74244k908797l456178N9660
$$ plain form
8956 -2516020 -159128 741502 177770 1130353 4027538 6134450 5857415 4115592 1830632
8947 1830632 -756643 -2555702 -2365467 -1024674 -358578 -400766 -10174 555876 320175
8938 320175 -82851 310297 130867 -2312805 -5114017 -4729146 -1653434 -47747 -1295415
8929 -1295415 -2080471 -26766 2638412 2862218 954246 -1066413 -2642314 -4031346 -4573072
8920 -4573072 -3728876 -2475782 -2040371 -2306260 -2525641 -2501142 -2358700 -2268771 -2657033 -3397484
8910 -3397484 -3052043 -803863 1255361 335833 -2693489 -4111472 -2630166 -604283 383119
8901 383119 1356985 2430717 1561358 -1315302 -2767120 -976053 1105708 588002 -611886
8892 -611886 638874 3010654 2698489 -456492 -2773971 -2101159 -82517 865788 250446
$$ packed form
8956b516020K356892R00630n63732R52583K897185K106912k77035j741823k284960
8947A830632k587275j799059J90235J340793O66096m2188L90592N66050k35701
8938C20175m03026L93148j79430k443672k801212L84871L075712J605687j247668
8929a295415p85056K053705K665178K23806j907972k020659j575901j389032n41726
8920d573072Q44196J253094M35411k65889k19381K4499J42442Q9929l88262p40451
8910c397484L45441K248180K059224r19528l029322j417983J481306K025883R87402
8901C83119R73866J073732q69359k876660j451818J791067K081761n17706j199888
8892f11886J250760K371780l12165l154981k317479O72812K018642R48305o15342
$$ plain form
8883 250446 -978496 -1720019 -1418437 -590971 -336989 -728678 -781439 -584478 -1611195 -3861076
8873 -3861076 -4834865 -2970516 -166560 840397 -217347 -2031112 -3765091 -4430635 -2610442
8864 -2610442 966407 2875433 1447698 -506325 35757 1806518 1981975 864153 277683
8855 277683 -369436 -2320883 -3699139 -2033446 773917 735199 -1727032 -2364827 2410
8846 2410 1952891 1274548 -195488 -534195 -478987 -881099 -910940 -196160 238570 309208
8836 309208 1299265 2946645 2957815 537916 -2192681 -3238814 -2672911 -919559 2019117
8827 2019117 4796942 5154862 3214367 1594506 1323940 629803 -1160362 -1846449 -111923
8818 -111923 2078784 2794051 2988164 3938260 4549568 3599761 2264266 1897467 1453517
$$ packed form
8883B50446j228942p41523L01582Q27466K53982l91689n2761J96961j026717k249881
8873c861076r73789J864349K803956J006957j057744j813765j733979o65544J820193
8864b610442L576849J909026j427735j954023N42082J770761J75457j117822n86470
8855B77683o47119j951447j378256J665693K807363l8718k462231o37795K367237
8846B410J950481o78343j470036l38707N5208m02112k9841P14780M34730P0638
8836C09208R90057J647380J1170k419899k730597j046133N65903J753352K938676
8827B019117K777825L57920j940495j619861k70566o94137j790165o86087J734526
8818a11923K190707P15267J94113R50096O11308r49807j335495l66799m43950
$$ plain form
8809 1453517 -245755 -1607413 -546263 1740272 2233004 538852 -819122 -246017 1100625
8800 1100625 1403884 371120 -914913 -1286416 -561024 241749 122878 -450136 -374034
8791 -374034 -106570 -1189789 -3245985 -3781798 -1964876 -197462 -463615 -1469820 -1299419
8782 -1299419 -582416 -593332 -266763 1896391 4403204 4466101 2343986 899016 1192554
8773 1192554 1559943 1124444 1205298 2486449 3366261 2358375 299786 -1016679 -1027070
8764 -1027070 -200004 1082104 2293371 2376408 891889 -893177 -1285132 -482414 -456224
8755 -456224 -2071613 -3387585 -2036251 1189315 2912116 1729620 158813 634121 1579305
8746 1579305 57798 -3069639 -4183983 -2740342 -2049523 -3452253 -3826064 -928292 2413932
$$ packed form
8809A453517j699272j361658J061150K286535M92732j694152j357974N73105J346642
8800A100625L03259j032764j286033l71503P25392Q02773j18871n73014P6102
8791c74034K67464j083219k056196n35813J816922J767414k66153j006205J70401
8782a299419P17003j0916L26569K163154K506813O2897k122115j444970K93538
8773A192554L67389m35499Q0854J281151Q79812j007886k058589j316465j0391
8764a027070Q27066J282108J211267Q3037j484519j785066l91955Q02718K6190
8755d56224j615389j315972J351334L225566J722801j182496j570807M75308R45184
8746A579305j521507l127437j114344J443641O90819j402730l73811K897772L342224
$$ plain form
8737 2413932 2399020 -253686 -2121250 -2138018 -1451271 -200859 1695491 1987174 -1362416
8728 -1362416 -5658184 -5905163 -2022873 610695 -1189017 -4264464 -4446949 -2470173 -1851553
8719 -1851553 -3396711 -4880513 -4855032 -3958435 -2925409 -1648267 -350775 14245 -1001213
8710 -1001213 -2666129 -3926720 -4365374 -4218316 -3923018 -3791912 -3877211 -3982048 -3732580
8701 -3732580 -2687684 -744523 1322478 2197240 1422630 67988 -625275 -819958 -1486204
8692 -1486204 -2629443 -3158193 -2394389 -791324 726182 1263150 101051 -2467021 -4513305
8683 -4513305 -3957345 -979133 1934484 2535603 702627 -2070040 -4115789 -4583665 -3891982
8674 -3891982 -3129057 -2364067 -290040 3266873 5520216 3588455 -1205257 -4388391 -3857187
$$ packed form
8737B413932j4912k652706j867564j6768O86747J250412J896350K91683l349590
8728a362416m295768k46979L882290K633568j799712l075447j82485J976776O18620
8719a851553j545158j483802K5481Q96597J033026J277142J297492L65020j015458
8710a001213j664916j260591m38654J47058K95298J31106q5299j04837K49468
8701c732580J044896J943161K067001Q74762p74610j354642o93263j94683o66246
8692a486204j143239n28750P63804J603065J517506N36968j162099k568072k046284
8683d513305N55960K978212K913617O01119j832976k772667k045749m67876O91683
8674c891982P62925P64990K074027L556913K253343j931761m793712l183134N31204
$$ plain form
8665 -3857187 -1786453 -541462 391570 2033760 3251931 2736185 1669160 1919030 2871287
8656 2871287 2497300 670717 -969294 -1860996 -2858546 -4012454 -4323850 -3780660 -3510494
8647 -3510494 -3623913 -2898898 -1100148 248077 120877 -616593 -932982 -1264196 -2300059
8638 -2300059 -3237361 -2553371 -146642 2167493 2314722 -4781 -2736205 -3301378 -1650190
8629 -1650190 -785166 -2946686 -6022807 -5912313 -2226725 1085632 1300265 91849 -141155
8620 -141155 32471 -592391 -683936 1124429 2647085 1031015 -1997646 -2107511 764025
8611 764025 2067357 -193756 -2492509 -1642419 571844 1219506 1062314 2194267 3602135
8602 3602135 2934927 978310 519205 1645304 1754661 -94594 -2081855 -2825475 -2773730
$$ packed form
8665c857187K070734J244991R33032J642190J218171n15746j067025K49870R52257
8656B871287l73987j826583j640011q91702r97550j153908l11396N43190K70166
8647c510494j13419P25015J798750J348225j27200p37470l16389l31214j035863
8638b300059r37302O83990K406729K314135J47229k319503k731424n65173J651188
8629a650190Q65024k161520l076121J10494L685588L312357K14633j208416k33004
8620a41155J73626o24862r1545J808365J522656j616070l028661j09865K871536
8611G64025J303332k261113k298753Q50090K214263O47662j57192J131953J407868
8602C602135o67208j956617m59105J126099J09357j849255j987261p43620N1745
$$ plain form
8593 -2773730 -2373836 -1640631 -1576843 -3128586 -4590335 -3190426 285134 1829008 129527
8584 129527 -1369558 13968 2112973 1906440 544400 907179 2258338 1343204 -2023351
8575 -2023351 -4359655 -3723470 -2131973 -1853858 -2130469 -1156290 737155 1763615 1355949
8566 1355949 391840 -598104 -1736078 -2455948 -1573521 670260 1951359 516778 -2112144
8557 -2112144 -2637574 -296712 1892396 949798 -2412815 -5200167 -5900783 -5002671 -2773555
8548 -2773555 827315 4126587 4502995 2115353 469877 1883475 4389318 4775443 2879487
8539 2879487 837897 -487363 -1892778 -3347918 -3535650 -1980381 126907 1499720
8531 1499720 1901263 1588932 675294 -765603 -2543482 -4135180 -4315626 -1936906 2086114
$$ packed form
8593b773730L99894P33205O3788j551743j461749J399909L475560J543874j699481
8584A29527j499085J383526K099005k06533j362040L62779J351159r15134l366555
8575b023351k336304O36185J591497K78115k76611R74179J893445J026460m07666
8566A355949r64109r89944j137974p19870Q82427K243781J281099j434581k628922
8557b112144n25430K340862K189108r42598l362613k787352p00616Q98112K229116
8548b773555L600870L299272L76408k387642j645476J413598K505843L86125j895956
8539B879487k041590j325260j405415j455140j87732J555269K107288J372813
8531A499720M01543l12331r13638j440897j777879j591698j80446K378720M023020
$$ plain form
8522 2086114 4664064 3796877 1149296 -145936 455593 795328 -558377 -2755770 -4476288
8513 -4476288 -5354216 -5276233 -3978927 -1966371 -515663 -135787 23945 819468 2035489
8504 2035489 2957971 3243453 3034406 2854120 3297941 4157446 4262085 3105486 1978007
8495 1978007 2128751 2491486 1166948 -1199469 -1896746 -253016 1209254 606997 -616813
8486 -616813 -290788 1095333 1444625 206936 -1397055 -2479327 -3030761 -2843141 -1548295
8477 -1548295 368761 1881153 2650376 2876209 2214003 188969 -2298986 -3271031 -1958418
8468 -1958418 160082 1126225 591139 -344972 -742477 -656685 -734489 -1518227 -2913421 -3924987
8458 -3924987 -3260896 -808694 1755840 2688302 2459778 3210521 5541784 7143810 5710507
$$ packed form
8522B086114K577950q67187k647581j295232O01529L39735j353705k197393j720518
8513d476288q77928P7983J297306K012556J450708L79876J59732P95523J216021
8504B035489R22482K85482k09047j80286M43821Q59505J04639j156599j127479
8495A978007J50744L62735j324538k366417o97277J643730J462270o02257j223810
8486f16813L26025J386121L49292j237689j603991j082272n51434J87620J294846
8477a548295J917056J512392P69223K25833o62206k025034k487955r72045J312613
8468a958418K118500R66143n35086r36111l97505Q5792p7804p83738j395194j011566
8458c924987O64091K452202K564534R32462k28524P50743K331263J602026j433303
$$ plain form
8449 5710507 2187877 -491761 -1247186 -1372283 -1467752 -461264 1616265 2562456 1374807
8440 1374807 403970 1830550 3820064 3036631 -262454 -2839825 -3459255 -3675218 -3700843
8431 -3700843 -1541222 2523438 4396248 1543469 -2911723 -4329899 -2682148 -1396653
8423 -1396653 -1607326 -1212041 719837 2230119 1972522 1524339 2720928 4695350 5190748
8414 5190748 3516285 805041 -1582765 -2564870 -1321242 1526021 3432628 2585915 782816
8405 782816 1490804 4711746 6160436 2870457 -2428337 -4672040 -2835833 -297123 511792
8396 511792 664489 1509786 2031655 1082208 -151464 -72124 619864 355426 -527215 -786293
8386 -786293 -900450 -2023712 -3141994 -2306293 -432077 -584825 -3013993 -4175556 -1952435
$$ packed form
8449E710507l522630k679638p55425j25097r5469J006488K077529R46191j187649
8440A374807r70837J426580J989514p83433l299085k577371o19430k15963k5625
8431c700843K159621M064660J872810k852779m455192j418176J647751J285495
8423a396653k10673L95285J931878J510282k57597m48183J196589J974422M95398
8414E190748j674463k711244k387806r82105J243628K847263J906607q46713j803099
8405G82816P07988L220942J448690l289979n298794k243703J836207K538710Q08915
8396E11792J52697Q45297N21869r49447j233672P9340O91988k64438q82641k59078
8386g86293j14157j123262j118282Q35701J874216j52748k429168j161563K223121
$$ plain form
8377 -1952435 1101607 1597902 -77787 -1344491 -1762217 -3014600 -5383754 -6806766 -5534354
8368 -5534354 -2063209 1636852 3598387 2724966 -545364 -4293999 -6576879 -6802320 -5423259
8359 -5423259 -3114834 -980385 -490980 -1841576 -3010907 -1930539 727993 2293598
8351 2293598 1405804 -761709 -2462158 -3117080 -2934153 -2172532 -1342387 -1176413 -1815955
8342 -1815955 -2568254 -2738600 -2185091 -998306 656716 2226285 2997363 2873274 2352250
8333 2352250 1640676 509074 -772036 -1182211 -164460 1478094 2501158 2706027 2924644
8324 2924644 3663621 4365393 4208521 3229902 2173143 1260017 -250677 -2744487 -4930199
8315 -4930199 -4908161 -2744893 -827004 -867786 -1531831 -333693 2665890 4761891 4336147
$$ packed form
8377a952435L054042M96295j675689j266704m17726j252383k369154j423012J272412
8368e534354L471145L700061J961535q73421l270330l748635k282880k25441J379061
8359e423259K308425K134449M89405j350596j169331J080368K658532J565605
8351B293598q87794k167513j700449o54922J82927P61621Q30145J65974o39542
8342a815955p52299j70346N53509J186785J655022J569569P71078j24089n21024
8333B352250p11574j131602j281110m10175J017751J642554J023064K04869K18617
8324B924644P38977P01772j56872r78619j056759r13126j510694k493810k185712
8315d930199K2038K163268J917889m0782o64045J198138K999583K096001m25744
$$ plain form
8306 4336147 2944998 2760433 3301158 2326467 -520883 -2734253 -2091468 404306 1659188
8297 1659188 101012 -2658219 -3742488 -2088017 497151 1165903 -1005293 -3854329
8289 -3854329 -4346864 -2093576 170950 252253 -462895 781537 3560959 4432653 2075300
8280 2075300 -438306 -149178 1325154 505550 -2253152 -3157224 -836983 1565305 1096891
8271 1096891 -1026305 -1758864 -457012 1146958 1786725 1489790 360870 -1584100 -3556784
8262 -3556784 -4379978 -3796670 -2552454 -1360074 -530339 -303155 -678300 -1067999 -844178
8253 -844178 -151027 348620 354858 78796 -274853 -679512 -1046688 -1212853 -1245977 -1691265
8243 -1691265 -3327059 -6107170 -8157549 -6982352 -2789785 493319 -499010 -3919490
$$ packed form
8306D336147j391149j84565N40725r74691k847350k213370O42785K495774J254882
8297A659188j558176k759231j084269J654471K585168O68752k171196k849036
8289c854329m92535K253288K264526Q1303p15148J244432K779422Q71694k357353
8280B075300k513606K89128J474332q19604k758702r04072K320241K402288m68414
8271A096891k123196p32559J301852J603970O39767k96935j128920j944970j972684
8262c556784q23194N83308J244216J192380Q29735K27184l75145l89699K23821
8253h44178O93151M99647O238k76062l53649m04659l67176j66165l3124m45288
8243a691265j635794k780111k050379J175197M192567L283104r92329l420480
$$ plain form
8235 -3919490 -4831255 -1818713 1538989 2315514 1873525 2239137 2308690 555524 -1174062
8226 -1174062 -214796 2199895 2522461 368317 -1216071 -707532 160982 -85513 -617253
8217 -617253 -489006 -149174 37863 381513 323229 -1272466 -3586187 -4101677 -2279834
8208 -2279834 -483297 -212705 -57304 1199574 2106774 1189860 -191897 17660 1316877
8199 1316877 1921762 1899431 2545496 3603712 3562654 2259057 1127668 1202613 2518979
8190 2518979 4799600 6928266 6637809 3069206 -869654 -1263626 1731750 4116747 3638378
8181 3638378 2463639 3295244 5304918 5708968 3758434 1228404 -191301 -251277 721643
8172 721643 2461723 4292841 5020186 3880412 1486318 -399239 -372726 1023171 1628480
$$ packed form
8235c919490r11765L012542L357702P76525m41989L65612O9553j753166j729586
8226a174062R59266K414691L22566k154144j584388N08539Q68514k46495n31740
8217f17253J28247L39832J87037L43650n8284j595695k313721n15490J821843
8208b279834J796537K70592J55401J256878R07200r16914j381757K09557J299217
8199A316877O04885k2331O46065J058216m1058j303597j131389P4945J316366
8190B518979K280621K128666k90457l568603l938860l93972K995376K384997m78369
8181C638378j174739Q31605K009674M04050j950534k530030j419705n9976R72920
8172G21643J740080J831118P27345j139774k394094j885557K6513J395897O05309
$$ plain form
8163 1628480 248956 -1550402 -1378050 575516 1732892 879124 -331623 -490261 -894741
8154 -894741 -3035454 -5271483 -4660981 -1486279 778241 253027 -1084858 -762455 799017
8145 799017 1701745 1619511 1495271 1269688 68073 -1653914 -2199816 -1219937 -538229 -1653153
8135 -1653153 -3699090 -4886850 -5041963 -5477557 -6755260 -7808781 -7402427 -5531726 -3084693
8126 -3084693 -862119 632452 1081920 757138 723563 1846038 3502252 3907193 1986495
8117 1986495 -1440070 -4477561 -5716764 -4877238 -2637002 -355614 652009 389975 395540
8108 395540 1851965 3806379 4330824 3290600 2562280 3180814 3720495 2408478 -259966
8099 -259966 -2184092 -2227210 -972564 557484 1712274 2056986 1679581 1621445 2824385
$$ packed form
8163A628480j379524j799358J72352J953566J157376q53768j210747j58638m04480
8154h94741k140713k236029O10502L174702K264520n25214j337885L22403J561472
8145G99017R02728q2234j24240k25583j201615j721987n45902R79879O81708j114924
8135a653153k045937j187760j55113m35594j277703j053521M06354J870701K447033
8126c084693K222574J494571M49468l24782l3575J122475J656214M04941j920698
8117A986495l426565l037491j239203Q39526K240236K281388J007623k62034N565
8108C95540J456425J954414N24445j040224p28320O18534N39681j312017k668444
8099b59966j924126m3118J254646J530048J154790L44712l77405n8136J202940
$$ plain form
8090 2824385 4492978 4577200 2218397 -1151201 -3489113 -4143272 -3805683 -3251407 -2781224
8081 -2781224 -2527593 -2650906 -3120422 -3505129 -3190990 -2046592 -836081 -492748 -868456
8072 -868456 -903141 -327905 -222293 -1205333 -2179760 -2044203 -1667505 -2561899 -4260166 -4830372
8062 -4830372 -3667191 -1933208 -428078 975923 1766986 885300 -1126246 -2091744 -1034454
8053 -1034454 712166 1752971 2054374 1571795 -219513 -2391412 -2530970 -184001 1777914
8044 1777914 1021003 -946374 -1365698 -392128 -289445 -1677200 -2948263 -2730164 -1034220
8035 -1034220 1275009 2531391 956651 -2842704 -5365609 -4345732 -2051883 -1988391 -3693699
8026 -3693699 -3968192 -2291334 -1259940 -1702271 -1164174 1835489 5276074 6700407 6200172
$$ packed form
8090B824385J668593Q4222k358803l369598k337912o54159L37589N54276M70183
8081b781224K53631j23313m69516l84707L14139J144398J210511L43333l75708
8072h68456l4685N75236J05612r83040r74427J35557L76698q94394j698267n70206
8062d830372J163181J733983J505130J404001P91063q81686k011546r65498J057290
8053a034454J746620J040805L01403m82579j791308k171899j39558K346969J961915
8044A777914p56911j967377m19324R73570J02683j387755j271063K18099J695944
8035a034220K309229J256382j574740l799355k522905J019877K293849O3492j705308
8026c693699k74493J676858J031394m42331N38097K999663L440585J424333n00235
$$ plain form
8017 6200172 4976600 3233808 1027008 -681512 -1318560 -1586215 -1895088 -1431795 52848
8008 52848 1038253 149206 -1921475 -3590073 -4364032 -4519525 -3894480 -2289886 -359242
7999 -359242 970652 1455783 1220481 174555 -1554466 -3211584 -4051673 -3963364 -3221322
7990 -3221322 -2201523 -1384369 -875428 -16251 1567532 2772454 2209220 490560 -219226
7981 -219226 928828 2582044 3346888 3272414 2942733 2645119 2677083 3009986 2674212 1119651
7971 1119651 -155702 504568 1809137 1145284 -814593 -644760 2124280 3664758 1634940
7962 1634940 -1406003 -2340016 -1691180 -1085596 -39563 1692246 1849508 -609946 -2320554
7953 -2320554 -73513 3744924 4575960 2634286 1780931 2827541 2971619 1369736 246477
$$ packed form
8017F200172j223572j742792k206800j708520o37048k67655l08873M63293J484643
8008E2848R85405q89047k070681j668598p73959j55493O25045J604594J930644
7999c59242J329894M85131k35302j045926j729021j657118q40089Q8309P42042
7990c221322J019799Q17154N08941Q59177J583783J204922n63234j718660p09786
7981b19226J148054J653216P64844p4474l29681k97614L1964L32903l35774j554561
7971A119651j275353O60270J304569o63853j959877J69833K769040J540478k029818
7962A634940l040943r34013O48836O05584J046033J731809J57262k459454j710608
7953b320554K247041L818437Q31036j941674q53355J046610J44078j601883j123259
$$ plain form
7944 246477 162030 -1080281 -3874051 -5454340 -4438428 -2915431 -2509240 -1904458 -59158
7935 -59158 1371408 936456 41174 542562 1820888 2217661 1661648 1212087 1500614 2818916
7925 2818916 5063914 6636546 5445202 2079412 -253278 -143641 179005 -1070768 -2118973
7916 -2118973 -917028 929788 490064 -1879426 -3210584 -2165745 98547 2477551
7908 2477551 4662200 5820251 5052914 3080809 1446725 233333 -1569005 -3781815
7900 -3781815 -5115583 -5304916 -5229509 -5048978 -4103625 -2566272 -1329996 -363163 911210
7891 911210 1744410 740755 -1499213 -2688287 -2175431 -1687439 -2205349 -2513488 -1764434
7882 -1764434 -1002603 -771896 317030 2706387 3917385 2089611 -372088 64224 2444058
$$ packed form
7944B46477q4447j242311k793770j580289J015912J522997M06191O04782J845300
7935e9158J430566m34952q95282N01388J278326L96773n56013m49561K88527J318302
7925B818916K244998J572632j191344l365790k332690J09637L22646j249773j048205
7916b118973J201945J846816m39724k369490j331158J044839K264292K379004
7908B477551K184649J158051p67337j972105j634084j213392j802338k212810
7900c781815j333768j89333P5407J80531R45353J537353J236276R66833J274373
7891I11210Q33200j003655k239968j189074N12856M87992n17910l08139P49054
7882a764434P61831K30707J088926K389357J210998j827774k461699M36312K379834
$$ plain form
7873 2444058 2583588 -314116 -2324119 -989212 1071376 858949 -90273 1266588 3895462
7864 3895462 4072748 1292885 -1191468 -1625061 -1630805 -2144534 -1396846 1274635 3086882
7855 3086882 1947611 139777 613781 1720674 -407069 -5187737 -7454353 -4412300
7847 -4412300 668669 2774986 577974 -3518256 -6498479 -6674224 -4325251 -1685565
7839 -1685565 -1066265 -2230244 -2796746 -1482596 677222 2432233 3451510 3029694 339169
7830 339169 -3113832 -4113654 -2296452 -1288813 -3321096 -5537964 -4431027 -1457080 -702573
7821 -702573 -2603512 -3860479 -2894869 -1632550 -1794542 -2770865 -3724355 -4908742 -6092932
$$ packed form
7873B444058J39530k897704k010003J334907K060588k12427r49222J356861K628874
7864C895462J77286k779863k484353m33593n744n13729P47688K671481J812247
7855C086882j139271j807834M74004J106893k127743m780668k266616L042053
7847d412300N080969K106317k197012m096230k980223j75745K348973K639686
7839a685565O19300j163979n66502J314150K159818J755011J019277m21816k690525
7830C39169l453001r99822J817202J007639k032283k216868J106937K973947P54507
7821g02573j900939j256967R65610J262319j61992r76323r53490j184387j184190
$$ [...]
##END NTUPLES=NMR SPECTRUM
##END=
