##TITLE=31Pdec_Glu_AcCl_Ac20
 CDCl3, 24 sc
 23.08.2021
##JCAMPDX= 6.0         $$ Bruker NMR JCAMP-DX V2.0
##DATA TYPE= NMR SPECTRUM
##DATA CLASS= NTUPLES
##ORIGIN= UXNMR, Bruker Analytische Messtechnik GmbH
##OWNER= root
$$ XWIN-NMR		Version 3.5
$$ Mon Aug 23 13:04:10 2021 Russian Standard Time (UT+4h)  she@DPX200
##.OBSERVE FREQUENCY= 81.013821
##.OBSERVE NUCLEUS= ^31P
##.ACQUISITION MODE= SIMULTANEOUS
##.ACQUISITION SCHEME= undefined
##.AVERAGES= 24
##.DIGITISER RES= 16
##SPECTROMETER/DATA SYSTEM= spect
##.PULSE SEQUENCE= zgpg30
##.SOLVENT NAME= CDCl3
##.SHIFT REFERENCE= (INTERNAL, CDCl3, 0, 248.564)
##AUDIT TRAIL= $$ (NUMBER, WHEN, WHO, WHERE, WHAT)
$$ ##TITLE= Audit trail, XWIN-NMR		Version 3.5
$$ ##JCAMPDX= 5.01
$$ ##ORIGIN= Bruker BioSpin GmbH
$$ ##OWNER= she
$$ F:/spectra/data/she/nmr/P31/1/pdata/1/auditp.txt
$$ ##AUDIT TRAIL=  $$ (NUMBER, WHEN, WHO, WHERE, WHAT)
(   1,<2021-08-23 13:02:22.65 +0400>,<she>,<DPX200>,
      <created by zg, POWCHK disabled, PULCHK disabled
       configuration hash MD5:
       00 E9 B6 7A A2 85 ED C7 34 08 36 98 17 FE 4E 26
       data hash MD5: 32K
       D3 9D D2 82 08 89 0A D7 F7 1E 22 5C F8 0D 07 5F>)
(   2,<2021-08-23 13:02:25.32 +0400>,<she>,<DPX200>,
      <Start of raw data processing
       efp BC_mod = 2 LB = 1 FT_mod = 6 PKNL = 1 PHC0 = -7486.206 PHC1 = 359.0746 SI = 64K 
       data hash MD5: 64K
       AB C1 B3 EB D8 C7 D4 FA EB 13 B5 52 86 75 E5 11>)
(   3,<2021-08-23 13:02:52.48 +0400>,<she>,<DPX200>,
      <pk PHC0 = -249.5337 PHC1 = 510.7998 
       data hash MD5: 64K
       F2 9D 83 44 25 38 16 EF E5 D5 6B D5 22 AD 13 99>)
(   4,<2021-08-23 13:03:12.56 +0400>,<she>,<DPX200>,
      <pk PHC0 = -154.2117 PHC1 = 361.1998 
       data hash MD5: 64K
       B0 72 71 C2 7F 74 57 DF 1D 06 89 FE 4B 1F A2 03>)
(   5,<2021-08-23 13:03:36.92 +0400>,<she>,<DPX200>,
      <pk PHC0 = 10.59273 PHC1 = -25.4 
       data hash MD5: 64K
       7F DD 1A F1 79 F2 C0 FA 5D 06 31 EF 41 B5 85 78>)
(   6,<2021-08-23 13:03:40.64 +0400>,<she>,<DPX200>,
      <abs ABSG = 5 
       data hash MD5: 64K
       EA 01 D9 EC 82 E8 02 D8 23 7E 16 E5 8C 69 C3 D2>)
$$ ##END=
$$ 
$$ hash MD5
$$ 6C C9 69 86 2E 05 B8 70 45 ED DD 16 41 78 FA DA
##$RELAX= 
##$RELAX= 
##$RELAX= 
##$RELAX= 
##$RELAX= 
##$RELAX= 
##$RELAX= 
##$RELAX= 
$$ Bruker specific parameters
$$ --------------------------
##$DU= <F:/spectra>
##$EXPNO= 1
##$NAME= <P31>
##$PROCNO= 1
##$TYPE= <nmr>
##$USER= <she>
##$AMP= (0..31)
100 100 100 100 100 100 100 100 100 100 100 100 100 100 100 100 100 100 
100 100 100 100 100 100 100 100 100 100 100 100 100 100 
##$AQSEQ= 0
##$AQ_mod= 1
##$AUNM= <au_zg>
##$AUTOPOS= <>
##$BF1= 81.014009
##$BF2= 200.13
##$BF3= 200.13
##$BF4= 200.13
##$BF5= 200.13
##$BF6= 200.13
##$BF7= 200.13
##$BF8= 200.13
##$BYTORDA= 1
##$CFDGTYP= 0
##$CFRGTYP= 5
##$CHEMSTR= <none>
##$CNST= (0..31)
1 1 145 1 1 1 1 1 1 1 1 1 1 1 1 1 1 1 1 1 1 1 1 1 1 1 1 1 1 1 1 1 
##$CPDPRG= <waltz16>
##$CPDPRG1= <>
##$CPDPRG2= <waltz16>
##$CPDPRG3= <>
##$CPDPRG4= <mlev>
$$ [...]
##$SUBNAM3= <"">
##$SUBNAM4= <"">
##$SUBNAM5= <"">
##$SUBNAM6= <"">
##$SUBNAM7= <"">
##$SUBNAM8= <"">
##$SUBNAM9= <"">
##$SW= 501.771253377433
##$SWIBOX= (0..15)
0 1 3 0 0 0 0 0 0 0 0 0 0 0 0 0 
##$SW_h= 40650.406504065
##$TD= 32768
##$TD0= 1
##$TE= 0
##$TE2= 300
##$TE3= 300
##$TEG= 300
##$TL= (0..7)
0 120 53 12 22 120 120 120 
##$TP= (0..7)
150 150 150 150 150 150 150 150 
##$TP07= 0
##$TPNAME0= <>
##$TPNAME1= <>
##$TPNAME2= <>
##$TPNAME3= <>
##$TPNAME4= <>
##$TPNAME5= <>
##$TPNAME6= <>
##$TPNAME7= <>
##$TPOAL= (0..7)
0.5 0.5 0.5 0.5 0.5 0.5 0.5 0.5 
##$TPOFFS= (0..7)
0 0 0 0 0 0 0 0 
##$TUNHIN= 0
##$TUNHOUT= 0
##$TUNXOUT= 0
##$USERA1= <user>
##$USERA2= <user>
##$USERA3= <user>
##$USERA4= <user>
##$USERA5= <user>
##$V9= 5
##$VALIST= <valist>
##$VCLIST= <CCCCCCCCCCCCCCC>
##$VD= 0
##$VDLIST= <DDDDDDDDDDDDDDD>
##$VPLIST= <PPPPPPPPPPPPPPP>
##$VTLIST= <TTTTTTTTTTTTTTT>
##$WBST= 1024
##$WBSW= 4
##$XGAIN= (0..3)
0 0 0 0 
##$XL= 0
##$YL= 0
##$YMAX_a= 3211
##$YMIN_a= -3647
##$ZGOPTNS= <>
##$ZL1= 120
##$ZL2= 120
##$ZL3= 120
##$ZL4= 120
##$ABSF1= 248.5645
##$ABSF2= -253.2056
##$ABSG= 5
##$ABSL= 3
##$ALPHA= 0
##$AQORDER= 0
##$ASSFAC= 0
##$ASSFACI= 0
##$ASSFACX= 0
##$ASSWID= 0
##$AUNMP= <proc_1d>
##$AZFE= 0.1
##$AZFW= 0.5
##$BCFW= 0
##$BC_mod= 2
##$BYTORDP= 0
##$COROFFS= 0
##$CY= -3
##$DATMOD= 1
##$DC= 0
##$DFILT= <>
##$DTYPP= 0
##$F1P= 0
##$F2P= 0
##$FCOR= 1
##$FTSIZE= 65536
##$FT_mod= 6
##$GAMMA= 0
##$GB= 0
##$INTBC= 1
##$INTSCL= 5.30512e-09
##$ISEN= 30
##$LB= 1
##$LEV0= 0
##$LPBIN= 0
##$MAXI= 10000
##$MC2= 0
##$MEAN= 0
##$ME_mod= 0
##$MI= 50
##$NCOEF= 0
##$NC_proc= -7
##$NLEV= 6
##$NOISF1= 182.463
##$NOISF2= 159.3651
##$NSP= 0
##$NTH_PI= 0
##$NZP= 0
##$OFFSET= 248.5645
##$PC= 4
##$PHC0= -7879.359
##$PHC1= 1205.674
##$PH_mod= 1
##$PKNL= yes
##$PPARMOD= 0
##$PSCAL= 0
##$PSIGN= 0
##$REVERSE= no
##$SF= 81.014009
##$SI= 65536
##$SIGF1= 159.3651
##$SIGF2= -187.1042
##$SINO= 113.3802
##$SIOLD= 16384
##$SREGLST= <1H.CDCl3>
##$SSB= 0
##$STSI= 65536
##$STSR= 0
##$SW_p= 40650.406504065
##$SYMM= 0
##$S_DEV= 0
##$TDeff= 32768
##$TDoff= 0
##$TI= <>
##$TILT= no
##$TM1= 0
##$TM2= 0
##$TOPLEV= 0
##$USERP1= <user>
##$USERP2= <user>
##$USERP3= <user>
##$USERP4= <user>
##$USERP5= <user>
##$WDW= 1
##$XDIM= 65536
##$YMAX_p= 120962005
##$YMIN_p= -244650400
$$ End of Bruker specific parameters
$$ ---------------------------------
##NTUPLES= NMR SPECTRUM
##VAR_NAME=  FREQUENCY,     SPECTRUM/REAL,   SPECTRUM/IMAG
##SYMBOL=    X,             R,               I
##VAR_TYPE=  INDEPENDENT,   DEPENDENT,       DEPENDENT
##VAR_FORM=  AFFN,          ASDF,            ASDF
##VAR_DIM=   65536,         65536,           65536
##UNITS=     HZ,            ARBITRARY UNITS, ARBITRARY UNITS
##FACTOR=    0.620285442955139, 1,           1
##FIRST=     20137.2065510759, 0,            0
##LAST=      -20513.1999529892, 0,           0
##MIN=       -20513.1999529892, -244650400,  0
##MAX=       20137.2065510759, 120962005,    0
$$ Real data points
##PAGE= N=1
##DATA TABLE= (X++(R..R)), XYDATA
$$ [...]
39844C497112O32863j326721l115170k405176L4080J720831J852452J231450K21823
39835B343544j001101j313051j2772J478715J334034J3349o57053l57346k98698
39826A529621r75149j699522j898024j385289q0951J224672J033127m20071n69366
39817c240952J579969K929070N95069l043655l410820o66379Q61446j42318k64768
39808d803338K238488M096264K290473j169212k527856j457202j29845N73822
39800h88406J071171J018989K0038p87794k35601P87111Q30874L46976M84220
39791B647578N35481r44218l136445l545041j442574J286650K667956K289498
39783C58885O84490j168304j853492o98432J081854J791272J454340J122186O28327
$$ plain form
39844 3497112 4129975 2803254 -311916 -2717092 -2683012 -962181 890271 2121721 2343544
39835 2343544 1342443 29392 16620 1495335 2829369 2842718 2185665 1828319 1529621
39826 1529621 554472 -1145050 -3043074 -4428363 -4509314 -3284642 -2251515 -2671586 -3240952
39817 -3240952 -1660983 1268087 1863156 -1180499 -4591319 -5257698 -4396252 -4538570 -4803338
39808 -4803338 -2564850 1531414 3821887 2652675 124819 -1332383 -1462228 -888406
39800 -888406 182765 1201754 1221792 433998 198397 985508 1816382 2163358 2647578
39791 2647578 3183059 2238841 -897604 -4442645 -5885219 -4598569 -1930613 358885
39783 358885 1043375 -124929 -1978421 -2676853 -1594999 196273 1650613 2772799 3401126
39774C401126q75228k484412k134001P2420J515622P79793n03722n69526j10406
39765i08334m11697p65324J79960J706135J894211O00287n67579r89777j540344
39756h02462k150003j231035J398963L058930J526307j453158k180832k5294J868865
39747A0281J087441j074399k019093j276196j05197P93374J404955J308174L43168
39738D72508l13102M14212J510280J192603k61790j058707q55349q55727j141254
39729h96326n50122O24661O70928k70619K9716J914841K750951J205926n54238
39720D925718p63783q62303k014656k203408k5351J713576J98377k194056j470329
39711b696215J268649J836415K35512J53056J720521J079146k054642k792083
$$ plain form
39774 3401126 2525898 41486 -2092515 -2020095 -504473 275320 -228402 -797928 -908334
39765 -908334 -1320031 -2085355 -1905395 -199260 1694951 2295238 1727659 737882 -802462
39756 -802462 -2952465 -4183500 -2784537 274393 1800700 347542 -1833290 -1858584 10281
39747 10281 1097722 23323 -1995770 -3271966 -3377163 -2583789 -1178834 129340 472508
39738 472508 159406 573618 2083898 3276501 3014711 1956004 1100655 244928 -896326
39729 -896326 -1446448 -821787 -150859 -421478 -391762 1523079 4274030 5479956 4925718
39720 4925718 4161935 3299632 1284976 -918432 -943783 769793 968170 -1225886 -2696215
39711 -2696215 -1427566 408849 644361 797417 2517938 3597084 1542442 -1249641
39703a249641P30809L469917J271899k458872k288306R51237K341479P07538q10008
39694B666052n94258j94526n32811n68547N1982L16644Q9146K66937O05396j117
39684B104898j033455p60443P39216J531731R73580L05649j00464j233169k639553
39675a12010k189385K07708J572008K43121j342698m66541J542224J515779o08139
39666C62067k052748j558461m80675K03523J031894J887646J548498K91615K68327
39657A501686J862105K243669k94127k850850j823726J284047J825336p15921
39649C032219j861851M44293K111632n83945m505033m016587L50670K661805N13279
39640a853518j866224n38162K617688L612891K104406M76996l82885j204218j719821
$$ plain form
39703 -1249641 -518832 2951085 4222984 1764112 -524194 427043 2768522 3476060 2666052
39694 2666052 2071794 1877268 1344457 775910 827892 1144536 1233682 1500619 2106015 2104898
39684 2104898 1071443 311000 1050216 2581947 3555527 3861176 3760712 2527543 -112010
39675 -112010 -2301395 -2093687 -521679 -278558 -1621256 -2087797 -545573 970206 362067
39666 362067 -1690681 -3249142 -3729817 -3526294 -2494400 -606754 941744 1233359 1501686
39657 1501686 3363791 5607460 5313333 2462483 638757 1922804 3748140 3032219
39649 3032219 1170368 1614661 3726293 3142348 -1362685 -5379272 -5028602 -2366797 -1853518
39640 -1853518 -3719742 -4257904 -1640216 1972675 4077081 4554077 4171192 2966974 1247153
39631A247153j049819j7558l59050j807435k254943q84377P80016J164044M56082
39622b725887j19894K45146J271324J667664L76697j568908j554981J068055L362112
39613B021328K556875L0503r48256k51777l91676j562848j159598J137939J836099
39604C268589r10864l743452k780270P05779K517794J653075O05832M83595k61829
39595A538249j900405j952559O95580L043546J841748j452149k385388L23304
39587b48074L056250K312883q23896k678561j895352l64750J13013j06334j04739
39578g39560j35983o73296r87187o0620J616377K332835J113542j273720l018720
39569a826332k594344k9095K618345K908072Q57909q79259n86303J29911r08342
$$ plain form
39631 1247153 197334 179776 -179274 -1986709 -4241652 -5126029 -4346013 -3181969 -2725887
39622 -2725887 -2845781 -2600635 -1329311 338353 715050 -853858 -2408839 -1340784 2021328
39613 2021328 4578203 4608706 3660450 3408673 3016997 1454149 294551 1432490 3268589
39604 3268589 2357725 -1385727 -4165997 -3460218 -942424 710651 1316483 1800078 1538249
39595 1538249 -362156 -2314715 -1619135 1424411 3266159 1814010 -571378 -248074
39587 -248074 2808176 5121059 4297163 1618602 -276750 -641500 -528487 -634821 -739560
39578 -739560 -875543 -1548839 -2536026 -2596646 -980269 1352566 2466108 1192388 -1826332
39569 -1826332 -4420676 -4449771 -1831426 1076646 1934555 1055296 468993 598904 -309438
39560c09438k650493k225580M56436K307710J517628k13122o75762n677O41813
39551a156485J107378J368690N33653j402417k267774m01887K286416K327664
39543B395238m79065k540721j244245J668735K601187P37213j298352j120772
39535G19218M84695J005983j99274j095336m013J892295K212249O44930j027268
39526D633479j690444j769587j426409j65797J222479P67711j373294k057449
39518a859311M03888K981656J837541j882384l432857j206038J367291J245031
39510e45183j70816r5488J082307Q64519j006149j922884j83588K557063L296692
39501C876473J125607j997183l417513k242137J65195J708994J437852Q1208r10282
$$ plain form
39560 -309438 -2959931 -5185511 -4729075 -2421365 -903737 -1116859 -1792621 -1798298 -1156485
39551 -1156485 -49107 1319583 1853236 450819 -1816955 -2218842 67574 2395238
39543 2395238 1916173 -624548 -1868793 -200058 2401129 3138342 1839990 719218
39535 719218 1203913 2209896 2010622 915286 911273 2803568 5015817 5660747 4633479
39526 4633479 2943035 1173448 -252961 -418758 803721 1571432 198138 -1859311
39518 -1859311 -1455423 1526233 3363774 1481390 -1951467 -3157505 -1790214 -545183
39510 -545183 -715999 -811487 270820 1135339 129190 -1793694 -1977282 579781 3876473
39501 3876473 5002080 3004897 -412616 -2654753 -2489558 -780564 657288 738496 -171786
39492a71786o44714O09119J690854J553780M03761l52634J85749J033998N06382
39483D814509j300823k374431j515721m9638M0418j208344k049638j474298j16942
39474e234908J057376J729819J817697J255643N13098L40787N97784K59764r19260
39465A417800j705675j053035L41453R70239L55993q21668j745626j765672n18826
39456d525017J151449J300201n86941k001867l90852K779159L480576Q02927j642050
39447C67585r57406J156026J544126K33100o01198n82815j057874j863443j227339
39438b989238R35033K206008R51179j371635k075192l11388K302873L395263J988648
39429E031551m80941j517906m57083P75784N45946k05767P015M82637r6575p32907
$$ plain form
39492 -171786 -816500 -207381 1483473 3037253 3441014 3088380 3274129 4308127 4814509
39483 4814509 3513686 1139255 -376466 -426104 -385686 -1594030 -3643668 -5117966 -5234908
39474 -5234908 -4177532 -2447713 -630016 625627 1138725 1479512 2077296 2337060 1417800
39465 1417800 -287875 -1340910 -999457 -29218 326775 -494893 -2240519 -4006191 -4525017
39456 -4525017 -3373568 -2073367 -2660308 -4662175 -5053027 -2273868 1206708 2009635 367585
39447 367585 -589821 566205 2110331 2343431 1742233 1159418 101544 -1761899 -2989238
39438 -2989238 -2054205 151803 1102982 -268653 -2343845 -2655233 -352360 3042903 5031551
39429 5031551 4550610 3032704 2575621 3351405 3897351 3691584 3698599 4181236 4084661 3351754
39419C351754K65028J670374Q74053j367496j697789P1885L36485k012129l231992
39410a739827r45549J583051P21551j593879j316559J044160J837799O45734M26946
39401F63427J915163K459142P68777j178149j749508j713269j720233r41501N12192
39392i83959P26056q49294j843914m14418J796767K132089P60855o8038M07128
39383A663272P76427L3701r68278r41121Q9810R47237P30608k62025r56830p01194
39373D11607J16144O58060N29761o8951o24578n23237L78025J109176M48171j099529
39363A334649j439902J26299J529172R08637n64997p79528j22312k51376n97884
39354A42758O31282K453155J829251j188145k759311r66107J283704J030669k47671
$$ plain form
39419 3351754 3616782 5287156 6161209 4793713 3095924 3167809 3504294 1492165 -1739827
39410 -1739827 -2685376 -1102325 -380774 -1974653 -3291212 -2247052 -409253 236481 663427
39401 663427 2578590 5037732 5806509 4628360 2878852 1165583 -554650 -1496151 -983959
39392 -983959 -257903 -1107197 -2951111 -3365529 -1568762 563327 1324182 1256144 1663272
39383 1663272 2439699 2473400 1505122 564001 653811 1601048 2331656 2069631 1112801 411607
39373 411607 527751 1185811 1715572 1646621 1022043 498806 876831 1986007 2434178 1334649
39363 1334649 -105253 21046 1550218 2458855 1893858 1114330 992018 740642 142758
39354 142758 774040 3227195 5056446 3868301 1108990 142883 1426587 2457256 2209585
39345B209585L04814J867554J359942j398226l284639k359109l5578J419460J419298
39336A503101O87229N604j29774L48886R38910J133343R90710O64589m0637r50503
39326E151458j155059l12105N02202L31052j68351l8110J79427l98757r78160
39317C113597l18897O61203j6434j855799k166203l59399P98640n14782k129398
39308b787472j149496J556176K623213J021310q99031j057272p0763M90620M49179
39299A76464N93149J042862J171939O89565k9813n33288p05119o94918o84923
39290A025918o03532p7909R39389J564562P68864j020980k035767j409872l39867
39281a189194j47347k44983N37030J460571Q13627q66032r59695J136659K456509
$$ plain form
39345 2209585 2514399 4381953 5741895 4343669 1059030 -1300079 -1335657 83803 1503101
39336 1503101 2190330 2195934 2066160 2415046 3353956 4487299 5478009 6142598 6101961 5151458
39326 5151458 3996399 3684294 4186496 4517548 4349197 4311087 4490514 4091757 3113597
39317 3113597 2794700 3455903 3439469 1583670 -582533 -941932 -143292 -658074 -2787472
39308 -2787472 -3936968 -2380792 242421 1263731 364700 -692572 -763335 -272715 176464
39299 176464 769613 1812475 2984414 3673979 3644166 3110878 2405759 1710841 1025918
39290 1025918 422386 344477 1283866 2848428 3617292 2596312 560545 -849327 -1189194
39281 -1189194 -1336541 -1581524 -1044494 416077 1229704 363672 -596023 540636 2997145
39272B997145N69660k622329l336101r91041J486879J914761J051903M49460K51229
39263A771566j56610q22168j346301j401086p62128L34922Q91734L18517k60779
39254a432333N90231J981250J497348r17975k198237n06921J770759J355530j141383
39245I98269k176758l20418K074248K333441N67819j270214j915085j514882p42848
39236a966428m0630N04118Q81944P45233l84362j997099k241032R5141L280391
39227a122724L816823O57488k949073l125562k17600J673945Q7857k647652k716392
39218f542890P8365K380540K023800N19754K03501Q86426Q69008l6292m62100
39209g9888P3417O15169O68667Q99581J545337J631945M78349j103113j840729
$$ plain form
39272 2997145 3566805 944476 -2391625 -3382666 -1895787 18974 1070877 1520337 1771566
39263 1771566 1614956 792788 -553513 -1954599 -2716727 -2381805 -1490071 -1171554 -1432333
39254 -1432333 -842102 1139148 2636496 1718521 -479716 -986637 784122 2139652 998269
39245 998269 -1178489 -1498907 575341 2908782 3476601 2206387 291302 -1223580 -1966428
39236 -1966428 -2007058 -1502940 -620996 124237 -260125 -2257224 -4498256 -4403115 -1122724
39227 -1122724 2694099 3351587 402514 -2723048 -2940648 -1266703 -1178846 -3826498 -6542890
39218 -6542890 -6464525 -4083985 -2060185 -1540431 -1336930 -450504 418504 382212 -79888
39209 -79888 -6471 608698 1277365 2176946 3722283 5354228 5832577 4729464 2888735
39200B888735j520098r07864o62675o72338j83220J314288K964926K922884P17420
39191F862058j513487j561348k58768j85936j700594k565520j556390O9380J159364
39182a251241K113552K865285K053631l79042k121488j665327m39881j68706l04904
39173G01879P6142J56192o37282q10063M48041R42898j029541k990722j764879
39164d907335J060535J392954p38206j421597N96539K353504K075106J454690
39156A866190J456369M45008j734464k216205o9681J297810l14119j794790Q1956
39147i81926K748442J820759j416448j852860J158734K849429P71600j633885
39139C463845r28916J145056J106505p30699j396148j83831P60783J85004p07556
$$ plain form
39200 2888735 1368637 460773 -201902 -874240 -1057460 256828 3221754 6144638 6862058
39191 6862058 5348571 3787223 3528455 3342519 1641925 -923595 -2479985 -2410605 -1251241
39182 -1251241 862311 3727596 5781227 5402185 3280697 1615370 1175489 1006783 701879
39173 701879 778021 934213 296931 -513132 -65091 877807 -151734 -3142456 -4907335
39164 -4907335 -3846800 -2453846 -3192052 -4613649 -4017110 -1663606 411500 1866190
39156 1866190 3322559 3767567 2033103 -183102 -252783 1045027 730908 -1063882 -981926
39147 -981926 1766516 3587275 2170827 317967 1476701 4326130 5097730 3463845
39139 3463845 2534929 3679985 4786490 4055791 2659643 2475812 3236595 3421599 2714043
39130B714043p30947o17426j488715k692417k416627k12136K076166K359788Q64686
39121a43585j54576O26445J897961J719958L44687l96786j31186m68933k070992
39112A222993l051616j551746J370275K972465K269981P26390j74337n35498j079446
39103B169461j796298k027136j248590M43539K196644K859061K087922P21030
39095E405633m71671j716539l017196l018429q32881J671065J745939j49171p49608
39086a132858J066274K581519J641033j67736o34014m58546j048002j243198L80504
39077I84976J845615L82629k409239k339026O96836K269536L05277j893125j057745
39068a214266J399359K285373J088247p20575k245988k803466j352368J422806
$$ plain form
39130 2714043 1983096 1365670 -123045 -2815462 -5232089 -5444225 -3368059 -1008271 -143585
39121 -143585 -298161 328284 2226245 3946203 4290890 3894104 3762918 3293985 1222993
39112 1222993 -1828623 -3380369 -2010094 962371 3232352 3958742 3784405 3248907 2169461
39103 2169461 373163 -1653973 -2902563 -2459024 -262380 2596681 4684603 5405633
39095 5405633 4933962 3217423 200227 -2818202 -3651083 -1980018 -234079 -383250 -1132858
39086 -1132858 -66584 2514935 4155968 3988232 3354218 2895672 1847670 604472 984976
39077 984976 2830591 3213220 803981 -1535045 -838209 1431327 1736604 -156521 -1214266
39068 -1214266 185093 2470466 3558713 2838138 592150 -2211316 -3563684 -2140878
39060b140878K579734P32717j561931j433113L17248J197806R32333P04348L79078
39051A707342n88421j057824k4242Q91152j22248j502594o12860J515026J519484
39042A724815p65731j999063n91316J377762J947395J601789J108665J39751j044461
39033C499606j257134n80264m33528q82649n01533N54937K91788j424003j920233
39024b653013J33994K367119K187250L27883q47370o59592j0784M73559O32149
39015A951195K83843l09767n53225o38492j178889j514425l41285J636012K035466
39006A370433M19096r04859n47602J44453P9177M37515K044417L234716K312085
38997H589431J56250j344018j644357j004744K96119R82409m87803k866482k673728
$$ plain form
39060 -2140878 438856 1171573 -390358 -1823471 -1506223 -308417 623916 1328264 1707342
39051 1707342 1118921 61097 36855 928007 805759 -696835 -1309695 205331 1724815
39042 1724815 959084 -1039979 -1631295 -253533 1693862 3295651 4404316 4544067 3499606
39033 3499606 2242472 1662208 1228680 346031 -155502 399435 691223 -732780 -2653013
39024 -2653013 -2519019 -151900 2035350 2363233 1515863 856271 845487 1319046 1951195
39015 1951195 2235038 1925271 1372046 733554 -445335 -1959760 -2301045 -665033 1370433
39006 1370433 1789529 884670 337068 481521 560698 998213 3042630 6277346 8589431
38997 8589431 8745681 7401663 5757306 4752562 5048681 6031090 5543287 2676805 3077
38988C077N41220K750968J409336p02644m97084K41072j296638l123289j507125
38979b181107K240433L354526J017990r39533m94813K78590k38727q49389o32683
38970A555287n10766o89511J766J247081J049397o07479j196957J27325J045987
38961B022130J80398o24326O2894M74732j115321k944577k289688L18670K023669
38952a891419J634940L97063m43152p94318q53770o95133n25571l26425L28662
38943c169123J313248J569881O13402m04917k35414N55323M58645n77681r54536
38934h31172K23452J652252J363514o29012k066852j211518Q07180J445283K16508
38925I69635r06506p41304m12390o96801l27215J162931J400460j047821k972859
$$ plain form
38988 3077 544297 3295265 4704601 4001957 3504873 3745945 2449307 -673982 -2181107
38979 -2181107 59326 3413852 4431842 3492309 2997496 3276086 3037359 2187970 1555287
38970 1555287 1044521 355010 356776 1603857 2653254 2045775 848818 976143 2022130
38961 2022130 2202528 1578202 1641096 2115828 1000507 -1944070 -4233758 -3915088 -1891419
38952 -1891419 -256479 140584 -302568 -1096886 -1950656 -2645789 -3171360 -3497785 -3169123
38943 -3169123 -1855875 -285994 327408 -77509 -312923 242400 701045 123364 -831172
38934 -831172 -607720 1044532 2408046 1779034 -287818 -1499336 -692156 753127 969635
38925 969635 63129 -678175 -1090565 -1787366 -2114581 -951650 448810 -599011 -3571870
38916c571870o08301L859011M586937P06560k397737j410203M35372m85791k226058
38907a112080j127098J792920K616717P20028r19098o70634J09289J52588m6565
38898A516067J21907L30056K20193j77610q90895j650433j549608k58242J122445
38889a216120J591867J615473J666941Q46550j203789k481885j171845J106944
38881G54136J383102o8232k89257J403456K300551P29373j389482j620653k58755
38872B944239Q68637R09227k1559j627746k847931k058264O32524K615737J888907
38863C303771j76673q21848K90031J118167N19745n54372j106851j368573j516125
38854c12728q36408Q18606J994344J328723m35472j384708r42176j60961K27812
$$ plain form
38916 -3571870 -4180171 -321160 4265777 4972337 2574600 1164397 1599769 1113978 -1112080
38907 -1112080 -2239178 -446258 2170459 2890487 1971389 1300755 1410044 1562632 1516067
38898 1516067 1637974 1968030 2188223 2010613 1119718 -530715 -2080323 -2338565 -1216120
38889 -1216120 375747 1991220 3658161 4504711 3300922 819037 -352808 754136
38881 754136 2137238 2069006 1779749 3183205 5483756 6213129 4823647 3202994 2944239
38872 2944239 3812876 4722103 4700544 3072798 224867 -1833397 -1200873 1414864 3303771
38863 3303771 3127098 2305250 2595281 3713448 4233193 3678821 2571970 1203397 -312728
38854 -312728 -1149136 -330530 1663814 2992537 2557065 1172357 230181 69220 297032
38845B97032N41272P64153J07875j291015j743878l47884J237465R45419o32739
38836a22300j199601k50386M94618J18741k43588K97965R08229P76399N56623
38827A336700Q48989P53071o02111k175980k199901o70168O26493L72270q27726
38818b538363j189608K87523K381607K576260K65426j743581o68404K000892K355745
38809C727497l9486j583303o16202N4349j547405k798733j095567J290931R39601
38800a668318r26001q42561Q10839J007574p4585M24562K301542K314966P8939
38791C426957j182686m35818l59469j886294k191910K3974J926171J532790R45451
38782A799166J883513K139626k32239k829293k630516p97697j13787l23372K23228
$$ plain form
38845 297032 838304 1602457 1710332 419317 -1324561 -1672445 -434980 510439 -122300
38836 -122300 -1321901 -1572287 -1077669 -958928 -1202516 -904551 3678 780077 1336700
38827 1336700 2185689 2938760 2336649 160669 -2039232 -2709400 -2082907 -1710637 -2538363
38818 -2538363 -3727971 -3440448 -1058841 1517419 1782845 39264 -629140 1371752 3727497
38809 3727497 3688011 2104708 1488506 1542855 -4550 -2803283 -3898850 -2607919 -1668318
38800 -1668318 -2594319 -3436880 -2626041 -1618467 -1693052 -1268490 1033052 3348018 3426957
38791 3426957 2244271 1808453 1448984 -437310 -2629220 -2605246 -679075 853715 1799166
38782 1799166 3682679 5822305 5590066 2760773 130257 -667440 -781227 -1104599 -881371
38773h81371P03202m14469j702239r00004Q47344Q31705m72033n03277O45145
38764a845997P28856j58739J47290J410585J016342j289516k630629j534952L34666
38755c822094J529049K370183K569387R63206j426027j695434K95001J102245
38747A885516r03052k781151j706826P88095J750323J250854J080929J144811
38739B509499J47196j469329k001511j152972r9008M73001O75879M78747n5920
38730d94418k91916J2846R8583m42115q13652m79675j29068j96210j2205M92836
38720b254994J55116j012827r69579R97529K372763J219311l87814K86267J886527
38711B292299J233356j122591j794906l63036J66196j015934r06855J866722L944232
$$ plain form
38773 -881371 -178169 -592638 -2294877 -3194881 -2347537 -1515832 -1987865 -2491142 -1845997
38764 -1845997 -1117141 -1275880 -1128590 281995 1298337 8821 -2621808 -4156760 -3822094
38755 -3822094 -2293045 77138 2646525 3609731 2183704 488270 783271 1885516
38747 1885516 982464 -1798687 -3505513 -2717418 -967095 283759 1364688 2509499
38739 2509499 2656695 1187366 -814145 -1967117 -2066125 -1593124 -917245 -438498 -494418
38730 -494418 -786334 -773488 -674905 -1117020 -1930672 -2410347 -2539415 -2735625 -2747830 -2254994
38720 -2254994 -2099878 -3112705 -4082284 -3084755 -711992 507319 119505 405772 2292299
38711 2292299 3525655 2403064 608158 245122 411318 -604616 -1511471 355251 4299483
38702D299483J999002k197842m189934k599443j5681R34433L17824p3141Q66748
38693f58551K182469J737467r63182l214671k010501J537220L009544O62471j948085
38684C34181r97745K198834L323173J155352j355277j661476m62794M28946O90947
38675C654141Q36968O02930n26808j912706k228675j270095l11698l78196q65024
38666b399163n00485O89749J324804P44283R4795N52363J322871P62448q95836
38657A695829j580954l77089J108345J099903N2233l76349K13630P86155O43273
38648C264976J52351j93182m49351q08902j162477j259941r67016l34621L33812
38639a424351N86349K94085p2647M6972N66134Q66340P33641P96253J590203K330249
$$ plain form
38702 4299483 6298485 4100643 -89291 -2688734 -2704415 -1769982 -1452158 -1525299 -658551
38693 -658551 1523918 3261385 2298203 -916468 -2926969 -1389749 1619795 2282266 334181
38684 334181 -663564 1535270 4858443 6013795 4658518 2997042 2534248 2963194 3654141
38675 3654141 4491109 5094039 4567231 2654525 425850 -844245 -1155943 -1534139 -2399163
38666 -2399163 -2899648 -2209899 -885095 -140812 -46017 506346 1829217 2591665 1695829
38657 1695829 114875 -262214 846131 1946034 1998267 1621918 1835548 2621703 3264976
38648 3264976 3417327 3224145 2774794 1965892 803415 -456526 -1423542 -1758163 -1424351
38639 -1424351 -838002 -543917 -616564 -569592 -3458 862882 1596523 2392776 3982979 6313228
38629F313228J438085j171562l127800k188701N31939J623712p4397j931232j431141
38620a7869L98262J110596N95010M09359O56017K01745o72401n57032L93514O13416
38610C130617j12047n00981k97659l99187n88412J08215R36006L59643o44163
38601A992032J43440J592634K96037l101322l679974n2910K874913J697725k58194
38592A504381O23944J759355l98757l064128j574799K012486J949770j410911
38584A401341k283251O59706K501467Q62280p26229k0876J18709j994104k812862
38575b293819L57044M043231L620804L8126k430825k223960o52251J305923K787747
38566D552020J968161j253647l471686k026422Q34403J339001j77764o20508N36567
$$ plain form
38629 6313228 7751313 6579751 3451951 1263250 1795189 3418901 3344504 1413272 -17869
38620 -17869 380393 1490989 2085999 2495358 3151375 3353120 2680719 2123687 2517201 3130617
38610 3130617 3018570 2517589 2219930 1820743 1232331 1340546 2276552 2636195 1992032
38601 1992032 2135472 3728106 4024143 922821 -2757153 -2810063 64850 1762575 1504381
38592 1504381 2128325 3887680 3488923 424795 -1150004 862482 2812252 1401341
38584 1401341 -881910 -222204 2279263 3141543 2415314 2394438 2513147 519043 -2293819
38575 -2293819 -1936775 2106456 5727260 5765386 3334561 1110601 458350 1764273 4552020
38566 4552020 6520181 5266534 1794848 -231574 602829 1941830 1764066 1143558 1680125
38557A680125J159630O11751J48262j84476j316292k203338q41752J773618K371416
38548C198944M73993q17118R9387R45910k97773j962075j463223O87463J836504
38539B702012Q51019r59077j788823r46412Q45548J949847J342276J00243K74114
38530D370747J799939K054052m93622l616125l904241j147840J586400J967410
38522B616720P92773O8721K05150J70148l50359l83274N26652J130365Q1279j835972
38512C022203k401431r56164O21828M97466p61593j343803p41324P8320M04037
38503a580461L71067J45571k35276l21622L49881J327222J623192R43328k49606
38494B373296j550414k493485k075175J66146K674791L028896R29231j254226
$$ plain form
38557 1680125 2839755 3451506 3599768 3415292 2099000 -104338 -946090 827528 3198944
38548 3198944 3672937 2855819 2955206 3901116 3603343 1641268 178045 865508 2702012
38539 2702012 3553031 2593954 805131 -141281 704267 2654114 3996390 4096633 4370747
38530 4370747 6170686 8224738 7731116 4114991 210750 -937090 649310 2616720
38522 2616720 3409493 3478214 3683364 3853512 3503153 3119879 3646531 4776896 4858175 3022203
38512 3022203 620772 -335392 286436 783902 22309 -1321494 -2062818 -1984498 -1580461
38503 -1580461 -1209394 -1063823 -1299099 -1620721 -1270840 56382 1679574 2622902 2373296
38494 2373296 822882 -1670603 -3745778 -3579632 -904841 2124055 3053286 1799060
38486A799060j414612n5131Q81013M99955n24765j224163j247981p26627J47676
38477a865575J211375K049760J853889J76022j943662k517951j037742N60023
38469a513861M91511k60117L72075J989816K175476L98817j011502l80637J126168
38460C387746J736741J296776J33405j982296m095264l604075Q4761L317013K480540
38451B755347q15260k066159m67433O00382l88310q06858J067305K634528J207564
38442C721106j340610j472423M61114J189938k5629p04777K07255O99733m73144
38433B262563j581541j007979J56250L68348J62184M50339M44085m33515n62978
38424B57756J134709K224235K1490l288803k912969J291913M136911K602047k26091
$$ plain form
38486 1799060 384448 329317 1210330 1710285 1185520 -38643 -1286624 -2013251 -1865575
38477 -1865575 -654200 1395560 3249449 3425471 1481809 -1036142 -2073884 -1513861
38469 -1513861 -1022350 -1282467 -910392 1079424 3254900 3653717 2642215 2261578 3387746
38460 3387746 5124487 6421263 6554668 4572372 477108 -3126967 -3042206 274807 2755347
38451 2755347 1940087 -126072 -593505 6877 -381433 -1188291 -120986 2513542 3721106
38442 3721106 2380496 908073 1369187 2559125 2533496 1828719 2035974 2735707 2262563
38433 2262563 681022 -326957 -170707 197641 359825 810164 1254249 820734 257756
38424 257756 1392465 3616700 3638190 349387 -2563582 -1271669 2865242 5467289 5241198
38415E241198o57945J43213o82500k251328j656291P35148J825623Q40967J1328
38406C549413L72322N25405l9607J25474J216035J101685j026643k711007j836089
38397A276988J07316N20906m12823p23929r7211K86791M26413J229725J881492
38388D495668L66550k851268m293757j910802J886339L232124J458569r41308
38380A442115j887537j268724L59359K268989K781028M99387k916948l592166
38372b314497m60669K708586K309117j25284p70866L54685O0262j852104j812771
38363a903541J153649K985792R55643j647674q08589J586879J019096j980773
38355A360482k684562M9786K134850R84186q73425m40910J460101K511093K231035
$$ plain form
38415 5241198 4583253 4726466 4043966 1792638 136347 871495 2697118 3538085 3549413
38406 3549413 3921735 4447140 4407533 4533007 5749042 6850727 5824084 3113077 1276988
38397 1276988 1384304 1905210 1492387 768458 671247 958038 1384451 2614176 4495668
38388 4495668 4862218 2010950 -2282807 -4193609 -2307270 924854 2383423 1442115
38380 1442115 -445422 -1714146 -1354787 914202 3695230 4194617 1277669 -2314497
38372 -2314497 -2775166 -66580 2242537 2117253 1346387 1701072 1761334 -90770 -1903541
38363 -1903541 -749892 2235900 3191543 1543869 735280 2322159 3341255 1360482
38355 1360482 -1324080 -1274294 860556 1844742 971317 530407 1990508 4501601 6732636
38346F732636R78933j412623l834365l481235K28773L558867K898067m83416k604533
38337B581104k047762n01854N18279P84406K32954p08969n38644J204038K229013
38328C752565M82963k141740k090241M64538J834464M51755j100764n21870Q29563
38319A961233N79566r29237j483134k85804J255979J486269K19661j217983j267188
38310C19362K40261J793052J964512R94977l0120p00930r24730j94345J200751
38301D662790J444503k65290j710893p96245O27954m65490k746151k216349Q35658
38292f29513J818728l29839j003004K036041M174789J480846k315567j707281
38284C525200J582388J737001j474447k897745r28356M59441q86395k023416o24040
$$ plain form
38346 6732636 7711569 6298946 2464581 -1016654 -787881 2770986 5669053 5185637 2581104
38337 2581104 533342 31488 549767 1334173 1567127 858158 319514 1523552 3752565
38328 3752565 4235528 2093788 3547 468085 2302549 2754304 1653540 1131670 1961233
38319 1961233 2540799 1611562 128428 -157376 1098603 2584872 2804533 1586550 319362
38310 319362 559623 2352675 4317187 5312164 5282044 4581114 3656384 3462039 4662790
38301 4662790 6107293 5842003 4131110 3334865 3962819 3497329 751178 -1465171 -629513
38292 -629513 1189215 859376 -143628 1892413 6067202 7548048 5232481 3525200
38284 3525200 5107588 6844589 5370142 2472397 1544041 2003482 1117087 -906329 -1530369
38275a530369J330502J667236J311300J230304K35782j721524j940706N78073
38267A160598K586128J463514o18194o32674L26377k34573j236325j34862J898851
38258D578840J514335j079533k352610j130615J53072Q6026J41524J094553J227626
38249D233218m38627k041981j645057Q0501J339842J530973Q74823n02021j855672
38240A575999j730780J01315J733153J286385p94050k370040j885711L40123K405690
38231F62084K413431N59114q00390k41363N39188n16328k039090j165966J386728
38222G97408J988201J05178o16801J356709K470847R252k983427k430550K57273
38213I54090Q27673q07641j093810P12106J633475N94151J51089J536099K291557
$$ plain form
38275 -1530369 -199867 1467369 2778669 4008973 4244755 2523231 582525 1160598
38267 1160598 3746726 5210240 4592046 3959372 4285749 4051176 2814851 2679989 4578840
38258 4578840 6093175 5013642 2661032 1530417 1683489 1769515 1911039 3005592 4233218
38249 4233218 3794591 1752610 107553 188054 1527896 3058869 3933692 3431671 1575999
38240 1575999 -154781 -53466 1679687 2966072 2172022 -198018 -2083729 -1743606 662084
38231 662084 3075515 3634629 2834239 2592876 3132064 2615736 576646 -589320 797408
38222 797408 2785609 2890787 2273986 3630695 6101542 6110794 3127367 696817 954090
38213 954090 1781763 974122 -119688 592418 2225893 2820044 2971133 4507232 6798789
38204F798789P61546p62898J9845J285531N3383k638232k986230j47871K492551
38195D876414K107493j09698j262225o29790K54682L19884K3362j23800n22895
38186D933427j366508j682583o11194R46529J285453L84423r648Q85034J570769
38177F335702N68798j252697j949001j208847l09599J26791P36539J765760K238831
38168G052277J295196m19718j226220j51287J826066K408761M68025k137041k402676
38159F713383j87921J246327k95014k723091k733501n86334O81055o9491j036777
38150A008636r35936n98840o26784j32803J127496J644006N17406q69041r16659
38141B17481m7537M58048N06482O91066R01557P99407O88529O35861k33625k131315
$$ plain form
38204 6798789 7560335 6797437 6817282 8102813 8156196 5517964 2531734 2383863 4876414
38195 4876414 6983907 6874209 5611984 4982194 5236876 5556760 5580122 5456322 4933427
38186 4933427 3566919 1884336 1273142 2219671 3505124 3889547 3879899 4764933 6335702
38177 6335702 6904500 5651803 3702802 2493955 2184356 2311147 3047686 4813446 7052277
38168 7052277 8347473 7927755 6701535 6550248 8376314 10785075 11253100 9116059 6713383
38159 6713383 6525462 7771789 7476775 4753684 2020183 1433849 2114904 2045413 1008636
38150 1008636 72700 -526140 -1152924 -1285727 -158231 1485775 2003181 1134140 217481
38141 217481 169944 627992 1134474 1825540 2727097 3526504 4215033 4850894 4617269 2485954
38131B485954l272515j877643J057538K696994J846559j4301j070355j036185
38123H16046n41669m1280K16422J36753J07714O05755J254855J141944L02002
38114C998542j31976K64271L19072r34465k434984k337218o69722O76985O72511
38105e76984L65980Q14887J256833N84399m46687k54287P95931O81205r74174
38096B247103j886793l59059K054075K491165M07147k041931k581320p61968J970936
38087A539355L222925J541123j626220k905555j111227R21228K42874j898076
38079g3573k033244K90475K198933K022737R81923J40566j020588k120317j283134
38070h96222J313029K312741o4872k696895j847449J210765K249276N02306p91314
$$ plain form
38131 2485954 -786561 -2664204 -1606666 1090328 2936887 2922586 1852231 816046
38123 816046 274377 233097 449519 586272 693986 1299741 2554596 3696540 3998542
38114 3998542 3866566 4130837 4449909 3515444 1080460 -1256758 -1926480 -1249495 -576984
38105 -576984 -211004 603883 1860716 2445115 1998428 1744141 2540072 3221277 2247103
38096 2247103 360310 1251 2055326 4546491 4953638 2911707 330387 -431581 1539355
38087 1539355 4762280 6303403 4677183 1771628 660401 1581629 1824503 -73573
38079 -73573 -2106817 -1816342 382591 2405328 3387251 3527817 2507229 386912 -896222
38070 -896222 416807 2729548 2664676 -32219 -1879668 -668903 1580373 2082679 1291365
38061A291365o8581L00541j392017k771970r63254K595363L802250J475447j440414
38052B828730k223989j395468o28799L5733J181145J833624O50300j363290j778929
38043h60943m26889L19015n02008q40961O64555K008568J074271o36205n25721
38034B73682M81841m51474k623517k177581J517543L975177J876365k069888l066989
38025b264841o56970J587620J352730j64525p46303K72223J850593K275865N80408
38016D086800k100134l182468j594065P72934J624514J176728J004693J032732
38008B821734j76622k408877l270626j290556J945887L606665K690173N54023
38000D471801j079445j808112k172440k200773j112923J204404L129045K780088
$$ plain form
38061 1291365 1222784 1523325 131308 -2640662 -3603916 -1008553 2793697 4269144 2828730
38052 2828730 604741 -790727 -1419526 -1383793 -202648 1630976 2281276 917986 -860943
38043 -860943 -1287832 -968817 -1470825 -2311786 -1647231 361337 1435608 799403 273682
38034 273682 755523 304049 -2319468 -4497049 -2979506 995671 2872036 802148 -2264841
38025 -2264841 -2921811 -1334191 18539 -145986 -892289 -620066 1230527 3506392 4086800
38016 4086800 1986666 -1195802 -2789867 -2016933 -392419 784309 1789002 2821734
38008 2821734 2645112 236235 -3034391 -4324947 -2379060 1227605 3917778 4471801
38000 4471801 3392356 1584244 -588196 -2788969 -3901892 -2697488 431557 3211645
37992C211645M85383j365106j215203j6360M61469r7752p49164q63850n34081
37983f83019O4775P77333J159579Q24508Q9709k17719K54820P78846J93351j539517
37973A702666k670178j494140J005272J812585k6619j737684q23959J122341J142191
37964C2475j63675P6597J680518J556500o97432j756742k64193P66682p18514
37955E12216k094603n61697J967482J925527l94318j815245j041948O26707J887457
37946A011578K001963L10176k206351k594431J13146K528256J528263q52028q12366
37937A028206R18410O86977j487082j999919j20298P51732q93742k082126m26202
37928c624044K137367K708169J363748k46460j542121k276177j514844O13141
$$ plain form
37992 3211645 3697028 2331922 1116719 1100359 1561828 1464076 714912 -148938 -683019
37983 -683019 -618244 159089 1318668 2143176 2232885 2015166 2269986 3048832 3242183 1702666
37973 1702666 -967512 -2461652 -1456380 356205 329586 -1408098 -2232057 -1109716 32475
37964 32475 -131200 -54603 1625915 3182415 2484983 728241 464048 1230730 512216
37955 512216 -1582387 -2144084 -176602 1748925 1354607 -460638 -1502586 -875879 1011578
37946 1011578 3013541 3323717 1117366 -1477065 -1363919 1164337 2692600 1840572 1028206
37937 1028206 1946616 2633593 1146511 -853408 -973706 -221974 -1115716 -3197842 -3624044
37928 -3624044 -1486677 1221492 2585240 2338780 796659 -1479518 -2994362 -2381221
37920b381221J982160J082703r09740k017532j816247p32927J132723L007997
37912f52084L061597Q09728j484166j576167k33593L00037k21871j55384R66591
37903H14688J584185O44783o22415l78655J155420J808593L60347j597009j651205
37894B118732J0521P87819l93453j334504j06307J572941Q47458j666451k684253
37885h47497j181608N17384P50404N86560J050356J079328k43141j573581j175474
37876a037269N31459J794309J833576J108706K13747m05468l58218K07958N72718
37867D461518L43811k08345p88371j157395o88923Q98095K404954K216251N56771
37858H038366q38219j291164j656735k221866k198052j533976j062601n74832
$$ plain form
37920 -2381221 -399061 683642 -226098 -2243630 -4059877 -4792804 -3660081 -652084
37912 -652084 2409513 3219241 1735075 158908 -74685 225352 3481 -151903 814688
37903 814688 2398873 3043656 2421241 2042586 3198006 5006599 5366946 3769937 2118732
37894 2118732 2129253 2917072 2523619 1189115 1082808 2655749 3503207 1836756 -847497
37885 -847497 -2029105 -1511721 -761317 -174757 875599 1954927 1711786 138205 -1037269
37876 -1037269 -505810 1288499 3122075 4230781 4444528 4039060 3680842 3888800 4461518
37867 4461518 4805329 4596984 3808613 2651218 1962295 2860390 5265344 7481595 8038366
37858 8038366 7200147 5908983 4252248 2030382 -167670 -1701646 -2764247 -3339079
37850c339079Q08681K016526Q05317j961825k242602J184098L990851K249846
37842C511813j802135l293825j662328j24143J76266R95064K436821K138388k23524
37833B152397j631725m88601P73167m5570j054878M07822K810245K376743q94292
37824D405308k855971j232339J289005J368130l02717q77592m9131J9323j258311
37815E05705j853629n05108J308760J697193P70945k68566q06430n76569O12210
37806H84511J798264J225180r02297j834839j13393J880257J344912p31529j442182
37797B108884n73611k17535p41736n85459K84188K18092o31731j30833J845912
37788A576171K546283O54807j485554j481122j55031M62909J94887j5200n4687
$$ plain form
37850 -3339079 -2530398 -513872 291445 -1670380 -3912982 -2728884 1261967 3511813
37842 3511813 1709678 -1584147 -3246475 -3370618 -3194352 -2199288 237533 2375921 2152397
37833 2152397 520672 32071 805238 759668 -295210 112612 2922857 5299600 4405308
37824 4405308 1549337 316998 1606003 2974133 2671416 1793824 1744693 1764016 505705
37815 505705 -1347924 -1853032 -544272 1152921 1923866 1655300 848870 272301 884511
37806 884511 2682775 3907955 3005658 1170819 1057426 2937683 4282595 3551066 2108884
37797 2108884 1535273 1317738 576002 -9457 274731 492823 -138908 -269741 1576171
37788 1576171 4122454 4777261 3291707 1810585 1655554 2118463 2313350 2298150 2243463
37779B243463j25440J98641Q05712L58813j614221l193042k343934J22019J504277
37770b043712P33364m35963J33939K127484K921450Q21299k237363k594393J24607
37761d49288K030687N58226j437696j69888K625307K118748j728227l816244j755546
37752b023921J059323J506770Q84725Q89247K41685j662939k047227N62890K546027
37743A956580L27472l471831l559535K13542L032275K113594n49712k027784j474489
37734c439888N85753K890689L302926P53371k513155k966613k40872K462208K559292
37725C393711Q47205k33229L24155J245293O58849j464999k802887j520811Q12169
37716A259456J141123l96242o55209J102847J645222p12359k784780j480394J222527
$$ plain form
37779 2243463 2118023 2316664 3122376 3481189 1866968 -1326074 -3670008 -3547989 -2043712
37770 -2043712 -1310348 -1746311 -1612372 515112 3436562 4257861 2020498 -573895 -449288
37761 -449288 1581399 2139625 701929 532041 3157348 5276096 3547869 -268375 -2023921
37752 -2023921 -964598 542172 1426897 2316144 2557829 894890 -1152337 -589447 1956580
37743 1956580 2284052 -1187779 -4747314 -4533772 -1501497 612097 62385 -1965399 -3439888
37734 -3439888 -2854135 36554 3339480 4092851 1579696 -1386917 -1627789 834419 3393711
37725 3393711 4240916 4007687 4331842 5577135 6235984 4770985 1968098 447287 1259456
37716 1259456 2400579 2004337 1349128 2451975 4097197 3384838 600058 -880336 342191
37707C42191J672575J49334o71907n05949o88175n74461J019578K282279P43373
37698C768838j891647j783607P25495J474267p77245k531384j294476R80307J594018
37689B64566Q48316M10140N01586L59007j95148p44144p34069K73389J683949
37680B667592J753134n8909j537509n70544J477379J746962K50146o65435m53215
37671D609601p30029j830815k217469j347536k28811Q37599K277252L228965K367337
37662F966094M35090q69261j848252l467556m080450j536443K106681K624661
37654C30564K95347m18449J705956K824421Q61221j157992p25439J96132l71910
37645C539851n69209J329938K981708J722229q84998j918027j835243k638623
$$ plain form
37707 342191 2014766 2164100 1492193 986244 298069 -276392 743186 3025465 3768838
37698 3768838 1877191 93584 819079 2293346 1516101 -1015283 -2309759 -1329452 264566
37689 264566 1112882 1523022 2024608 2383615 2188467 1444323 710254 983643 2667592
37680 2667592 4420726 4361817 2824308 2253764 3731143 5478105 5728251 5062816 4609601
37671 4609601 3879572 2048757 -168712 -1516248 -1745059 -907460 1369792 4598757 6966094
37662 6966094 7401184 6531923 4683671 1216115 -2864335 -4400778 -2294097 330564
37654 330564 625911 207462 1913418 4737839 5599060 4441068 3715629 3911761 3539851
37645 3539851 2970642 4300580 7282288 9004517 8119519 6201492 4366249 1727626
37637A727626l510366k114574J107748L298599L000584J092676j053199k201408
37629A347686j355682O96818J397554q8923j187717J72216K056125J576391n23638
37620D090830j435122q47282n92767q57621k35196R89339R86701k36783o69696
37611A192403K68026R13754M15826o976M27291O20995l26246j453556j469195
37602E82322n83035J94623N32290O43450M91286L4557k11170L10526J209848J299842
37592D504539O365j632196j888390m50381R67633O99405p16918j381908o11583
37583e03434N63617J215177J307163O77198r96337k769701k726751n40845J684970
37574b088943K021816R09157o3187k85040r9069K17078M45183K60476j79048k77687
$$ plain form
37637 1727626 -1782740 -3897314 -2789566 509033 3509617 4602293 3549094 1347686
37629 1347686 -7996 688822 2086376 1997453 809736 981952 3038077 4614468 4090830
37620 4090830 2655708 1808426 1215659 358038 122842 1112181 2098882 1862099 1192403
37611 1192403 1460429 2374183 2790009 2783033 3210324 3831319 3505073 2051517 582322
37602 582322 -713 193910 726200 1369650 1860936 1895493 1684323 1994849 3204697 4504539
37592 4504539 4510904 2878708 990318 539937 1507570 2206975 1490057 108149 -503434
37583 -503434 60183 1275360 2582523 3259721 2263384 -506317 -3233068 -3773913 -2088943
37574 -2088943 -67127 842030 778843 493803 394734 611812 1056995 1317471 1138423 860736
37564H60736o7742j96425n26832j01447J019090J378243L11242q86442p98593
37555I91830L33708J392166J743968J209780j14991j444149j812306j270082m41547
37546E88377Q06783K518622K998619O31787k768617l568746j636822n83740j838106
37537b851843k365448k0227K669327K639994Q95203P891j07726p43632j177237
37528a053698k13116J046981J072457O59179R17667O55944j084881k166156o33508
37519g99131J279746M45703j763855j764182J65721Q78876K44577Q39717K319489
37510A846661J581690j192872k153756m36715J77731j968320l178613o57161K592684
37501c388671K627733O61236L59180J710725J752501j03080j392463q03032J82591
$$ plain form
37564 860736 792994 596569 69737 -31710 987380 2365623 2676865 1790423 991830
37555 991830 1325538 2717704 4461672 5671452 5556461 4112312 2300006 1029924 588377
37546 588377 1395160 3913782 6912401 7544188 4775571 1206825 -429997 -1013737 -2851843
37537 -2851843 -5217291 -5237518 -2568191 71803 967006 974897 867171 123539 -1053698
37528 -1053698 -1266814 -219833 852624 1511803 2429470 3085414 2000533 -165623 -799131
37519 -799131 480615 926318 -837537 -2601719 -2435998 -1557122 -1312545 -472828 1846661
37510 1846661 3428351 2235479 81723 -354992 -177261 -2145581 -5324194 -5981355 -3388671
37501 -3388671 -760938 -99702 259478 1970203 3722704 3619624 2227161 1424129 1606720
37492A606720N2958p13285q76758j21659R00638J328847Q14747m9536l86133l72362
37482B184177j020716k184860k124200p5187J983602J650948n44252j727644m18116
37473b276248J768161K395277J063798o23065j329058j354290j581569j767741
37465c704735q49414J041069K128842J359118R0509R8072P92114K85061j261528
37456b0892j648716j99017J060678O73064L8220Q81528K138638J454029j065489
37447C312043k701670j677110P85053K226741J534667n94636k652181l177033
37439b944126j522444J309437L018308K163151l4775r04864M46427K019127J579839
37430E130080m43226j751520j275621j46325K51644k20670j041896j730186j628962
$$ plain form
37492 1606720 1659678 946393 69635 -52024 848614 2177461 2992208 2942672 2556539 2184177
37482 2184177 1163461 -1021399 -3145599 -3220786 -1237184 413764 -130488 -1858132 -2276248
37473 -2276248 -508087 1887190 2950988 2327923 998865 -355425 -1936994 -3704735
37465 -3704735 -4554149 -3513080 -1384238 -25120 65389 163461 955575 1240636 -20892
37456 -20892 -1669608 -1868625 -807947 -134883 -96663 784865 2923503 4377532 3312043
37447 3312043 610373 -1066737 -281684 1945057 3479724 2885088 232907 -2944126
37439 -2944126 -4466570 -3157133 -138825 2024326 1989551 1084687 1531114 3550241 5130080
37430 5130080 4686854 2935334 1659713 1513388 1765032 1544362 502466 -1227720 -2856682
37421b856682l43459J191593J447684N06805l2734K48007M9057p26960j08065
37412f24754K242187L143279M42955k785506k196749J101879K037822n44361k119341
37403F97411K49731L204843K303792j265549k746703q86863Q45785p7236j801179
37394E24032j448890N91193J723028J107339K62576O3392m66881j719685k073699
37385a437595m76404J286512J109733P0296O26645K118601J533111j174612k375085
37376A281202m63027J535834R77260l90192p9264Q04243K46277n45196L59294
37367C726431J314830k83418k774631k341406O12478J999277O69214k88131P61205
37358C395849J595579M72928j197346j838803j829035j391403K81577K502350
$$ plain form
37421 -2856682 -3200141 -2008548 -560864 -54059 -86793 161214 210271 -516689 -624754
37412 -624754 1617433 4760712 5203667 2418161 221412 1323291 3361113 2816752 697411
37403 697411 947142 4151985 6455777 5190228 2443525 1556662 2402447 2325211 524032
37394 524032 -924858 -333665 1389363 2496702 2759278 2822670 2355789 636104 -1437595
37385 -1437595 -1913999 -627487 482246 552542 1179187 3297788 4830899 3656287 1281202
37376 1281202 818175 2354009 3331269 2941077 2861813 3666056 3912333 3367137 3726431
37367 3726431 5041261 4757843 1983212 -358194 254284 2253561 2922775 2634644 3395849
37358 3395849 4991428 5464356 4267010 2428207 599172 -792231 -510654 1991696
37350A991696K831209O72332j658087k381572j918967o31517J609061L031625
37342C545780J252881k030718k127736J347190L128156N09786k259859j131121
37334B234359J244516O75599j302797p75883J348630J465435J95969R27219K849688
37325H862735J894058j672879k902097k26968J976560O18157j583049j343538
37317E622979p3328n89693j975819j433646P81357J798806O16324p59115n61940
37308C425925M71177N45553o56030j518843n10490J564869K083786J6554k208281
37299C214220j789765L58394R24388p29186j680691j63321J799768J875115R02279
37290D711201Q53864J425488J134330L14927L07841N43014p35778l016211l529283
$$ plain form
37350 1991696 4822905 5495237 3837150 1455578 -463389 -1094906 514155 3545780
37342 3545780 4798661 2767943 640207 1987397 5115553 5625339 3365480 2234359
37334 2234359 3478875 4154474 2851677 2075794 3424424 4889859 5085828 6013047 8862735
37325 8862735 10756793 9083914 6181817 5954849 7931409 8549566 6966517 5622979
37317 5622979 5549651 4959958 2984139 1550493 2331850 4130656 4746980 3987865 3425925
37308 3425925 3897102 4442655 3786625 2267782 1757292 3322161 5405947 5422501 3214220
37299 3214220 1424455 1782849 2707237 1978051 297360 134039 1933807 3808922 4711201
37290 4711201 5565065 6990553 8124883 8439810 8747651 9290665 8554887 5538676 2009393
37281B009393j273298J267623J438195l07012j585719j167655L64874J926494
37273B672895K543437J481261p92382k275739j485918M72950J307036O90137K96723
37264D910400P36547O07451p52536j752459j129531j27790k57472n21126P50068
37255B463552K475467K056265m55874k267511j916552o40599N39432K022310L181268
37246G457758K030995j072203k470098k03631K661214K384441p4339j183658m54470
37237I076009k12062q84294n57679R10185J228459k43595j254292o09410j63060
37228G290261j304226k340599j425298L12567R08677Q72489J702159K552790J435491
37219A0004311q50298j097002J559198L897053K829992m60879k180778p50857
$$ plain form
37281 2009393 736095 2003718 3441913 3134901 1549182 381527 746401 2672895
37273 2672895 5216332 6697593 5905211 3629472 2143554 2616504 3923540 4613677 4910400
37264 4910400 5646947 6254398 5501862 3749403 2619872 2492082 2234610 1713484 2463552
37255 2463552 4939019 6995284 6539410 4271899 2355347 1714748 2254180 4276490 7457758
37246 7457758 9488753 8416550 5946452 5742821 8404035 10788476 10714137 9530479 9076009
37237 9076009 8863947 7979653 7421974 8332159 9560618 9317023 8062731 7453321 7290261
37228 7290261 5986035 3645436 2220138 2532705 3441382 4313871 6016030 8568820 10004311
37219 10004311 9154013 8057011 9616209 13513262 16343254 15882375 13701597 12950740
37211A2950740J565281J720438n78901k794910k515425L8450K562484L357629
37203A6305786K825296K138004J369311Q298j151281l36417K438967M442082L419408
37194C1459454Q44784K25124K393020M449306L954747K275643K296895M133965
37186E2032938N221347M297832L138258L778017N751279P164900P331036P009155
37178I5724762O671481N918705M582075L276365K487072J797035N04510j301419
37170A19660586k758144l363734l733319m807397o331665o786944n364781l480076
37162H3034526l312573m951107o169816n390227l709338l192320m075560m821725
37154D7411860m469774l624925l050561k460472j334047k44128m48434k077648
$$ plain form
37211 12950740 14516021 16236459 15657558 12862648 10347223 10385673 12948157 16305786
37203 16305786 19131082 21269086 22638397 22646695 21495414 21158997 23597964 28040046 31459454
37194 31459454 32304238 32529362 34922382 39371688 43326435 45602078 47898973 52032938
37186 52032938 57254285 61552117 64690375 68468392 74219671 81384571 88715607 95724762
37178 95724762 102396243 108314948 112897023 116173388 118660460 120457495 120962005 119660586
37170 119660586 116902442 113538708 109805389 104997992 98666327 91879383 86514602 83034526
37162 83034526 79721953 74770846 68601030 63210803 59501465 56309145 52233585 47411860
37154 47411860 42942086 39317161 36266600 33806128 32472081 32227953 31779519 29701871
37146B9701871l397765k515870K24494K233054J482386j175063l154492l183520
37138B0215095k223359j513945r66226P3907J464047K353019K095667P25829r13001
37129B1311033j429657k32185J242946R68827o36000q56442J219496K804418J471817
37120B5864253p51867k17232K549612L500648J575936O45201L427586O957163
37112D3551300O909537M017330K709768M615453P015286P492724O648338N670917
37104H8630653M456351L300828L487877M518274L528136l21132l459906k807401
37096A01333680q11255j922199n624733p354969n737426m137175m586423n084893
37088F6074607m415610m733384o737827o893131l235572L2601j496199m997311
$$ plain form
37146 29701871 26304106 23788236 24012730 26245784 27728170 26553107 23398615 20215095
37138 20215095 17991736 16477791 15511565 15585472 17049519 19402538 21498205 22224034 21311033
37129 21311033 19881376 19649191 20892137 21860964 21224964 20368522 21588018 24392436 25864253
37120 25864253 25112386 24895154 27444766 30945414 32521350 33166551 36594137 43551300
37112 43551300 50460837 54478167 57187935 61803388 68818674 76311398 82959736 88630653
37104 88630653 93087004 96387832 99875709 104393983 107922119 107600987 104141081 101333680
37096 101333680 100522425 98600226 92975493 85620524 79883098 75745923 71159500 66074607
37088 66074607 61658997 56925613 50187786 43294655 40059083 40091684 38595485 33598174
37080C3598174m476221k32910J830069l95576k797986k557901j953664k832353
37072B0181632k891966m72487J551413K77101k343507k781038j289949m04645
37064A1826554m36057j30837P1694q55718j626167n18694R75084J50809k037295
37055G419373k091206K08860J216512o35406k241344q86920J390766J106340j148303
37046D338672j513295J427383M397741L611775l10651k925059j261426K631672
37038A0396812M273591K224510o16226j343378o57548q24565j762717j522864
37030A0167615N9635Q53171r0618q96462J46103J686289J121680j507824l285930
37021H253659k258162Q810O63784n67119j314440k51984J023081O87868m55004
$$ plain form
37080 33598174 29121953 28889043 30719112 30323536 27525550 24967649 23013985 20181632
37072 20181632 17289666 16817179 18368592 18645693 16302186 13521148 12231199 11826554
37064 11826554 11390497 11259660 11331354 10475636 8849469 8330775 9305859 9456668 7419373
37055 7419373 5328167 5537027 6753539 6118133 3876789 2989869 4380635 5486975 4338672
37046 4338672 2825377 4252760 8650501 12262276 11951625 9026566 7765140 10396812
37038 10396812 14670403 16894913 16278687 14935309 14277761 13453196 11690479 10167615
37030 10167615 10227250 11080421 10989803 10093341 10239444 11925733 13047413 11539589 8253659
37021 8253659 5995497 6004307 6668091 6100972 4786532 4534548 5557629 6245497 5790493
37012E790493n73006L5021k71149j259968j168418j08209j34146j479434j840822
37003a009638m12662N29103l52651r54399N39235K226366J531037n93194j441219
36994F1978p21021r405L83804J044005J306916M50631j77458Q43474K086083J372784
36984F641791l92375o98146L54427O64676l6695m72753r42840k372809l177358
36975d32082j272446J473525J375001q95198j250709P33854J222332p56773j503757
36966a306253M40551J560991L4460p86251J059565J893000q05626k782338P4090
36957f17811L767188K017865l118546m037622M82029L801907K076055q95843j164485
36948B310737m65923j518566k735418j532564P70487J330700N77654Q89748K120993
$$ plain form
37012 5790493 5217487 5252508 4981359 3721391 2552973 2444764 2310618 831184 -1009638
37003 -1009638 -1422300 -893197 -1245848 -2200247 -1661012 565354 2096391 1503197 61978
36994 61978 -659043 -668448 -284644 759361 2066277 2516908 2339450 3182924 5269007 6641791
36984 6641791 6249416 5551270 5905697 6570373 6533678 6060925 5118085 2745276 -432082
36975 -432082 -1704528 -231003 1143998 248800 -1001909 -268055 954277 197504 -1306253
36966 -1306253 -865702 695289 729749 -56502 1003063 2896063 2090437 -691901 -617811
36957 -617811 3149377 5167242 2048696 -1988926 -1506897 2295010 4371065 3475222 2310737
36948 2310737 1844814 326248 -2409170 -3941734 -3171247 -1840547 -1262893 -373145 1747848
36939A747848K017021K91559r33877o71529l18443r24378j414168m71801J243702
36930E65934J860662O48735j172765j805407o72062J093369J832929J066166q4642
36921C332919k79044M44828P74776k47159k055301l122640k472831n36846J280851
36912b880447J751046P93056m09518m70675O45131J394401N93428p35077o20036
36903F1309P46928Q90813j133711k707458j276967J479801J812924m86506j809778
36894b422645l07436J540652J148720l82372p19899j00115j11105m44711K91883
36885a507028J559000J488734O3332q53551n20322k2876J6506J68583M74999K36309
36875A103686j48042N89572J941150J604510q32136k501009j211672J116172J128092
$$ plain form
36939 1747848 3764869 4056428 3122551 2451022 2132579 1208201 -205967 -677768 565934
36930 565934 2426596 3075331 1902566 97159 -574903 518466 2351395 3417561 3332919
36921 3332919 3053875 3498703 4273479 4026320 1971019 -1151621 -3624452 -4161298 -2880447
36912 -2880447 -1129401 -336345 -745863 -1216538 -571407 822994 1416422 681345 61309
36903 61309 808237 1699050 565339 -2142119 -3419086 -1939285 -126361 -612867 -2422645
36894 -2422645 -2730081 -1189429 -40709 -423081 -1142980 -1243095 -1354200 -1798911 -1507028
36885 -1507028 51972 1540706 1604038 750487 230165 207289 223795 392378 867377 1103686
36875 1103686 955644 1545216 3486366 5090876 4258740 1757731 546059 1662231 2790323
36866B790323j114256k348226p39488J908007K804015J320621j041018k556009
36858A023969k472714j168975J88602N60739L2100l73392L8187J009625K001755
36849H39896K723360K718345J347986j029277k550216j699285N20459J511001
36841D382269L64802j067762j013163l10038p40483j811728j308566R61533K247129
36832A703993P34029j477305j124619J511095K878636J037749j882226k808177
36824E73175j524531l4639O35172J191611K012228K141846Q61025r70839j960471
36815B924577j871695j475489j160179n68605M78715J487113J894132J639678
36807C348247R50312K9491p89113r98430m04569N32745J095668R08068O5616r98992
$$ plain form
36866 2790323 1676067 -672159 -1411647 496360 3300375 4620996 3579978 1023969
36858 1023969 -1448745 -2617720 -2429118 -1868379 -1836279 -2209671 -2171484 -1161859 839896
36849 839896 3563256 6281601 7629587 6600310 4050094 2350809 2871268 4382269
36841 4382269 4747071 3679309 2666146 2356108 1615625 -196103 -1504669 -543136 1703993
36832 1703993 2438022 960717 -163902 1347193 4225829 5263578 3381352 573175
36824 573175 -951356 -985995 -350823 840788 2853016 4994862 5855887 4885048 2924577
36815 2924577 1052882 -422607 -1582786 -2151391 -1672676 -185563 1708569 3348247
36807 3348247 4298559 4328050 3538937 2540507 2135938 2668683 3764351 4672419 4738035 3739043
36797C739043j610655j248136k28274L53136j34302r01844o34159P08902J637105
36788A680816R46970o76042j385509m27093Q53550O38592r25520j620333Q2884
36779h31685K688133L060552K07178l283676m104995j848677R57611J986652J355295
36770A86388O76881P06507O42458k54942j075816k01640K092062L182449J267117
36761G221464j917786l167889k089464j160423j487174j217332P21155K046633
36753a050816N86973j723456j340450J446468K789299Q57839j909341k653118
36745b996602j438242K48490J841809K996650K575938L36526j643888j234348
36737F86333P16900J446927J01122j268776p90745O50085P94067q39973k278741
$$ plain form
36797 3739043 2128388 880252 651978 1005114 870812 -31032 -665191 43711 1680816
36788 1680816 2627786 1951744 566235 139142 992692 1631284 705764 -914569 -831685
36779 -831685 1856448 4917000 5124178 1840502 -2264493 -4113170 -3155559 -1168907 186388
36770 186388 863269 1569776 2212234 1957292 881476 679836 2771898 5954347 7221464
36761 7221464 5303678 2135789 46325 -1114098 -2601272 -3818604 -3097449 -1050816
36753 -1050816 -463843 -2187299 -3527749 -2081281 708018 1565857 -343484 -2996602
36745 -2996602 -4434844 -4186354 -2344545 652105 3228043 3564569 1920681 686333
36737 686333 1403233 2850160 2951282 1682506 891761 1541846 2335913 1495940 -782801
36728g82801j598775O83418K268088J803624K31046o89218m08613L32163P92672
36719B631604Q08531M23180k32190p46294p15054k10020L74642P03420M59630
36710C497449n16882j565843j374574L78232K086620J889274J4905j392228p20939
36701B296014J362665K542687J142887j811248l160941j351193R09270j17658
36693A812483l416649l913767M2251L699778K833829p7730l80006J284440J018077
36684B902706j063122j410351J54508L42096r00482P5942L287386L702448m48273
36675F642858l885908k276580J158976J234592j336255k402207j327998n16231
36667b708753l40496O43792J963037J972254J139895Q42252K53269j809732l403197
$$ plain form
36728 -782801 -2381576 -1698158 569930 2373554 2604600 1915382 1506769 1838932 2631604
36719 2631604 3440135 3863315 3631125 2884831 2169777 1959757 2334399 3037819 3497449
36710 3497449 2980567 1414724 40150 418382 2505002 4394276 4409181 3016953 2296014
36701 2296014 3658679 6201366 7344253 5533005 2372064 1020871 1930141 1812483
36693 1812483 -1604166 -5517933 -5475682 -1775904 1057925 980195 600189 1884629 2902706
36684 2902706 1839584 429233 583741 925837 25355 101297 3388683 7091131 6642858
36675 6642858 2756950 480370 1639346 2873938 1537683 -864524 -2192522 -2708753
36667 -2708753 -3049249 -2405457 -442420 1529834 2669729 3511981 3765250 1955518 -1447679
36658a447679j917880J122768J958127M70666j53631Q50931R66335o30339j624077
36649d04779p98319K47856N19194J088713K128612J972569L15739q94007q73883
36640C301695j060836j662948p53749J625380K185910m60563k753781j211823
36632g90715K261180L345909J453857m94192r19688p86387q08507o80555p36679
36623A844223j509643j830227j46645K268444K321909k35478k037503j054969
36615c79889M30007l50381k123635j583050J256673K759814Q97231j885917k217563
36606c196710k87074J053113O28780J73119J135846K263045J470061r81160k596648
36597c37628j764234L35458J273681K46591j153684j041814L71407J111078J73616
$$ plain form
36658 -1447679 -3365559 -2242791 -284664 186002 32371 883302 1849637 1219298 -404779
36649 -404779 -1203098 -955242 -436048 652665 2781277 4753846 5069585 4175578 3301695
36640 3301695 2240859 577911 -175838 1449542 3635452 3174889 421108 -790715
36632 -790715 1470465 4816374 6270231 5776039 4856351 4069964 3261457 2580902 1844223
36623 1844223 334580 -1495647 -1642292 626152 2948061 2712583 675080 -379889
36615 -379889 50118 -300263 -2423898 -4006948 -2750275 9539 906770 -979147 -3196710
36606 -3196710 -3483784 -2430671 -1801891 -1628772 -492926 1770119 3240180 2259020 -337628
36597 -337628 -2101862 -1766404 -492723 -246132 -1399816 -2441630 -2070223 -959145 -785529
36588g85529j011619n91420J049809J963482J580180J313984K068138K827689
36580H414714K391109J107298J27666J17060J288206L310666M548316L134116
36572B4439151j60063j957120n93764J422658J066245r57873k004070j892828
36564A9362336k435827l469889k822534l29210J299116M19146j331200j770103
36556H921835r26412N1638Q14630J344280J069310k32181j623451k051623j434855
36547E933171k75075P66734O57662j147832l119378k625489N36437L147817K384024
36538F258071o64650k679539k198813m38572J046691J627782R47470r60238k622819
36529C15383j997092P77237K852026K103083J47343K91795K729044L764833P38993
$$ plain form
36588 -785529 -1797148 -2388568 -1338759 624723 2204903 3518887 5587025 8414714
36580 8414714 10805823 11913121 12040787 12157847 13446053 16756719 21305035 24439151
36572 24439151 24279088 22321968 21728204 23150862 24217107 23259234 21255164 19362336
36564 19362336 16926509 13456620 10634086 10304876 11603992 12023138 10691938 8921835
36556 8921835 7995423 8047061 8861691 10205971 11275281 11043100 9419649 7368026 5933171
36547 5933171 5658096 6424830 7082492 5934660 2815282 189793 726230 3874047 6258071
36538 6258071 5593421 2913882 715069 276497 1323188 2950970 3898440 2938202 315383
36529 315383 -1681709 -904472 1947554 4050637 4197980 4489775 7218819 10983652 11722645
36520A1722645l886136n225767k129118J536571K049862J71042q45229R1980J109544
36511D595394N55458q47128j295452l19082O09572k13219k409118l390297j417291
36502d131163J680731K531399Q41336m12651J22112J99437j545377k514667m84596
36493c713439J919189J141225j075365l34041K674990K758471j108139l529960
36485a267069j082296K365345K026629m98157o52119J497154K116483L95470o03749
36476D297691L40564P20996r39360k424809j722150m13986p89500j890837j290024
36467d111415N88589J066593k18183n23681J423909K939092J357271j596524k098331
36458a172680J82379J769947O19016j246562j176920M85947J594753J120557m86243
$$ plain form
36520 11722645 7836509 2610742 481624 2018195 4068057 4239099 3393870 3485850 4595394
36511 4595394 5150852 4303724 3008272 2689190 3298762 3085543 676425 -2713872 -4131163
36502 -4131163 -2450432 80967 922303 509652 631764 831201 -714176 -3228843 -3713439
36493 -3713439 -1794250 -653025 -1728390 -2062431 612559 3371030 2262891 -1267069
36485 -1267069 -2349365 15980 2042609 1544452 892333 2389487 4505970 4901440 4297691
36476 4297691 4638255 5359251 4419891 1995082 272932 -141054 -930554 -2821391 -4111415
36467 -4111415 -3522826 -2456233 -2674416 -3198097 -1774188 1164904 2522175 925651 -1172680
36458 -1172680 -990301 779646 1398662 152100 -1024820 -538873 1055880 2176437 1690194
36449A690194k260498k817604j149345J459899K185574O25847k76751J046806
36441E04122J930484p7779k709118k542963p28234o62952j644106j04474L406455
36432b628565M157731Q91741j899966j138483M16771m22561j894329r18506J317296
36423b118871J554052J05501J47273K217510L098385N12784l560933n081645k367701
36414e493645K070596L936194J684794j624467k043758K62971J730373P88755
36406A311813l31624K55957J261094R67794P4841r3517M3030l46653p59323p20946
36396A662466j003122j797171j655151J4418J437356J263279P23158J065080J147920
36387B858233q3294r80949J73185J792572J198919j182110k638910k071085n63956
$$ plain form
36449 1690194 -570304 -3387908 -4537253 -3077354 -891780 -265933 -542684 504122
36441 504122 2434606 2356827 -352291 -2895254 -3623488 -4286440 -5930546 -6035020 -2628565
36432 -2628565 1529166 2420907 520941 -617542 -200771 -623332 -2517661 -3436167 -2118871
36423 -2118871 -564819 -459318 -312045 1905465 5003850 5516634 1955701 -3125944 -5493645
36414 -5493645 -3423049 513145 2197939 573472 -1470286 -1207315 523058 1311813
36406 1311813 980189 1236146 2497240 3465034 3539875 3446358 3489388 3142735 2383412 1662466
36396 1662466 659344 -1137827 -2792978 -2778560 -1341204 -77925 645233 1710313 2858233
36387 2858233 2774939 1793990 1967175 3759747 4958666 3776556 1137646 -933439 -1497395
36378a497395Q04927J417757O37754r04986j052753O29846J273209j008112l439135
36369c138888k517662M11108J449023L85036K11225J415446J491789m3369p54543
36360a090835J47822N87902k47829n10611N46260J055333J3307j015314q58513
36351a372478l35003J08595J195162K259717J288990j218886j923508K12802J923801
36342B139192P81701j062357p74329O38391O60524m25597p22933k56634k67590
36333G10368m96457m0363L67456l48626j182076n47863Q08624R81745P9384l02283
36323B9909M3877J01522o8128K88365O23234L6148n11124K89567J064397m83333
36313A414434l059462k705496J190653M383221L574818N82602j039076p56450
$$ plain form
36378 -1497395 -692468 725289 1363043 458057 -594696 35150 1308359 300247 -3138888
36369 -3138888 -5656550 -5245442 -3796419 -3411383 -3200158 -1784712 -292923 -336292 -1090835
36360 -1090835 -943013 -355111 -602940 -1113551 -567291 488042 501349 -513965 -1372478
36351 -1372478 -1707481 -1598886 -403724 1855993 3144983 1926097 2589 215391 2139192
36342 2139192 2920893 1858536 1084207 1722598 2383122 1957525 1234592 977958 710368
36333 710368 213911 173548 541004 192378 -989698 -1537561 -728937 252808 332192 29909
36323 29909 73786 175308 107180 395545 1018779 1054927 543803 833370 1897767 1414434
36313 1414434 -1645028 -4350524 -3159871 1223350 4798168 5380770 4341694 3585244
36305C585244k60606j66906Q138O6753l83062p03013l81896l29890j195282j623793
36295a384313l02892J386195J169795n14542j313109p60436m43746o10038K35083
36286b538003J936831K090014n9080j950585j442643K97599J251371J435422J419285
36277B440211M17800j675227k522863n43400J835985J305679j231454k051432
36269b024701k11142J717317J990158J219467j78051k321077l577467j864268
36261e249764J299395K094718M76315M25556K845574L360645j83856l210854j517519
36252C40210J620404Q24323k348701k146010J509894K830717k03699k698940r63797
36243a235599K015445K036171j1160q22833k77637m96082j443716j243805J29863
$$ plain form
36305 3585244 3324638 3157732 3165870 3232623 2849561 2146548 1764652 1434762 239480 -1384313
36295 -1384313 -1687205 -301010 868785 354243 -958866 -1719302 -2163048 -2773086 -2538003
36286 -2538003 -601172 1488842 1429762 -520823 -1963466 -1665867 -414496 1020926 2440211
36277 2440211 2858011 1182784 -1340079 -1883479 -47494 1258185 26731 -2024701
36269 -2024701 -2235843 -518526 1471632 2691099 2513048 191971 -3385496 -5249764
36261 -5249764 -3950369 -1855651 -1379336 -953780 1891794 5252439 5068583 1857729 340210
36252 340210 1960614 2784937 436236 -1709774 -199880 2630837 2427138 -271802 -1235599
36243 -1235599 779846 2816017 2804857 1982024 1704387 1208305 -235411 -1479216 -1349353
36234a349353P63372J45119j29520P73569J550196Q76997o46237j461502j044277
36225e21636k42574o5646n95635r78203l56167J098458K139902J659107k6270
36216B111336j325592j058607J02795L56764q18590j680910n54263J421110J516768
36207G0811n22923j682743J06354K880577L439355J675254k8258o16724j069693
36198D252010j755076j655285m49331Q04045J464560J899525J927278O50532j538935
36189E599323k669757j811595m32713k06113q14281r07402j14159Q51862J240425
36180G35590P26193l87533j004549k30427J120256J141119o16527k395207k515930
36171c427015j210187L25557J414761J823100J454970Q04317N64430L30047q99677
$$ plain form
36234 -1349353 -585981 -440862 -570382 203187 1753383 2630380 1984143 522641 -521636
36225 -521636 -764210 -829856 -1425491 -2403694 -2759861 -1661403 478499 2137606 2111336
36216 2111336 785744 -272863 -170068 186696 -631894 -2312804 -2867067 -1445957 70811
36207 70811 -452112 -2134855 -2028501 852076 4291431 5966685 5938427 5321703 4252010
36198 4252010 2496934 841649 392318 1196363 2660923 4560448 6487726 7138258 5599323
36189 5599323 2929566 1117971 685258 479145 -335136 -1242538 -1356697 -504835 735590
36180 735590 1461783 1074250 69701 -160726 959530 2100649 1484122 -911085 -3427015
36171 -3427015 -4637202 -4311645 -2896884 -1073784 381186 1185503 1749933 2079980 1180303
36162A180303k470120k190570L55808K539667K121591K23792p84540p06548p69476
36153e00093q72897n4069J151427J329694P30848P38032J018020j59647k476767
36144I04548l109495p18801K290802K861769J011735q85341j252893l86091O41366
36135A357599Q67782l8550j155210r87936L86535R91066j51771j188897k22459
36126a41841J339946O55298j963172l148877j401303Q76995J224384M80105O84845
36117a393620J638036J630066L63926q60553j153959n83306N90369J700902J486184
36108C418045k89320j805344j456369k72899j66677p44222l05918P36734M00533
36099d85437j100966j284574M85221J883618J473979O77348O79170K94516j367363
$$ plain form
36162 1180303 -1289817 -3480387 -3124579 -584912 1536679 1760471 975931 269383 -500093
36153 -500093 -1372990 -1427059 -275632 1054062 1784910 2522942 3540962 3381315 904548
36144 904548 -2204947 -2923748 -632946 2228823 3240558 2355217 1102324 716233 1357599
36135 1357599 2225381 2186831 1031621 43685 430220 1421286 1269515 80618 -141841
36126 -141841 1198105 1853403 -109769 -3258646 -4659949 -3782954 -2558570 -2078465 -1393620
36117 -1393620 244416 1874482 2238408 1377855 223896 -359410 230959 1931861 3418045
36108 3418045 3128725 1323381 -132988 -405887 -572564 -1316786 -1622704 -885970 -485437
36099 -485437 -1586403 -2870977 -2385756 -502138 971841 1649189 2328359 2622875 1255512
36090A255512k706370k112951n05980N26608J088719J603364J243064j44747p02337
36081d55118M49852J041516p31317k499552j070599K118845K867548P32440n01747
36072A951868R38882K149824M09697k542861l146649r62770J085303O67073j252941
36063g02574j832969L1974K152566J856325j41582o63206Q85394J295255j099405
36054A781778l014598j057944K663759L555395J228159r97353j808688k420856
36046g0348k297262L11709L446617K614610j871900m057004r93886K744004K219699
36037B046239p17658j432023j1589P1207j387204j133786J558739L216366J323600
36028C533891k062112l221580j319096J266594K101145J123389J30863L30468
$$ plain form
36090 1255512 -1450858 -3563809 -4069789 -3543181 -2454462 -851098 391966 247219 -455118
36081 -455118 -5266 1036250 304933 -2194619 -3265218 -1146373 1721175 2453615 1951868
36072 1951868 2890750 5040574 5450271 2907410 -239239 -1202009 -116706 550367 -702574
36063 -702574 -2535543 -2503569 -351003 1505322 1363740 700534 1585928 2881183 1781778
36054 1781778 -1232820 -2290764 372995 3928390 5156549 4159196 2350508 -70348
36046 -70348 -2367610 -2055901 1390716 4005326 2133426 -1923578 -2917464 -173460 2046239
36037 2046239 1328581 -103442 -115031 -43824 -1431028 -2564814 -1006075 2210291 3533891
36028 3533891 1471779 -1749801 -3068897 -1802303 298842 1422231 1553094 1883562
36020A883562Q04458p0899j939351k489249o39645J635647J789921J20145p10208
36011C84381O62784K446496K033687n36541k504976j978109m39792m13603j443204
36002a788877p78015J834106L120372J384007n88073j92172N36616j217467l418166
35993a107669k203599J192350K072911J59602j21814K302850L003353k18167l266836
35984A812981k422458l879L15372m99246J94643J292618K33732j707380j190200
35975a973817J471148K698401J177657p38936j022696k21345M08118M93030M5748
35966B337308p22685r98239j89217J006789J419885Q33328j73889r68209q65963
35957A679108L08306J154709K5930j926340j475293J718503L634837J357546k558386
$$ plain form
36020 1883562 2688020 2617121 677770 -1811479 -2451124 -815477 974444 1094589 384381
36011 384381 1047165 3493661 5527348 4990807 2485831 507722 67930 -345673 -1788877
36002 -1788877 -2566892 -732786 2387586 3771593 3183520 2991348 3527964 2310497 -1107669
35993 -1107669 -3311268 -2118918 -46007 113595 -8219 2294631 5297984 5079817 1812981
35984 1812981 -609477 -613356 -297984 -797230 -602587 690031 923763 -783617 -1973817
35975 -1973817 -502669 2195732 3373389 2634453 1611757 1390412 1798530 2291560 2337308
35966 2337308 1614623 616384 427167 1433956 2853841 3687169 3513280 2545071 1679108
35957 1679108 1987414 3142123 3168053 1241713 -233580 1484923 5119760 6477306 3918920
35948C918920l723998j798458J04365K90770j90842k01515J35082L77406K45042
35939h43228m12858r69651k49018J685317L224814L355517K425946N00677k447792
35930F269724m285475k250484K099237L546873O78233j774430o36297O16985j617130
35921B647236m267580k667638J354958K504710M54015q59316m01570l62481o80610
35912b278276N77949K132985Q26057k227815k644982K2085J713077P23040m29123
35903a585003l98954o63156j093832M25945K913126K490963q71845k432898l01225
35894a516879J556038J96287j818612j609785n77653o25508m39789J012565J536748
35885b286588j06843j016659R92488K949720J321366k010326k728050o92906O99028
$$ plain form
35948 3918920 194922 -1603536 -1499171 -1208401 -1399243 -1600758 -1465676 -1088270 -843228
35939 -843228 -1256086 -2225737 -2474755 -789438 2435376 5790893 8216839 8717516 6269724
35930 6269724 1984249 -266235 1833002 5379875 6058108 4283678 3647381 4264366 2647236
35921 2647236 -1620344 -4287982 -2933024 -428314 25701 -833615 -1235185 -1597666 -2278276
35912 -2278276 -1700327 432658 1258715 -969100 -3614082 -3591997 -1878920 -1155880 -1585003
35903 -1585003 -1983957 -2647113 -3740945 -3315000 -401874 2089089 1217244 -1215654 -1516879
35894 -1516879 39159 235446 -1583166 -3192951 -3770604 -4396112 -4835901 -3823336 -2286588
35885 -2286588 -2393431 -3410090 -2417602 532118 1853484 -156842 -2884892 -3577798 -2878770
35876b878770R8118p97031o77540K76219J748059K983653K359487k27878k054064
35867H30253j191244L02194l85212k186252j984897L53418K190451K382538K003151
35858B314400J447168R6296j357678j309846q4781K45088r06284j873927j407456
35849b837020p4700J119590J668879J126651m32924j542626p82344Q70269J018132
35840A33907o05744j489634Q2071K412442K489240j00896k474031j775508J311512
35831a6641L077462J231881j918597k144012J104260L789493K551527j228946
35823F446427l834691l736859k016192O3825J742471K103589R24743l64552l67225
35814I61536K31931J857o23722j34984J152833J292250j51125j333392j028620
$$ plain form
35876 -2878770 -2780652 -3577683 -4255223 -3979004 -2230945 752708 3112195 2884317 830253
35867 830253 -360991 -58797 -444009 -2630261 -4615158 -4261740 -2071289 311249 2314400
35858 2314400 3761568 3857864 2500186 1190340 1105559 1350647 444363 -1429564 -2837020
35849 -2837020 -2911720 -1792130 -123251 1003400 570476 -972150 -1754494 -884225 133907
35840 133907 -471837 -1961471 -1879400 533042 3022282 2921386 447355 -1328153 -16641
35831 -16641 3060821 4292702 2374105 230093 1334353 5123846 7675373 6446427
35823 6446427 2611736 -1125123 -3141315 -3077490 -1335019 768570 1693313 1328761 961536
35814 961536 1193467 1195324 571602 436618 1589451 2881701 2730576 1397184 368564
35805C68564l72824p72078j535650q98586J288779L110872K836689Q57402r72110
35796C911058j545109j423415j500036j623691j236482n79675r4430P39002K368066
35787i84712L405697J981355j066147k598662j334453O22477J206951R90111J113079
35778C335696R70294k46307j602452j912609j545056j026742K86406K198288K437044
35769B894562J9520k058804o90916K212526K109141j383718l925907k757441J45515
35760c435522J944687K486287K593069J856401R6987j229624j105478p24993j345257
35751A136557j928200r56834P12003J142442O22231J092294K465384K245943m26140
35742F105680k823468k365981m57305k67979j751048j758921Q00645K947533K064577
$$ plain form
35805 368564 -4260 -776338 -2311988 -3210574 -1921795 1189077 4025766 4883168 3911058
35796 3911058 2365949 942534 -557502 -2181193 -3417675 -3997350 -4091780 -3352778 -984712
35787 -984712 2420985 4402340 3336193 737531 -596922 25555 1232506 2222617 3335696
35778 3335696 4305990 4059683 2457231 544622 -1000434 -2027176 -1740770 457518 2894562
35769 2894562 2914082 855278 164362 2376888 4486029 3102311 -823596 -3581037 -3435522
35760 -3435522 -1490835 995452 3588521 5444922 5541909 4312285 3206807 2481814 1136557
35751 1136557 -791643 -1748477 -1036474 105968 728199 1820493 4285877 6531820 6105680
35742 6105680 3282212 916231 458926 190947 -1560101 -3319022 -2518377 429156 2493733
35733B493733k24833q02931K58031N72949k30790l50787M12996J84878j218398
35724A094848j428292L64095J573592L31890j336770q28464Q18679Q31345p39283
35715F81640j362886j77343R93889O95518l08349m86197O58951K318590K909377
35706E923190J281068j645356l189921j945231M04236J399084P42569l80617j404631
35697A184391k006042j171708J063210K286733P47417j442473j125317Q65768
35689D01979J045138q19326j256601R02700K275180M17465k075488j602213J005415
35680B94249K113897O87803r44194r24597J79489J053435J112931K44300j191151
35671B626162j971520j146971L15355N09860n51508o99273J092335K758770J861556
$$ plain form
35733 2493733 2268900 1465969 1724000 2296949 2066159 1715372 2128368 2313246 1094848
35724 1094848 -333444 30651 1604243 1936133 599363 -229101 589578 1420923 681640
35715 681640 -681246 -858589 135300 830818 522469 36272 695223 3013813 5923190
35706 5923190 7204258 5558902 2368981 423750 827986 2227070 2969639 2589022 1184391
35697 1184391 -821651 -1993359 -930149 1356584 2104001 661528 -463789 401979
35689 401979 1447117 627791 -628810 273890 2549070 2966535 891047 -711166 294249
35680 294249 2408146 3095949 2151755 1227158 1406647 2460082 3573013 3817313 2626162
35671 2626162 654642 -492329 -176974 332886 -218622 -917895 174440 2933210 4794766
35662D794766q33239k292365j342962Q2196R8483o98021r16027o73542n83725
35653b364436O3747J852077K992878J342075j675790k307844n7163J305470m26525
35644G24489k403557j335616J330193K008662O27002k091P43204P26044o46008
35635A772322j244660k6420J133741O38726l25161j7397J005707R82981k29136
35626C690703j015109l24949R37214J005988n75388k142316j723494L40191J630140
35617A822980R30505j85180o6285M04964l02988j399569j109874O0071J15840
35608B70464r47674j239125k69174O13660R51166J474850J727626N29343r96561
35599B114575l45997J789683J640130j648933l960185k236894R55838J623084
$$ plain form
35662 4794766 3961527 1669162 326200 408396 506879 -191142 -1107169 -1780711 -2364436
35653 -2364436 -2300689 -448612 2544266 3886341 2210551 -97293 -154456 1151014 724489
35644 724489 -1679068 -3014684 -1684491 324171 951173 949082 1692286 2418330 1772322
35635 1772322 527662 501242 1634983 2273709 1948548 1931151 2936858 3919839 3690703
35626 3690703 2675594 2350645 3287859 4293847 3718459 1576143 -147351 192840 1822980
35617 1822980 2753485 2568305 2502020 2906984 2603996 1204427 94553 154624 270464
35608 270464 -677210 -1916335 -2185509 -1571849 -620683 854167 2581793 3111136 2114575
35599 2114575 1768578 3558261 5198391 3549458 -410727 -2647621 -1691783 -68699
35591f8699K6042r88520p68745m54924J82220J770134K636767Q57250j932236
35582A259289k442109p62481K72938K17872J219621K962396K156288j525991l514501
35573a56678r05977K790650K764873j88212j700496o71186J97728l49293p56040
35564A025369n64040j428212l219436l002701K04031K927960K005748p37369j438882
35555d227532J85168J378919J087893O57887M69217n39921j920017j682679J92431
35546d398634J350963R26784O46670J081583L04979j991590k651745j6191K484110
35537b263071J215454j723255j594282J602024L298197J273247j888968l351029
35529c431683l071567j764625M46598K342211J976510Q83m67199J393564K579572
$$ plain form
35591 -68699 -42657 -1031177 -1799922 -2254846 -2072626 -302492 2334275 3191525 1259289
35582 1259289 -1182820 -1945301 -1672363 -1454491 -234870 2727526 4883814 3357823 -156678
35573 -156678 -1062655 1727995 4492868 4304656 2604160 1932974 2130702 1781409 1025369
35564 1025369 461329 -966883 -4186319 -7189020 -6984989 -4057029 -2051281 -2788650 -4227532
35555 -4227532 -4042364 -2663445 -1575552 -917665 -448448 -988369 -2908386 -4591065 -4398634
35546 -4398634 -3047671 -2120887 -1474217 -392634 -87655 -2079245 -4730990 -4747181 -2263071
35537 -2263071 -1047617 -2770872 -4365154 -2763130 535067 1808314 -80654 -3431683
35529 -3431683 -6503250 -8267875 -7821277 -5479066 -3502556 -3501673 -3968872 -2575308 4264
35520D264J088406q79471p27381M15971J55156r15611o01545Q01065J086495L6290
35510D63639l63748N33677J045892J28814r11308m79368J050150J929468J054736
35501D451952r96007k412242j749097L51113J513276N25686q20069q5652K169555
35492B948515K862910N61748k549913l473872j794337N50844J806372J663443
35484B575710O93283l17077o55571k58508k1281p66648j847407j669141N3357
35475b213283J506684J045478m92629r23292K36024J311750J081774K39749j86377
35466A605878k57907j54104N99588J711110J466679q50784l151667l049560j170539
35457c251306Q4522J69549M13127J031207Q11928k31680m61738P17224J945629
$$ plain form
35520 4264 1092670 213199 -514182 -98211 56945 -858666 -1460211 -659146 427349 463639
35510 463639 99891 633568 1679460 1808274 896966 417598 1467748 3397216 4451952
35501 4451952 3455945 1043703 -705394 -354281 1158995 1684681 864612 778960 2948515
35492 2948515 5811425 6373173 3823260 349388 -1444949 -894105 912267 2575710
35484 2575710 3268993 2951916 2296345 2037837 2016556 1249908 -597499 -2266640 -2213283
35475 -2213283 -706599 338879 -153750 -1077042 -841018 470732 1552506 1792255 1605878
35466 1605878 1347971 1193867 1793455 3504565 4971244 4120460 968793 -2080767 -3251306
35457 -3251306 -3166784 -2997235 -2584108 -1552901 -740973 -972653 -1434391 -717167 1228462
35448A228462K045822J150006l95349k156169k703537j038547J056250Q74657
35440F1595q72652q38306J355058K086795l68343k794270k052373L77444J547902
35431a497150J503530J455804M63919k296600m246291k475626J365512L138845
35423b588057K073075P79808L85499l24388j351364j142238O0419K98722k90183
35414b098707N76459K908440L661719J555249p58561r32527k44937p36820j720954
35405B209361j464480l26533J55267p6908l958L77467K60383k97813m55062Q2276
35395D60000R32038J730775K034086J190640o85730k167353j907793k74157J089268
35386B401774J008714l33700j774712k036880p49904J036318J823281J273344
$$ plain form
35448 1228462 3274284 4424290 4028941 1872772 -830765 -1869312 -813062 61595
35440 61595 -811057 -1649363 -294305 1792490 1424147 -1370123 -3422496 -3045052 -1497150
35431 -1497150 6380 1462184 1926103 -370497 -4616788 -7092414 -5726902 -2588057
35423 -2588057 -514982 264826 650325 325937 -1025427 -2167665 -2107246 -1808524 -2098707
35414 -2098707 -1522248 1386192 5047911 6603160 5844599 4912072 4667135 3930315 2209361
35405 2209361 744881 418348 573615 496707 492749 870216 1130599 832786 377724 460000
35395 460000 1392038 3122813 5156899 6347539 5661809 3494456 1586663 1312506 2401774
35386 2401774 3410488 3076788 1302076 -734804 -1484708 -448390 1374891 2648235
35378B648235K49164o56262j599980k394032k180530p30602R10278J619278J262147
35369h72304K67942q88235j418926n29390J416923K904973K937075J905862N52507
35360F276427q39857j808314j552203k03670P79856L62616p23566j115117n30776
35351F45396L38270Q81916P97156l9810j199057j737408j200174j27619P51364
35342h89966J206337J177946N94782j99381o68830r11236j306184j330907r0921
35333b418360J770557K323205J044758l49967m49920J67489N99487J088672J653684
35324E429605J123503q76004k587313k496580j569811j305550j084955L07953
35316c059152J813071J391508m64520j144446K61270J847322J781158M11910p59535
$$ plain form
35378 2648235 2897399 2241137 641157 -1752875 -3933405 -4664007 -3753729 -2134451 -872304
35369 -872304 -604362 -1492597 -2911523 -3440913 -2023990 880983 3818058 5723920 6276427
35360 6276427 5436570 3628256 2076053 1872383 2652239 3014855 2291289 1176172 645396
35351 645396 983666 1865582 2662738 2622928 1423871 -313537 -1513711 -1641330 -889966
35342 -889966 316371 1494317 2089099 1889718 1220888 309652 -996532 -2327439 -2418360
35333 -2418360 -647803 1675402 2720160 2370193 1920273 2087762 2687249 3775921 5429605
35324 5429605 6553108 5677104 3089791 593211 -976600 -2282150 -3367105 -3059152
35316 -3059152 -1246081 145427 -319093 -1463539 -1202269 645053 2426211 2838121 2078586
35307B078586p53908K86661J018104j18475k573901l338670p39813K500866K500428
35298H59878k87413j806702l59584J458882J195031l43665j421381j879855j915394
35289d500203r25142Q64792J849459J590108J704139K758272K726408M40594j851537
35280D656890j803056o97507r96729j924672r06700J557010K129452j25453k040247
35271a51012q99436J808325K696995R72913j000010j063019J13867J71903j584347
35262A066179k876957j347638J806132K888266O73209j821903j625002K56045
35254i81669R92835J84241m29902k11779l3095k04281l33398o17303j126095o68395
35244c428841J276215K531312R71515j616699j742990L34737J158097p4020m48439
$$ plain form
35307 2078586 1324678 1611339 2629443 2510968 -62933 -3401603 -4141416 -1640550 859878
35298 859878 572465 -1234237 -1593821 -134939 1060092 716427 -704954 -2584809 -4500203
35289 -4500203 -5425345 -4560553 -2711094 -1120986 583153 3341425 6067833 6508427 4656890
35280 4656890 2853834 2156327 1159598 -765074 -1671774 -114764 2014688 1889235 -151012
35271 -151012 -1050448 757877 3454872 4427785 3427775 2364756 2478623 2650526 1066179
35262 1066179 -1810778 -3158416 -1352284 1535982 2209191 387288 -1237714 -981669
35254 -981669 11166 195407 -234495 -446274 -479369 -683650 -1017048 -1634351 -2760446 -3428841
35244 -3428841 -2152626 378686 1350201 -266498 -2009488 -1674751 -516654 -590674 -1039113
35235a039113J184649K059452M56522j200523n43306Q55636M46549j275253k365350
35226a420737k559214k235239o91299J837887K804405R05430j181785o54954J024060
35217b171446R25957l41833k85075P05294N52304J3861J279438K973995J688442
35208E340937j697428k578695j24572J220230p78694k550172j131788Q52731J94994
35199a252457j226132k04894J655687O19389k375483k800826K11801K563796J603409
35190a205710l49663k09962J465132K133105J083161l09710q58377n56638K5066
35181A216404L12126O4309l65427m60578k81375k04579q4528M54147J020836Q49423
35171B520758J97121J32222P03630O08412p76966k184299k069670o18788O60727
$$ plain form
35235 -1039113 145536 2204988 2661510 1460987 917681 1773317 2219866 944613 -1420737
35226 -1420737 -3979951 -6215190 -6906489 -5068602 -2264197 -1358767 -2540552 -3195506 -2171446
35217 -2171446 -1245489 -1587322 -1872397 -1167103 -614799 -600938 678500 3652495 5340937
35208 5340937 3643509 1064814 940242 2160472 1381778 -1168394 -2300182 -1447451 -1252457
35199 -1252457 -2478589 -2683483 -1027796 -408407 -2783890 -5584716 -5372915 -2809119 -1205710
35190 -1205710 -1555373 -1765335 -300203 1832902 2916063 2606353 1747976 1191338 1216404
35181 1216404 1528530 1592839 1227412 766834 485459 280880 196352 650499 1671335 2520758
35171 2520758 2717879 2850101 3553731 4162143 3385177 1200878 -868792 -1487580 -826853
35162h26853P57721j12644j043510j048190K84742J993196K156317P8597k315395
35153g6019k430448k76607J471328J003437l60876l23714J081591J827371J067075
35144B983138J95117M03753Q13737M7035j497606k267910j774470p96168K41345
35135a652029J586127K867532K969114J575829l27655j824442k716697k548198
35127g0419o46225K022423K759812M48252k333370k397850k51960R06736L8672
35118D76071n32651P90842K206243J398633q43005j946273j373761q97599j386128
35109b107628j480031J3014K028659K539153J099096p63529j349404m50838O23663
35100A52155M95823o81644j311311m62611O71734M99631l00285L21559K127174
$$ plain form
35162 -826853 -69132 -181776 -1225286 -2273476 -1988734 4462 2160779 2239376 -76019
35153 -76019 -2506467 -2783074 -1311746 -308309 -669185 -992899 88692 1916063 2983138
35144 2983138 3178255 3582008 4395745 4442780 2945174 677264 -1097206 -1893374 -1652029
35135 -1652029 -65902 2801630 5770744 7346573 7018918 5194476 2477779 -70419
35127 -70419 -716644 1305779 4065591 4513843 2180473 -217377 -469337 437399 476071
35118 476071 -56580 734262 2940505 4339138 3496133 1549860 176099 -721500 -2107628
35109 -2107628 -3587659 -3574645 -1545986 993167 2092263 1328734 -20670 -471508 152155
35100 152155 647978 -33666 -1344977 -1807588 -1135854 -636223 -936508 -614949 1512225
35091A512225K217575n58526l145559k326806N85904J863497R38896N30188J552370
35082C169764J638639m02167k103104j181587Q06362R80339n81059j479492o86298
35073A61397O47246J291123R45618k35313j537271j764607p92088j33769o38851
35064b056515r16753K73317J568169J152444l6390K2146O85925j91101j941247
35055a440005j527554J418497L432715K036703j172310l307223l418691j854609
35047e832477R07109L343015L283789R19709p38869k0751J006801J45654j242644
35038A771336o72449J181144J621971L29606m03987L93149R31568l67014k517156
35029B268168l405461k316537l71530Q02308M88602n42265q13687J60088J243948
$$ plain form
35091 1512225 3729800 3171274 25715 -2301091 -1715187 148310 1087206 1617394 3169764
35082 3169764 4808403 4406236 2303132 1121545 1927907 2908246 2327187 847695 161397
35073 161397 808643 2099766 3045384 2810071 1272800 -491807 -1283895 -1417664 -2056515
35064 -2056515 -2973268 -2699951 -1131782 20662 -15728 6418 692343 501242 -1440005
35055 -1440005 -2967559 -1549062 1883653 3920356 2748046 -559177 -3977868 -5832477
35047 -5832477 -4925368 -1582353 1701436 2621145 1882276 1861525 2868326 3013980 1771336
35038 1771336 1098887 2280031 3902002 4231608 3827621 4220770 5152338 4785324 2268168
35029 2268168 -1137293 -3453830 -3825360 -3023052 -2534450 -3076715 -3890402 -3730314 -2486366
35020b486366J200340L79658J79483J066793J879509J240029o35104j810983p36591
35011B76768J427778J623492j030285l223936j511013K527050M071987J872224
35003F034065l01709J01800O42894j300750l498131k350438R36890J980661l7520
34994B207762j559379n64048P90162L91292n27323p9052J011801J009013J73740
34985B853968p6674R3189p28494k458559l095139j480295Q68075J551868K74315
34976b197746r36865m24769J139082K003341J722459J197841P64737k09861j585551
34967A472668j920757n63164J017698J162918L36622J90299R43704J105855k96702
34958C449141k285770k929436j354806J189251K261822P42038j644783k225438
$$ plain form
35020 -2486366 -1286026 -906368 -726885 339908 2219417 3459446 2824342 1013359 276768
35011 276768 1704546 3328038 2297753 -926183 -2437196 89854 4161841 6034065
35003 6034065 5732356 5834156 6477050 5176300 1678169 -672269 264621 2245282 2207762
34994 2207762 648383 84335 874497 1265789 738466 659414 1671215 2680228 2853968
34985 2853968 2777294 2870483 2141989 -316570 -3411709 -4892004 -4023929 -2472061 -2197746
34976 -2197746 -3134611 -3559380 -2420298 -416957 1305502 2503343 3268080 3058219 1472668
34967 1472668 -448089 -1011253 6445 1169363 1505985 1696284 2639988 3745843 3449141
34958 3449141 1163371 -1766065 -3120871 -1931620 330202 1072240 -572543 -2797981
34950b797981p26028O79814P43829N72243J031798J012094k82233j371884p82587
34941a920935M14330M84029n8152K10658P17668O4055r02361j83789J694783K142693
34931B662979N71293r22704j117687r46772p66639M91478K361872K150559r02654
34922C581725l357137j950865J573175K776068O21720j594082j235862M99213
34914I13955J171153O15873L03912N46027K84869p24420j371476j089802o91570
34905d1479p03318m49975K36638J06202j155553j411110P36874K784409J584170
34896A686858j283173j462755J102425J860012o88535k268833j57811J936197
34888G24385K24340k408744j196567K262328K560196n62487k040983J38112K243778
$$ plain form
34950 -2797981 -3524009 -2844195 -2100366 -1528123 -496325 515769 233536 -1138348 -1920935
34941 -1920935 -1506605 -1022576 -1080728 -870070 -152402 -88347 -990708 -1174497 520286 2662979
34931 2662979 3234272 2311568 1193881 247109 -519530 -28052 2333820 4484379 3581725
34922 3581725 224588 -1726277 -153102 2622966 3244686 1650604 414742 913955
34914 913955 2085108 2700981 3004893 3550920 3835789 3111369 1739893 650091 -41479
34905 -41479 -744797 -1194772 -958134 -851932 -2007485 -3418595 -2681721 102688 1686858
34896 1686858 403685 -1059070 43355 1903367 1214832 -1054001 -1211812 724385
34888 724385 948725 -1460019 -2656586 -394258 2165938 1603451 -437532 -299420 1944358
34879A944358J229505j190217k243536j733101n36656J036982K141199J675160
34871B323694N11957N15759J040448j58302k336614k254137R8792R04839r73265
34862c26829j753545P03290K846904J265609j569059j430079J022726K084838
34854B843855J132379M87703P05145K64736q27427j015904m27239o43727j374870
34845A144651o74110J298641J890074O5242j827460j547418m8147L45186o53414
34836f755j237169j99945J552021K170740R18150j127964k219844j594083K5430
34827a719419J253489J137270j41221j220230p71465O80967J054634k64350j012764
34818a003089O08261K540291J512414j726580l134830j294080R07228J071188
$$ plain form
34879 1944358 3173863 1983646 -259890 -1992991 -2529647 -1492665 648534 2323694
34871 2323694 2835651 3351410 4391858 4233556 1896942 -357195 -258403 646436 -326829
34862 -326829 -2080374 -1377084 1469820 2735429 1166370 -263709 759017 2843855
34854 2843855 3976234 4463937 5169082 5433818 4606391 3590487 3163248 2519521 1144651
34845 1144651 470541 1769182 3659256 3724498 1897038 349620 301473 646659 -6755
34836 -6755 -1243924 -1443869 108152 2278892 3197042 2069078 -150766 -1744849 -1719419
34827 -1719419 -465930 671340 530119 -690111 -1461576 -780609 274025 9675 -1003089
34818 -1003089 -394828 2145463 3657877 1931297 -1203533 -2497613 -1590385 -519197
34810e19197J73325m52069j334061k356510j613936R45321K123256M32101q67551
34801c469321R79283L082483J273662k805655l920094j263439Q20375l5776j269985
34792f608467m51471J031676J090619L61200M08815R55190R63875P64420J220237
34783b63906J947366J911976J002916j26261j035673j413600q41213L85405R20055
34774B487065p4814j511887j618631l61346N42884J78984k45151N98486J855879
34765A851469J633913k438j040146p19136n56225j268427j112016Q24606K049289
34756A660889L00055k195131j837383L67740M89747j357763j058652K051561L530168
34747A951231J353244o63117J56304O09247j965917l779229o97903L850657L605903
$$ plain form
34810 -519197 -345872 -797941 -2132002 -4488512 -6102448 -5157127 -3033871 -2601770 -3469321
34801 -3469321 -2490038 592445 1866107 -939548 -4859642 -6123081 -5302706 -5338482 -6608467
34792 -6608467 -7059938 -6028262 -4937643 -4576443 -4167628 -3212438 -2248563 -1484143 -263906
34783 -263906 1683460 3595436 4598352 4472091 3436418 2022818 1181605 1567010 2487065
34774 2487065 2412251 900364 -718267 -1079613 -536729 -357745 -602896 -4410 1851469
34765 1851469 3485382 3482944 2442798 1723662 1167437 -100990 -1213006 -388400 1660889
34756 1660889 1960944 -234187 -2071570 -1703830 -1214083 -2571846 -3630498 -1578937 1951231
34747 1951231 3304475 2641358 2797662 3406909 1440992 -2338237 -3036140 814517 4420420
34738D420420o10048k540745n78406P48545q36728k194096j023510O40184R26966
34729a047418J048342J752560J363789n52127j597517o75910O4671o05996p71462
34720a021068M87048P27185j253048k276050K41102L455013L243587N89581m83076
34711C710274N38582P04652q15081j698976r27477k04690m38054l72936M49685
34702I45979O01194l14747o29692K21467L69992j006071j671717o3397J488131
34693e8861K53540k071180j672647J205608K418608M35107j346614j93687J683280
34684F53154R38771j572033k395649p34581J057613J318231N07965o26071j581212
34675b433812j235874Q07505K392892J203995j321291j642937M64077J734239
$$ plain form
34738 4420420 3810372 1269627 691221 1439766 603038 -1591058 -2614568 -1974384 -1047418
34729 -1047418 924 1753484 3117273 2565146 967629 291719 356390 -249606 -1021068
34720 -1021068 -534020 193165 -1059883 -3335933 -3094831 360182 3603769 4193350 3710274
34711 3710274 4248856 4953508 4138427 2439451 1511974 1307284 869230 496294 945979
34702 945979 1547173 1232426 602734 824201 1194193 188122 -1483595 -1546992 -58861
34693 -58861 194679 -1876501 -3549148 -2343540 75068 510175 -836439 -1030126 653154
34684 653154 1591925 19892 -2375757 -3110338 -2052725 -734494 -226529 -852600 -2433812
34675 -2433812 -3669686 -2862181 -469289 734706 -586585 -2229522 -1765445 -31206
34667c1206Q51677L1125L72005J1337j466389j232515J626475L316778J030510
34658D509797k207775k240679k08877M5834j436333j428148O94220K320615J994849
34649B043503N88383j193103k930413k949021k35793K805418K956010P94481o34964
34640A244501p18554j135873j832614j203077L47649J029603J188263K127833
34632A047731K384013j04381k958824k021114J248201J228322k428959l561213
34624e166224L94045L796681J767474k230800k405904N58587K016837J238869
34616c0435J193237K380971K149183l25749k573426k593459j103861K58579Q38148
34607A93188Q17470N48348J18382q46098k294311k745586q55388J878448K311905
$$ plain form
34667 -31206 820471 851596 1223601 1234938 -231451 -1463966 162509 3479287 4509797
34658 4509797 2302022 61343 -147534 -101700 -1538033 -2966181 -2271961 48654 2043503
34649 2043503 2631886 1438783 -1491630 -4440651 -4676444 -1871026 1084984 1879465 1244501
34640 1244501 525947 -609926 -2442540 -3645617 -3297968 -2268365 -1080102 1047731
34632 1047731 3431744 3327363 368539 -1652575 -404374 823948 -1605011 -5166224
34624 -5166224 -4772179 -975498 791976 -1438824 -3844728 -3286141 -1269304 -30435
34616 -30435 1162802 3543773 5692956 5367207 2793781 200322 -903539 -644960 193188
34607 193188 1010658 1559006 1677388 831290 -1463021 -4208607 -5063995 -3185547 -873642
34598h73642R9755j695413j243360j72010R4143Q54810K915783L991699K092180
34589F063945r20842j976941j086778l85228n73329p78017n53948L1398Q94237
34580G14497J016585r13056l462624k892068J238164M038001J858309k094568
34572d96760k472216M12178J921152N44700p55780q2042J011339J014225O07972
34563A704768N44543L33107j52677r9663N48483P20734L6617n41367k04150O69030
34553C559425J021706K6341j989011l152338j884280M68208R06542o37362r10124
34544b590893J126462K016911l75177k553254p52089K628971K768617J56150q39284
34535A586414M15759M56905j473665k063889l4992J635008R31176k98457k61344
$$ plain form
34598 -873642 -773887 -2469300 -3712660 -3884670 -3790527 -2935717 -19934 3971765 6063945
34589 6063945 5143103 3166162 2079384 1694156 1120827 342810 -211138 -179740 714497
34580 714497 1731082 818026 -2644598 -5536666 -4298502 -260501 1597808 -496760
34572 -496760 -2968976 -2556798 -635646 -90946 -846726 -928768 82571 1096796 1704768
34563 1704768 2249311 2582418 2429741 2330078 2878561 3599295 3635912 3094545 2890395 3559425
34553 3559425 4581131 4607472 2618461 -533877 -2418157 -1949949 -1043407 -1680769 -2590893
34544 -2590893 -1464431 552480 177303 -2375951 -3128040 -499069 2269548 2425698 1586414
34535 1586414 2002173 2459078 985413 -1078476 -1113468 521540 1452716 1154259 892915
34526H92915j5796n84719q18148K2842N99700J14517j50781N66511R83611K92372
34516A903024k74072J95585O60472J69848n89494q88554j022628r15085J40239
34507f20665J549698J557419J15175p44772j55692M22657J1808n08326n69007
34498A058295p40963o77055P94333K704051K367354j23889j357813q133R51853
$$ plain form
34526 892915 877119 292400 -525748 -502906 96794 211311 60530 627041 1610652 1903024
34516 1903024 1628952 1824537 2485009 2654857 2065363 1176809 154181 -760904 -620665
34507 -620665 929033 2486452 2601627 1856855 1701163 2123820 2135628 1627302 1058295
34498 1058295 317332 -359723 434610 3138661 5506015 5382126 4024313 4016180 4968033
$$ [...]
##END NTUPLES=NMR SPECTRUM
##END=
